lucene-dev mailing list archives

Site index · List index
Message view « Date » · « Thread »
Top « Date » · « Thread »
From Policeman Jenkins Server <jenk...@thetaphi.de>
Subject [JENKINS] Lucene-Solr-5.5-Linux (32bit/jdk1.8.0_102) - Build # 424 - Unstable!
Date Sun, 11 Sep 2016 22:01:40 GMT
Build: http://jenkins.thetaphi.de/job/Lucene-Solr-5.5-Linux/424/
Java: 32bit/jdk1.8.0_102 -client -XX:+UseConcMarkSweepGC

1 tests failed.
FAILED:  org.apache.solr.update.AutoCommitTest.testMaxTime

Error Message:
expected:<2> but was:<3>

Stack Trace:
java.lang.AssertionError: expected:<2> but was:<3>
	at __randomizedtesting.SeedInfo.seed([728D925758F9B45A:E879EFB5C6632866]:0)
	at org.junit.Assert.fail(Assert.java:93)
	at org.junit.Assert.failNotEquals(Assert.java:647)
	at org.junit.Assert.assertEquals(Assert.java:128)
	at org.junit.Assert.assertEquals(Assert.java:472)
	at org.junit.Assert.assertEquals(Assert.java:456)
	at org.apache.solr.update.AutoCommitTest.testMaxTime(AutoCommitTest.java:256)
	at sun.reflect.NativeMethodAccessorImpl.invoke0(Native Method)
	at sun.reflect.NativeMethodAccessorImpl.invoke(NativeMethodAccessorImpl.java:62)
	at sun.reflect.DelegatingMethodAccessorImpl.invoke(DelegatingMethodAccessorImpl.java:43)
	at java.lang.reflect.Method.invoke(Method.java:498)
	at com.carrotsearch.randomizedtesting.RandomizedRunner.invoke(RandomizedRunner.java:1764)
	at com.carrotsearch.randomizedtesting.RandomizedRunner$8.evaluate(RandomizedRunner.java:871)
	at com.carrotsearch.randomizedtesting.RandomizedRunner$9.evaluate(RandomizedRunner.java:907)
	at com.carrotsearch.randomizedtesting.RandomizedRunner$10.evaluate(RandomizedRunner.java:921)
	at com.carrotsearch.randomizedtesting.rules.SystemPropertiesRestoreRule$1.evaluate(SystemPropertiesRestoreRule.java:57)
	at org.apache.lucene.util.TestRuleSetupTeardownChained$1.evaluate(TestRuleSetupTeardownChained.java:49)
	at org.apache.lucene.util.AbstractBeforeAfterRule$1.evaluate(AbstractBeforeAfterRule.java:45)
	at org.apache.lucene.util.TestRuleThreadAndTestName$1.evaluate(TestRuleThreadAndTestName.java:48)
	at org.apache.lucene.util.TestRuleIgnoreAfterMaxFailures$1.evaluate(TestRuleIgnoreAfterMaxFailures.java:64)
	at org.apache.lucene.util.TestRuleMarkFailure$1.evaluate(TestRuleMarkFailure.java:47)
	at com.carrotsearch.randomizedtesting.rules.StatementAdapter.evaluate(StatementAdapter.java:36)
	at com.carrotsearch.randomizedtesting.ThreadLeakControl$StatementRunner.run(ThreadLeakControl.java:367)
	at com.carrotsearch.randomizedtesting.ThreadLeakControl.forkTimeoutingTask(ThreadLeakControl.java:809)
	at com.carrotsearch.randomizedtesting.ThreadLeakControl$3.evaluate(ThreadLeakControl.java:460)
	at com.carrotsearch.randomizedtesting.RandomizedRunner.runSingleTest(RandomizedRunner.java:880)
	at com.carrotsearch.randomizedtesting.RandomizedRunner$5.evaluate(RandomizedRunner.java:781)
	at com.carrotsearch.randomizedtesting.RandomizedRunner$6.evaluate(RandomizedRunner.java:816)
	at com.carrotsearch.randomizedtesting.RandomizedRunner$7.evaluate(RandomizedRunner.java:827)
	at com.carrotsearch.randomizedtesting.rules.StatementAdapter.evaluate(StatementAdapter.java:36)
	at com.carrotsearch.randomizedtesting.rules.SystemPropertiesRestoreRule$1.evaluate(SystemPropertiesRestoreRule.java:57)
	at org.apache.lucene.util.AbstractBeforeAfterRule$1.evaluate(AbstractBeforeAfterRule.java:45)
	at com.carrotsearch.randomizedtesting.rules.StatementAdapter.evaluate(StatementAdapter.java:36)
	at org.apache.lucene.util.TestRuleStoreClassName$1.evaluate(TestRuleStoreClassName.java:41)
	at com.carrotsearch.randomizedtesting.rules.NoShadowingOrOverridesOnMethodsRule$1.evaluate(NoShadowingOrOverridesOnMethodsRule.java:40)
	at com.carrotsearch.randomizedtesting.rules.NoShadowingOrOverridesOnMethodsRule$1.evaluate(NoShadowingOrOverridesOnMethodsRule.java:40)
	at com.carrotsearch.randomizedtesting.rules.StatementAdapter.evaluate(StatementAdapter.java:36)
	at com.carrotsearch.randomizedtesting.rules.StatementAdapter.evaluate(StatementAdapter.java:36)
	at com.carrotsearch.randomizedtesting.rules.StatementAdapter.evaluate(StatementAdapter.java:36)
	at org.apache.lucene.util.TestRuleAssertionsRequired$1.evaluate(TestRuleAssertionsRequired.java:53)
	at org.apache.lucene.util.TestRuleMarkFailure$1.evaluate(TestRuleMarkFailure.java:47)
	at org.apache.lucene.util.TestRuleIgnoreAfterMaxFailures$1.evaluate(TestRuleIgnoreAfterMaxFailures.java:64)
	at org.apache.lucene.util.TestRuleIgnoreTestSuites$1.evaluate(TestRuleIgnoreTestSuites.java:54)
	at com.carrotsearch.randomizedtesting.rules.StatementAdapter.evaluate(StatementAdapter.java:36)
	at com.carrotsearch.randomizedtesting.ThreadLeakControl$StatementRunner.run(ThreadLeakControl.java:367)
	at java.lang.Thread.run(Thread.java:745)




Build Log:
[...truncated 10766 lines...]
   [junit4] Suite: org.apache.solr.update.AutoCommitTest
   [junit4]   2> Creating dataDir: /home/jenkins/workspace/Lucene-Solr-5.5-Linux/solr/build/solr-core/test/J2/temp/solr.update.AutoCommitTest_728D925758F9B45A-001/init-core-data-001
   [junit4]   2> 143989 INFO  (SUITE-AutoCommitTest-seed#[728D925758F9B45A]-worker) [    ] o.a.s.SolrTestCaseJ4 Randomized ssl (false) and clientAuth (true)
   [junit4]   2> 143989 INFO  (SUITE-AutoCommitTest-seed#[728D925758F9B45A]-worker) [    ] o.a.s.SolrTestCaseJ4 ####initCore
   [junit4]   2> 143989 INFO  (SUITE-AutoCommitTest-seed#[728D925758F9B45A]-worker) [    ] o.a.s.c.SolrResourceLoader new SolrResourceLoader for directory: '/home/jenkins/workspace/Lucene-Solr-5.5-Linux/solr/core/src/test-files/solr/collection1'
   [junit4]   2> 143990 INFO  (SUITE-AutoCommitTest-seed#[728D925758F9B45A]-worker) [    ] o.a.s.c.SolrResourceLoader JNDI not configured for solr (NoInitialContextEx)
   [junit4]   2> 143990 INFO  (SUITE-AutoCommitTest-seed#[728D925758F9B45A]-worker) [    ] o.a.s.c.SolrResourceLoader using system property solr.solr.home: /home/jenkins/workspace/Lucene-Solr-5.5-Linux/solr/core/src/test-files/solr
   [junit4]   2> 143990 INFO  (SUITE-AutoCommitTest-seed#[728D925758F9B45A]-worker) [    ] o.a.s.c.SolrResourceLoader Adding 'file:/home/jenkins/workspace/Lucene-Solr-5.5-Linux/solr/core/src/test-files/solr/collection1/lib/classes/' to classloader
   [junit4]   2> 143990 INFO  (SUITE-AutoCommitTest-seed#[728D925758F9B45A]-worker) [    ] o.a.s.c.SolrResourceLoader Adding 'file:/home/jenkins/workspace/Lucene-Solr-5.5-Linux/solr/core/src/test-files/solr/collection1/lib/README' to classloader
   [junit4]   2> 144022 INFO  (SUITE-AutoCommitTest-seed#[728D925758F9B45A]-worker) [    ] o.a.s.c.SolrConfig current version of requestparams : -1
   [junit4]   2> 144046 WARN  (SUITE-AutoCommitTest-seed#[728D925758F9B45A]-worker) [    ] o.a.s.c.Config Beginning with Solr 5.5, <mergePolicy> is deprecated, use <mergePolicyFactory> instead.
   [junit4]   2> 144051 INFO  (SUITE-AutoCommitTest-seed#[728D925758F9B45A]-worker) [    ] o.a.s.c.SolrConfig Using Lucene MatchVersion: 5.5.3
   [junit4]   2> 144091 INFO  (SUITE-AutoCommitTest-seed#[728D925758F9B45A]-worker) [    ] o.a.s.c.SolrConfig Loaded SolrConfig: solrconfig.xml
   [junit4]   2> 144122 INFO  (SUITE-AutoCommitTest-seed#[728D925758F9B45A]-worker) [    ] o.a.s.s.IndexSchema [null] Schema name=test
   [junit4]   2> 144272 INFO  (SUITE-AutoCommitTest-seed#[728D925758F9B45A]-worker) [    ] o.a.s.s.OpenExchangeRatesOrgProvider Initialized with rates=open-exchange-rates.json, refreshInterval=1440.
   [junit4]   2> 144283 INFO  (SUITE-AutoCommitTest-seed#[728D925758F9B45A]-worker) [    ] o.a.s.s.IndexSchema default search field in schema is text
   [junit4]   2> 144292 INFO  (SUITE-AutoCommitTest-seed#[728D925758F9B45A]-worker) [    ] o.a.s.s.IndexSchema unique key field: id
   [junit4]   2> 144300 INFO  (SUITE-AutoCommitTest-seed#[728D925758F9B45A]-worker) [    ] o.a.s.s.FileExchangeRateProvider Reloading exchange rates from file currency.xml
   [junit4]   2> 144304 INFO  (SUITE-AutoCommitTest-seed#[728D925758F9B45A]-worker) [    ] o.a.s.s.FileExchangeRateProvider Reloading exchange rates from file currency.xml
   [junit4]   2> 144307 INFO  (SUITE-AutoCommitTest-seed#[728D925758F9B45A]-worker) [    ] o.a.s.s.OpenExchangeRatesOrgProvider Reloading exchange rates from open-exchange-rates.json
   [junit4]   2> 144307 INFO  (SUITE-AutoCommitTest-seed#[728D925758F9B45A]-worker) [    ] o.a.s.s.OpenExchangeRatesOrgProvider Reloading exchange rates from open-exchange-rates.json
   [junit4]   2> 144308 INFO  (SUITE-AutoCommitTest-seed#[728D925758F9B45A]-worker) [    ] o.a.s.c.SolrResourceLoader JNDI not configured for solr (NoInitialContextEx)
   [junit4]   2> 144308 INFO  (SUITE-AutoCommitTest-seed#[728D925758F9B45A]-worker) [    ] o.a.s.c.SolrResourceLoader using system property solr.solr.home: /home/jenkins/workspace/Lucene-Solr-5.5-Linux/solr/core/src/test-files/solr
   [junit4]   2> 144308 INFO  (SUITE-AutoCommitTest-seed#[728D925758F9B45A]-worker) [    ] o.a.s.c.SolrResourceLoader new SolrResourceLoader for directory: '/home/jenkins/workspace/Lucene-Solr-5.5-Linux/solr/core/src/test-files/solr'
   [junit4]   2> 144308 INFO  (SUITE-AutoCommitTest-seed#[728D925758F9B45A]-worker) [    ] o.a.s.c.SolrResourceLoader JNDI not configured for solr (NoInitialContextEx)
   [junit4]   2> 144308 INFO  (SUITE-AutoCommitTest-seed#[728D925758F9B45A]-worker) [    ] o.a.s.c.SolrResourceLoader using system property solr.solr.home: /home/jenkins/workspace/Lucene-Solr-5.5-Linux/solr/core/src/test-files/solr
   [junit4]   2> 144308 INFO  (SUITE-AutoCommitTest-seed#[728D925758F9B45A]-worker) [    ] o.a.s.c.CoreContainer New CoreContainer 23268916
   [junit4]   2> 144309 INFO  (SUITE-AutoCommitTest-seed#[728D925758F9B45A]-worker) [    ] o.a.s.c.CoreContainer Loading cores into CoreContainer [instanceDir=/home/jenkins/workspace/Lucene-Solr-5.5-Linux/solr/core/src/test-files/solr]
   [junit4]   2> 144309 WARN  (SUITE-AutoCommitTest-seed#[728D925758F9B45A]-worker) [    ] o.a.s.c.CoreContainer Couldn't add files from /home/jenkins/workspace/Lucene-Solr-5.5-Linux/solr/core/src/test-files/solr/lib to classpath: /home/jenkins/workspace/Lucene-Solr-5.5-Linux/solr/core/src/test-files/solr/lib
   [junit4]   2> 144309 INFO  (SUITE-AutoCommitTest-seed#[728D925758F9B45A]-worker) [    ] o.a.s.h.c.HttpShardHandlerFactory created with socketTimeout : 600000,connTimeout : 60000,maxConnectionsPerHost : 20,maxConnections : 10000,corePoolSize : 0,maximumPoolSize : 2147483647,maxThreadIdleTime : 5,sizeOfQueue : -1,fairnessPolicy : false,useRetries : false,connectionsEvictorSleepDelay : 5000,maxConnectionIdleTime : 40000,
   [junit4]   2> 144312 INFO  (SUITE-AutoCommitTest-seed#[728D925758F9B45A]-worker) [    ] o.a.s.u.UpdateShardHandler Creating UpdateShardHandler HTTP client with params: socketTimeout=30000&connTimeout=30000&retry=true
   [junit4]   2> 144313 INFO  (SUITE-AutoCommitTest-seed#[728D925758F9B45A]-worker) [    ] o.a.s.l.LogWatcher SLF4J impl is org.slf4j.impl.Log4jLoggerFactory
   [junit4]   2> 144313 INFO  (SUITE-AutoCommitTest-seed#[728D925758F9B45A]-worker) [    ] o.a.s.l.LogWatcher Registering Log Listener [Log4j (org.slf4j.impl.Log4jLoggerFactory)]
   [junit4]   2> 144313 INFO  (SUITE-AutoCommitTest-seed#[728D925758F9B45A]-worker) [    ] o.a.s.c.CoreContainer Security conf doesn't exist. Skipping setup for authorization module.
   [junit4]   2> 144313 INFO  (SUITE-AutoCommitTest-seed#[728D925758F9B45A]-worker) [    ] o.a.s.c.CoreContainer No authentication plugin used.
   [junit4]   2> 144314 INFO  (SUITE-AutoCommitTest-seed#[728D925758F9B45A]-worker) [    ] o.a.s.c.CoreDescriptor Created CoreDescriptor: {name=collection1, config=solrconfig.xml, transient=false, schema=schema.xml, loadOnStartup=true, configSetProperties=configsetprops.json, collection=collection1, dataDir=/home/jenkins/workspace/Lucene-Solr-5.5-Linux/solr/build/solr-core/test/J2/temp/solr.update.AutoCommitTest_728D925758F9B45A-001/init-core-data-001, shard=shard1}
   [junit4]   2> 144315 INFO  (coreLoadExecutor-573-thread-1) [    ] o.a.s.c.SolrResourceLoader new SolrResourceLoader for directory: '/home/jenkins/workspace/Lucene-Solr-5.5-Linux/solr/core/src/test-files/solr/collection1'
   [junit4]   2> 144315 INFO  (coreLoadExecutor-573-thread-1) [    ] o.a.s.c.SolrResourceLoader JNDI not configured for solr (NoInitialContextEx)
   [junit4]   2> 144315 INFO  (coreLoadExecutor-573-thread-1) [    ] o.a.s.c.SolrResourceLoader using system property solr.solr.home: /home/jenkins/workspace/Lucene-Solr-5.5-Linux/solr/core/src/test-files/solr
   [junit4]   2> 144315 INFO  (coreLoadExecutor-573-thread-1) [    ] o.a.s.c.SolrResourceLoader Adding 'file:/home/jenkins/workspace/Lucene-Solr-5.5-Linux/solr/core/src/test-files/solr/collection1/lib/classes/' to classloader
   [junit4]   2> 144315 INFO  (coreLoadExecutor-573-thread-1) [    ] o.a.s.c.SolrResourceLoader Adding 'file:/home/jenkins/workspace/Lucene-Solr-5.5-Linux/solr/core/src/test-files/solr/collection1/lib/README' to classloader
   [junit4]   2> 144367 INFO  (coreLoadExecutor-573-thread-1) [    ] o.a.s.c.SolrConfig current version of requestparams : -1
   [junit4]   2> 144397 WARN  (coreLoadExecutor-573-thread-1) [    ] o.a.s.c.Config Beginning with Solr 5.5, <mergePolicy> is deprecated, use <mergePolicyFactory> instead.
   [junit4]   2> 144400 INFO  (coreLoadExecutor-573-thread-1) [    ] o.a.s.c.SolrConfig Using Lucene MatchVersion: 5.5.3
   [junit4]   2> 144435 INFO  (coreLoadExecutor-573-thread-1) [    ] o.a.s.c.SolrConfig Loaded SolrConfig: solrconfig.xml
   [junit4]   2> 144447 INFO  (coreLoadExecutor-573-thread-1) [    ] o.a.s.s.IndexSchema [collection1] Schema name=test
   [junit4]   2> 144709 INFO  (coreLoadExecutor-573-thread-1) [    ] o.a.s.s.OpenExchangeRatesOrgProvider Initialized with rates=open-exchange-rates.json, refreshInterval=1440.
   [junit4]   2> 144725 INFO  (coreLoadExecutor-573-thread-1) [    ] o.a.s.s.IndexSchema default search field in schema is text
   [junit4]   2> 144728 INFO  (coreLoadExecutor-573-thread-1) [    ] o.a.s.s.IndexSchema unique key field: id
   [junit4]   2> 144748 INFO  (coreLoadExecutor-573-thread-1) [    ] o.a.s.s.FileExchangeRateProvider Reloading exchange rates from file currency.xml
   [junit4]   2> 144758 INFO  (coreLoadExecutor-573-thread-1) [    ] o.a.s.s.FileExchangeRateProvider Reloading exchange rates from file currency.xml
   [junit4]   2> 144761 INFO  (coreLoadExecutor-573-thread-1) [    ] o.a.s.s.OpenExchangeRatesOrgProvider Reloading exchange rates from open-exchange-rates.json
   [junit4]   2> 144761 INFO  (coreLoadExecutor-573-thread-1) [    ] o.a.s.s.OpenExchangeRatesOrgProvider Reloading exchange rates from open-exchange-rates.json
   [junit4]   2> 144764 INFO  (coreLoadExecutor-573-thread-1) [    ] o.a.s.c.ConfigSetProperties Did not find ConfigSet properties, assuming default properties: Can't find resource 'configsetprops.json' in classpath or '/home/jenkins/workspace/Lucene-Solr-5.5-Linux/solr/core/src/test-files/solr/collection1'
   [junit4]   2> 144764 INFO  (coreLoadExecutor-573-thread-1) [    ] o.a.s.c.CoreContainer Creating SolrCore 'collection1' using configuration from instancedir /home/jenkins/workspace/Lucene-Solr-5.5-Linux/solr/core/src/test-files/solr/collection1
   [junit4]   2> 144765 INFO  (coreLoadExecutor-573-thread-1) [    x:collection1] o.a.s.c.SolrCore org.apache.solr.core.MockDirectoryFactory
   [junit4]   2> 144765 INFO  (coreLoadExecutor-573-thread-1) [    x:collection1] o.a.s.c.SolrCore [[collection1] ] Opening new SolrCore at [/home/jenkins/workspace/Lucene-Solr-5.5-Linux/solr/core/src/test-files/solr/collection1], dataDir=[/home/jenkins/workspace/Lucene-Solr-5.5-Linux/solr/build/solr-core/test/J2/temp/solr.update.AutoCommitTest_728D925758F9B45A-001/init-core-data-001/]
   [junit4]   2> 144765 INFO  (coreLoadExecutor-573-thread-1) [    x:collection1] o.a.s.c.JmxMonitoredMap JMX monitoring is enabled. Adding Solr mbeans to JMX Server: com.sun.jmx.mbeanserver.JmxMBeanServer@aa71a
   [junit4]   2> 144766 INFO  (coreLoadExecutor-573-thread-1) [    x:collection1] o.a.s.c.CachingDirectoryFactory return new directory for /home/jenkins/workspace/Lucene-Solr-5.5-Linux/solr/build/solr-core/test/J2/temp/solr.update.AutoCommitTest_728D925758F9B45A-001/init-core-data-001
   [junit4]   2> 144767 INFO  (coreLoadExecutor-573-thread-1) [    x:collection1] o.a.s.c.SolrCore New index directory detected: old=null new=/home/jenkins/workspace/Lucene-Solr-5.5-Linux/solr/build/solr-core/test/J2/temp/solr.update.AutoCommitTest_728D925758F9B45A-001/init-core-data-001/index/
   [junit4]   2> 144767 WARN  (coreLoadExecutor-573-thread-1) [    x:collection1] o.a.s.c.SolrCore [collection1] Solr index directory '/home/jenkins/workspace/Lucene-Solr-5.5-Linux/solr/build/solr-core/test/J2/temp/solr.update.AutoCommitTest_728D925758F9B45A-001/init-core-data-001/index' doesn't exist. Creating new index...
   [junit4]   2> 144767 INFO  (coreLoadExecutor-573-thread-1) [    x:collection1] o.a.s.c.CachingDirectoryFactory return new directory for /home/jenkins/workspace/Lucene-Solr-5.5-Linux/solr/build/solr-core/test/J2/temp/solr.update.AutoCommitTest_728D925758F9B45A-001/init-core-data-001/index
   [junit4]   2> 144767 INFO  (coreLoadExecutor-573-thread-1) [    x:collection1] o.a.s.u.RandomMergePolicy RandomMergePolicy wrapping class org.apache.lucene.index.TieredMergePolicy: [TieredMergePolicy: maxMergeAtOnce=22, maxMergeAtOnceExplicit=27, maxMergedSegmentMB=74.23828125, floorSegmentMB=0.9482421875, forceMergeDeletesPctAllowed=16.264205757081278, segmentsPerTier=17.0, maxCFSSegmentSizeMB=8.796093022207999E12, noCFSRatio=0.0
   [junit4]   2> 144768 INFO  (coreLoadExecutor-573-thread-1) [    x:collection1] o.a.s.c.SolrDeletionPolicy SolrDeletionPolicy.onCommit: commits: num=1
   [junit4]   2> 	commit{dir=MockDirectoryWrapper(RAMDirectory@e509de lockFactory=org.apache.lucene.store.SingleInstanceLockFactory@5dd033),segFN=segments_1,generation=1}
   [junit4]   2> 144768 INFO  (coreLoadExecutor-573-thread-1) [    x:collection1] o.a.s.c.SolrDeletionPolicy newest commit generation = 1
   [junit4]   2> 144768 INFO  (OldIndexDirectoryCleanupThreadForCore-collection1) [    x:collection1] o.a.s.c.SolrCore Looking for old index directories to cleanup for core collection1 in /home/jenkins/workspace/Lucene-Solr-5.5-Linux/solr/build/solr-core/test/J2/temp/solr.update.AutoCommitTest_728D925758F9B45A-001/init-core-data-001/
   [junit4]   2> 144777 INFO  (coreLoadExecutor-573-thread-1) [    x:collection1] o.a.s.u.p.UpdateRequestProcessorChain creating updateRequestProcessorChain "dedupe"
   [junit4]   2> 144777 INFO  (coreLoadExecutor-573-thread-1) [    x:collection1] o.a.s.u.p.UpdateRequestProcessorChain inserting DistributedUpdateProcessorFactory into updateRequestProcessorChain "dedupe"
   [junit4]   2> 144777 INFO  (coreLoadExecutor-573-thread-1) [    x:collection1] o.a.s.u.p.UpdateRequestProcessorChain creating updateRequestProcessorChain "dedupe-allfields"
   [junit4]   2> 144777 INFO  (coreLoadExecutor-573-thread-1) [    x:collection1] o.a.s.u.p.UpdateRequestProcessorChain inserting DistributedUpdateProcessorFactory into updateRequestProcessorChain "dedupe-allfields"
   [junit4]   2> 144777 INFO  (coreLoadExecutor-573-thread-1) [    x:collection1] o.a.s.u.p.UpdateRequestProcessorChain creating updateRequestProcessorChain "stored_sig"
   [junit4]   2> 144778 INFO  (coreLoadExecutor-573-thread-1) [    x:collection1] o.a.s.u.p.UpdateRequestProcessorChain inserting DistributedUpdateProcessorFactory into updateRequestProcessorChain "stored_sig"
   [junit4]   2> 144778 INFO  (coreLoadExecutor-573-thread-1) [    x:collection1] o.a.s.u.p.UpdateRequestProcessorChain creating updateRequestProcessorChain "uniq-fields"
   [junit4]   2> 144778 INFO  (coreLoadExecutor-573-thread-1) [    x:collection1] o.a.s.u.p.UpdateRequestProcessorChain inserting DistributedUpdateProcessorFactory into updateRequestProcessorChain "uniq-fields"
   [junit4]   2> 144778 INFO  (coreLoadExecutor-573-thread-1) [    x:collection1] o.a.s.u.p.UpdateRequestProcessorChain creating updateRequestProcessorChain "distrib-dup-test-chain-explicit"
   [junit4]   2> 144779 INFO  (coreLoadExecutor-573-thread-1) [    x:collection1] o.a.s.u.p.UpdateRequestProcessorChain creating updateRequestProcessorChain "distrib-dup-test-chain-implicit"
   [junit4]   2> 144779 INFO  (coreLoadExecutor-573-thread-1) [    x:collection1] o.a.s.u.p.UpdateRequestProcessorChain inserting DistributedUpdateProcessorFactory into updateRequestProcessorChain "distrib-dup-test-chain-implicit"
   [junit4]   2> 144779 INFO  (coreLoadExecutor-573-thread-1) [    x:collection1] o.a.s.c.SolrCore no updateRequestProcessorChain defined as default, creating implicit default
   [junit4]   2> 144781 INFO  (coreLoadExecutor-573-thread-1) [    x:collection1] o.a.s.h.l.XMLLoader xsltCacheLifetimeSeconds=60
   [junit4]   2> 144783 INFO  (coreLoadExecutor-573-thread-1) [    x:collection1] o.a.s.h.l.XMLLoader xsltCacheLifetimeSeconds=60
   [junit4]   2> 144784 INFO  (coreLoadExecutor-573-thread-1) [    x:collection1] o.a.s.h.l.XMLLoader xsltCacheLifetimeSeconds=60
   [junit4]   2> 144786 INFO  (coreLoadExecutor-573-thread-1) [    x:collection1] o.a.s.h.l.XMLLoader xsltCacheLifetimeSeconds=60
   [junit4]   2> 144804 INFO  (coreLoadExecutor-573-thread-1) [    x:collection1] o.a.s.c.PluginBag requestHandler : 'lazy' created with startup=lazy 
   [junit4]   2> 144816 INFO  (coreLoadExecutor-573-thread-1) [    x:collection1] o.a.s.c.RequestHandlers Registered paths: /admin/mbeans,standard,spellCheckCompRH,lazy,/update/json/docs,/admin/luke,spellCheckWithWordbreak_Direct,tvrh,/get,/admin/properties,/update/json,mltrh,/admin/threads,/search-facet-def,/update/csv,/search-facet-invariants,/admin/segments,spellCheckCompRH1,/mlt,/admin/system,/replication,dismax,defaults,/config,/schema,/admin/plugins,/admin/logging,spellCheckWithWordbreak,mock,/admin/ping,/update,/admin/file,/terms,spellCheckCompRH_Direct,/debug/dump
   [junit4]   2> 144816 WARN  (coreLoadExecutor-573-thread-1) [    x:collection1] o.a.s.c.SolrCore solrconfig.xml uses deprecated <admin/gettableFiles>, Please update your config to use the ShowFileRequestHandler.
   [junit4]   2> 144817 INFO  (coreLoadExecutor-573-thread-1) [    x:collection1] o.a.s.c.SolrCore Using default statsCache cache: org.apache.solr.search.stats.LocalStatsCache
   [junit4]   2> 144817 INFO  (coreLoadExecutor-573-thread-1) [    x:collection1] o.a.s.u.UpdateHandler Using UpdateLog implementation: org.apache.solr.update.UpdateLog
   [junit4]   2> 144817 INFO  (coreLoadExecutor-573-thread-1) [    x:collection1] o.a.s.u.UpdateLog Initializing UpdateLog: dataDir= defaultSyncLevel=FLUSH numRecordsToKeep=100 maxNumLogsToKeep=10 numVersionBuckets=65536
   [junit4]   2> 144819 INFO  (coreLoadExecutor-573-thread-1) [    x:collection1] o.a.s.u.CommitTracker Hard AutoCommit: disabled
   [junit4]   2> 144819 INFO  (coreLoadExecutor-573-thread-1) [    x:collection1] o.a.s.u.CommitTracker Soft AutoCommit: disabled
   [junit4]   2> 144820 INFO  (coreLoadExecutor-573-thread-1) [    x:collection1] o.a.s.u.RandomMergePolicy RandomMergePolicy wrapping class org.apache.lucene.index.TieredMergePolicy: [TieredMergePolicy: maxMergeAtOnce=42, maxMergeAtOnceExplicit=45, maxMergedSegmentMB=0.0380859375, floorSegmentMB=1.78515625, forceMergeDeletesPctAllowed=6.260121078290094, segmentsPerTier=18.0, maxCFSSegmentSizeMB=8.796093022207999E12, noCFSRatio=0.5081919591895759
   [junit4]   2> 144820 INFO  (coreLoadExecutor-573-thread-1) [    x:collection1] o.a.s.c.SolrDeletionPolicy SolrDeletionPolicy.onInit: commits: num=1
   [junit4]   2> 	commit{dir=MockDirectoryWrapper(RAMDirectory@e509de lockFactory=org.apache.lucene.store.SingleInstanceLockFactory@5dd033),segFN=segments_1,generation=1}
   [junit4]   2> 144820 INFO  (coreLoadExecutor-573-thread-1) [    x:collection1] o.a.s.c.SolrDeletionPolicy newest commit generation = 1
   [junit4]   2> 144820 INFO  (coreLoadExecutor-573-thread-1) [    x:collection1] o.a.s.s.SolrIndexSearcher Opening Searcher@18044f3[collection1] main
   [junit4]   2> 144820 INFO  (coreLoadExecutor-573-thread-1) [    x:collection1] o.a.s.r.RestManager Initializing RestManager with initArgs: {storageIO=org.apache.solr.rest.ManagedResourceStorage$InMemoryStorageIO}
   [junit4]   2> 144821 INFO  (coreLoadExecutor-573-thread-1) [    x:collection1] o.a.s.r.ManagedResourceStorage Reading _rest_managed.json using InMemoryStorage
   [junit4]   2> 144821 INFO  (coreLoadExecutor-573-thread-1) [    x:collection1] o.a.s.r.RestManager Initializing 0 registered ManagedResources
   [junit4]   2> 144821 INFO  (coreLoadExecutor-573-thread-1) [    x:collection1] o.a.s.h.c.SpellCheckComponent Initializing spell checkers
   [junit4]   2> 144859 INFO  (coreLoadExecutor-573-thread-1) [    x:collection1] o.a.s.s.DirectSolrSpellChecker init: {name=direct,classname=DirectSolrSpellChecker,field=lowerfilt,minQueryLength=3}
   [junit4]   2> 145045 INFO  (coreLoadExecutor-573-thread-1) [    x:collection1] o.a.s.h.ReplicationHandler Commits will be reserved for  10000
   [junit4]   2> 145045 INFO  (searcherExecutor-574-thread-1-processing-x:collection1) [    x:collection1] o.a.s.h.c.SpellCheckComponent Loading spell index for spellchecker: default
   [junit4]   2> 145046 INFO  (searcherExecutor-574-thread-1-processing-x:collection1) [    x:collection1] o.a.s.h.c.SpellCheckComponent Loading spell index for spellchecker: direct
   [junit4]   2> 145046 INFO  (searcherExecutor-574-thread-1-processing-x:collection1) [    x:collection1] o.a.s.h.c.SpellCheckComponent Loading spell index for spellchecker: wordbreak
   [junit4]   2> 145046 INFO  (searcherExecutor-574-thread-1-processing-x:collection1) [    x:collection1] o.a.s.h.c.SpellCheckComponent Loading spell index for spellchecker: multipleFields
   [junit4]   2> 145046 INFO  (searcherExecutor-574-thread-1-processing-x:collection1) [    x:collection1] o.a.s.h.c.SpellCheckComponent Loading spell index for spellchecker: jarowinkler
   [junit4]   2> 145047 INFO  (searcherExecutor-574-thread-1-processing-x:collection1) [    x:collection1] o.a.s.h.c.SpellCheckComponent Loading spell index for spellchecker: external
   [junit4]   2> 145047 INFO  (searcherExecutor-574-thread-1-processing-x:collection1) [    x:collection1] o.a.s.h.c.SpellCheckComponent Loading spell index for spellchecker: freq
   [junit4]   2> 145047 INFO  (searcherExecutor-574-thread-1-processing-x:collection1) [    x:collection1] o.a.s.h.c.SpellCheckComponent Loading spell index for spellchecker: fqcn
   [junit4]   2> 145047 INFO  (coreLoadExecutor-573-thread-1) [    x:collection1] o.a.s.u.UpdateLog Looking up max value of version field to seed version buckets
   [junit4]   2> 145047 INFO  (searcherExecutor-574-thread-1-processing-x:collection1) [    x:collection1] o.a.s.h.c.SpellCheckComponent Loading spell index for spellchecker: perDict
   [junit4]   2> 145047 INFO  (coreLoadExecutor-573-thread-1) [    x:collection1] o.a.s.u.VersionInfo Refreshing highest value of _version_ for 65536 version buckets from index
   [junit4]   2> 145047 INFO  (coreLoadExecutor-573-thread-1) [    x:collection1] o.a.s.u.VersionInfo No terms found for _version_, cannot seed version bucket highest value from index
   [junit4]   2> 145048 INFO  (coreLoadExecutor-573-thread-1) [    x:collection1] o.a.s.u.UpdateLog Could not find max version in index or recent updates, using new clock 1545211562189389824
   [junit4]   2> 145049 INFO  (searcherExecutor-574-thread-1-processing-x:collection1) [    x:collection1] o.a.s.c.SolrCore [collection1] Registered new searcher Searcher@18044f3[collection1] main{ExitableDirectoryReader(UninvertingDirectoryReader())}
   [junit4]   2> 145050 INFO  (coreLoadExecutor-573-thread-1) [    x:collection1] o.a.s.u.UpdateLog Took 2.0ms to seed version buckets with highest version 1545211562189389824
   [junit4]   2> 145050 INFO  (coreLoadExecutor-573-thread-1) [    x:collection1] o.a.s.c.CoreContainer registering core: collection1
   [junit4]   2> 145052 INFO  (SUITE-AutoCommitTest-seed#[728D925758F9B45A]-worker) [    ] o.a.s.SolrTestCaseJ4 ####initCore end
   [junit4]   2> 145055 INFO  (TEST-AutoCommitTest.testCommitWithin-seed#[728D925758F9B45A]) [    ] o.a.s.SolrTestCaseJ4 ###Starting testCommitWithin
   [junit4]   2> 145057 INFO  (TEST-AutoCommitTest.testCommitWithin-seed#[728D925758F9B45A]) [    ] o.a.s.u.p.LogUpdateProcessorFactory [collection1]  webapp=null path=null params={}{deleteByQuery=*:* (-1545211562196729856)} 0 2
   [junit4]   2> 145061 INFO  (TEST-AutoCommitTest.testCommitWithin-seed#[728D925758F9B45A]) [    ] o.a.s.c.SolrResourceLoader new SolrResourceLoader for directory: '/home/jenkins/workspace/Lucene-Solr-5.5-Linux/solr/core/src/test-files/solr/collection1'
   [junit4]   2> 145061 INFO  (TEST-AutoCommitTest.testCommitWithin-seed#[728D925758F9B45A]) [    ] o.a.s.c.SolrResourceLoader JNDI not configured for solr (NoInitialContextEx)
   [junit4]   2> 145061 INFO  (TEST-AutoCommitTest.testCommitWithin-seed#[728D925758F9B45A]) [    ] o.a.s.c.SolrResourceLoader using system property solr.solr.home: /home/jenkins/workspace/Lucene-Solr-5.5-Linux/solr/core/src/test-files/solr
   [junit4]   2> 145062 INFO  (TEST-AutoCommitTest.testCommitWithin-seed#[728D925758F9B45A]) [    ] o.a.s.c.SolrResourceLoader Adding 'file:/home/jenkins/workspace/Lucene-Solr-5.5-Linux/solr/core/src/test-files/solr/collection1/lib/classes/' to classloader
   [junit4]   2> 145062 INFO  (TEST-AutoCommitTest.testCommitWithin-seed#[728D925758F9B45A]) [    ] o.a.s.c.SolrResourceLoader Adding 'file:/home/jenkins/workspace/Lucene-Solr-5.5-Linux/solr/core/src/test-files/solr/collection1/lib/README' to classloader
   [junit4]   2> 145109 INFO  (TEST-AutoCommitTest.testCommitWithin-seed#[728D925758F9B45A]) [    ] o.a.s.c.SolrConfig current version of requestparams : -1
   [junit4]   2> 145120 WARN  (TEST-AutoCommitTest.testCommitWithin-seed#[728D925758F9B45A]) [    ] o.a.s.c.Config Beginning with Solr 5.5, <mergePolicy> is deprecated, use <mergePolicyFactory> instead.
   [junit4]   2> 145122 INFO  (TEST-AutoCommitTest.testCommitWithin-seed#[728D925758F9B45A]) [    ] o.a.s.c.SolrConfig Using Lucene MatchVersion: 5.5.3
   [junit4]   2> 145153 INFO  (TEST-AutoCommitTest.testCommitWithin-seed#[728D925758F9B45A]) [    ] o.a.s.c.SolrConfig Loaded SolrConfig: solrconfig.xml
   [junit4]   2> 145161 INFO  (TEST-AutoCommitTest.testCommitWithin-seed#[728D925758F9B45A]) [    ] o.a.s.s.IndexSchema [collection1] Schema name=test
   [junit4]   2> 145303 INFO  (TEST-AutoCommitTest.testCommitWithin-seed#[728D925758F9B45A]) [    ] o.a.s.s.OpenExchangeRatesOrgProvider Initialized with rates=open-exchange-rates.json, refreshInterval=1440.
   [junit4]   2> 145316 INFO  (TEST-AutoCommitTest.testCommitWithin-seed#[728D925758F9B45A]) [    ] o.a.s.s.IndexSchema default search field in schema is text
   [junit4]   2> 145319 INFO  (TEST-AutoCommitTest.testCommitWithin-seed#[728D925758F9B45A]) [    ] o.a.s.s.IndexSchema unique key field: id
   [junit4]   2> 145333 INFO  (TEST-AutoCommitTest.testCommitWithin-seed#[728D925758F9B45A]) [    ] o.a.s.s.FileExchangeRateProvider Reloading exchange rates from file currency.xml
   [junit4]   2> 145336 INFO  (TEST-AutoCommitTest.testCommitWithin-seed#[728D925758F9B45A]) [    ] o.a.s.s.FileExchangeRateProvider Reloading exchange rates from file currency.xml
   [junit4]   2> 145344 INFO  (TEST-AutoCommitTest.testCommitWithin-seed#[728D925758F9B45A]) [    ] o.a.s.s.OpenExchangeRatesOrgProvider Reloading exchange rates from open-exchange-rates.json
   [junit4]   2> 145344 INFO  (TEST-AutoCommitTest.testCommitWithin-seed#[728D925758F9B45A]) [    ] o.a.s.s.OpenExchangeRatesOrgProvider Reloading exchange rates from open-exchange-rates.json
   [junit4]   2> 145348 INFO  (TEST-AutoCommitTest.testCommitWithin-seed#[728D925758F9B45A]) [    ] o.a.s.c.ConfigSetProperties Did not find ConfigSet properties, assuming default properties: Can't find resource 'configsetprops.json' in classpath or '/home/jenkins/workspace/Lucene-Solr-5.5-Linux/solr/core/src/test-files/solr/collection1'
   [junit4]   2> 145348 INFO  (TEST-AutoCommitTest.testCommitWithin-seed#[728D925758F9B45A]) [    ] o.a.s.c.CoreContainer Reloading SolrCore 'collection1' using configuration from instancedir /home/jenkins/workspace/Lucene-Solr-5.5-Linux/solr/core/src/test-files/solr/collection1
   [junit4]   2> 145349 INFO  (TEST-AutoCommitTest.testCommitWithin-seed#[728D925758F9B45A]) [    x:collection1] o.a.s.c.SolrCore [[collection1] ] Opening new SolrCore at [/home/jenkins/workspace/Lucene-Solr-5.5-Linux/solr/core/src/test-files/solr/collection1], dataDir=[/home/jenkins/workspace/Lucene-Solr-5.5-Linux/solr/build/solr-core/test/J2/temp/solr.update.AutoCommitTest_728D925758F9B45A-001/init-core-data-001/]
   [junit4]   2> 145349 INFO  (TEST-AutoCommitTest.testCommitWithin-seed#[728D925758F9B45A]) [    x:collection1] o.a.s.c.JmxMonitoredMap JMX monitoring is enabled. Adding Solr mbeans to JMX Server: com.sun.jmx.mbeanserver.JmxMBeanServer@aa71a
   [junit4]   2> 145350 INFO  (TEST-AutoCommitTest.testCommitWithin-seed#[728D925758F9B45A]) [    x:collection1] o.a.s.c.SolrCore New index directory detected: old=null new=/home/jenkins/workspace/Lucene-Solr-5.5-Linux/solr/build/solr-core/test/J2/temp/solr.update.AutoCommitTest_728D925758F9B45A-001/init-core-data-001/index/
   [junit4]   2> 145351 INFO  (OldIndexDirectoryCleanupThreadForCore-collection1) [    x:collection1] o.a.s.c.SolrCore Looking for old index directories to cleanup for core collection1 in /home/jenkins/workspace/Lucene-Solr-5.5-Linux/solr/build/solr-core/test/J2/temp/solr.update.AutoCommitTest_728D925758F9B45A-001/init-core-data-001/
   [junit4]   2> 145364 INFO  (TEST-AutoCommitTest.testCommitWithin-seed#[728D925758F9B45A]) [    x:collection1] o.a.s.u.p.UpdateRequestProcessorChain creating updateRequestProcessorChain "dedupe"
   [junit4]   2> 145364 INFO  (TEST-AutoCommitTest.testCommitWithin-seed#[728D925758F9B45A]) [    x:collection1] o.a.s.u.p.UpdateRequestProcessorChain inserting DistributedUpdateProcessorFactory into updateRequestProcessorChain "dedupe"
   [junit4]   2> 145365 INFO  (TEST-AutoCommitTest.testCommitWithin-seed#[728D925758F9B45A]) [    x:collection1] o.a.s.u.p.UpdateRequestProcessorChain creating updateRequestProcessorChain "dedupe-allfields"
   [junit4]   2> 145365 INFO  (TEST-AutoCommitTest.testCommitWithin-seed#[728D925758F9B45A]) [    x:collection1] o.a.s.u.p.UpdateRequestProcessorChain inserting DistributedUpdateProcessorFactory into updateRequestProcessorChain "dedupe-allfields"
   [junit4]   2> 145365 INFO  (TEST-AutoCommitTest.testCommitWithin-seed#[728D925758F9B45A]) [    x:collection1] o.a.s.u.p.UpdateRequestProcessorChain creating updateRequestProcessorChain "stored_sig"
   [junit4]   2> 145365 INFO  (TEST-AutoCommitTest.testCommitWithin-seed#[728D925758F9B45A]) [    x:collection1] o.a.s.u.p.UpdateRequestProcessorChain inserting DistributedUpdateProcessorFactory into updateRequestProcessorChain "stored_sig"
   [junit4]   2> 145366 INFO  (TEST-AutoCommitTest.testCommitWithin-seed#[728D925758F9B45A]) [    x:collection1] o.a.s.u.p.UpdateRequestProcessorChain creating updateRequestProcessorChain "uniq-fields"
   [junit4]   2> 145367 INFO  (TEST-AutoCommitTest.testCommitWithin-seed#[728D925758F9B45A]) [    x:collection1] o.a.s.u.p.UpdateRequestProcessorChain inserting DistributedUpdateProcessorFactory into updateRequestProcessorChain "uniq-fields"
   [junit4]   2> 145367 INFO  (TEST-AutoCommitTest.testCommitWithin-seed#[728D925758F9B45A]) [    x:collection1] o.a.s.u.p.UpdateRequestProcessorChain creating updateRequestProcessorChain "distrib-dup-test-chain-explicit"
   [junit4]   2> 145367 INFO  (TEST-AutoCommitTest.testCommitWithin-seed#[728D925758F9B45A]) [    x:collection1] o.a.s.u.p.UpdateRequestProcessorChain creating updateRequestProcessorChain "distrib-dup-test-chain-implicit"
   [junit4]   2> 145368 INFO  (TEST-AutoCommitTest.testCommitWithin-seed#[728D925758F9B45A]) [    x:collection1] o.a.s.u.p.UpdateRequestProcessorChain inserting DistributedUpdateProcessorFactory into updateRequestProcessorChain "distrib-dup-test-chain-implicit"
   [junit4]   2> 145368 INFO  (TEST-AutoCommitTest.testCommitWithin-seed#[728D925758F9B45A]) [    x:collection1] o.a.s.c.SolrCore no updateRequestProcessorChain defined as default, creating implicit default
   [junit4]   2> 145371 INFO  (TEST-AutoCommitTest.testCommitWithin-seed#[728D925758F9B45A]) [    x:collection1] o.a.s.h.l.XMLLoader xsltCacheLifetimeSeconds=60
   [junit4]   2> 145374 INFO  (TEST-AutoCommitTest.testCommitWithin-seed#[728D925758F9B45A]) [    x:collection1] o.a.s.h.l.XMLLoader xsltCacheLifetimeSeconds=60
   [junit4]   2> 145377 INFO  (TEST-AutoCommitTest.testCommitWithin-seed#[728D925758F9B45A]) [    x:collection1] o.a.s.h.l.XMLLoader xsltCacheLifetimeSeconds=60
   [junit4]   2> 145395 INFO  (TEST-AutoCommitTest.testCommitWithin-seed#[728D925758F9B45A]) [    x:collection1] o.a.s.h.l.XMLLoader xsltCacheLifetimeSeconds=60
   [junit4]   2> 145414 INFO  (TEST-AutoCommitTest.testCommitWithin-seed#[728D925758F9B45A]) [    x:collection1] o.a.s.c.PluginBag requestHandler : 'lazy' created with startup=lazy 
   [junit4]   2> 145423 INFO  (TEST-AutoCommitTest.testCommitWithin-seed#[728D925758F9B45A]) [    x:collection1] o.a.s.c.RequestHandlers Registered paths: /admin/mbeans,standard,spellCheckCompRH,lazy,/update/json/docs,/admin/luke,spellCheckWithWordbreak_Direct,tvrh,/get,/admin/properties,/update/json,mltrh,/admin/threads,/search-facet-def,/update/csv,/search-facet-invariants,/admin/segments,spellCheckCompRH1,/mlt,/admin/system,/replication,dismax,defaults,/config,/schema,/admin/plugins,/admin/logging,spellCheckWithWordbreak,mock,/admin/ping,/update,/admin/file,/terms,spellCheckCompRH_Direct,/debug/dump
   [junit4]   2> 145423 WARN  (TEST-AutoCommitTest.testCommitWithin-seed#[728D925758F9B45A]) [    x:collection1] o.a.s.c.SolrCore solrconfig.xml uses deprecated <admin/gettableFiles>, Please update your config to use the ShowFileRequestHandler.
   [junit4]   2> 145424 INFO  (TEST-AutoCommitTest.testCommitWithin-seed#[728D925758F9B45A]) [    x:collection1] o.a.s.c.SolrCore Using default statsCache cache: org.apache.solr.search.stats.LocalStatsCache
   [junit4]   2> 145424 INFO  (TEST-AutoCommitTest.testCommitWithin-seed#[728D925758F9B45A]) [    x:collection1] o.a.s.u.CommitTracker Hard AutoCommit: disabled
   [junit4]   2> 145424 INFO  (TEST-AutoCommitTest.testCommitWithin-seed#[728D925758F9B45A]) [    x:collection1] o.a.s.u.CommitTracker Soft AutoCommit: disabled
   [junit4]   2> 145425 INFO  (TEST-AutoCommitTest.testCommitWithin-seed#[728D925758F9B45A]) [    x:collection1] o.a.s.s.SolrIndexSearcher Opening Searcher@1cc53fd[collection1] main
   [junit4]   2> 145425 INFO  (TEST-AutoCommitTest.testCommitWithin-seed#[728D925758F9B45A]) [    x:collection1] o.a.s.r.RestManager Initializing RestManager with initArgs: {storageIO=org.apache.solr.rest.ManagedResourceStorage$InMemoryStorageIO}
   [junit4]   2> 145425 INFO  (TEST-AutoCommitTest.testCommitWithin-seed#[728D925758F9B45A]) [    x:collection1] o.a.s.r.ManagedResourceStorage Reading _rest_managed.json using InMemoryStorage
   [junit4]   2> 145425 INFO  (TEST-AutoCommitTest.testCommitWithin-seed#[728D925758F9B45A]) [    x:collection1] o.a.s.r.RestManager Initializing 0 registered ManagedResources
   [junit4]   2> 145425 INFO  (TEST-AutoCommitTest.testCommitWithin-seed#[728D925758F9B45A]) [    x:collection1] o.a.s.h.c.SpellCheckComponent Initializing spell checkers
   [junit4]   2> 145426 INFO  (TEST-AutoCommitTest.testCommitWithin-seed#[728D925758F9B45A]) [    x:collection1] o.a.s.s.DirectSolrSpellChecker init: {name=direct,classname=DirectSolrSpellChecker,field=lowerfilt,minQueryLength=3}
   [junit4]   2> 145437 INFO  (TEST-AutoCommitTest.testCommitWithin-seed#[728D925758F9B45A]) [    x:collection1] o.a.s.h.ReplicationHandler Commits will be reserved for  10000
   [junit4]   2> 145437 INFO  (searcherExecutor-579-thread-1-processing-x:collection1) [    x:collection1] o.a.s.h.c.SpellCheckComponent Loading spell index for spellchecker: default
   [junit4]   2> 145438 INFO  (searcherExecutor-579-thread-1-processing-x:collection1) [    x:collection1] o.a.s.h.c.SpellCheckComponent Loading spell index for spellchecker: direct
   [junit4]   2> 145438 INFO  (searcherExecutor-579-thread-1-processing-x:collection1) [    x:collection1] o.a.s.h.c.SpellCheckComponent Loading spell index for spellchecker: wordbreak
   [junit4]   2> 145438 INFO  (searcherExecutor-579-thread-1-processing-x:collection1) [    x:collection1] o.a.s.h.c.SpellCheckComponent Loading spell index for spellchecker: multipleFields
   [junit4]   2> 145438 INFO  (searcherExecutor-579-thread-1-processing-x:collection1) [    x:collection1] o.a.s.h.c.SpellCheckComponent Loading spell index for spellchecker: jarowinkler
   [junit4]   2> 145439 INFO  (searcherExecutor-579-thread-1-processing-x:collection1) [    x:collection1] o.a.s.h.c.SpellCheckComponent Loading spell index for spellchecker: external
   [junit4]   2> 145439 INFO  (searcherExecutor-579-thread-1-processing-x:collection1) [    x:collection1] o.a.s.h.c.SpellCheckComponent Loading spell index for spellchecker: freq
   [junit4]   2> 145439 INFO  (searcherExecutor-579-thread-1-processing-x:collection1) [    x:collection1] o.a.s.h.c.SpellCheckComponent Loading spell index for spellchecker: fqcn
   [junit4]   2> 145439 INFO  (TEST-AutoCommitTest.testCommitWithin-seed#[728D925758F9B45A]) [    x:collection1] o.a.s.u.UpdateLog Looking up max value of version field to seed version buckets
   [junit4]   2> 145439 INFO  (searcherExecutor-579-thread-1-processing-x:collection1) [    x:collection1] o.a.s.h.c.SpellCheckComponent Loading spell index for spellchecker: perDict
   [junit4]   2> 145439 INFO  (TEST-AutoCommitTest.testCommitWithin-seed#[728D925758F9B45A]) [    x:collection1] o.a.s.u.VersionInfo Refreshing highest value of _version_ for 65536 version buckets from index
   [junit4]   2> 145439 INFO  (TEST-AutoCommitTest.testCommitWithin-seed#[728D925758F9B45A]) [    x:collection1] o.a.s.u.VersionInfo No terms found for _version_, cannot seed version bucket highest value from index
   [junit4]   2> 145441 INFO  (TEST-AutoCommitTest.testCommitWithin-seed#[728D925758F9B45A]) [    x:collection1] o.a.s.u.UpdateLog Took 1.0ms to seed version buckets with highest version 1545211562196729856
   [junit4]   2> 145441 INFO  (searcherExecutor-579-thread-1-processing-x:collection1) [    x:collection1] o.a.s.c.SolrCore [collection1] Registered new searcher Searcher@1cc53fd[collection1] main{ExitableDirectoryReader(UninvertingDirectoryReader())}
   [junit4]   2> 145441 INFO  (TEST-AutoCommitTest.testCommitWithin-seed#[728D925758F9B45A]) [    x:collection1] o.a.s.u.DefaultSolrCoreState Closing old IndexWriter... core=collection1
   [junit4]   2> 145442 INFO  (TEST-AutoCommitTest.testCommitWithin-seed#[728D925758F9B45A]) [    x:collection1] o.a.s.u.RandomMergePolicy RandomMergePolicy wrapping class org.apache.lucene.index.TieredMergePolicy: [TieredMergePolicy: maxMergeAtOnce=26, maxMergeAtOnceExplicit=45, maxMergedSegmentMB=87.9765625, floorSegmentMB=2.1103515625, forceMergeDeletesPctAllowed=19.143411489865226, segmentsPerTier=37.0, maxCFSSegmentSizeMB=8.796093022207999E12, noCFSRatio=0.481580978759534
   [junit4]   2> 145442 INFO  (TEST-AutoCommitTest.testCommitWithin-seed#[728D925758F9B45A]) [    x:collection1] o.a.s.c.SolrDeletionPolicy SolrDeletionPolicy.onInit: commits: num=1
   [junit4]   2> 	commit{dir=MockDirectoryWrapper(RAMDirectory@e509de lockFactory=org.apache.lucene.store.SingleInstanceLockFactory@5dd033),segFN=segments_1,generation=1}
   [junit4]   2> 145443 INFO  (TEST-AutoCommitTest.testCommitWithin-seed#[728D925758F9B45A]) [    x:collection1] o.a.s.c.SolrDeletionPolicy newest commit generation = 1
   [junit4]   2> 145443 INFO  (TEST-AutoCommitTest.testCommitWithin-seed#[728D925758F9B45A]) [    x:collection1] o.a.s.u.DefaultSolrCoreState New IndexWriter is ready to be used.
   [junit4]   2> 145443 INFO  (TEST-AutoCommitTest.testCommitWithin-seed#[728D925758F9B45A]) [    x:collection1] o.a.s.s.SolrIndexSearcher Opening Searcher@45f4d3[collection1] main
   [junit4]   2> 145443 INFO  (TEST-AutoCommitTest.testCommitWithin-seed#[728D925758F9B45A]) [    x:collection1] o.a.s.c.CoreContainer replacing core: collection1
   [junit4]   2> 145443 INFO  (TEST-AutoCommitTest.testCommitWithin-seed#[728D925758F9B45A]) [    x:collection1] o.a.s.c.SolrCore [collection1]  CLOSING SolrCore org.apache.solr.core.SolrCore@1b7c7f8
   [junit4]   2> 145443 INFO  (TEST-AutoCommitTest.testCommitWithin-seed#[728D925758F9B45A]) [    x:collection1] o.a.s.u.DirectUpdateHandler2 closing DirectUpdateHandler2{commits=0,autocommits=0,soft autocommits=0,optimizes=0,rollbacks=0,expungeDeletes=0,docsPending=0,adds=0,deletesById=0,deletesByQuery=1,errors=0,cumulative_adds=0,cumulative_deletesById=0,cumulative_deletesByQuery=1,cumulative_errors=0,transaction_logs_total_size=0,transaction_logs_total_number=0}
   [junit4]   2> 145444 INFO  (TEST-AutoCommitTest.testCommitWithin-seed#[728D925758F9B45A]) [    x:collection1] o.a.s.c.SolrCore [collection1] Closing main searcher on request.
   [junit4]   2> 145447 INFO  (searcherExecutor-579-thread-1-processing-x:collection1) [    x:collection1] o.a.s.c.SolrCore [collection1] Registered new searcher Searcher@45f4d3[collection1] main{ExitableDirectoryReader(UninvertingDirectoryReader())}
   [junit4]   2> 145469 INFO  (TEST-AutoCommitTest.testCommitWithin-seed#[728D925758F9B45A]) [    x:collection1] o.a.s.u.p.LogUpdateProcessorFactory [collection1] {add=[529 (1545211562628743168)]} 0 2
   [junit4]   2> 145470 INFO  (TEST-AutoCommitTest.testCommitWithin-seed#[728D925758F9B45A]) [    x:collection1] o.a.s.c.S.Request [collection1]  webapp=null path=null params={q=id:529&qt=standard&start=0&rows=20&version=2.2} hits=0 status=0 QTime=0
   [junit4]   2> 149469 INFO  (commitScheduler-582-thread-1) [    x:collection1] o.a.s.u.DirectUpdateHandler2 start commit{,optimize=false,openSearcher=true,waitSearcher=true,expungeDeletes=false,softCommit=true,prepareCommit=false}
   [junit4]   2> 149485 INFO  (commitScheduler-582-thread-1) [    x:collection1] o.a.s.s.SolrIndexSearcher Opening Searcher@173c6b6[collection1] main
   [junit4]   2> 149485 INFO  (commitScheduler-582-thread-1) [    x:collection1] o.a.s.u.DirectUpdateHandler2 end_commit_flush
   [junit4]   2> 149489 INFO  (searcherExecutor-579-thread-1-processing-x:collection1) [    x:collection1] o.a.s.c.SolrCore [collection1] Registered new searcher Searcher@173c6b6[collection1] main{ExitableDirectoryReader(UninvertingDirectoryReader(Uninverting(_0(5.5.3):C1)))}
   [junit4]   2> 149725 INFO  (TEST-AutoCommitTest.testCommitWithin-seed#[728D925758F9B45A]) [    x:collection1] o.a.s.u.p.LogUpdateProcessorFactory [collection1] {add=[530 (1545211567091482624)]} 0 4258
   [junit4]   2> 149726 INFO  (TEST-AutoCommitTest.testCommitWithin-seed#[728D925758F9B45A]) [    x:collection1] o.a.s.c.S.Request [collection1]  webapp=null path=null params={q=id:530&qt=standard&start=0&rows=20&version=2.2} hits=0 status=0 QTime=0
   [junit4]   2> 149728 INFO  (TEST-AutoCommitTest.testCommitWithin-seed#[728D925758F9B45A]) [    x:collection1] o.a.s.u.p.LogUpdateProcessorFactory [collection1] {delete=[529 (-1545211567096725504)]} 0 4261
   [junit4]   2> 149728 INFO  (TEST-AutoCommitTest.testCommitWithin-seed#[728D925758F9B45A]) [    x:collection1] o.a.s.c.S.Request [collection1]  webapp=null path=null params={q=id:529&qt=standard&start=0&rows=20&version=2.2} hits=1 status=0 QTime=0
   [junit4]   2> 150728 INFO  (commitScheduler-582-thread-1) [    x:collection1] o.a.s.u.DirectUpdateHandler2 start commit{,optimize=false,openSearcher=true,waitSearcher=true,expungeDeletes=false,softCommit=true,prepareCommit=false}
   [junit4]   2> 150735 INFO  (commitScheduler-582-thread-1) [    x:collection1] o.a.s.s.SolrIndexSearcher Opening Searcher@184b3ae[collection1] main
   [junit4]   2> 150735 INFO  (commitScheduler-582-thread-1) [    x:collection1] o.a.s.u.DirectUpdateHandler2 end_commit_flush
   [junit4]   2> 150737 INFO  (searcherExecutor-579-thread-1-processing-x:collection1) [    x:collection1] o.a.s.c.SolrCore [collection1] Registered new searcher Searcher@184b3ae[collection1] main{ExitableDirectoryReader(UninvertingDirectoryReader(Uninverting(_1(5.5.3):C1)))}
   [junit4]   2> 150983 INFO  (TEST-AutoCommitTest.testCommitWithin-seed#[728D925758F9B45A]) [    x:collection1] o.a.s.c.S.Request [collection1]  webapp=null path=null params={q=id:529&qt=standard&start=0&rows=20&version=2.2} hits=0 status=0 QTime=0
   [junit4]   2> 150984 INFO  (TEST-AutoCommitTest.testCommitWithin-seed#[728D925758F9B45A]) [    x:collection1] o.a.s.c.S.Request [collection1]  webapp=null path=null params={q=id:530&qt=standard&start=0&rows=20&version=2.2} hits=1 status=0 QTime=0
   [junit4]   2> 150988 INFO  (TEST-AutoCommitTest.testCommitWithin-seed#[728D925758F9B45A]) [    x:collection1] o.a.s.u.p.LogUpdateProcessorFactory [collection1] {add=[500 (1545211568416882688)]} 0 5521
   [junit4]   2> 150989 INFO  (TEST-AutoCommitTest.testCommitWithin-seed#[728D925758F9B45A]) [    x:collection1] o.a.s.u.p.LogUpdateProcessorFactory [collection1] {add=[500 (1545211568417931264)]} 0 5522
   [junit4]   2> 150989 INFO  (TEST-AutoCommitTest.testCommitWithin-seed#[728D925758F9B45A]) [    x:collection1] o.a.s.u.p.LogUpdateProcessorFactory [collection1] {add=[500 (1545211568418979840)]} 0 5522
   [junit4]   2> 150990 INFO  (TEST-AutoCommitTest.testCommitWithin-seed#[728D925758F9B45A]) [    x:collection1] o.a.s.u.p.LogUpdateProcessorFactory [collection1] {add=[500 (1545211568420028416)]} 0 5523
   [junit4]   2> 150990 INFO  (TEST-AutoCommitTest.testCommitWithin-seed#[728D925758F9B45A]) [    x:collection1] o.a.s.u.p.LogUpdateProcessorFactory [collection1] {add=[500 (1545211568420028417)]} 0 5523
   [junit4]   2> 150991 INFO  (TEST-AutoCommitTest.testCommitWithin-seed#[728D925758F9B45A]) [    x:collection1] o.a.s.u.p.LogUpdateProcessorFactory [collection1] {add=[500 (1545211568421076992)]} 0 5524
   [junit4]   2> 150992 INFO  (TEST-AutoCommitTest.testCommitWithin-seed#[728D925758F9B45A]) [    x:collection1] o.a.s.u.p.LogUpdateProcessorFactory [collection1] {add=[500 (1545211568421076993)]} 0 5524
   [junit4]   2> 150992 INFO  (TEST-AutoCommitTest.testCommitWithin-seed#[728D925758F9B45A]) [    x:collection1] o.a.s.u.p.LogUpdateProcessorFactory [collection1] {add=[500 (1545211568422125568)]} 0 5525
   [junit4]   2> 150993 INFO  (TEST-AutoCommitTest.testCommitWithin-seed#[728D925758F9B45A]) [    x:collection1] o.a.s.u.p.LogUpdateProcessorFactory [collection1] {add=[500 (1545211568422125569)]} 0 5526
   [junit4]   2> 150993 INFO  (TEST-AutoCommitTest.testCommitWithin-seed#[728D925758F9B45A]) [    x:collection1] o.a.s.u.p.LogUpdateProcessorFactory [collection1] {add=[500 (1545211568423174144)]} 0 5526
   [junit4]   2> 150995 INFO  (TEST-AutoCommitTest.testCommitWithin-seed#[728D925758F9B45A]) [    x:collection1] o.a.s.c.S.Request [collection1]  webapp=null path=null params={q=id:500&qt=standard&start=0&rows=20&version=2.2} hits=0 status=0 QTime=1
   [junit4]   2> 150996 INFO  (TEST-AutoCommitTest.testCommitWithin-seed#[728D925758F9B45A]) [    x:collection1] o.a.s.u.p.LogUpdateProcessorFactory [collection1] {delete=[530 (-1545211568426319872)]} 0 5528
   [junit4]   2> 150996 INFO  (TEST-AutoCommitTest.testCommitWithin-seed#[728D925758F9B45A]) [    x:collection1] o.a.s.u.p.LogUpdateProcessorFactory [collection1] {delete=[530 (-1545211568426319873)]} 0 5529
   [junit4]   2> 150996 INFO  (TEST-AutoCommitTest.testCommitWithin-seed#[728D925758F9B45A]) [    x:collection1] o.a.s.u.p.LogUpdateProcessorFactory [collection1] {delete=[530 (-1545211568426319874)]} 0 5529
   [junit4]   2> 150996 INFO  (TEST-AutoCommitTest.testCommitWithin-seed#[728D925758F9B45A]) [    x:collection1] o.a.s.u.p.LogUpdateProcessorFactory [collection1] {delete=[530 (-1545211568426319875)]} 0 5529
   [junit4]   2> 150997 INFO  (TEST-AutoCommitTest.testCommitWithin-seed#[728D925758F9B45A]) [    x:collection1] o.a.s.u.p.LogUpdateProcessorFactory [collection1] {delete=[530 (-1545211568427368448)]} 0 5529
   [junit4]   2> 150997 INFO  (TEST-AutoCommitTest.testCommitWithin-seed#[728D925758F9B45A]) [    x:collection1] o.a.s.u.p.LogUpdateProcessorFactory [collection1] {delete=[530 (-1545211568427368449)]} 0 5530
   [junit4]   2> 150997 INFO  (TEST-AutoCommitTest.testCommitWithin-seed#[728D925758F9B45A]) [    x:collection1] o.a.s.u.p.LogUpdateProcessorFactory [collection1] {delete=[530 (-1545211568427368450)]} 0 5530
   [junit4]   2> 150997 INFO  (TEST-AutoCommitTest.testCommitWithin-seed#[728D925758F9B45A]) [    x:collection1] o.a.s.u.p.LogUpdateProcessorFactory [collection1] {delete=[530 (-1545211568427368451)]} 0 5530
   [junit4]   2> 150998 INFO  (TEST-AutoCommitTest.testCommitWithin-seed#[728D925758F9B45A]) [    x:collection1] o.a.s.u.p.LogUpdateProcessorFactory [collection1] {delete=[530 (-1545211568427368452)]} 0 5530
   [junit4]   2> 150998 INFO  (TEST-AutoCommitTest.testCommitWithin-seed#[728D925758F9B45A]) [    x:collection1] o.a.s.u.p.LogUpdateProcessorFactory [collection1] {delete=[530 (-1545211568428417024)]} 0 5531
   [junit4]   2> 150998 INFO  (TEST-AutoCommitTest.testCommitWithin-seed#[728D925758F9B45A]) [    x:collection1] o.a.s.c.S.Request [collection1]  webapp=null path=null params={q=id:530&qt=standard&start=0&rows=20&version=2.2} hits=1 status=0 QTime=0
   [junit4]   2> 151996 INFO  (commitScheduler-582-thread-1) [    x:collection1] o.a.s.u.DirectUpdateHandler2 start commit{,optimize=false,openSearcher=true,waitSearcher=true,expungeDeletes=false,softCommit=true,prepareCommit=false}
   [junit4]   2> 152004 INFO  (commitScheduler-582-thread-1) [    x:collection1] o.a.s.s.SolrIndexSearcher Opening Searcher@58df15[collection1] main
   [junit4]   2> 152004 INFO  (commitScheduler-582-thread-1) [    x:collection1] o.a.s.u.DirectUpdateHandler2 end_commit_flush
   [junit4]   2> 152008 INFO  (searcherExecutor-579-thread-1-processing-x:collection1) [    x:collection1] o.a.s.c.SolrCore [collection1] Registered new searcher Searcher@58df15[collection1] main{ExitableDirectoryReader(UninvertingDirectoryReader(Uninverting(_2(5.5.3):C10/9:delGen=1)))}
   [junit4]   2> 152250 INFO  (TEST-AutoCommitTest.testCommitWithin-seed#[728D925758F9B45A]) [    x:collection1] o.a.s.c.S.Request [collection1]  webapp=null path=null params={q=id:500&qt=standard&start=0&rows=20&version=2.2} hits=1 status=0 QTime=0
   [junit4]   2> 152251 INFO  (TEST-AutoCommitTest.testCommitWithin-seed#[728D925758F9B45A]) [    x:collection1] o.a.s.c.S.Request [collection1]  webapp=null path=null params={q=id:530&qt=standard&start=0&rows=20&version=2.2} hits=0 status=0 QTime=0
   [junit4]   2> 152252 INFO  (TEST-AutoCommitTest.testCommitWithin-seed#[728D925758F9B45A]) [    x:collection1] o.a.s.SolrTestCaseJ4 ###Ending testCommitWithin
   [junit4]   2> 152255 INFO  (TEST-AutoCommitTest.testMaxTime-seed#[728D925758F9B45A]) [    x:collection1] o.a.s.SolrTestCaseJ4 ###Starting testMaxTime
   [junit4]   2> 152256 INFO  (TEST-AutoCommitTest.testMaxTime-seed#[728D925758F9B45A]) [    x:collection1] o.a.s.s.SolrIndexSearcher Opening Searcher@16d98c[collection1] realtime
   [junit4]   2> 152257 INFO  (TEST-AutoCommitTest.testMaxTime-seed#[728D925758F9B45A]) [    x:collection1] o.a.s.u.p.LogUpdateProcessorFactory [collection1]  webapp=null path=null params={}{deleteByQuery=*:* (-1545211569746477056)} 0 1
   [junit4]   2> 152257 INFO  (TEST-AutoCommitTest.testMaxTime-seed#[728D925758F9B45A]) [    x:collection1] o.a.s.c.SolrResourceLoader new SolrResourceLoader for directory: '/home/jenkins/workspace/Lucene-Solr-5.5-Linux/solr/core/src/test-files/solr/collection1'
   [junit4]   2> 152258 INFO  (TEST-AutoCommitTest.testMaxTime-seed#[728D925758F9B45A]) [    x:collection1] o.a.s.c.SolrResourceLoader JNDI not configured for solr (NoInitialContextEx)
   [junit4]   2> 152258 INFO  (TEST-AutoCommitTest.testMaxTime-seed#[728D925758F9B45A]) [    x:collection1] o.a.s.c.SolrResourceLoader using system property solr.solr.home: /home/jenkins/workspace/Lucene-Solr-5.5-Linux/solr/core/src/test-files/solr
   [junit4]   2> 152258 INFO  (TEST-AutoCommitTest.testMaxTime-seed#[728D925758F9B45A]) [    x:collection1] o.a.s.c.SolrResourceLoader Adding 'file:/home/jenkins/workspace/Lucene-Solr-5.5-Linux/solr/core/src/test-files/solr/collection1/lib/classes/' to classloader
   [junit4]   2> 152258 INFO  (TEST-AutoCommitTest.testMaxTime-seed#[728D925758F9B45A]) [    x:collection1] o.a.s.c.SolrResourceLoader Adding 'file:/home/jenkins/workspace/Lucene-Solr-5.5-Linux/solr/core/src/test-files/solr/collection1/lib/README' to classloader
   [junit4]   2> 152291 INFO  (TEST-AutoCommitTest.testMaxTime-seed#[728D925758F9B45A]) [    x:collection1] o.a.s.c.SolrConfig current version of requestparams : -1
   [junit4]   2> 152303 WARN  (TEST-AutoCommitTest.testMaxTime-seed#[728D925758F9B45A]) [    x:collection1] o.a.s.c.Config Beginning with Solr 5.5, <mergePolicy> is deprecated, use <mergePolicyFactory> instead.
   [junit4]   2> 152307 INFO  (TEST-AutoCommitTest.testMaxTime-seed#[728D925758F9B45A]) [    x:collection1] o.a.s.c.SolrConfig Using Lucene MatchVersion: 5.5.3
   [junit4]   2> 152356 INFO  (TEST-AutoCommitTest.testMaxTime-seed#[728D925758F9B45A]) [    x:collection1] o.a.s.c.SolrConfig Loaded SolrConfig: solrconfig.xml
   [junit4]   2> 152384 INFO  (TEST-AutoCommitTest.testMaxTime-seed#[728D925758F9B45A]) [    x:collection1] o.a.s.s.IndexSchema [collection1] Schema name=test
   [junit4]   2> 152732 INFO  (TEST-AutoCommitTest.testMaxTime-seed#[728D925758F9B45A]) [    x:collection1] o.a.s.s.OpenExchangeRatesOrgProvider Initialized with rates=open-exchange-rates.json, refreshInterval=1440.
   [junit4]   2> 152743 INFO  (TEST-AutoCommitTest.testMaxTime-seed#[728D925758F9B45A]) [    x:collection1] o.a.s.s.IndexSchema default search field in schema is text
   [junit4]   2> 152744 INFO  (TEST-AutoCommitTest.testMaxTime-seed#[728D925758F9B45A]) [    x:collection1] o.a.s.s.IndexSchema unique key field: id
   [junit4]   2> 152766 INFO  (TEST-AutoCommitTest.testMaxTime-seed#[728D925758F9B45A]) [    x:collection1] o.a.s.s.FileExchangeRateProvider Reloading exchange rates from file currency.xml
   [junit4]   2> 152769 INFO  (TEST-AutoCommitTest.testMaxTime-seed#[728D925758F9B45A]) [    x:collection1] o.a.s.s.FileExchangeRateProvider Reloading exchange rates from file currency.xml
   [junit4]   2> 152773 INFO  (TEST-AutoCommitTest.testMaxTime-seed#[728D925758F9B45A]) [    x:collection1] o.a.s.s.OpenExchangeRatesOrgProvider Reloading exchange rates from open-exchange-rates.json
   [junit4]   2> 152773 INFO  (TEST-AutoCommitTest.testMaxTime-seed#[728D925758F9B45A]) [    x:collection1] o.a.s.s.OpenExchangeRatesOrgProvider Reloading exchange rates from open-exchange-rates.json
   [junit4]   2> 152776 INFO  (TEST-AutoCommitTest.testMaxTime-seed#[728D925758F9B45A]) [    x:collection1] o.a.s.c.ConfigSetProperties Did not find ConfigSet properties, assuming default properties: Can't find resource 'configsetprops.json' in classpath or '/home/jenkins/workspace/Lucene-Solr-5.5-Linux/solr/core/src/test-files/solr/collection1'
   [junit4]   2> 152776 INFO  (TEST-AutoCommitTest.testMaxTime-seed#[728D925758F9B45A]) [    x:collection1] o.a.s.c.CoreContainer Reloading SolrCore 'collection1' using configuration from instancedir /home/jenkins/workspace/Lucene-Solr-5.5-Linux/solr/core/src/test-files/solr/collection1
   [junit4]   2> 152777 INFO  (TEST-AutoCommitTest.testMaxTime-seed#[728D925758F9B45A]) [    x:collection1] o.a.s.c.SolrCore [[collection1] ] Opening new SolrCore at [/home/jenkins/workspace/Lucene-Solr-5.5-Linux/solr/core/src/test-files/solr/collection1], dataDir=[/home/jenkins/workspace/Lucene-Solr-5.5-Linux/solr/build/solr-core/test/J2/temp/solr.update.AutoCommitTest_728D925758F9B45A-001/init-core-data-001/]
   [junit4]   2> 152777 INFO  (TEST-AutoCommitTest.testMaxTime-seed#[728D925758F9B45A]) [    x:collection1] o.a.s.c.JmxMonitoredMap JMX monitoring is enabled. Adding Solr mbeans to JMX Server: com.sun.jmx.mbeanserver.JmxMBeanServer@aa71a
   [junit4]   2> 152778 INFO  (TEST-AutoCommitTest.testMaxTime-seed#[728D925758F9B45A]) [    x:collection1] o.a.s.c.SolrCore New index directory detected: old=null new=/home/jenkins/workspace/Lucene-Solr-5.5-Linux/solr/build/solr-core/test/J2/temp/solr.update.AutoCommitTest_728D925758F9B45A-001/init-core-data-001/index/
   [junit4]   2> 152779 INFO  (OldIndexDirectoryCleanupThreadForCore-collection1) [    x:collection1] o.a.s.c.SolrCore Looking for old index directories to cleanup for core collection1 in /home/jenkins/workspace/Lucene-Solr-5.5-Linux/solr/build/solr-core/test/J2/temp/solr.update.AutoCommitTest_728D925758F9B45A-001/init-core-data-001/
   [junit4]   2> 152797 INFO  (TEST-AutoCommitTest.testMaxTime-seed#[728D925758F9B45A]) [    x:collection1] o.a.s.u.p.UpdateRequestProcessorChain creating updateRequestProcessorChain "dedupe"
   [junit4]   2> 152797 INFO  (TEST-AutoCommitTest.testMaxTime-seed#[728D925758F9B45A]) [    x:collection1] o.a.s.u.p.UpdateRequestProcessorChain inserting DistributedUpdateProcessorFactory into updateRequestProcessorChain "dedupe"
   [junit4]   2> 152797 INFO  (TEST-AutoCommitTest.testMaxTime-seed#[728D925758F9B45A]) [    x:collection1] o.a.s.u.p.UpdateRequestProcessorChain creating updateRequestProcessorChain "dedupe-allfields"
   [junit4]   2> 152797 INFO  (TEST-AutoCommitTest.testMaxTime-seed#[728D925758F9B45A]) [    x:collection1] o.a.s.u.p.UpdateRequestProcessorChain inserting DistributedUpdateProcessorFactory into updateRequestProcessorChain "dedupe-allfields"
   [junit4]   2> 152797 INFO  (TEST-AutoCommitTest.testMaxTime-seed#[728D925758F9B45A]) [    x:collection1] o.a.s.u.p.UpdateRequestProcessorChain creating updateRequestProcessorChain "stored_sig"
   [junit4]   2> 152797 INFO  (TEST-AutoCommitTest.testMaxTime-seed#[728D925758F9B45A]) [    x:collection1] o.a.s.u.p.UpdateRequestProcessorChain inserting DistributedUpdateProcessorFactory into updateRequestProcessorChain "stored_sig"
   [junit4]   2> 152798 INFO  (TEST-AutoCommitTest.testMaxTime-seed#[728D925758F9B45A]) [    x:collection1] o.a.s.u.p.UpdateRequestProcessorChain creating updateRequestProcessorChain "uniq-fields"
   [junit4]   2> 152798 INFO  (TEST-AutoCommitTest.testMaxTime-seed#[728D925758F9B45A]) [    x:collection1] o.a.s.u.p.UpdateRequestProcessorChain inserting DistributedUpdateProcessorFactory into updateRequestProcessorChain "uniq-fields"
   [junit4]   2> 152798 INFO  (TEST-AutoCommitTest.testMaxTime-seed#[728D925758F9B45A]) [    x:collection1] o.a.s.u.p.UpdateRequestProcessorChain creating updateRequestProcessorChain "distrib-dup-test-chain-explicit"
   [junit4]   2> 152798 INFO  (TEST-AutoCommitTest.testMaxTime-seed#[728D925758F9B45A]) [    x:collection1] o.a.s.u.p.UpdateRequestProcessorChain creating updateRequestProcessorChain "distrib-dup-test-chain-implicit"
   [junit4]   2> 152799 INFO  (TEST-AutoCommitTest.testMaxTime-seed#[728D925758F9B45A]) [    x:collection1] o.a.s.u.p.UpdateRequestProcessorChain inserting DistributedUpdateProcessorFactory into updateRequestProcessorChain "distrib-dup-test-chain-implicit"
   [junit4]   2> 152799 INFO  (TEST-AutoCommitTest.testMaxTime-seed#[728D925758F9B45A]) [    x:collection1] o.a.s.c.SolrCore no updateRequestProcessorChain defined as default, creating implicit default
   [junit4]   2> 152802 INFO  (TEST-AutoCommitTest.testMaxTime-seed#[728D925758F9B45A]) [    x:collection1] o.a.s.h.l.XMLLoader xsltCacheLifetimeSeconds=60
   [junit4]   2> 152804 INFO  (TEST-AutoCommitTest.testMaxTime-seed#[728D925758F9B45A]) [    x:collection1] o.a.s.h.l.XMLLoader xsltCacheLifetimeSeconds=60
   [junit4]   2> 152807 INFO  (TEST-AutoCommitTest.testMaxTime-seed#[728D925758F9B45A]) [    x:collection1] o.a.s.h.l.XMLLoader xsltCacheLifetimeSeconds=60
   [junit4]   2> 152809 INFO  (TEST-AutoCommitTest.testMaxTime-seed#[728D925758F9B45A]) [    x:collection1] o.a.s.h.l.XMLLoader xsltCacheLifetimeSeconds=60
   [junit4]   2> 152832 INFO  (TEST-AutoCommitTest.testMaxTime-seed#[728D925758F9B45A]) [    x:collection1] o.a.s.c.PluginBag requestHandler : 'lazy' created with startup=lazy 
   [junit4]   2> 152853 INFO  (TEST-AutoCommitTest.testMaxTime-seed#[728D925758F9B45A]) [    x:collection1] o.a.s.c.RequestHandlers Registered paths: /admin/mbeans,standard,spellCheckCompRH,lazy,/update/json/docs,/admin/luke,spellCheckWithWordbreak_Direct,tvrh,/get,/admin/properties,/update/json,mltrh,/admin/threads,/search-facet-def,/update/csv,/search-facet-invariants,/admin/segments,spellCheckCompRH1,/mlt,/admin/system,/replication,dismax,defaults,/config,/schema,/admin/plugins,/admin/logging,spellCheckWithWordbreak,mock,/admin/ping,/update,/admin/file,/terms,spellCheckCompRH_Direct,/debug/dump
   [junit4]   2> 152855 WARN  (TEST-AutoCommitTest.testMaxTime-seed#[728D925758F9B45A]) [    x:collection1] o.a.s.c.SolrCore solrconfig.xml uses deprecated <admin/gettableFiles>, Please update your config to use the ShowFileRequestHandler.
   [junit4]   2> 152856 INFO  (TEST-AutoCommitTest.testMaxTime-seed#[728D925758F9B45A]) [    x:collection1] o.a.s.c.SolrCore Using default statsCache cache: org.apache.solr.search.stats.LocalStatsCache
   [junit4]   2> 152856 INFO  (TEST-AutoCommitTest.testMaxTime-seed#[728D925758F9B45A]) [    x:collection1] o.a.s.u.CommitTracker Hard AutoCommit: disabled
   [junit4]   2> 152856 INFO  (TEST-AutoCommitTest.testMaxTime-seed#[728D925758F9B45A]) [    x:collection1] o.a.s.u.CommitTracker Soft AutoCommit: disabled
   [junit4]   2> 152857 INFO  (TEST-AutoCommitTest.testMaxTime-seed#[728D925758F9B45A]) [    x:collection1] o.a.s.s.SolrIndexSearcher Opening Searcher@1065ea2[collection1] main
   [junit4]   2> 152857 INFO  (TEST-AutoCommitTest.testMaxTime-seed#[728D925758F9B45A]) [    x:collection1] o.a.s.r.RestManager Initializing RestManager with initArgs: {storageIO=org.apache.solr.rest.ManagedResourceStorage$InMemoryStorageIO}
   [junit4]   2> 152857 INFO  (TEST-AutoCommitTest.testMaxTime-seed#[728D925758F9B45A]) [    x:collection1] o.a.s.r.ManagedResourceStorage Reading _rest_managed.json using InMemoryStorage
   [junit4]   2> 152857 INFO  (TEST-AutoCommitTest.testMaxTime-seed#[728D925758F9B45A]) [    x:collection1] o.a.s.r.RestManager Initializing 0 registered ManagedResources
   [junit4]   2> 152858 INFO  (TEST-AutoCommitTest.testMaxTime-seed#[728D925758F9B45A]) [    x:collection1] o.a.s.h.c.SpellCheckComponent Initializing spell checkers
   [junit4]   2> 152859 INFO  (TEST-AutoCommitTest.testMaxTime-seed#[728D925758F9B45A]) [    x:collection1] o.a.s.s.DirectSolrSpellChecker init: {name=direct,classname=DirectSolrSpellChecker,field=lowerfilt,minQueryLength=3}
   [junit4]   2> 152862 INFO  (TEST-AutoCommitTest.testMaxTime-seed#[728D925758F9B45A]) [    x:collection1] o.a.s.h.ReplicationHandler Commits will be reserved for  10000
   [junit4]   2> 152862 INFO  (searcherExecutor-583-thread-1-processing-x:collection1) [    x:collection1] o.a.s.h.c.SpellCheckComponent Loading spell index for spellchecker: default
   [junit4]   2> 152862 INFO  (searcherExecutor-583-thread-1-processing-x:collection1) [    x:collection1] o.a.s.h.c.SpellCheckComponent Loading spell index for spellchecker: direct
   [junit4]   2> 152862 INFO  (searcherExecutor-583-thread-1-processing-x:collection1) [    x:collection1] o.a.s.h.c.SpellCheckComponent Loading spell index for spellchecker: wordbreak
   [junit4]   2> 152862 INFO  (searcherExecutor-583-thread-1-processing-x:collection1) [    x:collection1] o.a.s.h.c.SpellCheckComponent Loading spell index for spellchecker: multipleFields
   [junit4]   2> 152863 INFO  (searcherExecutor-583-thread-1-processing-x:collection1) [    x:collection1] o.a.s.h.c.SpellCheckComponent Loading spell index for spellchecker: jarowinkler
   [junit4]   2> 152863 INFO  (searcherExecutor-583-thread-1-processing-x:collection1) [    x:collection1] o.a.s.h.c.SpellCheckComponent Loading spell index for spellchecker: external
   [junit4]   2> 152863 INFO  (TEST-AutoCommitTest.testMaxTime-seed#[728D925758F9B45A]) [    x:collection1] o.a.s.u.UpdateLog Looking up max value of version field to seed version buckets
   [junit4]   2> 152863 INFO  (searcherExecutor-583-thread-1-processing-x:collection1) [    x:collection1] o.a.s.h.c.SpellCheckComponent Loading spell index for spellchecker: freq
   [junit4]   2> 152863 INFO  (TEST-AutoCommitTest.testMaxTime-seed#[728D925758F9B45A]) [    x:collection1] o.a.s.u.VersionInfo Refreshing highest value of _version_ for 65536 version buckets from index
   [junit4]   2> 152863 INFO  (TEST-AutoCommitTest.testMaxTime-seed#[728D925758F9B45A]) [    x:collection1] o.a.s.u.VersionInfo No terms found for _version_, cannot seed version bucket highest value from index
   [junit4]   2> 152864 INFO  (searcherExecutor-583-thread-1-processing-x:collection1) [    x:collection1] o.a.s.h.c.SpellCheckComponent Loading spell index for spellchecker: fqcn
   [junit4]   2> 152864 INFO  (searcherExecutor-583-thread-1-processing-x:collection1) [    x:collection1] o.a.s.h.c.SpellCheckComponent Loading spell index for spellchecker: perDict
   [junit4]   2> 152875 INFO  (TEST-AutoCommitTest.testMaxTime-seed#[728D925758F9B45A]) [    x:collection1] o.a.s.u.UpdateLog Took 11.0ms to seed version buckets with highest version 1545211569746477056
   [junit4]   2> 152876 INFO  (TEST-AutoCommitTest.testMaxTime-seed#[728D925758F9B45A]) [    x:collection1] o.a.s.u.DefaultSolrCoreState Closing old IndexWriter... core=collection1
   [junit4]   2> 152876 INFO  (TEST-AutoCommitTest.testMaxTime-seed#[728D925758F9B45A]) [    x:collection1] o.a.s.c.SolrDeletionPolicy SolrDeletionPolicy.onCommit: commits: num=2
   [junit4]   2> 	commit{dir=MockDirectoryWrapper(RAMDirectory@e509de lockFactory=org.apache.lucene.store.SingleInstanceLockFactory@5dd033),segFN=segments_1,generation=1}
   [junit4]   2> 	commit{dir=MockDirectoryWrapper(RAMDirectory@e509de lockFactory=org.apache.lucene.store.SingleInstanceLockFactory@5dd033),segFN=segments_2,generation=2}
   [junit4]   2> 152876 INFO  (TEST-AutoCommitTest.testMaxTime-seed#[728D925758F9B45A]) [    x:collection1] o.a.s.c.SolrDeletionPolicy newest commit generation = 2
   [junit4]   2> 152877 INFO  (TEST-AutoCommitTest.testMaxTime-seed#[728D925758F9B45A]) [    x:collection1] o.a.s.u.RandomMergePolicy RandomMergePolicy wrapping class org.apache.lucene.index.TieredMergePolicy: [TieredMergePolicy: maxMergeAtOnce=50, maxMergeAtOnceExplicit=12, maxMergedSegmentMB=15.16796875, floorSegmentMB=0.8203125, forceMergeDeletesPctAllowed=23.349948912418647, segmentsPerTier=50.0, maxCFSSegmentSizeMB=8.796093022207999E12, noCFSRatio=0.6416381941695393
   [junit4]   2> 152877 INFO  (searcherExecutor-583-thread-1-processing-x:collection1) [    x:collection1] o.a.s.c.SolrCore [collection1] Registered new searcher Searcher@1065ea2[collection1] main{ExitableDirectoryReader(UninvertingDirectoryReader())}
   [junit4]   2> 152878 INFO  (TEST-AutoCommitTest.testMaxTime-seed#[728D925758F9B45A]) [    x:collection1] o.a.s.c.SolrDeletionPolicy SolrDeletionPolicy.onInit: commits: num=1
   [junit4]   2> 	commit{dir=MockDirectoryWrapper(RAMDirectory@e509de lockFactory=org.apache.lucene.store.SingleInstanceLockFactory@5dd033),segFN=segments_2,generation=2}
   [junit4]   2> 152879 INFO  (TEST-AutoCommitTest.testMaxTime-seed#[728D925758F9B45A]) [    x:collection1] o.a.s.c.SolrDeletionPolicy newest commit generation = 2
   [junit4]   2> 152879 INFO  (TEST-AutoCommitTest.testMaxTime-seed#[728D925758F9B45A]) [    x:collection1] o.a.s.u.DefaultSolrCoreState New IndexWriter is ready to be used.
   [junit4]   2> 152879 INFO  (TEST-AutoCommitTest.testMaxTime-seed#[728D925758F9B45A]) [    x:collection1] o.a.s.s.SolrIndexSearcher Opening Searcher@12a9f48[collection1] main
   [junit4]   2> 152879 INFO  (TEST-AutoCommitTest.testMaxTime-seed#[728D925758F9B45A]) [    x:collection1] o.a.s.c.CoreContainer replacing core: collection1
   [junit4]   2> 152879 INFO  (TEST-AutoCommitTest.testMaxTime-seed#[728D925758F9B45A]) [    x:collection1] o.a.s.c.SolrCore [collection1]  CLOSING SolrCore org.apache.solr.core.SolrCore@1d6ff2c
   [junit4]   2> 152880 INFO  (TEST-AutoCommitTest.testMaxTime-seed#[728D925758F9B45A]) [    x:collection1] o.a.s.u.DirectUpdateHandler2 closing DirectUpdateHandler2{commits=3,autocommits=0,soft autocommits=3,optimizes=0,rollbacks=0,expungeDeletes=0,docsPending=12,adds=0,deletesById=0,deletesByQuery=1,errors=0,cumulative_adds=12,cumulative_deletesById=11,cumulative_deletesByQuery=1,cumulative_errors=0,transaction_logs_total_size=0,transaction_logs_total_number=0}
   [junit4]   2> 152880 INFO  (TEST-AutoCommitTest.testMaxTime-seed#[728D925758F9B45A]) [    x:collection1] o.a.s.c.SolrCore [collection1] Closing main searcher on request.
   [junit4]   2> 152888 INFO  (searcherExecutor-583-thread-1-processing-x:collection1) [    x:collection1] o.a.s.c.SolrCore [collection1] Registered new searcher Searcher@12a9f48[collection1] main{ExitableDirectoryReader(UninvertingDirectoryReader())}
   [junit4]   2> 152919 INFO  (TEST-AutoCommitTest.testMaxTime-seed#[728D925758F9B45A]) [    x:collection1] o.a.s.u.p.LogUpdateProcessorFactory [collection1] {add=[529 (1545211570440634368)]} 0 2
   [junit4]   2> 152920 INFO  (TEST-AutoCommitTest.testMaxTime-seed#[728D925758F9B45A]) [    x:collection1] o.a.s.c.S.Request [collection1]  webapp=null path=null params={q=id:529&qt=standard&start=0&rows=20&version=2.2} hits=0 status=0 QTime=0
   [junit4]   2> 153919 INFO  (commitScheduler-586-thread-1) [    x:collection1] o.a.s.u.DirectUpdateHandler2 start commit{,optimize=false,openSearcher=true,waitSearcher=true,expungeDeletes=false,softCommit=true,prepareCommit=false}
   [junit4]   2> 153926 INFO  (commitScheduler-586-thread-1) [    x:collection1] o.a.s.s.SolrIndexSearcher Opening Searcher@c3c643[collection1] main
   [junit4]   2> 153927 INFO  (commitScheduler-586-thread-1) [    x:collection1] o.a.s.u.DirectUpdateHandler2 end_commit_flush
   [junit4]   2> 153932 INFO  (searcherExecutor-583-thread-1-processing-x:collection1) [    x:collection1] o.a.s.c.SolrCore [collection1] Registered new searcher Searcher@c3c643[collection1] main{ExitableDirectoryReader(UninvertingDirectoryReader(Uninverting(_3(5.5.3):C1)))}
   [junit4]   2> 154173 INFO  (TEST-AutoCommitTest.testMaxTime-seed#[728D925758F9B45A]) [    x:collection1] o.a.s.u.p.LogUpdateProcessorFactory [collection1] {add=[530 (1545211571756597248)]} 0 1256
   [junit4]   2> 154174 INFO  (TEST-AutoCommitTest.testMaxTime-seed#[728D925758F9B45A]) [    x:collection1] o.a.s.c.S.Request [collection1]  webapp=null path=null params={q=id:529&qt=standard&start=0&rows=20&version=2.2} hits=1 status=0 QTime=0
   [junit4]   2> 154175 INFO  (TEST-AutoCommitTest.testMaxTime-seed#[728D925758F9B45A]) [    x:collection1] o.a.s.c.S.Request [collection1]  webapp=null path=null params={q=id:530&qt=standard&start=0&rows=20&version=2.2} hits=0 status=0 QTime=0
   [junit4]   2> 154176 INFO  (TEST-AutoCommitTest.testMaxTime-seed#[728D925758F9B45A]) [    x:collection1] o.a.s.u.p.LogUpdateProcessorFactory [collection1]  webapp=null path=null params={}{delete=[529 (-1545211571760791552)]} 0 0
   [junit4]   2> 154177 INFO  (TEST-AutoCommitTest.testMaxTime-seed#[728D925758F9B45A]) [    x:collection1] o.a.s.c.S.Request [collection1]  webapp=null path=null params={q=id:529&qt=standard&start=0&rows=20&version=2.2} hits=1 status=0 QTime=0
   [junit4]   2> 155173 INFO  (commitScheduler-586-thread-1) [    x:collection1] o.a.s.u.DirectUpdateHandler2 start commit{,optimize=false,openSearcher=true,waitSearcher=true,expungeDeletes=false,softCommit=true,prepareCommit=false}
   [junit4]   2> 155181 INFO  (commitScheduler-586-thread-1) [    x:collection1] o.a.s.s.SolrIndexSearcher Opening Searcher@1e1aff7[collection1] main
   [junit4]   2> 155181 INFO  (commitScheduler-586-thread-1) [    x:collection1] o.a.s.u.DirectUpdateHandler2 end_commit_flush
   [junit4]   2> 155185 INFO  (searcherExecutor-583-thread-1-processing-x:collection1) [    x:collection1] o.a.s.c.SolrCore [collection1] Registered new searcher Searcher@1e1aff7[collection1] main{ExitableDirectoryReader(UninvertingDirectoryReader(Uninverting(_4(5.5.3):C1)))}
   [junit4]   2> 156432 INFO  (commitScheduler-586-thread-1) [    x:collection1] o.a.s.u.DirectUpdateHandler2 start commit{,optimize=false,openSearcher=true,waitSearcher=true,expungeDeletes=false,softCommit=true,prepareCommit=false}
   [junit4]   2> 156438 INFO  (commitScheduler-586-thread-1) [    x:collection1] o.a.s.s.SolrIndexSearcher Opening Searcher@ad466c[collection1] main
   [junit4]   2> 156438 INFO  (commitScheduler-586-thread-1) [    x:collection1] o.a.s.u.DirectUpdateHandler2 end_commit_flush
   [junit4]   2> 156442 INFO  (searcherExecutor-583-thread-1-processing-x:collection1) [    x:collection1] o.a.s.c.SolrCore [collection1] Registered new searcher Searcher@ad466c[collection1] main{ExitableDirectoryReader(UninvertingDirectoryReader(Uninverting(_4(5.5.3):C1) Uninverting(_5(5.5.3):C1)))}
   [junit4]   2> 156833 INFO  (TEST-AutoCommitTest.testMaxTime-seed#[728D925758F9B45A]) [    x:collection1] o.a.s.u.p.LogUpdateProcessorFactory [collection1] {add=[550 (1545211573074657280)]} 0 3916
   [junit4]   2> 156833 INFO  (TEST-AutoCommitTest.testMaxTime-seed#[728D925758F9B45A]) [    x:collection1] o.a.s.SolrTestCaseJ4 ###Ending testMaxTime
   [junit4]   2> NOTE: reproduce with: ant test  -Dtestcase=AutoCommitTest -Dtests.method=testMaxTime -Dtests.seed=728D925758F9B45A -Dtests.multiplier=3 -Dtests.slow=true -Dtests.locale=nl -Dtests.timezone=America/Lower_Princes -Dtests.asserts=true -Dtests.file.encoding=ISO-8859-1
   [junit4] FAILURE 4.58s J2 | AutoCommitTest.testMaxTime <<<
   [junit4]    > Throwable #1: java.lang.AssertionError: expected:<2> but was:<3>
   [junit4]    > 	at __randomizedtesting.SeedInfo.seed([728D925758F9B45A:E879EFB5C6632866]:0)
   [junit4]    > 	at org.apache.solr.update.AutoCommitTest.testMaxTime(AutoCommitTest.java:256)
   [junit4]    > 	at java.lang.Thread.run(Thread.java:745)
   [junit4]   2> 156839 INFO  (TEST-AutoCommitTest.testMaxDocs-seed#[728D925758F9B45A]) [    x:collection1] o.a.s.SolrTestCaseJ4 ###Starting testMaxDocs
   [junit4]   2> 156842 INFO  (TEST-AutoCommitTest.testMaxDocs-seed#[728D925758F9B45A]) [    x:collection1] o.a.s.s.SolrIndexSearcher Opening Searcher@11bd374[collection1] realtime
   [junit4]   2> 156843 INFO  (TEST-AutoCommitTest.testMaxDocs-seed#[728D925758F9B45A]) [    x:collection1] o.a.s.u.p.LogUpdateProcessorFactory [collection1]  webapp=null path=null params={}{deleteByQuery=*:* (-1545211574554198016)} 0 2
   [junit4]   2> 156844 INFO  (TEST-AutoCommitTest.testMaxDocs-seed#[728D925758F9B45A]) [    x:collection1] o.a.s.c.SolrResourceLoader new SolrResourceLoader for directory: '/home/jenkins/workspace/Lucene-Solr-5.5-Linux/solr/core/src/test-files/solr/collection1'
   [junit4]   2> 156844 INFO  (TEST-AutoCommitTest.testMaxDocs-seed#[728D925758F9B45A]) [    x:collection1] o.a.s.c.SolrResourceLoader JNDI not configured for solr (NoInitialContextEx)
   [junit4]   2> 156844 INFO  (TEST-AutoCommitTest.testMaxDocs-seed#[728D925758F9B45A]) [    x:collection1] o.a.s.c.SolrResourceLoader using system property solr.solr.home: /home/jenkins/workspace/Lucene-Solr-5.5-Linux/solr/core/src/test-files/solr
   [junit4]   2> 156844 INFO  (TEST-AutoCommitTest.testMaxDocs-seed#[728D925758F9B45A]) [    x:collection1] o.a.s.c.SolrResourceLoader Adding 'file:/home/jenkins/workspace/Lucene-Solr-5.5-Linux/solr/core/src/test-files/solr/collection1/lib/classes/' to classloader
   [junit4]   2> 156844 INFO  (TEST-AutoCommitTest.testMaxDocs-seed#[728D925758F9B45A]) [    x:collection1] o.a.s.c.SolrResourceLoader Adding 'file:/home/jenkins/workspace/Lucene-Solr-5.5-Linux/solr/core/src/test-files/solr/collection1/lib/README' to classloader
   [junit4]   2> 156908 INFO  (TEST-AutoCommitTest.testMaxDocs-seed#[728D925758F9B45A]) [    x:collection1] o.a.s.c.SolrConfig current version of requestparams : -1
   [junit4]   2> 156932 WARN  (TEST-AutoCommitTest.testMaxDocs-seed#[728D925758F9B45A]) [    x:collection1] o.a.s.c.Config Beginning with Solr 5.5, <mergePolicy> is deprecated, use <mergePolicyFactory> instead.
   [junit4]   2> 156938 INFO  (TEST-AutoCommitTest.testMaxDocs-seed#[728D925758F9B45A]) [    x:collection1] o.a.s.c.SolrConfig Using Lucene MatchVersion: 5.5.3
   [junit4]   2> 156969 INFO  (TEST-AutoCommitTest.testMaxDocs-seed#[728D925758F9B45A]) [    x:collection1] o.a.s.c.SolrConfig Loaded SolrConfig: solrconfig.xml
   [junit4]   2> 156978 INFO  (TEST-AutoCommitTest.testMaxDocs-seed#[728D925758F9B45A]) [    x:collection1] o.a.s.s.IndexSchema [collection1] Schema name=test
   [junit4]   2> 157102 INFO  (TEST-AutoCommitTest.testMaxDocs-seed#[728D925758F9B45A]) [    x:collection1] o.a.s.s.OpenExchangeRatesOrgProvider Initialized with rates=open-exchange-rates.json, refreshInterval=1440.
   [junit4]   2> 157108 INFO  (TEST-AutoCommitTest.testMaxDocs-seed#[728D925758F9B45A]) [    x:collection1] o.a.s.s.IndexSchema default search field in schema is text
   [junit4]   2> 157110 INFO  (TEST-AutoCommitTest.testMaxDocs-seed#[728D925758F9B45A]) [    x:collection1] o.a.s.s.IndexSchema unique key field: id
   [junit4]   2> 157117 INFO  (TEST-AutoCommitTest.testMaxDocs-seed#[728D925758F9B45A]) [    x:collection1] o.a.s.s.FileExchangeRateProvider Reloading exchange rates from file currency.xml
   [junit4]   2> 157119 INFO  (TEST-AutoCommitTest.testMaxDocs-seed#[728D925758F9B45A]) [    x:collection1] o.a.s.s.FileExchangeRateProvider Reloading exchange rates from file currency.xml
   [junit4]   2> 157121 INFO  (TEST-AutoCommitTest.testMaxDocs-seed#[728D925758F9B45A]) [    x:collection1] o.a.s.s.OpenExchangeRatesOrgProvider Reloading exchange rates from open-exchange-rates.json
   [junit4]   2> 157121 INFO  (TEST-AutoCommitTest.testMaxDocs-seed#[728D925758F9B45A]) [    x:collection1] o.a.s.s.OpenExchangeRatesOrgProvider Reloading exchange rates from open-exchange-rates.json
   [junit4]   2> 157123 INFO  (TEST-AutoCommitTest.testMaxDocs-seed#[728D925758F9B45A]) [    x:collection1] o.a.s.c.ConfigSetProperties Did not find ConfigSet properties, assuming default properties: Can't find resource 'configsetprops.json' in classpath or '/home/jenkins/workspace/Lucene-Solr-5.5-Linux/solr/core/src/test-files/solr/collection1'
   [junit4]   2> 157123 INFO  (TEST-AutoCommitTest.testMaxDocs-seed#[728D925758F9B45A]) [    x:collection1] o.a.s.c.CoreContainer Reloading SolrCore 'collection1' using configuration from instancedir /home/jenkins/workspace/Lucene-Solr-5.5-Linux/solr/core/src/test-files/solr/collection1
   [junit4]   2> 157123 INFO  (TEST-AutoCommitTest.testMaxDocs-seed#[728D925758F9B45A]) [    x:collection1] o.a.s.c.SolrCore [[collection1] ] Opening new SolrCore at [/home/jenkins/workspace/Lucene-Solr-5.5-Linux/solr/core/src/test-files/solr/collection1], dataDir=[/home/jenkins/workspace/Lucene-Solr-5.5-Linux/solr/build/solr-core/test/J2/temp/solr.update.AutoCommitTest_728D925758F9B45A-001/init-core-data-001/]
   [junit4]   2> 157123 INFO  (TEST-AutoCommitTest.testMaxDocs-seed#[728D925758F9B45A]) [    x:collection1] o.a.s.c.JmxMonitoredMap JMX monitoring is enabled. Adding Solr mbeans to JMX Server: com.sun.jmx.mbeanserver.JmxMBeanServer@aa71a
   [junit4]   2> 157127 INFO  (TEST-AutoCommitTest.testMaxDocs-seed#[728D925758F9B45A]) [    x:collection1] o.a.s.c.SolrCore New index directory detected: old=null new=/home/jenkins/workspace/Lucene-Solr-5.5-Linux/solr/build/solr-core/test/J2/temp/solr.update.AutoCommitTest_728D925758F9B45A-001/init-core-data-001/index/
   [junit4]   2> 157127 INFO  (OldIndexDirectoryCleanupThreadForCore-collection1) [    x:collection1] o.a.s.c.SolrCore Looking for old index directories to cleanup for core collection1 in /home/jenkins/workspace/Lucene-Solr-5.5-Linux/solr/build/solr-core/test/J2/temp/solr.update.AutoCommitTest_728D925758F9B45A-001/init-core-data-001/
   [junit4]   2> 157132 INFO  (TEST-AutoCommitTest.testMaxDocs-seed#[728D925758F9B45A]) [    x:collection1] o.a.s.u.p.UpdateRequestProcessorChain creating updateRequestProcessorChain "dedupe"
   [junit4]   2> 157132 INFO  (TEST-AutoCommitTest.testMaxDocs-seed#[728D925758F9B45A]) [    x:collection1] o.a.s.u.p.UpdateRequestProcessorChain inserting DistributedUpdateProcessorFactory into updateRequestProcessorChain "dedupe"
   [junit4]   2> 157132 INFO  (TEST-AutoCommitTest.testMaxDocs-seed#[728D925758F9B45A]) [    x:collection1] o.a.s.u.p.UpdateRequestProcessorChain creating updateRequestProcessorChain "dedupe-allfields"
   [junit4]   2> 157132 INFO  (TEST-AutoCommitTest.testMaxDocs-seed#[728D925758F9B45A]) [    x:collection1] o.a.s.u.p.UpdateRequestProcessorChain inserting DistributedUpdateProcessorFactory into updateRequestProcessorChain "dedupe-allfields"
   [junit4]   2> 157132 INFO  (TEST-AutoCommitTest.testMaxDocs-seed#[728D925758F9B45A]) [    x:collection1] o.a.s.u.p.UpdateRequestProcessorChain creating updateRequestProcessorChain "stored_sig"
   [junit4]   2> 157132 INFO  (TEST-AutoCommitTest.testMaxDocs-seed#[728D925758F9B45A]) [    x:collection1] o.a.s.u.p.UpdateRequestProcessorChain inserting DistributedUpdateProcessorFactory into updateRequestProcessorChain "stored_sig"
   [junit4]   2> 157132 INFO  (TEST-AutoCommitTest.testMaxDocs-seed#[728D925758F9B45A]) [    x:collection1] o.a.s.u.p.UpdateRequestProcessorChain creating updateRequestProcessorChain "uniq-fields"
   [junit4]   2> 157133 INFO  (TEST-AutoCommitTest.testMaxDocs-seed#[728D925758F9B45A]) [    x:collection1] o.a.s.u.p.UpdateRequestProcessorChain inserting DistributedUpdateProcessorFactory into updateRequestProcessorChain "uniq-fields"
   [junit4]   2> 157133 INFO  (TEST-AutoCommitTest.testMaxDocs-seed#[728D925758F9B45A]) [    x:collection1] o.a.s.u.p.UpdateRequestProcessorChain creating updateRequestProcessorChain "distrib-dup-test-chain-explicit"
   [junit4]   2> 157133 INFO  (TEST-AutoCommitTest.testMaxDocs-seed#[728D925758F9B45A]) [    x:collection1] o.a.s.u.p.UpdateRequestProcessorChain creating updateRequestProcessorChain "distrib-dup-test-chain-implicit"
   [junit4]   2> 157133 INFO  (TEST-AutoCommitTest.testMaxDocs-seed#[728D925758F9B45A]) [    x:collection1] o.a.s.u.p.UpdateRequestProcessorChain inserting DistributedUpdateProcessorFactory into updateRequestProcessorChain "distrib-dup-test-chain-implicit"
   [junit4]   2> 157133 INFO  (TEST-AutoCommitTest.testMaxDocs-seed#[728D925758F9B45A]) [    x:collection1] o.a.s.c.SolrCore no updateRequestProcessorChain defined as default, creating implicit default
   [junit4]   2> 157135 INFO  (TEST-AutoCommitTest.testMaxDocs-seed#[728D925758F9B45A]) [    x:collection1] o.a.s.h.l.XMLLoader xsltCacheLifetimeSeconds=60
   [junit4]   2> 157136 INFO  (TEST-AutoCommitTest.testMaxDocs-seed#[728D925758F9B45A]) [    x:collection1] o.a.s.h.l.XMLLoader xsltCacheLifetimeSeconds=60
   [junit4]   2> 157137 INFO  (TEST-AutoCommitTest.testMaxDocs-seed#[728D925758F9B45A]) [    x:collection1] o.a.s.h.l.XMLLoader xsltCacheLifetimeSeconds=60
   [junit4]   2> 157139 INFO  (TEST-AutoCommitTest.testMaxDocs-seed#[728D925758F9B45A]) [    x:collection1] o.a.s.h.l.XMLLoader xsltCacheLifetimeSeconds=60
   [junit4]   2> 157159 INFO  (TEST-AutoCommitTest.testMaxDocs-seed#[728D925758F9B45A]) [    x:collection1] o.a.s.c.PluginBag requestHandler : 'lazy' created with startup=lazy 
   [junit4]   2> 157169 INFO  (TEST-AutoCommitTest.testMaxDocs-seed#[728D925758F9B45A]) [    x:collection1] o.a.s.c.RequestHandlers Registered paths: /admin/mbeans,standard,spellCheckCompRH,lazy,/update/json/docs,/admin/luke,spellCheckWithWordbreak_Direct,tvrh,/get,/admin/properties,/update/json,mltrh,/admin/threads,/search-facet-def,/update/csv,/search-facet-invariants,/admin/segments,spellCheckCompRH1,/mlt,/admin/system,/replication,dismax,defaults,/config,/schema,/admin/plugins,/admin/logging,spellCheckWithWordbreak,mock,/admin/ping,/update,/admin/file,/terms,spellCheckCompRH_Direct,/debug/dump
   [junit4]   2> 157170 WARN  (TEST-AutoCommitTest.testMaxDocs-seed#[728D925758F9B45A]) [    x:collection1] o.a.s.c.SolrCore solrconfig.xml uses deprecated <admin/gettableFiles>, Please update your config to use the ShowFileRequestHandler.
   [junit4]   2> 157171 INFO  (TEST-AutoCommitTest.testMaxDocs-seed#[728D925758F9B45A]) [    x:collection1] o.a.s.c.SolrCore Using default statsCache cache: org.apache.solr.search.stats.LocalStatsCache
   [junit4]   2> 157171 INFO  (TEST-AutoCommitTest.testMaxDocs-seed#[728D925758F9B45A]) [    x:collection1] o.a.s.u.CommitTracker Hard AutoCommit: disabled
   [junit4]   2> 157171 INFO  (TEST-AutoCommitTest.testMaxDocs-seed#[728D925758F9B45A]) [    x:collection1] o.a.s.u.CommitTracker Soft AutoCommit: disabled
   [junit4]   2> 157172 INFO  (TEST-AutoCommitTest.testMaxDocs-seed#[728D925758F9B45A]) [    x:collection1] o.a.s.s.SolrIndexSearcher Opening Searcher@1d563b0[collection1] main
   [junit4]   2> 157172 INFO  (TEST-AutoCommitTest.testMaxDocs-seed#[728D925758F9B45A]) [    x:collection1] o.a.s.r.RestManager Initializing RestManager with initArgs: {storageIO=org.apache.solr.rest.ManagedResourceStorage$InMemoryStorageIO}
   [junit4]   2> 157173 INFO  (TEST-AutoCommitTest.testMaxDocs-seed#[728D925758F9B45A]) [    x:collection1] o.a.s.r.ManagedResourceStorage Reading _rest_managed.json using InMemoryStorage
   [junit4]   2> 157173 INFO  (TEST-AutoCommitTest.testMaxDocs-seed#[728D925758F9B45A]) [    x:collection1] o.a.s.r.RestManager Initializing 0 registered ManagedResources
   [junit4]   2> 157173 INFO  (TEST-AutoCommitTest.testMaxDocs-seed#[728D925758F9B45A]) [    x:collection1] o.a.s.h.c.SpellCheckComponent Initializing spell checkers
   [junit4]   2> 157174 INFO  (TEST-AutoCommitTest.testMaxDocs-seed#[728D925758F9B45A]) [    x:collection1] o.a.s.s.DirectSolrSpellChecker init: {name=direct,classname=DirectSolrSpellChecker,field=lowerfilt,minQueryLength=3}
   [junit4]   2> 157177 INFO  (TEST-AutoCommitTest.testMaxDocs-seed#[728D925758F9B45A]) [    x:collection1] o.a.s.h.ReplicationHandler Commits will be reserved for  10000
   [juni

[...truncated too long message...]

6928)]} 0 5
   [junit4]   2> 157229 INFO  (TEST-AutoCommitTest.testMaxDocs-seed#[728D925758F9B45A]) [    x:collection1] o.a.s.u.p.LogUpdateProcessorFactory [collection1] {add=[5 (1545211574961045504)]} 0 6
   [junit4]   2> 157229 INFO  (TEST-AutoCommitTest.testMaxDocs-seed#[728D925758F9B45A]) [    x:collection1] o.a.s.u.p.LogUpdateProcessorFactory [collection1] {add=[6 (1545211574962094080)]} 0 7
   [junit4]   2> 157230 INFO  (TEST-AutoCommitTest.testMaxDocs-seed#[728D925758F9B45A]) [    x:collection1] o.a.s.u.p.LogUpdateProcessorFactory [collection1] {add=[7 (1545211574963142656)]} 0 7
   [junit4]   2> 157231 INFO  (TEST-AutoCommitTest.testMaxDocs-seed#[728D925758F9B45A]) [    x:collection1] o.a.s.u.p.LogUpdateProcessorFactory [collection1] {add=[8 (1545211574963142657)]} 0 8
   [junit4]   2> 157232 INFO  (TEST-AutoCommitTest.testMaxDocs-seed#[728D925758F9B45A]) [    x:collection1] o.a.s.u.p.LogUpdateProcessorFactory [collection1] {add=[9 (1545211574964191232)]} 0 9
   [junit4]   2> 157233 INFO  (TEST-AutoCommitTest.testMaxDocs-seed#[728D925758F9B45A]) [    x:collection1] o.a.s.u.p.LogUpdateProcessorFactory [collection1] {add=[10 (1545211574965239808)]} 0 10
   [junit4]   2> 157234 INFO  (TEST-AutoCommitTest.testMaxDocs-seed#[728D925758F9B45A]) [    x:collection1] o.a.s.u.p.LogUpdateProcessorFactory [collection1] {add=[11 (1545211574966288384)]} 0 11
   [junit4]   2> 157235 INFO  (TEST-AutoCommitTest.testMaxDocs-seed#[728D925758F9B45A]) [    x:collection1] o.a.s.u.p.LogUpdateProcessorFactory [collection1] {add=[12 (1545211574967336960)]} 0 12
   [junit4]   2> 157235 INFO  (TEST-AutoCommitTest.testMaxDocs-seed#[728D925758F9B45A]) [    x:collection1] o.a.s.u.p.LogUpdateProcessorFactory [collection1] {add=[13 (1545211574968385536)]} 0 13
   [junit4]   2> 157236 INFO  (TEST-AutoCommitTest.testMaxDocs-seed#[728D925758F9B45A]) [    x:collection1] o.a.s.c.S.Request [collection1]  webapp=null path=null params={q=id:1&qt=standard&start=0&rows=20&version=2.2} hits=0 status=0 QTime=0
   [junit4]   2> 157238 INFO  (TEST-AutoCommitTest.testMaxDocs-seed#[728D925758F9B45A]) [    x:collection1] o.a.s.u.p.LogUpdateProcessorFactory [collection1] {add=[14 (1545211574970482688)]} 0 15
   [junit4]   2> 157239 INFO  (commitScheduler-590-thread-1) [    x:collection1] o.a.s.u.DirectUpdateHandler2 start commit{,optimize=false,openSearcher=true,waitSearcher=true,expungeDeletes=false,softCommit=true,prepareCommit=false}
   [junit4]   2> 157249 INFO  (commitScheduler-590-thread-1) [    x:collection1] o.a.s.s.SolrIndexSearcher Opening Searcher@1fa168a[collection1] main
   [junit4]   2> 157249 INFO  (commitScheduler-590-thread-1) [    x:collection1] o.a.s.u.DirectUpdateHandler2 end_commit_flush
   [junit4]   2> 157251 INFO  (searcherExecutor-587-thread-1-processing-x:collection1) [    x:collection1] o.a.s.c.SolrCore [collection1] Registered new searcher Searcher@1fa168a[collection1] main{ExitableDirectoryReader(UninvertingDirectoryReader(Uninverting(_6(5.5.3):C15)))}
   [junit4]   2> 157490 INFO  (TEST-AutoCommitTest.testMaxDocs-seed#[728D925758F9B45A]) [    x:collection1] o.a.s.u.p.LogUpdateProcessorFactory [collection1] {add=[15 (1545211575233675264)]} 0 268
   [junit4]   2> 157491 INFO  (TEST-AutoCommitTest.testMaxDocs-seed#[728D925758F9B45A]) [    x:collection1] o.a.s.c.S.Request [collection1]  webapp=null path=null params={q=id:14&qt=standard&start=0&rows=20&version=2.2} hits=1 status=0 QTime=0
   [junit4]   2> 157492 INFO  (TEST-AutoCommitTest.testMaxDocs-seed#[728D925758F9B45A]) [    x:collection1] o.a.s.c.S.Request [collection1]  webapp=null path=null params={q=id:15&qt=standard&start=0&rows=20&version=2.2} hits=0 status=0 QTime=0
   [junit4]   2> 157493 INFO  (TEST-AutoCommitTest.testMaxDocs-seed#[728D925758F9B45A]) [    x:collection1] o.a.s.SolrTestCaseJ4 ###Ending testMaxDocs
   [junit4]   2> 157493 INFO  (SUITE-AutoCommitTest-seed#[728D925758F9B45A]-worker) [    x:collection1] o.a.s.SolrTestCaseJ4 ###deleteCore
   [junit4]   2> 157493 INFO  (SUITE-AutoCommitTest-seed#[728D925758F9B45A]-worker) [    x:collection1] o.a.s.c.CoreContainer Shutting down CoreContainer instance=23268916
   [junit4]   2> 157494 INFO  (coreCloseExecutor-591-thread-1-processing-x:collection1) [    x:collection1] o.a.s.c.SolrCore [collection1]  CLOSING SolrCore org.apache.solr.core.SolrCore@47d57b
   [junit4]   2> 157494 INFO  (coreCloseExecutor-591-thread-1-processing-x:collection1) [    x:collection1] o.a.s.u.DirectUpdateHandler2 closing DirectUpdateHandler2{commits=1,autocommits=0,soft autocommit maxDocs=14,soft autocommits=1,optimizes=0,rollbacks=0,expungeDeletes=0,docsPending=16,adds=1,deletesById=0,deletesByQuery=0,errors=0,cumulative_adds=16,cumulative_deletesById=0,cumulative_deletesByQuery=0,cumulative_errors=0,transaction_logs_total_size=0,transaction_logs_total_number=0}
   [junit4]   2> 157494 INFO  (coreCloseExecutor-591-thread-1-processing-x:collection1) [    x:collection1] o.a.s.u.SolrCoreState Closing SolrCoreState
   [junit4]   2> 157494 INFO  (coreCloseExecutor-591-thread-1-processing-x:collection1) [    x:collection1] o.a.s.u.DefaultSolrCoreState SolrCoreState ref count has reached 0 - closing IndexWriter
   [junit4]   2> 157494 INFO  (coreCloseExecutor-591-thread-1-processing-x:collection1) [    x:collection1] o.a.s.u.DefaultSolrCoreState closing IndexWriter with IndexWriterCloser
   [junit4]   2> 157494 INFO  (coreCloseExecutor-591-thread-1-processing-x:collection1) [    x:collection1] o.a.s.u.DirectUpdateHandler2 Committing on IndexWriter close.
   [junit4]   2> 157507 INFO  (coreCloseExecutor-591-thread-1-processing-x:collection1) [    x:collection1] o.a.s.c.SolrDeletionPolicy SolrDeletionPolicy.onCommit: commits: num=2
   [junit4]   2> 	commit{dir=MockDirectoryWrapper(RAMDirectory@e509de lockFactory=org.apache.lucene.store.SingleInstanceLockFactory@5dd033),segFN=segments_3,generation=3}
   [junit4]   2> 	commit{dir=MockDirectoryWrapper(RAMDirectory@e509de lockFactory=org.apache.lucene.store.SingleInstanceLockFactory@5dd033),segFN=segments_4,generation=4}
   [junit4]   2> 157507 INFO  (coreCloseExecutor-591-thread-1-processing-x:collection1) [    x:collection1] o.a.s.c.SolrDeletionPolicy newest commit generation = 4
   [junit4]   2> 157507 INFO  (coreCloseExecutor-591-thread-1-processing-x:collection1) [    x:collection1] o.a.s.c.SolrCore [collection1] Closing main searcher on request.
   [junit4]   2> 157542 INFO  (coreCloseExecutor-591-thread-1-processing-x:collection1) [    x:collection1] o.a.s.c.CachingDirectoryFactory Closing MockDirectoryFactory - 2 directories currently being tracked
   [junit4]   2> 157543 INFO  (coreCloseExecutor-591-thread-1-processing-x:collection1) [    x:collection1] o.a.s.c.CachingDirectoryFactory looking to close /home/jenkins/workspace/Lucene-Solr-5.5-Linux/solr/build/solr-core/test/J2/temp/solr.update.AutoCommitTest_728D925758F9B45A-001/init-core-data-001 [CachedDir<<refCount=0;path=/home/jenkins/workspace/Lucene-Solr-5.5-Linux/solr/build/solr-core/test/J2/temp/solr.update.AutoCommitTest_728D925758F9B45A-001/init-core-data-001;done=false>>]
   [junit4]   2> 157543 INFO  (coreCloseExecutor-591-thread-1-processing-x:collection1) [    x:collection1] o.a.s.c.CachingDirectoryFactory Closing directory: /home/jenkins/workspace/Lucene-Solr-5.5-Linux/solr/build/solr-core/test/J2/temp/solr.update.AutoCommitTest_728D925758F9B45A-001/init-core-data-001
   [junit4]   2> 157543 INFO  (coreCloseExecutor-591-thread-1-processing-x:collection1) [    x:collection1] o.a.s.c.CachingDirectoryFactory looking to close /home/jenkins/workspace/Lucene-Solr-5.5-Linux/solr/build/solr-core/test/J2/temp/solr.update.AutoCommitTest_728D925758F9B45A-001/init-core-data-001/index [CachedDir<<refCount=0;path=/home/jenkins/workspace/Lucene-Solr-5.5-Linux/solr/build/solr-core/test/J2/temp/solr.update.AutoCommitTest_728D925758F9B45A-001/init-core-data-001/index;done=false>>]
   [junit4]   2> 157543 INFO  (coreCloseExecutor-591-thread-1-processing-x:collection1) [    x:collection1] o.a.s.c.CachingDirectoryFactory Closing directory: /home/jenkins/workspace/Lucene-Solr-5.5-Linux/solr/build/solr-core/test/J2/temp/solr.update.AutoCommitTest_728D925758F9B45A-001/init-core-data-001/index
   [junit4]   2> NOTE: leaving temporary files on disk at: /home/jenkins/workspace/Lucene-Solr-5.5-Linux/solr/build/solr-core/test/J2/temp/solr.update.AutoCommitTest_728D925758F9B45A-001
   [junit4]   2> NOTE: test params are: codec=Asserting(Lucene54): {range_facet_l_dv=PostingsFormat(name=Direct), _version_=FST50, field_t=PostingsFormat(name=Memory doPackFST= false), multiDefault=TestBloomFilteredLucenePostings(BloomFilteringPostingsFormat(Lucene50(blocksize=128))), subject=TestBloomFilteredLucenePostings(BloomFilteringPostingsFormat(Lucene50(blocksize=128))), intDefault=FST50, id=PostingsFormat(name=Direct), range_facet_i_dv=FST50, text=PostingsFormat(name=Memory doPackFST= false), range_facet_l=FST50, timestamp=FST50}, docValues:{range_facet_l_dv=DocValuesFormat(name=Memory), range_facet_i_dv=DocValuesFormat(name=Lucene54), timestamp=DocValuesFormat(name=Lucene54)}, sim=DefaultSimilarity, locale=nl, timezone=America/Lower_Princes
   [junit4]   2> NOTE: Linux 4.4.0-36-generic i386/Oracle Corporation 1.8.0_102 (32-bit)/cpus=12,threads=1,free=14656056,total=90234880
   [junit4]   2> NOTE: All tests run in this JVM: [IgnoreCommitOptimizeUpdateProcessorFactoryTest, SolrTestCaseJ4Test, DocValuesMissingTest, SimpleFacetsTest, TestClusterStateMutator, TestIndexSearcher, TestRestoreCore, TestRandomRequestDistribution, HighlighterConfigTest, TestManagedSchemaFieldTypeResource, FieldAnalysisRequestHandlerTest, TestUniqueKeyFieldResource, CoreSorterTest, TestRecovery, DistributedDebugComponentTest, TestSolrCloudWithKerberosAlt, TestPostingsSolrHighlighter, HdfsLockFactoryTest, TestConfigSetImmutable, TestManagedResource, SliceStateTest, AutoCommitTest]
   [junit4] Completed [50/575 (1!)] on J2 in 13.58s, 3 tests, 1 failure <<< FAILURES!

[...truncated 50833 lines...]


Mime
View raw message