lucene-dev mailing list archives

Site index · List index
Message view « Date » · « Thread »
Top « Date » · « Thread »
From Policeman Jenkins Server <jenk...@thetaphi.de>
Subject [JENKINS] Lucene-Solr-master-Windows (64bit/jdk1.8.0_102) - Build # 6128 - Unstable!
Date Tue, 20 Sep 2016 23:43:37 GMT
Build: http://jenkins.thetaphi.de/job/Lucene-Solr-master-Windows/6128/
Java: 64bit/jdk1.8.0_102 -XX:-UseCompressedOops -XX:+UseParallelGC

3 tests failed.
FAILED:  junit.framework.TestSuite.org.apache.solr.cloud.CdcrVersionReplicationTest

Error Message:
ObjectTracker found 1 object(s) that were not released!!! [InternalHttpClient]

Stack Trace:
java.lang.AssertionError: ObjectTracker found 1 object(s) that were not released!!! [InternalHttpClient]
	at __randomizedtesting.SeedInfo.seed([86AC16513837805E]:0)
	at org.junit.Assert.fail(Assert.java:93)
	at org.junit.Assert.assertTrue(Assert.java:43)
	at org.junit.Assert.assertNull(Assert.java:551)
	at org.apache.solr.SolrTestCaseJ4.teardownTestCases(SolrTestCaseJ4.java:257)
	at sun.reflect.NativeMethodAccessorImpl.invoke0(Native Method)
	at sun.reflect.NativeMethodAccessorImpl.invoke(NativeMethodAccessorImpl.java:62)
	at sun.reflect.DelegatingMethodAccessorImpl.invoke(DelegatingMethodAccessorImpl.java:43)
	at java.lang.reflect.Method.invoke(Method.java:498)
	at com.carrotsearch.randomizedtesting.RandomizedRunner.invoke(RandomizedRunner.java:1764)
	at com.carrotsearch.randomizedtesting.RandomizedRunner$7.evaluate(RandomizedRunner.java:834)
	at com.carrotsearch.randomizedtesting.rules.StatementAdapter.evaluate(StatementAdapter.java:36)
	at com.carrotsearch.randomizedtesting.rules.SystemPropertiesRestoreRule$1.evaluate(SystemPropertiesRestoreRule.java:57)
	at org.apache.lucene.util.AbstractBeforeAfterRule$1.evaluate(AbstractBeforeAfterRule.java:45)
	at com.carrotsearch.randomizedtesting.rules.StatementAdapter.evaluate(StatementAdapter.java:36)
	at org.apache.lucene.util.TestRuleStoreClassName$1.evaluate(TestRuleStoreClassName.java:41)
	at com.carrotsearch.randomizedtesting.rules.NoShadowingOrOverridesOnMethodsRule$1.evaluate(NoShadowingOrOverridesOnMethodsRule.java:40)
	at com.carrotsearch.randomizedtesting.rules.NoShadowingOrOverridesOnMethodsRule$1.evaluate(NoShadowingOrOverridesOnMethodsRule.java:40)
	at com.carrotsearch.randomizedtesting.rules.StatementAdapter.evaluate(StatementAdapter.java:36)
	at com.carrotsearch.randomizedtesting.rules.StatementAdapter.evaluate(StatementAdapter.java:36)
	at com.carrotsearch.randomizedtesting.rules.StatementAdapter.evaluate(StatementAdapter.java:36)
	at org.apache.lucene.util.TestRuleAssertionsRequired$1.evaluate(TestRuleAssertionsRequired.java:53)
	at org.apache.lucene.util.TestRuleMarkFailure$1.evaluate(TestRuleMarkFailure.java:47)
	at org.apache.lucene.util.TestRuleIgnoreAfterMaxFailures$1.evaluate(TestRuleIgnoreAfterMaxFailures.java:64)
	at org.apache.lucene.util.TestRuleIgnoreTestSuites$1.evaluate(TestRuleIgnoreTestSuites.java:54)
	at com.carrotsearch.randomizedtesting.rules.StatementAdapter.evaluate(StatementAdapter.java:36)
	at com.carrotsearch.randomizedtesting.ThreadLeakControl$StatementRunner.run(ThreadLeakControl.java:367)
	at java.lang.Thread.run(Thread.java:745)


FAILED:  org.apache.solr.cloud.CollectionsAPIDistributedZkTest.test

Error Message:
replicaCount expected:<0> but was:<1>

Stack Trace:
java.lang.AssertionError: replicaCount expected:<0> but was:<1>
	at __randomizedtesting.SeedInfo.seed([86AC16513837805E:EF8298B96CBEDA6]:0)
	at org.junit.Assert.fail(Assert.java:93)
	at org.junit.Assert.failNotEquals(Assert.java:647)
	at org.junit.Assert.assertEquals(Assert.java:128)
	at org.junit.Assert.assertEquals(Assert.java:472)
	at org.apache.solr.cloud.CollectionsAPIDistributedZkTest.testNoConfigSetExist(CollectionsAPIDistributedZkTest.java:619)
	at org.apache.solr.cloud.CollectionsAPIDistributedZkTest.test(CollectionsAPIDistributedZkTest.java:177)
	at sun.reflect.NativeMethodAccessorImpl.invoke0(Native Method)
	at sun.reflect.NativeMethodAccessorImpl.invoke(NativeMethodAccessorImpl.java:62)
	at sun.reflect.DelegatingMethodAccessorImpl.invoke(DelegatingMethodAccessorImpl.java:43)
	at java.lang.reflect.Method.invoke(Method.java:498)
	at com.carrotsearch.randomizedtesting.RandomizedRunner.invoke(RandomizedRunner.java:1764)
	at com.carrotsearch.randomizedtesting.RandomizedRunner$8.evaluate(RandomizedRunner.java:871)
	at com.carrotsearch.randomizedtesting.RandomizedRunner$9.evaluate(RandomizedRunner.java:907)
	at com.carrotsearch.randomizedtesting.RandomizedRunner$10.evaluate(RandomizedRunner.java:921)
	at org.apache.solr.BaseDistributedSearchTestCase$ShardsRepeatRule$ShardsFixedStatement.callStatement(BaseDistributedSearchTestCase.java:985)
	at org.apache.solr.BaseDistributedSearchTestCase$ShardsRepeatRule$ShardsStatement.evaluate(BaseDistributedSearchTestCase.java:960)
	at com.carrotsearch.randomizedtesting.rules.SystemPropertiesRestoreRule$1.evaluate(SystemPropertiesRestoreRule.java:57)
	at org.apache.lucene.util.TestRuleSetupTeardownChained$1.evaluate(TestRuleSetupTeardownChained.java:49)
	at org.apache.lucene.util.AbstractBeforeAfterRule$1.evaluate(AbstractBeforeAfterRule.java:45)
	at org.apache.lucene.util.TestRuleThreadAndTestName$1.evaluate(TestRuleThreadAndTestName.java:48)
	at org.apache.lucene.util.TestRuleIgnoreAfterMaxFailures$1.evaluate(TestRuleIgnoreAfterMaxFailures.java:64)
	at org.apache.lucene.util.TestRuleMarkFailure$1.evaluate(TestRuleMarkFailure.java:47)
	at com.carrotsearch.randomizedtesting.rules.StatementAdapter.evaluate(StatementAdapter.java:36)
	at com.carrotsearch.randomizedtesting.ThreadLeakControl$StatementRunner.run(ThreadLeakControl.java:367)
	at com.carrotsearch.randomizedtesting.ThreadLeakControl.forkTimeoutingTask(ThreadLeakControl.java:809)
	at com.carrotsearch.randomizedtesting.ThreadLeakControl$3.evaluate(ThreadLeakControl.java:460)
	at com.carrotsearch.randomizedtesting.RandomizedRunner.runSingleTest(RandomizedRunner.java:880)
	at com.carrotsearch.randomizedtesting.RandomizedRunner$5.evaluate(RandomizedRunner.java:781)
	at com.carrotsearch.randomizedtesting.RandomizedRunner$6.evaluate(RandomizedRunner.java:816)
	at com.carrotsearch.randomizedtesting.RandomizedRunner$7.evaluate(RandomizedRunner.java:827)
	at com.carrotsearch.randomizedtesting.rules.StatementAdapter.evaluate(StatementAdapter.java:36)
	at com.carrotsearch.randomizedtesting.rules.SystemPropertiesRestoreRule$1.evaluate(SystemPropertiesRestoreRule.java:57)
	at org.apache.lucene.util.AbstractBeforeAfterRule$1.evaluate(AbstractBeforeAfterRule.java:45)
	at com.carrotsearch.randomizedtesting.rules.StatementAdapter.evaluate(StatementAdapter.java:36)
	at org.apache.lucene.util.TestRuleStoreClassName$1.evaluate(TestRuleStoreClassName.java:41)
	at com.carrotsearch.randomizedtesting.rules.NoShadowingOrOverridesOnMethodsRule$1.evaluate(NoShadowingOrOverridesOnMethodsRule.java:40)
	at com.carrotsearch.randomizedtesting.rules.NoShadowingOrOverridesOnMethodsRule$1.evaluate(NoShadowingOrOverridesOnMethodsRule.java:40)
	at com.carrotsearch.randomizedtesting.rules.StatementAdapter.evaluate(StatementAdapter.java:36)
	at com.carrotsearch.randomizedtesting.rules.StatementAdapter.evaluate(StatementAdapter.java:36)
	at com.carrotsearch.randomizedtesting.rules.StatementAdapter.evaluate(StatementAdapter.java:36)
	at org.apache.lucene.util.TestRuleAssertionsRequired$1.evaluate(TestRuleAssertionsRequired.java:53)
	at org.apache.lucene.util.TestRuleMarkFailure$1.evaluate(TestRuleMarkFailure.java:47)
	at org.apache.lucene.util.TestRuleIgnoreAfterMaxFailures$1.evaluate(TestRuleIgnoreAfterMaxFailures.java:64)
	at org.apache.lucene.util.TestRuleIgnoreTestSuites$1.evaluate(TestRuleIgnoreTestSuites.java:54)
	at com.carrotsearch.randomizedtesting.rules.StatementAdapter.evaluate(StatementAdapter.java:36)
	at com.carrotsearch.randomizedtesting.ThreadLeakControl$StatementRunner.run(ThreadLeakControl.java:367)
	at java.lang.Thread.run(Thread.java:745)


FAILED:  junit.framework.TestSuite.org.apache.solr.schema.TestManagedSchemaAPI

Error Message:
ObjectTracker found 2 object(s) that were not released!!! [SolrCore, MockDirectoryWrapper]

Stack Trace:
java.lang.AssertionError: ObjectTracker found 2 object(s) that were not released!!! [SolrCore, MockDirectoryWrapper]
	at __randomizedtesting.SeedInfo.seed([86AC16513837805E]:0)
	at org.junit.Assert.fail(Assert.java:93)
	at org.junit.Assert.assertTrue(Assert.java:43)
	at org.junit.Assert.assertNull(Assert.java:551)
	at org.apache.solr.SolrTestCaseJ4.teardownTestCases(SolrTestCaseJ4.java:257)
	at sun.reflect.GeneratedMethodAccessor59.invoke(Unknown Source)
	at sun.reflect.DelegatingMethodAccessorImpl.invoke(DelegatingMethodAccessorImpl.java:43)
	at java.lang.reflect.Method.invoke(Method.java:498)
	at com.carrotsearch.randomizedtesting.RandomizedRunner.invoke(RandomizedRunner.java:1764)
	at com.carrotsearch.randomizedtesting.RandomizedRunner$7.evaluate(RandomizedRunner.java:834)
	at com.carrotsearch.randomizedtesting.rules.StatementAdapter.evaluate(StatementAdapter.java:36)
	at com.carrotsearch.randomizedtesting.rules.SystemPropertiesRestoreRule$1.evaluate(SystemPropertiesRestoreRule.java:57)
	at org.apache.lucene.util.AbstractBeforeAfterRule$1.evaluate(AbstractBeforeAfterRule.java:45)
	at com.carrotsearch.randomizedtesting.rules.StatementAdapter.evaluate(StatementAdapter.java:36)
	at org.apache.lucene.util.TestRuleStoreClassName$1.evaluate(TestRuleStoreClassName.java:41)
	at com.carrotsearch.randomizedtesting.rules.NoShadowingOrOverridesOnMethodsRule$1.evaluate(NoShadowingOrOverridesOnMethodsRule.java:40)
	at com.carrotsearch.randomizedtesting.rules.NoShadowingOrOverridesOnMethodsRule$1.evaluate(NoShadowingOrOverridesOnMethodsRule.java:40)
	at com.carrotsearch.randomizedtesting.rules.StatementAdapter.evaluate(StatementAdapter.java:36)
	at com.carrotsearch.randomizedtesting.rules.StatementAdapter.evaluate(StatementAdapter.java:36)
	at com.carrotsearch.randomizedtesting.rules.StatementAdapter.evaluate(StatementAdapter.java:36)
	at org.apache.lucene.util.TestRuleAssertionsRequired$1.evaluate(TestRuleAssertionsRequired.java:53)
	at org.apache.lucene.util.TestRuleMarkFailure$1.evaluate(TestRuleMarkFailure.java:47)
	at org.apache.lucene.util.TestRuleIgnoreAfterMaxFailures$1.evaluate(TestRuleIgnoreAfterMaxFailures.java:64)
	at org.apache.lucene.util.TestRuleIgnoreTestSuites$1.evaluate(TestRuleIgnoreTestSuites.java:54)
	at com.carrotsearch.randomizedtesting.rules.StatementAdapter.evaluate(StatementAdapter.java:36)
	at com.carrotsearch.randomizedtesting.ThreadLeakControl$StatementRunner.run(ThreadLeakControl.java:367)
	at java.lang.Thread.run(Thread.java:745)




Build Log:
[...truncated 11373 lines...]
   [junit4] Suite: org.apache.solr.cloud.CdcrVersionReplicationTest
   [junit4]   2> Creating dataDir: C:\Users\jenkins\workspace\Lucene-Solr-master-Windows\solr\build\solr-core\test\J0\temp\solr.cloud.CdcrVersionReplicationTest_86AC16513837805E-001\init-core-data-001
   [junit4]   2> 1175033 INFO  (SUITE-CdcrVersionReplicationTest-seed#[86AC16513837805E]-worker) [    ] o.a.s.SolrTestCaseJ4 Randomized ssl (false) and clientAuth (false) via: @org.apache.solr.util.RandomizeSSL(reason=, value=NaN, ssl=NaN, clientAuth=NaN)
   [junit4]   2> 1175033 INFO  (SUITE-CdcrVersionReplicationTest-seed#[86AC16513837805E]-worker) [    ] o.a.s.BaseDistributedSearchTestCase Setting hostContext system property: /
   [junit4]   2> 1175036 INFO  (TEST-CdcrVersionReplicationTest.testCdcrDocVersions-seed#[86AC16513837805E]) [    ] o.a.s.c.ZkTestServer STARTING ZK TEST SERVER
   [junit4]   2> 1175037 INFO  (Thread-1615) [    ] o.a.s.c.ZkTestServer client port:0.0.0.0/0.0.0.0:0
   [junit4]   2> 1175037 INFO  (Thread-1615) [    ] o.a.s.c.ZkTestServer Starting server
   [junit4]   2> 1175137 INFO  (TEST-CdcrVersionReplicationTest.testCdcrDocVersions-seed#[86AC16513837805E]) [    ] o.a.s.c.ZkTestServer start zk server on port:60322
   [junit4]   2> 1175137 INFO  (TEST-CdcrVersionReplicationTest.testCdcrDocVersions-seed#[86AC16513837805E]) [    ] o.a.s.c.c.SolrZkClient Using default ZkCredentialsProvider
   [junit4]   2> 1175138 INFO  (TEST-CdcrVersionReplicationTest.testCdcrDocVersions-seed#[86AC16513837805E]) [    ] o.a.s.c.c.ConnectionManager Waiting for client to connect to ZooKeeper
   [junit4]   2> 1175144 INFO  (zkCallback-1380-thread-1) [    ] o.a.s.c.c.ConnectionManager Watcher org.apache.solr.common.cloud.ConnectionManager@396e7ceb name:ZooKeeperConnection Watcher:127.0.0.1:60322 got event WatchedEvent state:SyncConnected type:None path:null path:null type:None
   [junit4]   2> 1175145 INFO  (TEST-CdcrVersionReplicationTest.testCdcrDocVersions-seed#[86AC16513837805E]) [    ] o.a.s.c.c.ConnectionManager Client is connected to ZooKeeper
   [junit4]   2> 1175145 INFO  (TEST-CdcrVersionReplicationTest.testCdcrDocVersions-seed#[86AC16513837805E]) [    ] o.a.s.c.c.SolrZkClient Using default ZkACLProvider
   [junit4]   2> 1175145 INFO  (TEST-CdcrVersionReplicationTest.testCdcrDocVersions-seed#[86AC16513837805E]) [    ] o.a.s.c.c.SolrZkClient makePath: /solr
   [junit4]   2> 1175149 WARN  (NIOServerCxn.Factory:0.0.0.0/0.0.0.0:0) [    ] o.a.z.s.NIOServerCnxn caught end of stream exception
   [junit4]   2> EndOfStreamException: Unable to read additional data from client sessionid 0x15749ca191a0000, likely client has closed socket
   [junit4]   2> 	at org.apache.zookeeper.server.NIOServerCnxn.doIO(NIOServerCnxn.java:228)
   [junit4]   2> 	at org.apache.zookeeper.server.NIOServerCnxnFactory.run(NIOServerCnxnFactory.java:208)
   [junit4]   2> 	at java.lang.Thread.run(Thread.java:745)
   [junit4]   2> 1175150 INFO  (TEST-CdcrVersionReplicationTest.testCdcrDocVersions-seed#[86AC16513837805E]) [    ] o.a.s.c.c.SolrZkClient Using default ZkCredentialsProvider
   [junit4]   2> 1175152 INFO  (TEST-CdcrVersionReplicationTest.testCdcrDocVersions-seed#[86AC16513837805E]) [    ] o.a.s.c.c.ConnectionManager Waiting for client to connect to ZooKeeper
   [junit4]   2> 1175154 INFO  (zkCallback-1381-thread-1) [    ] o.a.s.c.c.ConnectionManager Watcher org.apache.solr.common.cloud.ConnectionManager@23b14193 name:ZooKeeperConnection Watcher:127.0.0.1:60322/solr got event WatchedEvent state:SyncConnected type:None path:null path:null type:None
   [junit4]   2> 1175154 INFO  (TEST-CdcrVersionReplicationTest.testCdcrDocVersions-seed#[86AC16513837805E]) [    ] o.a.s.c.c.ConnectionManager Client is connected to ZooKeeper
   [junit4]   2> 1175155 INFO  (TEST-CdcrVersionReplicationTest.testCdcrDocVersions-seed#[86AC16513837805E]) [    ] o.a.s.c.c.SolrZkClient Using default ZkACLProvider
   [junit4]   2> 1175155 INFO  (TEST-CdcrVersionReplicationTest.testCdcrDocVersions-seed#[86AC16513837805E]) [    ] o.a.s.c.c.SolrZkClient makePath: /collections/collection1
   [junit4]   2> 1175157 INFO  (TEST-CdcrVersionReplicationTest.testCdcrDocVersions-seed#[86AC16513837805E]) [    ] o.a.s.c.c.SolrZkClient makePath: /collections/collection1/shards
   [junit4]   2> 1175159 INFO  (TEST-CdcrVersionReplicationTest.testCdcrDocVersions-seed#[86AC16513837805E]) [    ] o.a.s.c.c.SolrZkClient makePath: /collections/control_collection
   [junit4]   2> 1175161 INFO  (TEST-CdcrVersionReplicationTest.testCdcrDocVersions-seed#[86AC16513837805E]) [    ] o.a.s.c.c.SolrZkClient makePath: /collections/control_collection/shards
   [junit4]   2> 1175163 INFO  (TEST-CdcrVersionReplicationTest.testCdcrDocVersions-seed#[86AC16513837805E]) [    ] o.a.s.c.AbstractZkTestCase put C:\Users\jenkins\workspace\Lucene-Solr-master-Windows\solr\core\src\test-files\solr\collection1\conf\solrconfig-cdcr.xml to /configs/conf1/solrconfig.xml
   [junit4]   2> 1175163 INFO  (TEST-CdcrVersionReplicationTest.testCdcrDocVersions-seed#[86AC16513837805E]) [    ] o.a.s.c.c.SolrZkClient makePath: /configs/conf1/solrconfig.xml
   [junit4]   2> 1175166 INFO  (TEST-CdcrVersionReplicationTest.testCdcrDocVersions-seed#[86AC16513837805E]) [    ] o.a.s.c.AbstractZkTestCase put C:\Users\jenkins\workspace\Lucene-Solr-master-Windows\solr\core\src\test-files\solr\collection1\conf\schema15.xml to /configs/conf1/schema.xml
   [junit4]   2> 1175166 INFO  (TEST-CdcrVersionReplicationTest.testCdcrDocVersions-seed#[86AC16513837805E]) [    ] o.a.s.c.c.SolrZkClient makePath: /configs/conf1/schema.xml
   [junit4]   2> 1175167 INFO  (TEST-CdcrVersionReplicationTest.testCdcrDocVersions-seed#[86AC16513837805E]) [    ] o.a.s.c.AbstractZkTestCase put C:\Users\jenkins\workspace\Lucene-Solr-master-Windows\solr\core\src\test-files\solr\collection1\conf\solrconfig.snippet.randomindexconfig.xml to /configs/conf1/solrconfig.snippet.randomindexconfig.xml
   [junit4]   2> 1175168 INFO  (TEST-CdcrVersionReplicationTest.testCdcrDocVersions-seed#[86AC16513837805E]) [    ] o.a.s.c.c.SolrZkClient makePath: /configs/conf1/solrconfig.snippet.randomindexconfig.xml
   [junit4]   2> 1175169 INFO  (TEST-CdcrVersionReplicationTest.testCdcrDocVersions-seed#[86AC16513837805E]) [    ] o.a.s.c.AbstractZkTestCase put C:\Users\jenkins\workspace\Lucene-Solr-master-Windows\solr\core\src\test-files\solr\collection1\conf\stopwords.txt to /configs/conf1/stopwords.txt
   [junit4]   2> 1175169 INFO  (TEST-CdcrVersionReplicationTest.testCdcrDocVersions-seed#[86AC16513837805E]) [    ] o.a.s.c.c.SolrZkClient makePath: /configs/conf1/stopwords.txt
   [junit4]   2> 1175172 INFO  (TEST-CdcrVersionReplicationTest.testCdcrDocVersions-seed#[86AC16513837805E]) [    ] o.a.s.c.AbstractZkTestCase put C:\Users\jenkins\workspace\Lucene-Solr-master-Windows\solr\core\src\test-files\solr\collection1\conf\protwords.txt to /configs/conf1/protwords.txt
   [junit4]   2> 1175172 INFO  (TEST-CdcrVersionReplicationTest.testCdcrDocVersions-seed#[86AC16513837805E]) [    ] o.a.s.c.c.SolrZkClient makePath: /configs/conf1/protwords.txt
   [junit4]   2> 1175175 INFO  (TEST-CdcrVersionReplicationTest.testCdcrDocVersions-seed#[86AC16513837805E]) [    ] o.a.s.c.AbstractZkTestCase put C:\Users\jenkins\workspace\Lucene-Solr-master-Windows\solr\core\src\test-files\solr\collection1\conf\currency.xml to /configs/conf1/currency.xml
   [junit4]   2> 1175175 INFO  (TEST-CdcrVersionReplicationTest.testCdcrDocVersions-seed#[86AC16513837805E]) [    ] o.a.s.c.c.SolrZkClient makePath: /configs/conf1/currency.xml
   [junit4]   2> 1175176 INFO  (TEST-CdcrVersionReplicationTest.testCdcrDocVersions-seed#[86AC16513837805E]) [    ] o.a.s.c.AbstractZkTestCase put C:\Users\jenkins\workspace\Lucene-Solr-master-Windows\solr\core\src\test-files\solr\collection1\conf\enumsConfig.xml to /configs/conf1/enumsConfig.xml
   [junit4]   2> 1175176 INFO  (TEST-CdcrVersionReplicationTest.testCdcrDocVersions-seed#[86AC16513837805E]) [    ] o.a.s.c.c.SolrZkClient makePath: /configs/conf1/enumsConfig.xml
   [junit4]   2> 1175179 INFO  (TEST-CdcrVersionReplicationTest.testCdcrDocVersions-seed#[86AC16513837805E]) [    ] o.a.s.c.AbstractZkTestCase put C:\Users\jenkins\workspace\Lucene-Solr-master-Windows\solr\core\src\test-files\solr\collection1\conf\open-exchange-rates.json to /configs/conf1/open-exchange-rates.json
   [junit4]   2> 1175179 INFO  (TEST-CdcrVersionReplicationTest.testCdcrDocVersions-seed#[86AC16513837805E]) [    ] o.a.s.c.c.SolrZkClient makePath: /configs/conf1/open-exchange-rates.json
   [junit4]   2> 1175181 INFO  (TEST-CdcrVersionReplicationTest.testCdcrDocVersions-seed#[86AC16513837805E]) [    ] o.a.s.c.AbstractZkTestCase put C:\Users\jenkins\workspace\Lucene-Solr-master-Windows\solr\core\src\test-files\solr\collection1\conf\mapping-ISOLatin1Accent.txt to /configs/conf1/mapping-ISOLatin1Accent.txt
   [junit4]   2> 1175181 INFO  (TEST-CdcrVersionReplicationTest.testCdcrDocVersions-seed#[86AC16513837805E]) [    ] o.a.s.c.c.SolrZkClient makePath: /configs/conf1/mapping-ISOLatin1Accent.txt
   [junit4]   2> 1175183 INFO  (TEST-CdcrVersionReplicationTest.testCdcrDocVersions-seed#[86AC16513837805E]) [    ] o.a.s.c.AbstractZkTestCase put C:\Users\jenkins\workspace\Lucene-Solr-master-Windows\solr\core\src\test-files\solr\collection1\conf\old_synonyms.txt to /configs/conf1/old_synonyms.txt
   [junit4]   2> 1175183 INFO  (TEST-CdcrVersionReplicationTest.testCdcrDocVersions-seed#[86AC16513837805E]) [    ] o.a.s.c.c.SolrZkClient makePath: /configs/conf1/old_synonyms.txt
   [junit4]   2> 1175186 INFO  (TEST-CdcrVersionReplicationTest.testCdcrDocVersions-seed#[86AC16513837805E]) [    ] o.a.s.c.AbstractZkTestCase put C:\Users\jenkins\workspace\Lucene-Solr-master-Windows\solr\core\src\test-files\solr\collection1\conf\synonyms.txt to /configs/conf1/synonyms.txt
   [junit4]   2> 1175186 INFO  (TEST-CdcrVersionReplicationTest.testCdcrDocVersions-seed#[86AC16513837805E]) [    ] o.a.s.c.c.SolrZkClient makePath: /configs/conf1/synonyms.txt
   [junit4]   2> 1175191 INFO  (TEST-CdcrVersionReplicationTest.testCdcrDocVersions-seed#[86AC16513837805E]) [    ] o.a.s.SolrTestCaseJ4 ###Starting testCdcrDocVersions
   [junit4]   2> 1175766 INFO  (TEST-CdcrVersionReplicationTest.testCdcrDocVersions-seed#[86AC16513837805E]) [    ] o.a.s.SolrTestCaseJ4 Writing core.properties file to C:\Users\jenkins\workspace\Lucene-Solr-master-Windows\solr\build\solr-core\test\J0\temp\solr.cloud.CdcrVersionReplicationTest_86AC16513837805E-001\jetty-001\cores\collection1
   [junit4]   2> 1175770 INFO  (TEST-CdcrVersionReplicationTest.testCdcrDocVersions-seed#[86AC16513837805E]) [    ] o.e.j.s.Server jetty-9.3.8.v20160314
   [junit4]   2> 1175771 INFO  (TEST-CdcrVersionReplicationTest.testCdcrDocVersions-seed#[86AC16513837805E]) [    ] o.e.j.s.h.ContextHandler Started o.e.j.s.ServletContextHandler@148ddbec{/,null,AVAILABLE}
   [junit4]   2> 1175773 INFO  (TEST-CdcrVersionReplicationTest.testCdcrDocVersions-seed#[86AC16513837805E]) [    ] o.e.j.s.ServerConnector Started ServerConnector@4c2c4fe2{HTTP/1.1,[http/1.1]}{127.0.0.1:60329}
   [junit4]   2> 1175773 INFO  (TEST-CdcrVersionReplicationTest.testCdcrDocVersions-seed#[86AC16513837805E]) [    ] o.e.j.s.Server Started @1180279ms
   [junit4]   2> 1175773 INFO  (TEST-CdcrVersionReplicationTest.testCdcrDocVersions-seed#[86AC16513837805E]) [    ] o.a.s.c.s.e.JettySolrRunner Jetty properties: {shards=shard1, hostContext=/, hostPort=60329, coreRootDirectory=C:\Users\jenkins\workspace\Lucene-Solr-master-Windows\solr\build\solr-core\test\J0\temp\solr.cloud.CdcrVersionReplicationTest_86AC16513837805E-001\jetty-001\cores}
   [junit4]   2> 1175774 INFO  (TEST-CdcrVersionReplicationTest.testCdcrDocVersions-seed#[86AC16513837805E]) [    ] o.a.s.s.SolrDispatchFilter SolrDispatchFilter.init(): sun.misc.Launcher$AppClassLoader@73d16e93
   [junit4]   2> 1175774 INFO  (TEST-CdcrVersionReplicationTest.testCdcrDocVersions-seed#[86AC16513837805E]) [    ] o.a.s.c.SolrResourceLoader new SolrResourceLoader for directory: 'C:\Users\jenkins\workspace\Lucene-Solr-master-Windows\solr\build\solr-core\test\J0\temp\solr.cloud.CdcrVersionReplicationTest_86AC16513837805E-001\jetty-001'
   [junit4]   2> 1175774 INFO  (TEST-CdcrVersionReplicationTest.testCdcrDocVersions-seed#[86AC16513837805E]) [    ] o.a.s.c.SolrResourceLoader JNDI not configured for solr (NoInitialContextEx)
   [junit4]   2> 1175774 INFO  (TEST-CdcrVersionReplicationTest.testCdcrDocVersions-seed#[86AC16513837805E]) [    ] o.a.s.c.SolrResourceLoader solr home defaulted to 'solr/' (could not find system property or JNDI)
   [junit4]   2> 1175775 INFO  (TEST-CdcrVersionReplicationTest.testCdcrDocVersions-seed#[86AC16513837805E]) [    ] o.a.s.c.c.SolrZkClient Using default ZkCredentialsProvider
   [junit4]   2> 1175776 INFO  (TEST-CdcrVersionReplicationTest.testCdcrDocVersions-seed#[86AC16513837805E]) [    ] o.a.s.c.c.ConnectionManager Waiting for client to connect to ZooKeeper
   [junit4]   2> 1175777 INFO  (zkCallback-1382-thread-1) [    ] o.a.s.c.c.ConnectionManager Watcher org.apache.solr.common.cloud.ConnectionManager@1833338f name:ZooKeeperConnection Watcher:127.0.0.1:60322/solr got event WatchedEvent state:SyncConnected type:None path:null path:null type:None
   [junit4]   2> 1175777 INFO  (TEST-CdcrVersionReplicationTest.testCdcrDocVersions-seed#[86AC16513837805E]) [    ] o.a.s.c.c.ConnectionManager Client is connected to ZooKeeper
   [junit4]   2> 1175778 INFO  (TEST-CdcrVersionReplicationTest.testCdcrDocVersions-seed#[86AC16513837805E]) [    ] o.a.s.c.c.SolrZkClient Using default ZkACLProvider
   [junit4]   2> 1175778 INFO  (TEST-CdcrVersionReplicationTest.testCdcrDocVersions-seed#[86AC16513837805E]) [    ] o.a.s.s.SolrDispatchFilter Loading solr.xml from SolrHome (not found in ZooKeeper)
   [junit4]   2> 1175779 INFO  (TEST-CdcrVersionReplicationTest.testCdcrDocVersions-seed#[86AC16513837805E]) [    ] o.a.s.c.SolrXmlConfig Loading container configuration from C:\Users\jenkins\workspace\Lucene-Solr-master-Windows\solr\build\solr-core\test\J0\temp\solr.cloud.CdcrVersionReplicationTest_86AC16513837805E-001\jetty-001\solr.xml
   [junit4]   2> 1175791 INFO  (TEST-CdcrVersionReplicationTest.testCdcrDocVersions-seed#[86AC16513837805E]) [    ] o.a.s.c.CorePropertiesLocator Config-defined core root directory: C:\Users\jenkins\workspace\Lucene-Solr-master-Windows\solr\build\solr-core\test\J0\temp\solr.cloud.CdcrVersionReplicationTest_86AC16513837805E-001\jetty-001\cores
   [junit4]   2> 1175791 INFO  (TEST-CdcrVersionReplicationTest.testCdcrDocVersions-seed#[86AC16513837805E]) [    ] o.a.s.c.CoreContainer New CoreContainer 962340769
   [junit4]   2> 1175791 INFO  (TEST-CdcrVersionReplicationTest.testCdcrDocVersions-seed#[86AC16513837805E]) [    ] o.a.s.c.CoreContainer Loading cores into CoreContainer [instanceDir=C:\Users\jenkins\workspace\Lucene-Solr-master-Windows\solr\build\solr-core\test\J0\temp\solr.cloud.CdcrVersionReplicationTest_86AC16513837805E-001\jetty-001]
   [junit4]   2> 1175792 WARN  (TEST-CdcrVersionReplicationTest.testCdcrDocVersions-seed#[86AC16513837805E]) [    ] o.a.s.c.CoreContainer Couldn't add files from C:\Users\jenkins\workspace\Lucene-Solr-master-Windows\solr\build\solr-core\test\J0\temp\solr.cloud.CdcrVersionReplicationTest_86AC16513837805E-001\jetty-001\lib to classpath: C:\Users\jenkins\workspace\Lucene-Solr-master-Windows\solr\build\solr-core\test\J0\temp\solr.cloud.CdcrVersionReplicationTest_86AC16513837805E-001\jetty-001\lib
   [junit4]   2> 1175792 INFO  (TEST-CdcrVersionReplicationTest.testCdcrDocVersions-seed#[86AC16513837805E]) [    ] o.a.s.h.c.HttpShardHandlerFactory created with socketTimeout : 90000,urlScheme : ,connTimeout : 15000,maxConnectionsPerHost : 20,maxConnections : 10000,corePoolSize : 0,maximumPoolSize : 2147483647,maxThreadIdleTime : 5,sizeOfQueue : -1,fairnessPolicy : false,
   [junit4]   2> 1175799 INFO  (TEST-CdcrVersionReplicationTest.testCdcrDocVersions-seed#[86AC16513837805E]) [    ] o.a.s.u.UpdateShardHandler Created UpdateShardHandler HTTP client with params: socketTimeout=340000&connTimeout=45000&maxConnections=100000&maxConnectionsPerHost=100000
   [junit4]   2> 1175799 INFO  (TEST-CdcrVersionReplicationTest.testCdcrDocVersions-seed#[86AC16513837805E]) [    ] o.a.s.l.LogWatcher SLF4J impl is org.slf4j.impl.Log4jLoggerFactory
   [junit4]   2> 1175799 INFO  (TEST-CdcrVersionReplicationTest.testCdcrDocVersions-seed#[86AC16513837805E]) [    ] o.a.s.l.LogWatcher Registering Log Listener [Log4j (org.slf4j.impl.Log4jLoggerFactory)]
   [junit4]   2> 1175799 INFO  (TEST-CdcrVersionReplicationTest.testCdcrDocVersions-seed#[86AC16513837805E]) [    ] o.a.s.c.ZkContainer Zookeeper client=127.0.0.1:60322/solr
   [junit4]   2> 1175799 INFO  (TEST-CdcrVersionReplicationTest.testCdcrDocVersions-seed#[86AC16513837805E]) [    ] o.a.s.c.ZkController zkHost includes chroot
   [junit4]   2> 1175799 INFO  (TEST-CdcrVersionReplicationTest.testCdcrDocVersions-seed#[86AC16513837805E]) [    ] o.a.s.c.c.SolrZkClient Using default ZkCredentialsProvider
   [junit4]   2> 1175801 INFO  (TEST-CdcrVersionReplicationTest.testCdcrDocVersions-seed#[86AC16513837805E]) [    ] o.a.s.c.c.ConnectionManager Waiting for client to connect to ZooKeeper
   [junit4]   2> 1175804 INFO  (zkCallback-1385-thread-1) [    ] o.a.s.c.c.ConnectionManager Watcher org.apache.solr.common.cloud.ConnectionManager@53fa3df4 name:ZooKeeperConnection Watcher:127.0.0.1:60322 got event WatchedEvent state:SyncConnected type:None path:null path:null type:None
   [junit4]   2> 1175804 INFO  (TEST-CdcrVersionReplicationTest.testCdcrDocVersions-seed#[86AC16513837805E]) [    ] o.a.s.c.c.ConnectionManager Client is connected to ZooKeeper
   [junit4]   2> 1175805 INFO  (TEST-CdcrVersionReplicationTest.testCdcrDocVersions-seed#[86AC16513837805E]) [    ] o.a.s.c.c.SolrZkClient Using default ZkACLProvider
   [junit4]   2> 1175805 INFO  (TEST-CdcrVersionReplicationTest.testCdcrDocVersions-seed#[86AC16513837805E]) [n:127.0.0.1:60329_    ] o.a.s.c.ZkController Added new OnReconnect listener org.apache.solr.cloud.ZkController$$Lambda$22/1048821187@5c226f33
   [junit4]   2> 1175807 INFO  (TEST-CdcrVersionReplicationTest.testCdcrDocVersions-seed#[86AC16513837805E]) [n:127.0.0.1:60329_    ] o.a.s.c.c.ConnectionManager Waiting for client to connect to ZooKeeper
   [junit4]   2> 1175809 INFO  (zkCallback-1386-thread-1-processing-n:127.0.0.1:60329_) [n:127.0.0.1:60329_    ] o.a.s.c.c.ConnectionManager Watcher org.apache.solr.common.cloud.ConnectionManager@f36339b name:ZooKeeperConnection Watcher:127.0.0.1:60322/solr got event WatchedEvent state:SyncConnected type:None path:null path:null type:None
   [junit4]   2> 1175809 INFO  (TEST-CdcrVersionReplicationTest.testCdcrDocVersions-seed#[86AC16513837805E]) [n:127.0.0.1:60329_    ] o.a.s.c.c.ConnectionManager Client is connected to ZooKeeper
   [junit4]   2> 1175811 INFO  (TEST-CdcrVersionReplicationTest.testCdcrDocVersions-seed#[86AC16513837805E]) [n:127.0.0.1:60329_    ] o.a.s.c.c.SolrZkClient makePath: /overseer/queue
   [junit4]   2> 1175815 INFO  (TEST-CdcrVersionReplicationTest.testCdcrDocVersions-seed#[86AC16513837805E]) [n:127.0.0.1:60329_    ] o.a.s.c.c.SolrZkClient makePath: /overseer/collection-queue-work
   [junit4]   2> 1175817 INFO  (TEST-CdcrVersionReplicationTest.testCdcrDocVersions-seed#[86AC16513837805E]) [n:127.0.0.1:60329_    ] o.a.s.c.c.SolrZkClient makePath: /overseer/collection-map-running
   [junit4]   2> 1175820 INFO  (TEST-CdcrVersionReplicationTest.testCdcrDocVersions-seed#[86AC16513837805E]) [n:127.0.0.1:60329_    ] o.a.s.c.c.SolrZkClient makePath: /overseer/collection-map-completed
   [junit4]   2> 1175822 INFO  (TEST-CdcrVersionReplicationTest.testCdcrDocVersions-seed#[86AC16513837805E]) [n:127.0.0.1:60329_    ] o.a.s.c.c.SolrZkClient makePath: /overseer/collection-map-failure
   [junit4]   2> 1175824 INFO  (TEST-CdcrVersionReplicationTest.testCdcrDocVersions-seed#[86AC16513837805E]) [n:127.0.0.1:60329_    ] o.a.s.c.c.SolrZkClient makePath: /live_nodes
   [junit4]   2> 1175826 INFO  (TEST-CdcrVersionReplicationTest.testCdcrDocVersions-seed#[86AC16513837805E]) [n:127.0.0.1:60329_    ] o.a.s.c.c.SolrZkClient makePath: /aliases.json
   [junit4]   2> 1175828 INFO  (TEST-CdcrVersionReplicationTest.testCdcrDocVersions-seed#[86AC16513837805E]) [n:127.0.0.1:60329_    ] o.a.s.c.c.SolrZkClient makePath: /clusterstate.json
   [junit4]   2> 1175830 INFO  (TEST-CdcrVersionReplicationTest.testCdcrDocVersions-seed#[86AC16513837805E]) [n:127.0.0.1:60329_    ] o.a.s.c.c.SolrZkClient makePath: /security.json
   [junit4]   2> 1175831 INFO  (TEST-CdcrVersionReplicationTest.testCdcrDocVersions-seed#[86AC16513837805E]) [n:127.0.0.1:60329_    ] o.a.s.c.c.ZkStateReader Updating cluster state from ZooKeeper... 
   [junit4]   2> 1175831 INFO  (TEST-CdcrVersionReplicationTest.testCdcrDocVersions-seed#[86AC16513837805E]) [n:127.0.0.1:60329_    ] o.a.s.c.c.ZkStateReader Loaded empty cluster properties
   [junit4]   2> 1175833 INFO  (TEST-CdcrVersionReplicationTest.testCdcrDocVersions-seed#[86AC16513837805E]) [n:127.0.0.1:60329_    ] o.a.s.c.c.ZkStateReader Updated live nodes from ZooKeeper... (0) -> (0)
   [junit4]   2> 1175836 INFO  (TEST-CdcrVersionReplicationTest.testCdcrDocVersions-seed#[86AC16513837805E]) [n:127.0.0.1:60329_    ] o.a.s.c.c.SolrZkClient makePath: /overseer_elect
   [junit4]   2> 1175838 INFO  (TEST-CdcrVersionReplicationTest.testCdcrDocVersions-seed#[86AC16513837805E]) [n:127.0.0.1:60329_    ] o.a.s.c.c.SolrZkClient makePath: /overseer_elect/election
   [junit4]   2> 1175840 INFO  (TEST-CdcrVersionReplicationTest.testCdcrDocVersions-seed#[86AC16513837805E]) [n:127.0.0.1:60329_    ] o.a.s.c.Overseer Overseer (id=null) closing
   [junit4]   2> 1175840 INFO  (TEST-CdcrVersionReplicationTest.testCdcrDocVersions-seed#[86AC16513837805E]) [n:127.0.0.1:60329_    ] o.a.s.c.LeaderElector Joined leadership election with path: /overseer_elect/election/96627049365110788-127.0.0.1:60329_-n_0000000000
   [junit4]   2> 1175841 INFO  (TEST-CdcrVersionReplicationTest.testCdcrDocVersions-seed#[86AC16513837805E]) [n:127.0.0.1:60329_    ] o.a.s.c.OverseerElectionContext I am going to be the leader 127.0.0.1:60329_
   [junit4]   2> 1175841 INFO  (TEST-CdcrVersionReplicationTest.testCdcrDocVersions-seed#[86AC16513837805E]) [n:127.0.0.1:60329_    ] o.a.s.c.c.SolrZkClient makePath: /overseer_elect/leader
   [junit4]   2> 1175843 INFO  (TEST-CdcrVersionReplicationTest.testCdcrDocVersions-seed#[86AC16513837805E]) [n:127.0.0.1:60329_    ] o.a.s.c.Overseer Overseer (id=96627049365110788-127.0.0.1:60329_-n_0000000000) starting
   [junit4]   2> 1175845 INFO  (TEST-CdcrVersionReplicationTest.testCdcrDocVersions-seed#[86AC16513837805E]) [n:127.0.0.1:60329_    ] o.a.s.c.c.SolrZkClient makePath: /overseer/queue-work
   [junit4]   2> 1175852 INFO  (TEST-CdcrVersionReplicationTest.testCdcrDocVersions-seed#[86AC16513837805E]) [n:127.0.0.1:60329_    ] o.a.s.c.OverseerAutoReplicaFailoverThread Starting OverseerAutoReplicaFailoverThread autoReplicaFailoverWorkLoopDelay=10000 autoReplicaFailoverWaitAfterExpiration=10000 autoReplicaFailoverBadNodeExpiration=60000
   [junit4]   2> 1175854 INFO  (OverseerCollectionConfigSetProcessor-96627049365110788-127.0.0.1:60329_-n_0000000000) [n:127.0.0.1:60329_    ] o.a.s.c.OverseerTaskProcessor Process current queue of overseer operations
   [junit4]   2> 1175854 INFO  (TEST-CdcrVersionReplicationTest.testCdcrDocVersions-seed#[86AC16513837805E]) [n:127.0.0.1:60329_    ] o.a.s.c.ZkController Register node as live in ZooKeeper:/live_nodes/127.0.0.1:60329_
   [junit4]   2> 1175854 INFO  (TEST-CdcrVersionReplicationTest.testCdcrDocVersions-seed#[86AC16513837805E]) [n:127.0.0.1:60329_    ] o.a.s.c.c.SolrZkClient makePath: /live_nodes/127.0.0.1:60329_
   [junit4]   2> 1175855 INFO  (OverseerStateUpdate-96627049365110788-127.0.0.1:60329_-n_0000000000) [n:127.0.0.1:60329_    ] o.a.s.c.Overseer Starting to work on the main queue
   [junit4]   2> 1175856 INFO  (zkCallback-1386-thread-1-processing-n:127.0.0.1:60329_) [n:127.0.0.1:60329_    ] o.a.s.c.c.ZkStateReader A live node change: [WatchedEvent state:SyncConnected type:NodeChildrenChanged path:/live_nodes], has occurred - updating... (live nodes size: [0])
   [junit4]   2> 1175857 INFO  (OverseerStateUpdate-96627049365110788-127.0.0.1:60329_-n_0000000000) [n:127.0.0.1:60329_    ] o.a.s.c.c.ZkStateReader Updated live nodes from ZooKeeper... (0) -> (1)
   [junit4]   2> 1175875 INFO  (TEST-CdcrVersionReplicationTest.testCdcrDocVersions-seed#[86AC16513837805E]) [n:127.0.0.1:60329_    ] o.a.s.c.CoreContainer Security conf doesn't exist. Skipping setup for authorization module.
   [junit4]   2> 1175875 INFO  (TEST-CdcrVersionReplicationTest.testCdcrDocVersions-seed#[86AC16513837805E]) [n:127.0.0.1:60329_    ] o.a.s.c.CoreContainer No authentication plugin used.
   [junit4]   2> 1175876 INFO  (TEST-CdcrVersionReplicationTest.testCdcrDocVersions-seed#[86AC16513837805E]) [n:127.0.0.1:60329_    ] o.a.s.c.CorePropertiesLocator Looking for core definitions underneath C:\Users\jenkins\workspace\Lucene-Solr-master-Windows\solr\build\solr-core\test\J0\temp\solr.cloud.CdcrVersionReplicationTest_86AC16513837805E-001\jetty-001\cores
   [junit4]   2> 1175879 INFO  (TEST-CdcrVersionReplicationTest.testCdcrDocVersions-seed#[86AC16513837805E]) [n:127.0.0.1:60329_    ] o.a.s.c.CoreDescriptor Created CoreDescriptor: {name=collection1, config=solrconfig.xml, transient=false, schema=schema.xml, loadOnStartup=true, configSetProperties=configsetprops.json, collection=tmp_collection, coreNodeName=, dataDir=data\, shard=}
   [junit4]   2> 1175879 INFO  (TEST-CdcrVersionReplicationTest.testCdcrDocVersions-seed#[86AC16513837805E]) [n:127.0.0.1:60329_    ] o.a.s.c.CorePropertiesLocator Found core collection1 in C:\Users\jenkins\workspace\Lucene-Solr-master-Windows\solr\build\solr-core\test\J0\temp\solr.cloud.CdcrVersionReplicationTest_86AC16513837805E-001\jetty-001\cores\collection1
   [junit4]   2> 1175879 INFO  (TEST-CdcrVersionReplicationTest.testCdcrDocVersions-seed#[86AC16513837805E]) [n:127.0.0.1:60329_    ] o.a.s.c.CorePropertiesLocator Found 1 core definitions
   [junit4]   2> 1175879 INFO  (coreLoadExecutor-3148-thread-1-processing-n:127.0.0.1:60329_) [n:127.0.0.1:60329_ c:tmp_collection   x:collection1] o.a.s.c.ZkController publishing state=down
   [junit4]   2> 1175879 INFO  (coreLoadExecutor-3148-thread-1-processing-n:127.0.0.1:60329_) [n:127.0.0.1:60329_ c:tmp_collection   x:collection1] o.a.s.c.ZkController numShards not found on descriptor - reading it from system property
   [junit4]   2> 1175880 INFO  (TEST-CdcrVersionReplicationTest.testCdcrDocVersions-seed#[86AC16513837805E]) [n:127.0.0.1:60329_    ] o.a.s.s.SolrDispatchFilter user.dir=C:\Users\jenkins\workspace\Lucene-Solr-master-Windows\solr\build\solr-core\test\J0
   [junit4]   2> 1175880 INFO  (TEST-CdcrVersionReplicationTest.testCdcrDocVersions-seed#[86AC16513837805E]) [n:127.0.0.1:60329_    ] o.a.s.s.SolrDispatchFilter SolrDispatchFilter.init() done
   [junit4]   2> 1175880 INFO  (coreLoadExecutor-3148-thread-1-processing-n:127.0.0.1:60329_) [n:127.0.0.1:60329_ c:tmp_collection   x:collection1] o.a.s.c.ZkController Collection tmp_collection not visible yet, but flagging it so a watch is registered when it becomes visible
   [junit4]   2> 1175881 INFO  (OverseerStateUpdate-96627049365110788-127.0.0.1:60329_-n_0000000000) [n:127.0.0.1:60329_    ] o.a.s.c.Overseer processMessage: queueSize: 1, message = {
   [junit4]   2>   "core":"collection1",
   [junit4]   2>   "roles":null,
   [junit4]   2>   "base_url":"http://127.0.0.1:60329",
   [junit4]   2>   "node_name":"127.0.0.1:60329_",
   [junit4]   2>   "numShards":"2",
   [junit4]   2>   "state":"down",
   [junit4]   2>   "shard":null,
   [junit4]   2>   "collection":"tmp_collection",
   [junit4]   2>   "operation":"state"} current state version: 0
   [junit4]   2> 1175881 INFO  (OverseerStateUpdate-96627049365110788-127.0.0.1:60329_-n_0000000000) [n:127.0.0.1:60329_    ] o.a.s.c.o.ReplicaMutator Update state numShards=2 message={
   [junit4]   2>   "core":"collection1",
   [junit4]   2>   "roles":null,
   [junit4]   2>   "base_url":"http://127.0.0.1:60329",
   [junit4]   2>   "node_name":"127.0.0.1:60329_",
   [junit4]   2>   "numShards":"2",
   [junit4]   2>   "state":"down",
   [junit4]   2>   "shard":null,
   [junit4]   2>   "collection":"tmp_collection",
   [junit4]   2>   "operation":"state"}
   [junit4]   2> 1175881 INFO  (coreLoadExecutor-3148-thread-1-processing-n:127.0.0.1:60329_) [n:127.0.0.1:60329_ c:tmp_collection   x:collection1] o.a.s.c.c.ZkStateReader Deleting data for [tmp_collection]
   [junit4]   2> 1175881 INFO  (OverseerStateUpdate-96627049365110788-127.0.0.1:60329_-n_0000000000) [n:127.0.0.1:60329_    ] o.a.s.c.o.ClusterStateMutator building a new cName: tmp_collection
   [junit4]   2> 1175881 INFO  (OverseerStateUpdate-96627049365110788-127.0.0.1:60329_-n_0000000000) [n:127.0.0.1:60329_    ] o.a.s.c.o.ReplicaMutator Assigning new node to shard shard=shard2
   [junit4]   2> 1175882 INFO  (coreLoadExecutor-3148-thread-1-processing-n:127.0.0.1:60329_) [n:127.0.0.1:60329_ c:tmp_collection   x:collection1] o.a.s.c.ZkController look for our core node name
   [junit4]   2> 1175883 INFO  (zkCallback-1386-thread-1-processing-n:127.0.0.1:60329_) [n:127.0.0.1:60329_    ] o.a.s.c.c.ZkStateReader A cluster state change: [WatchedEvent state:SyncConnected type:NodeDataChanged path:/clusterstate.json], has occurred - updating... (live nodes size: [1])
   [junit4]   2> 1176883 INFO  (coreLoadExecutor-3148-thread-1-processing-n:127.0.0.1:60329_) [n:127.0.0.1:60329_ c:tmp_collection   x:collection1] o.a.s.c.ZkController waiting to find shard id in clusterstate for collection1
   [junit4]   2> 1176883 INFO  (coreLoadExecutor-3148-thread-1-processing-n:127.0.0.1:60329_) [n:127.0.0.1:60329_ c:tmp_collection   x:collection1] o.a.s.c.ZkController Check for collection zkNode:tmp_collection
   [junit4]   2> 1176884 INFO  (coreLoadExecutor-3148-thread-1-processing-n:127.0.0.1:60329_) [n:127.0.0.1:60329_ c:tmp_collection   x:collection1] o.a.s.c.ZkController Creating collection in ZooKeeper:tmp_collection
   [junit4]   2> 1176884 INFO  (coreLoadExecutor-3148-thread-1-processing-n:127.0.0.1:60329_) [n:127.0.0.1:60329_ c:tmp_collection   x:collection1] o.a.s.c.ZkController Looking for collection configName
   [junit4]   2> 1176884 INFO  (coreLoadExecutor-3148-thread-1-processing-n:127.0.0.1:60329_) [n:127.0.0.1:60329_ c:tmp_collection   x:collection1] o.a.s.c.ZkController Only one config set found in zk - using it:conf1
   [junit4]   2> 1176884 INFO  (coreLoadExecutor-3148-thread-1-processing-n:127.0.0.1:60329_) [n:127.0.0.1:60329_ c:tmp_collection   x:collection1] o.a.s.c.c.SolrZkClient makePath: /collections/tmp_collection
   [junit4]   2> 1176886 INFO  (zkCallback-1386-thread-1-processing-n:127.0.0.1:60329_) [n:127.0.0.1:60329_    ] o.a.s.c.c.ZkStateReader A collections change: [WatchedEvent state:SyncConnected type:NodeChildrenChanged path:/collections], has occurred - updating...
   [junit4]   2> 1176887 INFO  (coreLoadExecutor-3148-thread-1-processing-n:127.0.0.1:60329_) [n:127.0.0.1:60329_ c:tmp_collection   x:collection1] o.a.s.c.SolrResourceLoader new SolrResourceLoader for directory: 'C:\Users\jenkins\workspace\Lucene-Solr-master-Windows\solr\build\solr-core\test\J0\temp\solr.cloud.CdcrVersionReplicationTest_86AC16513837805E-001\jetty-001\cores\collection1'
   [junit4]   2> 1176887 INFO  (coreLoadExecutor-3148-thread-1-processing-n:127.0.0.1:60329_) [n:127.0.0.1:60329_ c:tmp_collection   x:collection1] o.a.s.c.SolrResourceLoader JNDI not configured for solr (NoInitialContextEx)
   [junit4]   2> 1176887 INFO  (coreLoadExecutor-3148-thread-1-processing-n:127.0.0.1:60329_) [n:127.0.0.1:60329_ c:tmp_collection   x:collection1] o.a.s.c.SolrResourceLoader solr home defaulted to 'solr/' (could not find system property or JNDI)
   [junit4]   2> 1176890 INFO  (coreLoadExecutor-3148-thread-1-processing-n:127.0.0.1:60329_) [n:127.0.0.1:60329_ c:tmp_collection   x:collection1] o.a.s.c.Config loaded config solrconfig.xml with version 0 
   [junit4]   2> 1176899 INFO  (coreLoadExecutor-3148-thread-1-processing-n:127.0.0.1:60329_) [n:127.0.0.1:60329_ c:tmp_collection   x:collection1] o.a.s.c.SolrConfig current version of requestparams : -1
   [junit4]   2> 1176902 WARN  (coreLoadExecutor-3148-thread-1-processing-n:127.0.0.1:60329_) [n:127.0.0.1:60329_ c:tmp_collection   x:collection1] o.a.s.c.Config Beginning with Solr 5.5, <mergePolicy> is deprecated, use <mergePolicyFactory> instead.
   [junit4]   2> 1176903 INFO  (coreLoadExecutor-3148-thread-1-processing-n:127.0.0.1:60329_) [n:127.0.0.1:60329_ c:tmp_collection   x:collection1] o.a.s.c.SolrConfig Using Lucene MatchVersion: 7.0.0
   [junit4]   2> 1176910 INFO  (coreLoadExecutor-3148-thread-1-processing-n:127.0.0.1:60329_) [n:127.0.0.1:60329_ c:tmp_collection   x:collection1] o.a.s.c.SolrConfig Loaded SolrConfig: solrconfig.xml
   [junit4]   2> 1176924 INFO  (coreLoadExecutor-3148-thread-1-processing-n:127.0.0.1:60329_) [n:127.0.0.1:60329_ c:tmp_collection   x:collection1] o.a.s.s.IndexSchema [collection1] Schema name=test
   [junit4]   2> 1176998 INFO  (coreLoadExecutor-3148-thread-1-processing-n:127.0.0.1:60329_) [n:127.0.0.1:60329_ c:tmp_collection   x:collection1] o.a.s.s.IndexSchema default search field in schema is text
   [junit4]   2> 1176999 INFO  (coreLoadExecutor-3148-thread-1-processing-n:127.0.0.1:60329_) [n:127.0.0.1:60329_ c:tmp_collection   x:collection1] o.a.s.s.IndexSchema unique key field: id
   [junit4]   2> 1176999 INFO  (coreLoadExecutor-3148-thread-1-processing-n:127.0.0.1:60329_) [n:127.0.0.1:60329_ c:tmp_collection   x:collection1] o.a.s.s.FileExchangeRateProvider Reloading exchange rates from file currency.xml
   [junit4]   2> 1177002 INFO  (coreLoadExecutor-3148-thread-1-processing-n:127.0.0.1:60329_) [n:127.0.0.1:60329_ c:tmp_collection   x:collection1] o.a.s.s.FileExchangeRateProvider Reloading exchange rates from file currency.xml
   [junit4]   2> 1177044 INFO  (coreLoadExecutor-3148-thread-1-processing-n:127.0.0.1:60329_) [n:127.0.0.1:60329_ c:tmp_collection   x:collection1] o.a.s.c.ConfigSetProperties Did not find ConfigSet properties, assuming default properties: Can't find resource 'configsetprops.json' in classpath or '/configs/conf1', cwd=C:\Users\jenkins\workspace\Lucene-Solr-master-Windows\solr\build\solr-core\test\J0
   [junit4]   2> 1177044 INFO  (coreLoadExecutor-3148-thread-1-processing-n:127.0.0.1:60329_) [n:127.0.0.1:60329_ c:tmp_collection   x:collection1] o.a.s.c.CoreContainer Creating SolrCore 'collection1' using configuration from collection tmp_collection
   [junit4]   2> 1177045 INFO  (coreLoadExecutor-3148-thread-1-processing-n:127.0.0.1:60329_) [n:127.0.0.1:60329_ c:tmp_collection s:shard2 r:core_node1 x:collection1] o.a.s.c.SolrCore org.apache.solr.core.MockDirectoryFactory
   [junit4]   2> 1177045 INFO  (coreLoadExecutor-3148-thread-1-processing-n:127.0.0.1:60329_) [n:127.0.0.1:60329_ c:tmp_collection s:shard2 r:core_node1 x:collection1] o.a.s.c.SolrCore [[collection1] ] Opening new SolrCore at [C:\Users\jenkins\workspace\Lucene-Solr-master-Windows\solr\build\solr-core\test\J0\temp\solr.cloud.CdcrVersionReplicationTest_86AC16513837805E-001\jetty-001\cores\collection1], dataDir=[C:\Users\jenkins\workspace\Lucene-Solr-master-Windows\solr\build\solr-core\test\J0\temp\solr.cloud.CdcrVersionReplicationTest_86AC16513837805E-001\jetty-001\cores\collection1\data\]
   [junit4]   2> 1177045 INFO  (coreLoadExecutor-3148-thread-1-processing-n:127.0.0.1:60329_) [n:127.0.0.1:60329_ c:tmp_collection s:shard2 r:core_node1 x:collection1] o.a.s.c.JmxMonitoredMap JMX monitoring is enabled. Adding Solr mbeans to JMX Server: com.sun.jmx.mbeanserver.JmxMBeanServer@36ef7ba8
   [junit4]   2> 1177047 INFO  (coreLoadExecutor-3148-thread-1-processing-n:127.0.0.1:60329_) [n:127.0.0.1:60329_ c:tmp_collection s:shard2 r:core_node1 x:collection1] o.a.s.c.CachingDirectoryFactory return new directory for C:\Users\jenkins\workspace\Lucene-Solr-master-Windows\solr\build\solr-core\test\J0\temp\solr.cloud.CdcrVersionReplicationTest_86AC16513837805E-001\jetty-001\cores\collection1\data\snapshot_metadata
   [junit4]   2> 1177047 INFO  (coreLoadExecutor-3148-thread-1-processing-n:127.0.0.1:60329_) [n:127.0.0.1:60329_ c:tmp_collection s:shard2 r:core_node1 x:collection1] o.a.s.c.s.SolrSnapshotMetaDataManager Loading from snapshot metadata file...
   [junit4]   2> 1177050 INFO  (coreLoadExecutor-3148-thread-1-processing-n:127.0.0.1:60329_) [n:127.0.0.1:60329_ c:tmp_collection s:shard2 r:core_node1 x:collection1] o.a.s.c.CachingDirectoryFactory return new directory for C:\Users\jenkins\workspace\Lucene-Solr-master-Windows\solr\build\solr-core\test\J0\temp\solr.cloud.CdcrVersionReplicationTest_86AC16513837805E-001\jetty-001\cores\collection1\data\
   [junit4]   2> 1177050 INFO  (coreLoadExecutor-3148-thread-1-processing-n:127.0.0.1:60329_) [n:127.0.0.1:60329_ c:tmp_collection s:shard2 r:core_node1 x:collection1] o.a.s.c.SolrCore New index directory detected: old=null new=C:\Users\jenkins\workspace\Lucene-Solr-master-Windows\solr\build\solr-core\test\J0\temp\solr.cloud.CdcrVersionReplicationTest_86AC16513837805E-001\jetty-001\cores\collection1\data\index/
   [junit4]   2> 1177050 WARN  (coreLoadExecutor-3148-thread-1-processing-n:127.0.0.1:60329_) [n:127.0.0.1:60329_ c:tmp_collection s:shard2 r:core_node1 x:collection1] o.a.s.c.SolrCore [collection1] Solr index directory 'C:\Users\jenkins\workspace\Lucene-Solr-master-Windows\solr\build\solr-core\test\J0\temp\solr.cloud.CdcrVersionReplicationTest_86AC16513837805E-001\jetty-001\cores\collection1\data\index' doesn't exist. Creating new index...
   [junit4]   2> 1177050 INFO  (coreLoadExecutor-3148-thread-1-processing-n:127.0.0.1:60329_) [n:127.0.0.1:60329_ c:tmp_collection s:shard2 r:core_node1 x:collection1] o.a.s.c.CachingDirectoryFactory return new directory for C:\Users\jenkins\workspace\Lucene-Solr-master-Windows\solr\build\solr-core\test\J0\temp\solr.cloud.CdcrVersionReplicationTest_86AC16513837805E-001\jetty-001\cores\collection1\data\index
   [junit4]   2> 1177051 INFO  (coreLoadExecutor-3148-thread-1-processing-n:127.0.0.1:60329_) [n:127.0.0.1:60329_ c:tmp_collection s:shard2 r:core_node1 x:collection1] o.a.s.u.RandomMergePolicy RandomMergePolicy wrapping class org.apache.lucene.index.AlcoholicMergePolicy: [AlcoholicMergePolicy: minMergeSize=0, mergeFactor=10, maxMergeSize=1833026874, maxMergeSizeForForcedMerge=9223372036854775807, calibrateSizeByDeletes=true, maxMergeDocs=2147483647, maxCFSSegmentSizeMB=8.796093022207999E12, noCFSRatio=0.1]
   [junit4]   2> 1177053 INFO  (coreLoadExecutor-3148-thread-1-processing-n:127.0.0.1:60329_) [n:127.0.0.1:60329_ c:tmp_collection s:shard2 r:core_node1 x:collection1] o.a.s.c.SolrDeletionPolicy SolrDeletionPolicy.onCommit: commits: num=1
   [junit4]   2> 	commit{dir=MockDirectoryWrapper(RAMDirectory@6e1cf5c5 lockFactory=org.apache.lucene.store.SingleInstanceLockFactory@3aae2de1),segFN=segments_1,generation=1}
   [junit4]   2> 1177053 INFO  (coreLoadExecutor-3148-thread-1-processing-n:127.0.0.1:60329_) [n:127.0.0.1:60329_ c:tmp_collection s:shard2 r:core_node1 x:collection1] o.a.s.c.SolrDeletionPolicy newest commit generation = 1
   [junit4]   2> 1177055 INFO  (OldIndexDirectoryCleanupThreadForCore-collection1) [n:127.0.0.1:60329_ c:tmp_collection s:shard2 r:core_node1 x:collection1] o.a.s.c.SolrCore Looking for old index directories to cleanup for core collection1 in C:\Users\jenkins\workspace\Lucene-Solr-master-Windows\solr\build\solr-core\test\J0\temp\solr.cloud.CdcrVersionReplicationTest_86AC16513837805E-001\jetty-001\cores\collection1\data\
   [junit4]   2> 1177062 WARN  (OldIndexDirectoryCleanupThreadForCore-collection1) [n:127.0.0.1:60329_ c:tmp_collection s:shard2 r:core_node1 x:collection1] o.a.s.c.DirectoryFactory C:\Users\jenkins\workspace\Lucene-Solr-master-Windows\solr\build\solr-core\test\J0\temp\solr.cloud.CdcrVersionReplicationTest_86AC16513837805E-001\jetty-001\cores\collection1\data\ does not point to a valid data directory; skipping clean-up of old index directories.
   [junit4]   2> 1177071 INFO  (coreLoadExecutor-3148-thread-1-processing-n:127.0.0.1:60329_) [n:127.0.0.1:60329_ c:tmp_collection s:shard2 r:core_node1 x:collection1] o.a.s.u.p.UpdateRequestProcessorChain creating updateRequestProcessorChain "cdcr-processor-chain"
   [junit4]   2> 1177162 INFO  (coreLoadExecutor-3148-thread-1-processing-n:127.0.0.1:60329_) [n:127.0.0.1:60329_ c:tmp_collection s:shard2 r:core_node1 x:collection1] o.a.s.c.SolrCore no updateRequestProcessorChain defined as default, creating implicit default
   [junit4]   2> 1177167 INFO  (coreLoadExecutor-3148-thread-1-processing-n:127.0.0.1:60329_) [n:127.0.0.1:60329_ c:tmp_collection s:shard2 r:core_node1 x:collection1] o.a.s.h.l.XMLLoader xsltCacheLifetimeSeconds=60
   [junit4]   2> 1177169 INFO  (coreLoadExecutor-3148-thread-1-processing-n:127.0.0.1:60329_) [n:127.0.0.1:60329_ c:tmp_collection s:shard2 r:core_node1 x:collection1] o.a.s.h.l.XMLLoader xsltCacheLifetimeSeconds=60
   [junit4]   2> 1177170 INFO  (coreLoadExecutor-3148-thread-1-processing-n:127.0.0.1:60329_) [n:127.0.0.1:60329_ c:tmp_collection s:shard2 r:core_node1 x:collection1] o.a.s.h.l.XMLLoader xsltCacheLifetimeSeconds=60
   [junit4]   2> 1177171 INFO  (coreLoadExecutor-3148-thread-1-processing-n:127.0.0.1:60329_) [n:127.0.0.1:60329_ c:tmp_collection s:shard2 r:core_node1 x:collection1] o.a.s.h.l.XMLLoader xsltCacheLifetimeSeconds=60
   [junit4]   2> 1177203 INFO  (coreLoadExecutor-3148-thread-1-processing-n:127.0.0.1:60329_) [n:127.0.0.1:60329_ c:tmp_collection s:shard2 r:core_node1 x:collection1] o.a.s.c.RequestHandlers Registered paths: /admin/mbeans,standard,/update/json/docs,/admin/luke,/export,/get,/admin/properties,/update/json,/admin/threads,/update/csv,/sql,/graph,/admin/segments,/admin/system,/replication,/config,/stream,/schema,/admin/plugins,/admin/logging,/admin/ping,/cdcr,/update,/admin/file,/terms
   [junit4]   2> 1177203 INFO  (coreLoadExecutor-3148-thread-1-processing-n:127.0.0.1:60329_) [n:127.0.0.1:60329_ c:tmp_collection s:shard2 r:core_node1 x:collection1] o.a.s.c.SolrCore Using default statsCache cache: org.apache.solr.search.stats.LocalStatsCache
   [junit4]   2> 1177239 INFO  (coreLoadExecutor-3148-thread-1-processing-n:127.0.0.1:60329_) [n:127.0.0.1:60329_ c:tmp_collection s:shard2 r:core_node1 x:collection1] o.a.s.u.UpdateHandler Using UpdateLog implementation: org.apache.solr.update.CdcrUpdateLog
   [junit4]   2> 1177240 INFO  (coreLoadExecutor-3148-thread-1-processing-n:127.0.0.1:60329_) [n:127.0.0.1:60329_ c:tmp_collection s:shard2 r:core_node1 x:collection1] o.a.s.u.UpdateLog Initializing UpdateLog: dataDir= defaultSyncLevel=FLUSH numRecordsToKeep=100 maxNumLogsToKeep=10 numVersionBuckets=65536
   [junit4]   2> 1177243 INFO  (coreLoadExecutor-3148-thread-1-processing-n:127.0.0.1:60329_) [n:127.0.0.1:60329_ c:tmp_collection s:shard2 r:core_node1 x:collection1] o.a.s.u.CommitTracker Hard AutoCommit: disabled
   [junit4]   2> 1177243 INFO  (coreLoadExecutor-3148-thread-1-processing-n:127.0.0.1:60329_) [n:127.0.0.1:60329_ c:tmp_collection s:shard2 r:core_node1 x:collection1] o.a.s.u.CommitTracker Soft AutoCommit: disabled
   [junit4]   2> 1177243 INFO  (coreLoadExecutor-3148-thread-1-processing-n:127.0.0.1:60329_) [n:127.0.0.1:60329_ c:tmp_collection s:shard2 r:core_node1 x:collection1] o.a.s.u.RandomMergePolicy RandomMergePolicy wrapping class org.apache.lucene.index.LogDocMergePolicy: [LogDocMergePolicy: minMergeSize=1000, mergeFactor=11, maxMergeSize=9223372036854775807, maxMergeSizeForForcedMerge=9223372036854775807, calibrateSizeByDeletes=false, maxMergeDocs=2147483647, maxCFSSegmentSizeMB=8.796093022207999E12, noCFSRatio=1.0]
   [junit4]   2> 1177243 INFO  (coreLoadExecutor-3148-thread-1-processing-n:127.0.0.1:60329_) [n:127.0.0.1:60329_ c:tmp_collection s:shard2 r:core_node1 x:collection1] o.a.s.c.SolrDeletionPolicy SolrDeletionPolicy.onInit: commits: num=1
   [junit4]   2> 	commit{dir=MockDirectoryWrapper(RAMDirectory@6e1cf5c5 lockFactory=org.apache.lucene.store.SingleInstanceLockFactory@3aae2de1),segFN=segments_1,generation=1}
   [junit4]   2> 1177243 INFO  (coreLoadExecutor-3148-thread-1-processing-n:127.0.0.1:60329_) [n:127.0.0.1:60329_ c:tmp_collection s:shard2 r:core_node1 x:collection1] o.a.s.c.SolrDeletionPolicy newest commit generation = 1
   [junit4]   2> 1177244 INFO  (coreLoadExecutor-3148-thread-1-processing-n:127.0.0.1:60329_) [n:127.0.0.1:60329_ c:tmp_collection s:shard2 r:core_node1 x:collection1] o.a.s.s.SolrIndexSearcher Opening [Searcher@5aa34604[collection1] main]
   [junit4]   2> 1177245 INFO  (coreLoadExecutor-3148-thread-1-processing-n:127.0.0.1:60329_) [n:127.0.0.1:60329_ c:tmp_collection s:shard2 r:core_node1 x:collection1] o.a.s.r.ManagedResourceStorage Setting up ZooKeeper-based storage for the RestManager with znodeBase: /configs/conf1
   [junit4]   2> 1177245 INFO  (coreLoadExecutor-3148-thread-1-processing-n:127.0.0.1:60329_) [n:127.0.0.1:60329_ c:tmp_collection s:shard2 r:core_node1 x:collection1] o.a.s.r.ManagedResourceStorage Configured ZooKeeperStorageIO with znodeBase: /configs/conf1
   [junit4]   2> 1177245 INFO  (coreLoadExecutor-3148-thread-1-processing-n:127.0.0.1:60329_) [n:127.0.0.1:60329_ c:tmp_collection s:shard2 r:core_node1 x:collection1] o.a.s.r.RestManager Initializing RestManager with initArgs: {}
   [junit4]   2> 1177245 INFO  (coreLoadExecutor-3148-thread-1-processing-n:127.0.0.1:60329_) [n:127.0.0.1:60329_ c:tmp_collection s:shard2 r:core_node1 x:collection1] o.a.s.r.ManagedResourceStorage Reading _rest_managed.json using ZooKeeperStorageIO:path=/configs/conf1
   [junit4]   2> 1177246 INFO  (coreLoadExecutor-3148-thread-1-processing-n:127.0.0.1:60329_) [n:127.0.0.1:60329_ c:tmp_collection s:shard2 r:core_node1 x:collection1] o.a.s.r.ManagedResourceStorage No data found for znode /configs/conf1/_rest_managed.json
   [junit4]   2> 1177246 INFO  (coreLoadExecutor-3148-thread-1-processing-n:127.0.0.1:60329_) [n:127.0.0.1:60329_ c:tmp_collection s:shard2 r:core_node1 x:collection1] o.a.s.r.ManagedResourceStorage Loaded null at path _rest_managed.json using ZooKeeperStorageIO:path=/configs/conf1
   [junit4]   2> 1177246 INFO  (coreLoadExecutor-3148-thread-1-processing-n:127.0.0.1:60329_) [n:127.0.0.1:60329_ c:tmp_collection s:shard2 r:core_node1 x:collection1] o.a.s.r.RestManager Initializing 0 registered ManagedResources
   [junit4]   2> 1177246 INFO  (coreLoadExecutor-3148-thread-1-processing-n:127.0.0.1:60329_) [n:127.0.0.1:60329_ c:tmp_collection s:shard2 r:core_node1 x:collection1] o.a.s.h.ReplicationHandler Commits will be reserved for  10000
   [junit4]   2> 1177254 INFO  (coreLoadExecutor-3148-thread-1-processing-n:127.0.0.1:60329_) [n:127.0.0.1:60329_ c:tmp_collection s:shard2 r:core_node1 x:collection1] o.a.s.c.c.SolrZkClient makePath: /collections/tmp_collection/cdcr/state
   [junit4]   2> 1177258 INFO  (coreLoadExecutor-3148-thread-1-processing-n:127.0.0.1:60329_) [n:127.0.0.1:60329_ c:tmp_collection s:shard2 r:core_node1 x:collection1] o.a.s.h.CdcrBufferStateManager Created znode /collections/tmp_collection/cdcr/state/buffer
   [junit4]   2> 1177271 INFO  (coreLoadExecutor-3148-thread-1-processing-n:127.0.0.1:60329_) [n:127.0.0.1:60329_ c:tmp_collection s:shard2 r:core_node1 x:collection1] o.a.s.h.CdcrProcessStateManager Created znode /collections/tmp_collection/cdcr/state/process
   [junit4]   2> 1177317 INFO  (searcherExecutor-3149-thread-1-processing-n:127.0.0.1:60329_ x:collection1 s:shard2 c:tmp_collection r:core_node1) [n:127.0.0.1:60329_ c:tmp_collection s:shard2 r:core_node1 x:collection1] o.a.s.c.SolrCore [collection1] Registered new searcher Searcher@5aa34604[collection1] main{ExitableDirectoryReader(UninvertingDirectoryReader())}
   [junit4]   2> 1177318 INFO  (coreLoadExecutor-3148-thread-1-processing-n:127.0.0.1:60329_) [n:127.0.0.1:60329_ c:tmp_collection s:shard2 r:core_node1 x:collection1] o.a.s.u.UpdateLog Looking up max value of version field to seed version buckets
   [junit4]   2> 1177318 INFO  (coreLoadExecutor-3148-thread-1-processing-n:127.0.0.1:60329_) [n:127.0.0.1:60329_ c:tmp_collection s:shard2 r:core_node1 x:collection1] o.a.s.u.VersionInfo Refreshing highest value of _version_ for 65536 version buckets from index
   [junit4]   2> 1177318 INFO  (coreLoadExecutor-3148-thread-1-processing-n:127.0.0.1:60329_) [n:127.0.0.1:60329_ c:tmp_collection s:shard2 r:core_node1 x:collection1] o.a.s.u.VersionInfo No terms found for _version_, cannot seed version bucket highest value from index
   [junit4]   2> 1177318 INFO  (coreLoadExecutor-3148-thread-1-processing-n:127.0.0.1:60329_) [n:127.0.0.1:60329_ c:tmp_collection s:shard2 r:core_node1 x:collection1] o.a.s.u.UpdateLog Could not find max version in index or recent updates, using new clock 1546032792228331520
   [junit4]   2> 1177319 INFO  (coreLoadExecutor-3148-thread-1-processing-n:127.0.0.1:60329_) [n:127.0.0.1:60329_ c:tmp_collection s:shard2 r:core_node1 x:collection1] o.a.s.u.UpdateLog Took 1.0ms to seed version buckets with highest version 1546032792228331520
   [junit4]   2> 1177319 INFO  (coreLoadExecutor-3148-thread-1-processing-n:127.0.0.1:60329_) [n:127.0.0.1:60329_ c:tmp_collection s:shard2 r:core_node1 x:collection1] o.a.s.c.ZkController watch zkdir /configs/conf1
   [junit4]   2> 1177320 INFO  (coreLoadExecutor-3148-thread-1-processing-n:127.0.0.1:60329_) [n:127.0.0.1:60329_ c:tmp_collection s:shard2 r:core_node1 x:collection1] o.a.s.c.CoreContainer registering core: collection1
   [junit4]   2> 1177321 INFO  (coreZkRegister-3141-thread-1-processing-n:127.0.0.1:60329_ x:collection1 s:shard2 c:tmp_collection r:core_node1) [n:127.0.0.1:60329_ c:tmp_collection s:shard2 r:core_node1 x:collection1] o.a.s.c.ZkController Register replica - core:collection1 address:http://127.0.0.1:60329 collection:tmp_collection shard:shard2
   [junit4]   2> 1177322 INFO  (coreZkRegister-3141-thread-1-processing-n:127.0.0.1:60329_ x:collection1 s:shard2 c:tmp_collection r:core_node1) [n:127.0.0.1:60329_ c:tmp_collection s:shard2 r:core_node1 x:collection1] o.a.s.c.c.SolrZkClient makePath: /collections/tmp_collection/leader_elect/shard2/election
   [junit4]   2> 1177326 INFO  (coreZkRegister-3141-thread-1-processing-n:127.0.0.1:60329_ x:collection1 s:shard2 c:tmp_collection r:core_node1) [n:127.0.0.1:60329_ c:tmp_collection s:shard2 r:core_node1 x:collection1] o.a.s.c.LeaderElector Joined leadership election with path: /collections/tmp_collection/leader_elect/shard2/election/96627049365110788-core_node1-n_0000000000
   [junit4]   2> 1177326 INFO  (coreZkRegister-3141-thread-1-processing-n:127.0.0.1:60329_ x:collection1 s:shard2 c:tmp_collection r:core_node1) [n:127.0.0.1:60329_ c:tmp_collection s:shard2 r:core_node1 x:collection1] o.a.s.c.ShardLeaderElectionContext Running the leader process for shard=shard2 and weAreReplacement=false and leaderVoteWait=10000
   [junit4]   2> 1177328 INFO  (coreZkRegister-3141-thread-1-processing-n:127.0.0.1:60329_ x:collection1 s:shard2 c:tmp_collection r:core_node1) [n:127.0.0.1:60329_ c:tmp_collection s:shard2 r:core_node1 x:collection1] o.a.s.c.ShardLeaderElectionContext Enough replicas found to continue.
   [junit4]   2> 1177328 INFO  (coreZkRegister-3141-thread-1-processing-n:127.0.0.1:60329_ x:collection1 s:shard2 c:tmp_collection r:core_node1) [n:127.0.0.1:60329_ c:tmp_collection s:shard2 r:core_node1 x:collection1] o.a.s.c.ShardLeaderElectionContext I may be the new leader - try and sync
   [junit4]   2> 1177328 INFO  (coreZkRegister-3141-thread-1-processing-n:127.0.0.1:60329_ x:collection1 s:shard2 c:tmp_collection r:core_node1) [n:127.0.0.1:60329_ c:tmp_collection s:shard2 r:core_node1 x:collection1] o.a.s.c.SyncStrategy Sync replicas to http://127.0.0.1:60329/collection1/
   [junit4]   2> 1177328 INFO  (coreZkRegister-3141-thread-1-processing-n:127.0.0.1:60329_ x:collection1 s:shard2 c:tmp_collection r:core_node1) [n:127.0.0.1:60329_ c:tmp_collection s:shard2 r:core_node1 x:collection1] o.a.s.c.SyncStrategy Sync Success - now sync replicas to me
   [junit4]   2> 1177328 INFO  (coreZkRegister-3141-thread-1-processing-n:127.0.0.1:60329_ x:collection1 s:shard2 c:tmp_collection r:core_node1) [n:127.0.0.1:60329_ c:tmp_collection s:shard2 r:core_node1 x:collection1] o.a.s.c.SyncStrategy http://127.0.0.1:60329/collection1/ has no replicas
   [junit4]   2> 1177329 INFO  (OverseerStateUpdate-96627049365110788-127.0.0.1:60329_-n_0000000000) [n:127.0.0.1:60329_    ] o.a.s.c.Overseer processMessage: queueSize: 1, message = {
   [junit4]   2>   "operation":"leader",
   [junit4]   2>   "shard":"shard2",
   [junit4]   2>   "collection":"tmp_collection"} current state version: 1
   [junit4]   2> 1177329 INFO  (coreZkRegister-3141-thread-1-processing-n:127.0.0.1:60329_ x:collection1 s:shard2 c:tmp_collection r:core_node1) [n:127.0.0.1:60329_ c:tmp_collection s:shard2 r:core_node1 x:collection1] o.a.s.c.c.SolrZkClient makePath: /collections/tmp_collection/leaders/shard2
   [junit4]   2> 1177332 INFO  (coreZkRegister-3141-thread-1-processing-n:127.0.0.1:60329_ x:collection1 s:shard2 c:tmp_collection r:core_node1) [n:127.0.0.1:60329_ c:tmp_collection s:shard2 r:core_node1 x:collection1] o.a.s.c.ShardLeaderElectionContextBase Creating leader registration node /collections/tmp_collection/leaders/shard2/leader after winning as /collections/tmp_collection/leader_elect/shard2/election/96627049365110788-core_node1-n_0000000000
   [junit4]   2> 1177333 INFO  (zkCallback-1386-thread-1-processing-n:127.0.0.1:60329_) [n:127.0.0.1:60329_    ] o.a.s.h.CdcrLeaderStateManager Received new leader state @ tmp_collection:shard2
   [junit4]   2> 1177336 INFO  (coreZkRegister-3141-thread-1-processing-n:127.0.0.1:60329_ x:collection1 s:shard2 c:tmp_collection r:core_node1) [n:127.0.0.1:60329_ c:tmp_collection s:shard2 r:core_node1 x:collection1] o.a.s.c.ShardLeaderElectionContext I am the new leader: http://127.0.0.1:60329/collection1/ shard2
   [junit4]   2> 1177337 INFO  (OverseerStateUpdate-96627049365110788-127.0.0.1:60329_-n_0000000000) [n:127.0.0.1:60329_    ] o.a.s.c.Overseer processMessage: queueSize: 1, message = {
   [junit4]   2>   "operation":"leader",
   [junit4]   2>   "shard":"shard2",
   [junit4]   2>   "collection":"tmp_collection",
   [junit4]   2>   "base_url":"http://127.0.0.1:60329",
   [junit4]   2>   "core":"collection1",
   [junit4]   2>   "state":"active"} current state version: 1
   [junit4]   2> 1177440 INFO  (zkCallback-1386-thread-2-processing-n:127.0.0.1:60329_) [n:127.0.0.1:60329_    ] o.a.s.c.c.ZkStateReader A cluster state change: [WatchedEvent state:SyncConnected type:NodeDataChanged path:/clusterstate.json], has occurred - updating... (live nodes size: [1])
   [junit4]   2> 1177489 INFO  (coreZkRegister-3141-thread-1-processing-n:127.0.0.1:60329_ x:collection1 s:shard2 c:tmp_collection r:core_node1) [n:127.0.0.1:60329_ c:tmp_collection s:shard2 r:core_node1 x:collection1] o.a.s.c.ZkController We are http://127.0.0.1:60329/collection1/ and leader is http://127.0.0.1:60329/collection1/
   [junit4]   2> 1177489 INFO  (coreZkRegister-3141-thread-1-processing-n:127.0.0.1:60329_ x:collection1 s:shard2 c:tmp_collection r:core_node1) [n:127.0.0.1:60329_ c:tmp_collection s:shard2 r:core_node1 x:collection1] o.a.s.c.ZkController No LogReplay needed for core=collection1 baseURL=http://127.0.0.1:60329
   [junit4]   2> 1177489 INFO  (coreZkRegister-3141-thread-1-processing-n:127.0.0.1:60329_ x:collection1 s:shard2 c:tmp_collection r:core_node1) [n:127.0.0.1:60329_ c:tmp_collection s:shard2 r:core_node1 x:collection1] o.a.s.c.ZkController I am the leader, no recovery necessary
   [junit4]   2> 1177489 INFO  (coreZkRegister-3141-thread-1-processing-n:127.0.0.1:60329_ x:collection1 s:shard2 c:tmp_collection r:core_node1) [n:127.0.0.1:60329_ c:tmp_collection s:shard2 r:core_node1 x:collection1] o.a.s.c.ZkController publishing state=active
   [junit4]   2> 1177489 INFO  (coreZkRegister-3141-thread-1-processing-n:127.0.0.1:60329_ x:collection1 s:shard2 c:tmp_collection r:core_node1) [n:127.0.0.1:60329_ c:tmp_collection s:shard2 r:core_node1 x:collection1] o.a.s.c.ZkController numShards not found on descriptor - reading it from system property
   [junit4]   2> 1177489 INFO  (coreZkRegister-3141-thread-1-processing-n:127.0.0.1:60329_ x:collection1 s:shard2 c:tmp_collection r:core_node1) [n:127.0.0.1:60329_ c:tmp_collection s:shard2 r:core_node1 x:collection1] o.a.s.c.c.ZkStateReader Checking legacy cluster state for collection tmp_collection
   [junit4]   2> 1177490 INFO  (OverseerStateUpdate-96627049365110788-127.0.0.1:60329_-n_0000000000) [n:127.0.0.1:60329_    ] o.a.s.c.Overseer processMessage: queueSize: 1, message = {
   [junit4]   2>   "core":"collection1",
   [junit4]   2>   "core_node_name":"core_node1",
   [junit4]   2>   "roles":null,
   [junit4]   2>   "base_url":"http://127.0.0.1:60329",
   [junit4]   2>   "node_name":"127.0.0.1:60329_",
   [junit4]   2>   "numShards":"2",
   [junit4]   2>   "state":"active",
   [junit4]   2>   "shard":"shard2",
   [junit4]   2>   "collection":"tmp_collection",
   [junit4]   2>   "operation":"state"} current state version: 2
   [junit4]   2> 1177490 INFO  (OverseerStateUpdate-96627049365110788-127.0.0.1:60329_-n_0000000000) [n:127.0.0.1:60329_    ] o.a.s.c.o.ReplicaMutator Update state numShards=2 message={
   [junit4]   2>   "core":"collection1",
   [junit4]   2>   "core_node_name":"core_node1",
   [junit4]   2>   "roles":null,
   [junit4]   2>   "base_url":"http://127.0.0.1:60329",
   [junit4]   2>   "node_name":"127.0.0.1:60329_",
   [junit4]   2>   "numShards":"2",
   [junit4]   2>   "state":"active",
   [junit4]   2>   "shard":"shard2",
   [junit4]   2>   "collection":"tmp_collection",
   [junit4]   2>   "operation":"state"}
   [junit4]   2> 1177594 INFO  (zkCallback-1386-thread-2-processing-n:127.0.0.1:60329_) [n:127.0.0.1:60329_    ] o.a.s.c.c.ZkStateReader A cluster state change: [WatchedEvent state:SyncConnected type:NodeDataChanged path:/clusterstate.json], has occurred - updating... (live nodes size: [1])
   [junit4]   2> 1177932 INFO  (TEST-CdcrVersionReplicationTest.testCdcrDocVersions-seed#[86AC16513837805E]) [    ] o.a.s.SolrTestCaseJ4 Writing core.properties file to C:\Users\jenkins\workspace\Lucene-Solr-master-Windows\solr\build\solr-core\test\J0\temp\solr.cloud.CdcrVersionReplicationTest_86AC16513837805E-001\jetty-002\cores\collection1
   [junit4]   2> 1177936 INFO  (TEST-CdcrVersionReplicationTest.testCdcrDocVersions-seed#[86AC16513837805E]) [    ] o.e.j.s.Server jetty-9.3.8.v20160314
   [junit4]   2> 1177937 INFO  (TEST-CdcrVersionReplicationTest.testCdcrDocVersions-seed#[86AC16513837805E]) [    ] o.e.j.s.h.ContextHandler Started o.e.j.s.ServletContextHandler@483cd668{/,null,AVAILABLE}
   [junit4]   2> 1177938 INFO  (TEST-CdcrVersionReplicationTest.testCdcrDocVersions-seed#[86AC16513837805E]) [    ] o.e.j.s.ServerConnector Started ServerConnector@14fa0cc5{HTTP/1.1,[http/1.1]}{127.0.0.1:60344}
   [junit4]   2> 1177939 INFO  (TEST-CdcrVersionReplicationTest.testCdcrDocVersions-seed#[86AC16513837805E]) [    ] o.e.j.s.Server Started @1182445ms
   [junit4]   2> 1177939 INFO  (TEST-CdcrVersionReplicationTest.testCdcrDocVersions-seed#[86AC16513837805E]) [    ] o.a.s.c.s.e.JettySolrRunner Jetty properties: {shards=shard2, hostContext=/, hostPort=60344, coreRootDirectory=C:\Users\jenkins\workspace\Lucene-Solr-master-Windows\solr\build\solr-core\test\J0\temp\solr.cloud.CdcrVersionReplicationTest_86AC16513837805E-001\jetty-002\cores}
   [junit4]   2> 1177939 INFO  (TEST-CdcrVersionReplicationTest.testCdcrDocVersions-seed#[86AC16513837805E]) [    ] o.a.s.s.SolrDispatchFilter SolrDispatchFilter.init(): sun.misc.Launcher$AppClassLoader@73d16e93
   [junit4]   2> 1177939 INFO  (TEST-CdcrVersionReplicationTest.testCdcrDocVersions-seed#[86AC16513837805E]) [    ] o.a.s.c.SolrResourceLoader new SolrResourceLoader for directory: 'C:\Users\jenkins\workspace\Lucene-Solr-master-Windows\solr\build\solr-core\test\J0\temp\solr.cloud.CdcrVersionReplicationTest_86AC16513837805E-001\jetty-002'
   [junit4]   2> 1177939 INFO  (TEST-CdcrVersionReplicationTest.testCdcrDocVersions-seed#[86AC16513837805E]) [    ] o.a.s.c.SolrResourceLoader JNDI not configured for solr (NoInitialContextEx)
   [junit4]   2> 1177939 INFO  (TEST-CdcrVersionReplicationTest.testCdcrDocVersions-seed#[86AC16513837805E]) [    ] o.a.s.c.SolrResourceLoader solr home defaulted to 'solr/' (could not find system property or JNDI)
   [junit4]   2> 1177940 INFO  (TEST-CdcrVersionReplicationTest.testCdcrDocVersions-seed#[86AC16513837805E]) [    ] o.a.s.c.c.SolrZkClient Using default ZkCredentialsProvider
   [junit4]   2> 1177941 INFO  (TEST-CdcrVersionReplicationTest.testCdcrDocVersions-seed#[86AC16513837805E]) [    ] o.a.s.c.c.ConnectionManager Waiting for client to connect to ZooKeeper
   [junit4]   2> 1177944 INFO  (zkCallback-1388-thread-1) [    ] o.a.s.c.c.ConnectionManager Watcher org.apache.solr.common.cloud.ConnectionManager@3211acd1 name:ZooKeeperConnection Watcher:127.0.0.1:60322/solr got event WatchedEvent state:SyncConnected type:None path:null path:null type:None
   [junit4]   2> 1177944 INFO  (TEST-CdcrVersionReplicationTest.testCdcrDocVersions-seed#[86AC16513837805E]) [    ] o.a.s.c.c.ConnectionManager Client is connected to ZooKeeper
   [junit4]   2> 1177944 INFO  (TEST-CdcrVersionReplicationTest.testCdcrDocVersions-seed#[86AC16513837805E]) [    ] o.a.s.c.c.SolrZkClient Using default ZkACLProvider
   [junit4]   2> 1177944 WARN  (NIOServerCxn.Factory:0.0.0.0/0.0.0.0:0) [    ] o.a.z.s.NIOServerCnxn caught end of stream exception
   [junit4]   2> EndOfStreamException: Unable to read additional data from client sessionid 0x15749ca191a0005, likely client has closed socket
   [junit4]   2> 	at org.apache.zookeeper.server.NIOServerCnxn.doIO(NIOServerCnxn.java:228)
   [junit4]   2> 	at org.apache.zookeeper.server.NIOServerCnxnFactory.run(NIOServerCnxnFactory.java:208)
   [junit4]   2> 	at java.lang.Thread.run(Thread.java:745)
   [junit4]   2> 1177945 INFO  (TEST-CdcrVersionReplicationTest.testCdcrDocVersions-seed#[86AC16513837805E]) [    ] o.a.s.s.SolrDispatchFilter Loading solr.xml from SolrHome (not found in ZooKeeper)
   [junit4]   2> 1177945 INFO  (TEST-CdcrVersionReplicationTest.testCdcrDocVersions-seed#[86AC16513837805E]) [    ] o.a.s.c.SolrXmlConfig Loading container configuration from C:\Users\jenkins\workspace\Lucene-Solr-master-Windows\solr\build\solr-core\test\J0\temp\solr.cloud.CdcrVersionReplicationTest_86AC16513837805E-001\jetty-002\solr.xml
   [junit4]   2> 1177955 INFO  (TEST-CdcrVersionReplicationTest.testCdcrDocVersions-seed#[86AC16513837805E]) [    ] o.a.s.c.CorePropertiesLocator Config-defined core root directory: C:\Users\jenkins\workspace\Lucene-Solr-master-Windows\solr\build\solr-core\test\J0\temp\solr.cloud.CdcrVersionReplicationTest_86AC16513837805E-001\jetty-002\cores
   [junit4]   2> 1177955 INFO  (TEST-CdcrVersionReplicationTest.testCdcrDocVersions-seed#[86AC16513837805E]) [    ] o.a.s.c.CoreContainer New CoreContainer 1766609403
   [junit4]   2> 1177955 INFO  (TEST-CdcrVersionReplicationTest.testCdcrDocVersions-seed#[86AC16513837805E]) [    ] o.a.s.c.CoreContainer Loading cores into CoreContainer [instanceDir=C:\Users\jenkins\workspace\Lucene-Solr-master-Windows\solr\build\solr-core\test\J0\temp\solr.cloud.CdcrVersionReplicationTest_86AC16513837805E-001\jetty-002]
   [junit4]   2> 1177955 WARN  (TEST-CdcrVersionReplicationTest.testCdcrDocVersions-seed#[86AC16513837805E]) [    ] o.a.s.c.CoreContainer Couldn't add files from C:\Users\jenkins\workspace\Lucene-Solr-master-Windows\solr\build\solr-core\test\J0\temp\solr.cloud.CdcrVersionReplicationTest_86AC16513837805E-001\jetty-002\lib to classpath: C:\Users\jenkins\workspace\Lucene-Solr-master-Windows\solr\build\solr-core\test\J0\temp\solr.cloud.CdcrVersionReplicationTest_86AC16513837805E-001\jetty-002\lib
   [junit4]   2> 1177955 INFO  (TEST-CdcrVersionReplicationTest.testCdcrDocVersions-seed#[86AC16513837805E]) [    ] o.a.s.h.c.HttpShardHandlerFactory created with socketTimeout : 90000,urlScheme : ,connTimeout : 15000,maxConnectionsPerHost : 20,maxConnections : 10000,corePoolSize : 0,maximumPoolSize : 2147483647,maxThreadIdleTime : 5,sizeOfQueue : -1,fairnessPolicy : false,
   [junit4]   2> 1177961 INFO  (TEST-CdcrVersionReplicationTest.testCdcrDocVersions-seed#[86AC16513837805E]) [    ] o.a.s.u.UpdateShardHandler Created UpdateShardHandler HTTP client with params: socketTimeout=340000&connTimeout=45000&maxConnections=100000&maxConnectionsPerHost=100000
   [junit4]   2> 1177961 INFO  (TEST-CdcrVersionReplicationTest.testCdcrDocVersions-seed#[86AC16513837805E]) [    ] o.a.s.l.LogWatcher SLF4J impl is org.slf4j.impl.Log4jLoggerFactory
   [junit4]   2> 1177961 INFO  (TEST-CdcrVersionReplicationTest.testCdcrDocVersions-seed#[86AC16513837805E]) [    ] o.a.s.l.LogWatcher Registering Log Listener [Log4j (org.slf4j.impl.Log4jLoggerFactory)]
   [junit4]   2> 1177961 INFO  (TEST-CdcrVersionReplicationTest.testCdcrDocVersions-seed#[86AC16513837805E]) [    ] o.a.s.c.ZkContainer Zookeeper client=127.0.0.1:60322/solr
   [junit4]   2> 1177961 INFO  (TEST-CdcrVersionReplicationTest.testCdcrDocVersions-seed#[86AC16513837805E]) [    ] o.a.s.c.ZkController zkHost includes chroot
   [junit4]   2> 1177961 INFO  (TEST-CdcrVersionReplicationTest.testCdcrDocVersions-seed#[86AC16513837805E]) [    ] o.a.s.c.c.SolrZkClient Using default ZkCredentialsProvider
   [junit4]   2> 1177962 INFO  (TEST-CdcrVersionReplicationTest.testCdcrDocVersions-seed#[86AC16513837805E]) [    ] o.a.s.c.c.ConnectionManager Waiting for client to connect to ZooKeeper
   [junit4]   2> 1177964 INFO  (zkCallback-1391-thread-1) [    ] o.a.s.c.c.ConnectionManager Watcher org.apache.solr.common.cloud.ConnectionManager@a55d0f name:ZooKeeperConnection Watcher:127.0.0.1:60322 got event WatchedEvent state:SyncConnected type:None path:null path:null type:None
   [junit4]   2> 1177964 INFO  (TEST-CdcrVersionReplicationTest.testCdcrDocVersions-seed#[86AC16513837805E]) [    ] o.a.s.c.c.ConnectionManager Client is connected to ZooKeeper
   [junit4]   2> 1177964 INFO  (TEST-CdcrVersionReplicationTest.testCdcrDocVersions-seed#[86AC16513837805E]) [    ] o.a.s.c.c.SolrZkClient Using default ZkACLProvider
   [junit4]   2> 1177965 WARN  (NIOServerCxn.Factory:0.0.0.0/0.0.0.0:0) [    ] o.a.z.s.NIOServerCnxn caught end of stream exception
   [junit4]   2> EndOfStreamException: Unable to read additional data from client sessionid 0x15749ca191a0006, likely client has closed socket
   [junit4]   2> 	at org.apache.zookeeper.server.NIOServerCnxn.doIO(NIOServerCnxn.java:228)
   [junit4]   2> 	at org.apache.zookeeper.server.NIOServerCnxnFactory.run(NIOServerCnxnFactory.java:208)
   [junit4]   2> 	at java.lang.Thread.run(Thread.java:745)
   [junit4]   2> 1177965 INFO  (TEST-CdcrVersionReplicationTest.testCdcrDocVersions-seed#[86AC16513837805E]) [n:127.0.0.1:60344_    ] o.a.s.c.ZkController Added new OnReconnect listener org.apache.solr.cloud.ZkController$$Lambda$22/1048821187@3becfdd
   [junit4]   2> 1177966 INFO  (TEST-CdcrVersionReplicationTest.testCdcrDocVersions-seed#[86AC16513837805E]) [n:127.0.0.1:60344_    ] o.a.s.c.c.ConnectionManager Waiting for client to connect to ZooKeeper
   [junit4]   2> 1177967 INFO  (zkCallback-1392-thread-1-processing-n:127.0.0.1:60344_) [n:127.0.0.1:60344_    ] o.a.s.c.c.ConnectionManager Watcher org.apache.solr.common.cloud.ConnectionManager@1aa1f868 name:ZooKeeperConnection Watcher:127.0.0.1:60322/solr got event WatchedEvent state:SyncConnected type:None path:null path:null type:None
   [junit4]   2> 1177968 INFO  (TEST-CdcrVersionReplicationTest.testCdcrDocVersions-seed#[86AC16513837805E]) [n:127.0.0.1:60344_    ] o.a.s.c.c.ConnectionManager Client is connected to ZooKeeper
   [junit4]   2> 1177974 INFO  (TEST-CdcrVersionReplicationTest.testCdcrDocVersions-seed#[86AC16513837805E]) [n:127.0.0.1:60344_    ] o.a.s.c.c.ZkStateReader Updating cluster state from ZooKeeper... 
   [junit4]   2> 1177975 INFO  (TEST-CdcrVersionReplicationTest.testCdcrDocVersions-seed#[86AC16513837805E]) [n:127.0.0.1:60344_    ] o.a.s.c.c.ZkStateReader Loaded empty cluster properties
   [junit4]   2> 1177975 INFO  (TEST-CdcrVersionReplicationTest.testCdcrDocVersions-seed#[86AC16513837805E]) [n:127.0.0.1:60344_    ] o.a.s.c.c.ZkStateReader Updated live nodes from ZooKeeper... (0) -> (1)
   [junit4]   2> 1177979 INFO  (TEST-CdcrVersionReplicationTest.testCdcrDocVersions-seed#[86AC16513837805E]) [n:127.0.0.1:60344_    ] o.a.s.c.Overseer Overseer (id=null) closing
   [junit4]   2> 1177979 INFO  (TEST-CdcrVersionReplicationTest.testCdcrDocVersions-seed#[86AC16513837805E]) [n:127.0.0.1:60344_    ] o.a.s.c.LeaderElector Joined leadership election with path: /overseer_elect/election/96627049365110791-127.0.0.1:60344_-n_0000000001
   [junit4]   2> 1177980 INFO  (TEST-CdcrVersionReplicationTest.testCdcrDocVersions-seed#[86AC16513837805E]) [n:127.0.0.1:60344_    ] o.a.s.c.LeaderElector Watching path /overseer_elect/election/96627049365110788-127.0.0.1:60329_-n_0000000000 to know if I could be the leader
   [junit4]   2> 1177980 INFO  (TEST-CdcrVersionReplicationTest.testCdcrDocVersions-seed#[86AC16513837805E]) [n:127.0.0.1:60344_    ] o.a.s.c.ZkController Publish node=127.0.0.1:60344_ as DOWN
   [junit4]   2> 1177982 INFO  (TEST-CdcrVersionReplicationTest.testCdcrDocVersions-seed#[86AC16513837805E]) [n:127.0.0.1:60344_    ] o.a.s.c.ZkController Register node as live in ZooKeeper:/live_nodes/127.0.0.1:60344_
   [junit4]   2> 1177982 INFO  (TEST-CdcrVersionReplicationTest.testCdcrDocVersions-seed#[86AC16513837805E]) [n:127.0.0.1:60344_    ] o.a.s.c.c.SolrZkClient makePath: /live_nodes/127.0.0.1:60344_
   [junit4]   2> 1177982 INFO  (OverseerStateUpdate-96627049365110788-127.0.0.1:60329_-n_0000000000) [n:127.0.0.1:60329_    ] o.a.s.c.Overseer processMessage: queueSize: 1, message = {
   [junit4]   2>   "operation":"downnode",
   [junit4]   2>   "node_name":"127.0.0.1:60344_"} current state version: 3
   [junit4]   2> 1177982 INFO  (OverseerStateUpdate-96627049365110788-127.0.0.1:60329_-n_0000000000) [n:127.0.0.1:60329_    ] o.a.s.c.o.NodeMutator DownNode state invoked for node: 127.0.0.1:60344_
   [junit4]   2> 1177983 INFO  (zkCallback-1386-thread-2-processing-n:127.0.0.1:60329_) [n:127.0.0.1:60329_    ] o.a.s.c.c.ZkStateReader A live node change: [WatchedEvent state:SyncConnected type:NodeChildrenChanged path:/live_nodes], has occurred - updating... (live nodes size: [1])
   [junit4]   2> 1177983 INFO  (zkCallback-1392-thread-1-processing-n:127.0.0.1:60344_) [n:127.0.0.1:60344_    ] o.a.s.c.c.ZkStateReader A live node change: [WatchedEvent state:SyncConnected type:NodeChildrenChanged path:/live_nodes], has occurred - updating... (live nodes size: [1])
   [junit4]   2> 1177983 INFO  (zkCallback-1386-thread-2-processing-n:127.0.0.1:60329_) [n:127.0.0.1:60329_    ] o.a.s.c.c.ZkStateReader Updated live nodes from ZooKeeper... (1) -> (2)
   [junit4]   2> 1177984 INFO  (zkCallback-1392-thread-1-processing-n:127.0.0.1:60344_) [n:127.0.0.1:60344_    ] o.a.s.c.c.ZkStateReader Updated live nodes from ZooKeeper... (1) -> (2)
   [junit4]   2> 1177993 INFO  (TEST-CdcrVersionReplicationTest.testCdcrDocVersions-seed#[86AC16513837805E]) [n:127.0.0.1:60344_    ] o.a.s.c.CoreContainer Security conf doesn't exist. Skipping setup for authorization module.
   [junit4]   2> 1177993 INFO  (TEST-CdcrVersionReplicationTest.testCdcrDocVersions-seed#[86AC16513837805E]) [n:127.0.0.1:60344_    ] o.a.s.c.CoreContainer No authentication plugin used.
   [junit4]   2> 1177994 INFO  (TEST-CdcrVersionReplicationTest.testCdcrDocVersions-seed#[86AC16513837805E]) [n:127.0.0.1:60344_    ] o.a.s.c.CorePropertiesLocator Looking for core definitions underneath C:\Users\jenkins\workspace\Lucene-Solr-master-Windows\solr\build\solr-core\test\J0\temp\solr.cloud.CdcrVersionReplicationTest_86AC16513837805E-001\jetty-002\cores
   [junit4]   2> 1177996 INFO  (TEST-CdcrVersionReplicationTest.testCdcrDocVersions-seed#[86AC16513837805E]) [n:127.0.0.1:60344_    ] o.a.s.c.CoreDescriptor Created CoreDescriptor: {name=collection1, config=solrconfig.xml, transient=false, schema=schema.xml, loadOnStartup=true, configSetProperties=configsetprops.json, collection=tmp_collection, coreNodeName=, dataDir=data\, shard=}
   [junit4]   2> 1177996 INFO  (TEST-CdcrVersionReplicationTest.testCdcrDocVersions-seed#[86AC16513837805E]) [n:127.0.0.1:60344_    ] o.a.s.c.CorePropertiesLocator Found core collection1 in C:\Users\jenkins\workspace\Lucene-Solr-master-Windows\solr\build\solr-core\test\J0\temp\solr.cloud.CdcrVersionReplicationTest_86AC16513837805E-001\jetty-002\cores\collection1
   [junit4]   2> 1177996 INFO  (TEST-CdcrVersionReplicationTest.testCdcrDocVersions-seed#[86AC16513837805E]) [n:127.0.0.1:60344_    ] o.a.s.c.CorePropertiesLocator Found 1 core definitions
   [junit4]   2> 1177997 INFO  (coreLoadExecutor-3160-thread-1-processing-n:127.0.0.1:60344_) [n:127.0.0.1:60344_ c:tmp_collection   x:collection1] o.a.s.c.ZkController publishing state=down
   [junit4]   2> 1177997 INFO  (coreLoadExecutor-3160-thread-1-processing-n:127.0.0.1:60344_) [n:127.0.0.1:60344_ c:tmp_collection   x:collection1] o.a.s.c.ZkController numShards not found on descriptor - reading it from system property
   [junit4]   2> 1177997 INFO  (TEST-CdcrVersionReplicationTest.testCdcrDocVersions-seed#[86AC16513837805E]) [n:127.0.0.1:60344_    ] o.a.s.s.SolrDispatchFilter user.dir=C:\Users\jenkins\workspace\Lucene-Solr-master-Windows\solr\build\solr-core\test\J0
   [junit4]   2> 1177997 INFO  (TEST-CdcrVersionReplicationTest.testCdcrDocVersions-seed#[86AC16513837805E]) [n:127.0.0.1:60344_    ] o.a.s.s.SolrDispatchFilter SolrDispatchFilter.init() done
   [junit4]   2> 1177998 INFO  (coreLoadExecutor-3160-thread-1-processing-n:127.0.0.1:60344_) [n:127.0.0.1:60344_ c:tmp_collection   x:collection1] o.a.s.c.ZkController Registering watch for collection tmp_collection
   [junit4]   2> 1177998 INFO  (coreLoadExecutor-3160-thread-1-processing-n:127.0.0.1:60344_) [n:127.0.0.1:60344_ c:tmp_collection   x:collection1] o.a.s.c.c.ZkStateReader Deleting data for [tmp_collection]
   [junit4]   2> 1177998 INFO  (OverseerStateUpdate-96627049365110788-127.0.0.1:60329_-n_0000000000) [n:127.0.0.1:60329_    ] o.a.s.c.Overseer processMessage: queueSize: 1, message = {
   [junit4]   2>   "core":"collection1",
   [junit4]   2>   "roles":null,
   [junit4]   2>   "base_url":"http://127.0.0.1:60344",
   [junit4]   2>   "node_name":"127.0.0.1:60344_",
   [junit4]   2>   "numShards":"2",
   [junit4]   2>   "state":"down",
   [junit4]   2>   "shard":null,
   [junit4]   2>   "collection":"tmp_collection",
   [junit4]   2>   "operation":"state"} current state version: 3
   [junit4]   2> 1177999 INFO  (OverseerStateUpdate-96627049365110788-127.0.0.1:60329_-n_0000000000) [n:127.0.0.1:60329_    ] o.a.s.c.o.ReplicaMutator Update state numShards=2 message={
   [junit4]   2>   "core":"collection1",
   [junit4]   2>   "roles":null,
   [junit4]   2>   "base_url":"http://127.0.0.1:60344",
   [junit4]   2>   "node_name":"127.0.0.1:60344_",
   [junit4]   2>   "numShards":"2",
   [junit4]   2>   "state":"down",
   [junit4]   2>   "shard":null,
   [junit4]   2>   "collection":"tmp_collection",
   [junit4]   2>   "operation":"state"}
   [junit4]   2> 1177999 INFO  (OverseerStateUpdate-96627049365110788-127.0.0.1:60329_-n_0000000000) [n:127.0.0.1:60329_    ] o.a.s.c.o.ReplicaMutator Collection already exists with numShards=2
   [junit4]   2> 1177999 INFO  (OverseerStateUpdate-96627049365110788-127.0.0.1:60329_-n_0000000000) [n:127.0.0.1:60329_    ] o.a.s.c.o.ReplicaMutator Assigning new node to shard shard=shard1
   [junit4]   2> 1177999 INFO  (coreLoadExecutor-3160-thread-1-processing-n:127.0.0.1:60344_) [n:127.0.0.1:60344_ c:tmp_collection   x:collection1] o.a.s.c.ZkController look for our core node name
   [junit4]   2> 1178103 INFO  (zkCallback-1386-thread-2-processing-n:127.0.0.1:60329_) [n:127.0.0.1:60329_    ] o.a.s.c.c.ZkStateReader A cluster state change: [WatchedEvent state:SyncConnected type:NodeDataChanged path:/clusterstate.json], has occurred - updating... (live nodes size: [2])
   [junit4]   2> 1178103 INFO  (zkCallback-1392-thread-1-processing-n:127.0.0.1:60344_) [n:127.0.0.1:60344_    ] o.a.s.c.c.ZkStateReader A cluster state change: [WatchedEvent state:SyncConnected type:NodeDataChanged path:/clusterstate.json], has occurred - updating... (live nodes size: [2])
   [junit4]   2> 1179000 INFO  (coreLoadExecutor-3160-thread-1-processing-n:127.0.0.1:60344_) [n:127.0.0.1:60344_ c:tmp_collection   x:collection1] o.a.s.c.ZkController waiting to find shard id in clusterstate for collection1
   [junit4]   2> 1179000 INFO  (coreLoadExecutor-3160-thread-1-processing-n:127.0.0.1:60344_) [n:127.0.0.1:60344_ c:tmp_collection   x:collection1] o.a.s.c.ZkController Check for collection zkNode:tmp_collection
   [junit4]   2> 1179000 INFO  (coreLoadExecutor-3160-thread-1-processing-n:127.0.0.1:60344_) [n:127.0.0.1:60344_ c:tmp_collection   x:collection1] o.a.s.c.ZkController Collection zkNode exists
   [junit4]   2> 1179000 INFO  (coreLoadExecutor-3160-thread-1-processing-n:127.0.0.1:60344_) [n:127.0.0.1:60344_ c:tmp_collection   x:collection1] o.a.s.c.SolrResourceLoader new SolrResourceLoader for directory: 'C:\Users\jenkins\workspace\Lucene-Solr-master-Windows\solr\build\solr-core\test\J0\temp\solr.cloud.CdcrVersionReplicationTest_86AC16513837805E-001\jetty-002\cores\collection1'
   [junit4]   2> 1179001 INFO  (coreLoadExecutor-3160-thread-1-processing-n:127.0.0.1:60344_) [n:127.0.0.1:60344_ c:tmp_collection   x:collection1] o.a.s.c.SolrResourceLoader JNDI not configured for solr (NoInitialContextEx)
   [junit4]   2> 1179001 INFO  (coreLoadExecutor-3160-thread-1-processing-n:127.0.0.1:60344_) [n:127.0.0.1:60344_ c:tmp_collection   x:collection1] o.a.s.c.SolrResourceLoader solr home defaulted to 'solr/' (could not find system property or JNDI)
   [junit4]   2> 1179003 INFO  (coreLoadExecutor-3160-thread-1-processing-n:127.0.0.1:60344_) [n:127.0.0.1:60344_ c:tmp_collection   x:collection1] o.a.s.c.Config loaded config solrconfig.xml with version 0 
   [junit4]   2> 1179011 INFO  (coreLoadExecutor-3160-thread-1-processing-n:127.0.0.1:60344_) [n:127.0.0.1:60344_ c:tmp_collection   x:collection1] o.a.s.c.SolrConfig current version of requestparams : -1
   [junit4]   2> 1179014 WARN  (coreLoadExecutor-3160-thread-1-processing-n:127.0.0.1:60344_) [n:127.0.0.1:60344_ c:tmp_collection   x:collection1] o.a.s.c.Config Beginning with Solr 5.5, <mergePolicy> is deprecated, use <mergePolicyFactory> instead.
   [junit4]   2> 1179015 INFO  (coreLoadExecutor-3160-thread-1-processing-n:127.0.0.1:60344_) [n:127.0.0.1:60344_ c:tmp_collection   x:collection1] o.a.s.c.SolrConfig Using Lucene MatchVersion: 7.0.0
   [junit4]   2> 1179020 INFO  (coreLoadExecutor-3160-thread-1-processing-n:127.0.0.1:60344_) [n:127.0.0.1:60344_ c:tmp_collection   x:collection1] o.a.s.c.SolrConfig Loaded SolrConfig: solrconfig.xml
   [junit4]   2> 1179026

[...truncated too long message...]

   2> 2862842 INFO  (Thread-5591) [n:127.0.0.1:49817_solr c:testschemaapi s:shard1 r:core_node1 x:testschemaapi_shard1_replica2] o.a.s.c.CachingDirectoryFactory Closing directory: C:\Users\jenkins\workspace\Lucene-Solr-master-Windows\solr\build\solr-core\test\J1\temp\solr.schema.TestManagedSchemaAPI_86AC16513837805E-001\tempDir-001\node1\.\testschemaapi_shard1_replica2\data\index
   [junit4]   2> 2862842 WARN  (Thread-5591) [n:127.0.0.1:49817_solr c:testschemaapi s:shard1 r:core_node1 x:testschemaapi_shard1_replica2] o.a.s.c.SolrCores Tried to remove core testschemaapi_shard1_replica2 from pendingCoreOps and it wasn't there. 
   [junit4]   2> 2862842 WARN  (Thread-5591) [n:127.0.0.1:49817_solr c:testschemaapi s:shard1 r:core_node1 x:testschemaapi_shard1_replica2] o.a.s.c.ZkController listener throws error
   [junit4]   2> org.apache.solr.common.SolrException: Unable to reload core [testschemaapi_shard1_replica2]
   [junit4]   2> 	at org.apache.solr.core.CoreContainer.reload(CoreContainer.java:970)
   [junit4]   2> 	at org.apache.solr.core.SolrCore.lambda$getConfListener$6(SolrCore.java:2602)
   [junit4]   2> 	at org.apache.solr.cloud.ZkController.lambda$fireEventListeners$3(ZkController.java:2443)
   [junit4]   2> 	at java.lang.Thread.run(Thread.java:745)
   [junit4]   2> Caused by: java.lang.IllegalStateException: This CoreContainer has been closed
   [junit4]   2> 	at org.apache.solr.core.CoreContainer.registerCore(CoreContainer.java:726)
   [junit4]   2> 	at org.apache.solr.core.CoreContainer.reload(CoreContainer.java:965)
   [junit4]   2> 	... 3 more
   [junit4]   2> Sep 20, 2016 11:17:31 PM com.carrotsearch.randomizedtesting.ThreadLeakControl checkThreadLeaks
   [junit4]   2> WARNING: Will linger awaiting termination of 4 leaked thread(s).
   [junit4]   2> NOTE: test params are: codec=Asserting(Lucene62): {_version_=Lucene50(blocksize=128), id=PostingsFormat(name=Asserting), myNewField1=PostingsFormat(name=Asserting), myNewField=Lucene50(blocksize=128)}, docValues:{}, maxPointsInLeafNode=1306, maxMBSortInHeap=7.477800586309659, sim=RandomSimilarity(queryNorm=false): {}, locale=en-AU, timezone=Europe/Mariehamn
   [junit4]   2> NOTE: Windows 10 10.0 amd64/Oracle Corporation 1.8.0_102 (64-bit)/cpus=3,threads=1,free=47671424,total=526909440
   [junit4]   2> NOTE: All tests run in this JVM: [TestConfigSetImmutable, HdfsChaosMonkeySafeLeaderTest, TestBadConfig, SortSpecParsingTest, TestStressUserVersions, SpellPossibilityIteratorTest, CollectionsAPIAsyncDistributedZkTest, SpellingQueryConverterTest, FullSolrCloudDistribCmdsTest, BlobRepositoryCloudTest, CoreAdminCreateDiscoverTest, LoggingHandlerTest, TestExclusionRuleCollectionAccess, TestRealTimeGet, TestOmitPositions, DocValuesMissingTest, OpenCloseCoreStressTest, TestSubQueryTransformer, SolrCloudExampleTest, TestCoreDiscovery, TestFastWriter, AddSchemaFieldsUpdateProcessorFactoryTest, ReturnFieldsTest, UUIDUpdateProcessorFallbackTest, HdfsWriteToMultipleCollectionsTest, TestLuceneMatchVersion, HdfsTlogReplayBufferedWhileIndexingTest, UpdateParamsTest, TestQuerySenderListener, HdfsDirectoryTest, ConvertedLegacyTest, TestNamedUpdateProcessors, TestCloudSchemaless, BadCopyFieldTest, BinaryUpdateRequestHandlerTest, BasicAuthIntegrationTest, TestQueryUtils, CoreMergeIndexesAdminHandlerTest, FileBasedSpellCheckerTest, TestLegacyFieldCache, TestCrossCoreJoin, FullHLLTest, TestSerializedLuceneMatchVersion, LeaderFailoverAfterPartitionTest, TestJettySolrRunner, DistributedQueryComponentCustomSortTest, ScriptEngineTest, SpellCheckComponentTest, StatsComponentTest, DirectoryFactoryTest, FieldMutatingUpdateProcessorTest, TestIndexSearcher, TestNoOpRegenerator, TestFiltering, TestLMJelinekMercerSimilarityFactory, WordBreakSolrSpellCheckerTest, TestMergePolicyConfig, ChaosMonkeySafeLeaderTest, TestConfigReload, TestSolrQueryParserResource, CSVRequestHandlerTest, TestFieldCacheSort, ParsingFieldUpdateProcessorsTest, QueryParsingTest, CdcrRequestHandlerTest, SignatureUpdateProcessorFactoryTest, TestReloadAndDeleteDocs, PreAnalyzedFieldTest, RuleEngineTest, TestSolr4Spatial, TlogReplayBufferedWhileIndexingTest, TestSolrCoreProperties, SpatialHeatmapFacetsTest, TestDynamicFieldCollectionResource, RequestLoggingTest, TestLeaderElectionZkExpiry, TestPHPSerializedResponseWriter, BasicFunctionalityTest, TestNumericTerms64, SolrIndexSplitterTest, TestDistributedGrouping, TestOrdValues, PeerSyncReplicationTest, ShardRoutingCustomTest, HLLUtilTest, ExternalFileFieldSortTest, TestDistributedMissingSort, CopyFieldTest, OverseerStatusTest, BigEndianAscendingWordDeserializerTest, TestTrackingShardHandlerFactory, ResourceLoaderTest, TestSolrFieldCacheMBean, TestUseDocValuesAsStored2, TestXmlQParser, TestAuthenticationFramework, TestSolrCLIRunExample, TestGraphMLResponseWriter, TestManagedResourceStorage, TestDocBasedVersionConstraints, TestSizeLimitedDistributedMap, TestRuleBasedAuthorizationPlugin, TestSchemaNameResource, BitVectorTest, HighlighterConfigTest, HighlighterMaxOffsetTest, TestTolerantUpdateProcessorCloud, TestExactStatsCache, TestConfigSets, TestCopyFieldCollectionResource, TestNonDefinedSimilarityFactory, DocExpirationUpdateProcessorFactoryTest, SimpleCollectionCreateDeleteTest, DistributedFacetPivotLongTailTest, TestRecovery, JsonLoaderTest, BadIndexSchemaTest, DebugComponentTest, TestMiniSolrCloudClusterSSL, DefaultValueUpdateProcessorTest, SuggesterTest, TestFieldSortValues, TestCloudInspectUtil, TestQueryTypes, TestSolrQueryParser, OverriddenZkACLAndCredentialsProvidersTest, SharedFSAutoReplicaFailoverTest, TestCustomDocTransformer, TestRangeQuery, AsyncCallRequestStatusResponseTest, LukeRequestHandlerTest, SearchHandlerTest, RequestHandlersTest, CachingDirectoryFactoryTest, ResponseHeaderTest, TestLMDirichletSimilarityFactory, TestAnalyzeInfixSuggestions, TestDistribIDF, TestUtils, SuggesterWFSTTest, TestExpandComponent, VMParamsZkACLAndCredentialsProvidersTest, TestSimpleTrackingShardHandler, SecurityConfHandlerTest, TestSearchPerf, TestSortingResponseWriter, MultiThreadedOCPTest, TestAtomicUpdateErrorCases, TestCloudManagedSchema, ChangedSchemaMergeTest, TestFieldCacheVsDocValues, DistributedFacetExistsSmallTest, TestImplicitCoreProperties, BasicDistributedZkTest, BasicDistributedZk2Test, UnloadDistributedZkTest, CollectionsAPIDistributedZkTest, SyncSliceTest, OverseerTest, LeaderElectionIntegrationTest, BasicZkTest, RecoveryZkTest, ZkSolrClientTest, TestRandomDVFaceting, TestDistributedSearch, TestJoin, TestReload, TestCoreContainer, SolrCoreTest, TestGroupingSearch, SolrCmdDistributorTest, DirectUpdateHandlerTest, ShowFileRequestHandlerTest, CurrencyFieldOpenExchangeTest, CurrencyFieldXmlFileTest, SpellCheckCollatorTest, CoreAdminHandlerTest, SuggesterTSTTest, TestCSVLoader, SolrCoreCheckLockOnStartupTest, TestWordDelimiterFilterFactory, DirectUpdateHandlerOptimizeTest, SortByFunctionTest, TestRemoteStreaming, DistanceFunctionTest, TestSolrDeletionPolicy1, CacheHeaderTest, TestSurroundQueryParser, StandardRequestHandlerTest, DirectSolrSpellCheckerTest, TestReversedWildcardFilterFactory, PrimitiveFieldTypeTest, TestValueSourceCache, TestIndexingPerformance, FieldAnalysisRequestHandlerTest, IndexSchemaTest, TestCollationField, TestPartialUpdateDeduplication, PingRequestHandlerTest, TestQuerySenderNoQuery, SolrIndexConfigTest, TestSolrDeletionPolicy2, SampleTest, TestDocSet, NumericFieldsTest, MinimalSchemaTest, TestConfig, TestFuzzyAnalyzedSuggestions, TestPhraseSuggestions, TestCodecSupport, TestJmxMonitoredMap, TimeZoneUtilsTest, TestFastLRUCache, ChaosMonkeyNothingIsSafeTest, BaseCdcrDistributedZkTest, CdcrReplicationDistributedZkTest, CleanupOldIndexTest, CollectionTooManyReplicasTest, ConcurrentDeleteAndCreateCollectionTest, ConnectionManagerTest, CustomCollectionTest, DistribDocExpirationUpdateProcessorTest, ForceLeaderTest, LeaderInitiatedRecoveryOnShardRestartTest, MigrateRouteKeyTest, OverseerRolesTest, SSLMigrationTest, SaslZkACLProviderTest, SolrXmlInZkTest, TestCloudDeleteByQuery, TestCloudPseudoReturnFields, TestConfigSetsAPI, TestConfigSetsAPIZkFailure, TestDistribDocBasedVersion, TestHdfsCloudBackupRestore, TestLeaderInitiatedRecoveryThread, TestLocalFSCloudBackupRestore, TestMiniSolrCloudCluster, TestOnReconnectListenerSupport, TestRequestForwarding, TestRequestStatusCollectionAPI, TestSolrCloudWithDelegationTokens, TestSolrCloudWithSecureImpersonation, TestStressCloudBlindAtomicUpdates, TriLevelCompositeIdRoutingTest, CoreSorterTest, HdfsDirectoryFactoryTest, QueryResultKeyTest, TestBackupRepositoryFactory, TestInfoStreamLogging, TestInitParams, TestNRTOpen, TestSolrConfigHandler, TestSolrXml, TestBlobHandler, TestHdfsBackupRestoreCore, TestReplicationHandlerBackup, TestReqParamsAPI, TestRestoreCore, TestSolrConfigHandlerCloud, SegmentsInfoRequestHandlerTest, DistributedDebugComponentTest, DistributedExpandComponentTest, DistributedFacetPivotSmallTest, DistributedSuggestComponentTest, TestDistributedStatsComponentCardinality, TestDynamicFieldResource, TestFieldResource, TestSchemaResource, TestSchemaVersionResource, TestUniqueKeyFieldResource, BooleanFieldTest, DateRangeFieldTest, EnumFieldTest, SpatialRPTFieldTypeTest, TestManagedSchemaAPI]
   [junit4]   2> NOTE: reproduce with: ant test  -Dtestcase=TestManagedSchemaAPI -Dtests.seed=86AC16513837805E -Dtests.slow=true -Dtests.locale=en-AU -Dtests.timezone=Europe/Mariehamn -Dtests.asserts=true -Dtests.file.encoding=US-ASCII
   [junit4] ERROR   0.00s J1 | TestManagedSchemaAPI (suite) <<<
   [junit4]    > Throwable #1: java.lang.AssertionError: ObjectTracker found 2 object(s) that were not released!!! [SolrCore, MockDirectoryWrapper]
   [junit4]    > 	at __randomizedtesting.SeedInfo.seed([86AC16513837805E]:0)
   [junit4]    > 	at org.apache.solr.SolrTestCaseJ4.teardownTestCases(SolrTestCaseJ4.java:257)
   [junit4]    > 	at java.lang.Thread.run(Thread.java:745)
   [junit4] Completed [574/631 (3!)] on J1 in 12.26s, 1 test, 1 failure <<< FAILURES!

[...truncated 60438 lines...]


Mime
View raw message