lucene-dev mailing list archives

Site index · List index
Message view « Date » · « Thread »
Top « Date » · « Thread »
From Policeman Jenkins Server <jenk...@thetaphi.de>
Subject [JENKINS] Lucene-Solr-5.5-Linux (32bit/jdk1.7.0_80) - Build # 403 - Unstable!
Date Thu, 08 Sep 2016 08:00:10 GMT
Build: http://jenkins.thetaphi.de/job/Lucene-Solr-5.5-Linux/403/
Java: 32bit/jdk1.7.0_80 -client -XX:+UseConcMarkSweepGC

1 tests failed.
FAILED:  junit.framework.TestSuite.org.apache.solr.handler.TestSolrConfigHandlerCloud

Error Message:
1 thread leaked from SUITE scope at org.apache.solr.handler.TestSolrConfigHandlerCloud:     1) Thread[id=14244, name=Thread-4561, state=TIMED_WAITING, group=TGRP-TestSolrConfigHandlerCloud]         at java.lang.Thread.sleep(Native Method)         at org.apache.solr.cloud.ZkSolrResourceLoader.openResource(ZkSolrResourceLoader.java:101)         at org.apache.solr.core.SolrResourceLoader.openSchema(SolrResourceLoader.java:355)         at org.apache.solr.schema.IndexSchemaFactory.create(IndexSchemaFactory.java:48)         at org.apache.solr.schema.IndexSchemaFactory.buildIndexSchema(IndexSchemaFactory.java:70)         at org.apache.solr.core.ConfigSetService.createIndexSchema(ConfigSetService.java:108)         at org.apache.solr.core.ConfigSetService.getConfig(ConfigSetService.java:79)         at org.apache.solr.core.CoreContainer.reload(CoreContainer.java:920)         at org.apache.solr.core.SolrCore$11.run(SolrCore.java:2623)         at org.apache.solr.cloud.ZkController$5.run(ZkController.java:2480)

Stack Trace:
com.carrotsearch.randomizedtesting.ThreadLeakError: 1 thread leaked from SUITE scope at org.apache.solr.handler.TestSolrConfigHandlerCloud: 
   1) Thread[id=14244, name=Thread-4561, state=TIMED_WAITING, group=TGRP-TestSolrConfigHandlerCloud]
        at java.lang.Thread.sleep(Native Method)
        at org.apache.solr.cloud.ZkSolrResourceLoader.openResource(ZkSolrResourceLoader.java:101)
        at org.apache.solr.core.SolrResourceLoader.openSchema(SolrResourceLoader.java:355)
        at org.apache.solr.schema.IndexSchemaFactory.create(IndexSchemaFactory.java:48)
        at org.apache.solr.schema.IndexSchemaFactory.buildIndexSchema(IndexSchemaFactory.java:70)
        at org.apache.solr.core.ConfigSetService.createIndexSchema(ConfigSetService.java:108)
        at org.apache.solr.core.ConfigSetService.getConfig(ConfigSetService.java:79)
        at org.apache.solr.core.CoreContainer.reload(CoreContainer.java:920)
        at org.apache.solr.core.SolrCore$11.run(SolrCore.java:2623)
        at org.apache.solr.cloud.ZkController$5.run(ZkController.java:2480)
	at __randomizedtesting.SeedInfo.seed([496B9CBCB5E36BC8]:0)




Build Log:
[...truncated 12251 lines...]
   [junit4] Suite: org.apache.solr.handler.TestSolrConfigHandlerCloud
   [junit4]   2> Creating dataDir: /home/jenkins/workspace/Lucene-Solr-5.5-Linux/solr/build/solr-core/test/J2/temp/solr.handler.TestSolrConfigHandlerCloud_496B9CBCB5E36BC8-001/init-core-data-001
   [junit4]   2> 1969051 INFO  (SUITE-TestSolrConfigHandlerCloud-seed#[496B9CBCB5E36BC8]-worker) [    ] o.a.s.SolrTestCaseJ4 Randomized ssl (false) and clientAuth (false)
   [junit4]   2> 1969051 INFO  (SUITE-TestSolrConfigHandlerCloud-seed#[496B9CBCB5E36BC8]-worker) [    ] o.a.s.BaseDistributedSearchTestCase Setting hostContext system property: /
   [junit4]   2> 1969053 INFO  (TEST-TestSolrConfigHandlerCloud.test-seed#[496B9CBCB5E36BC8]) [    ] o.a.s.c.ZkTestServer STARTING ZK TEST SERVER
   [junit4]   2> 1969053 INFO  (Thread-4354) [    ] o.a.s.c.ZkTestServer client port:0.0.0.0/0.0.0.0:0
   [junit4]   2> 1969053 INFO  (Thread-4354) [    ] o.a.s.c.ZkTestServer Starting server
   [junit4]   2> 1969153 INFO  (TEST-TestSolrConfigHandlerCloud.test-seed#[496B9CBCB5E36BC8]) [    ] o.a.s.c.ZkTestServer start zk server on port:35163
   [junit4]   2> 1969153 INFO  (TEST-TestSolrConfigHandlerCloud.test-seed#[496B9CBCB5E36BC8]) [    ] o.a.s.c.c.SolrZkClient Using default ZkCredentialsProvider
   [junit4]   2> 1969154 INFO  (TEST-TestSolrConfigHandlerCloud.test-seed#[496B9CBCB5E36BC8]) [    ] o.a.s.c.c.ConnectionManager Waiting for client to connect to ZooKeeper
   [junit4]   2> 1969156 INFO  (zkCallback-1866-thread-1) [    ] o.a.s.c.c.ConnectionManager Watcher org.apache.solr.common.cloud.ConnectionManager@999865 name:ZooKeeperConnection Watcher:127.0.0.1:35163 got event WatchedEvent state:SyncConnected type:None path:null path:null type:None
   [junit4]   2> 1969157 INFO  (TEST-TestSolrConfigHandlerCloud.test-seed#[496B9CBCB5E36BC8]) [    ] o.a.s.c.c.ConnectionManager Client is connected to ZooKeeper
   [junit4]   2> 1969157 INFO  (TEST-TestSolrConfigHandlerCloud.test-seed#[496B9CBCB5E36BC8]) [    ] o.a.s.c.c.SolrZkClient Using default ZkACLProvider
   [junit4]   2> 1969157 INFO  (TEST-TestSolrConfigHandlerCloud.test-seed#[496B9CBCB5E36BC8]) [    ] o.a.s.c.c.SolrZkClient makePath: /solr
   [junit4]   2> 1969159 INFO  (TEST-TestSolrConfigHandlerCloud.test-seed#[496B9CBCB5E36BC8]) [    ] o.a.s.c.c.SolrZkClient Using default ZkCredentialsProvider
   [junit4]   2> 1969159 INFO  (TEST-TestSolrConfigHandlerCloud.test-seed#[496B9CBCB5E36BC8]) [    ] o.a.s.c.c.ConnectionManager Waiting for client to connect to ZooKeeper
   [junit4]   2> 1969160 INFO  (zkCallback-1867-thread-1) [    ] o.a.s.c.c.ConnectionManager Watcher org.apache.solr.common.cloud.ConnectionManager@cdae89 name:ZooKeeperConnection Watcher:127.0.0.1:35163/solr got event WatchedEvent state:SyncConnected type:None path:null path:null type:None
   [junit4]   2> 1969160 INFO  (TEST-TestSolrConfigHandlerCloud.test-seed#[496B9CBCB5E36BC8]) [    ] o.a.s.c.c.ConnectionManager Client is connected to ZooKeeper
   [junit4]   2> 1969160 INFO  (TEST-TestSolrConfigHandlerCloud.test-seed#[496B9CBCB5E36BC8]) [    ] o.a.s.c.c.SolrZkClient Using default ZkACLProvider
   [junit4]   2> 1969160 INFO  (TEST-TestSolrConfigHandlerCloud.test-seed#[496B9CBCB5E36BC8]) [    ] o.a.s.c.c.SolrZkClient makePath: /collections/collection1
   [junit4]   2> 1969161 INFO  (TEST-TestSolrConfigHandlerCloud.test-seed#[496B9CBCB5E36BC8]) [    ] o.a.s.c.c.SolrZkClient makePath: /collections/collection1/shards
   [junit4]   2> 1969162 INFO  (TEST-TestSolrConfigHandlerCloud.test-seed#[496B9CBCB5E36BC8]) [    ] o.a.s.c.c.SolrZkClient makePath: /collections/control_collection
   [junit4]   2> 1969163 INFO  (TEST-TestSolrConfigHandlerCloud.test-seed#[496B9CBCB5E36BC8]) [    ] o.a.s.c.c.SolrZkClient makePath: /collections/control_collection/shards
   [junit4]   2> 1969164 INFO  (TEST-TestSolrConfigHandlerCloud.test-seed#[496B9CBCB5E36BC8]) [    ] o.a.s.c.AbstractZkTestCase put /home/jenkins/workspace/Lucene-Solr-5.5-Linux/solr/core/src/test-files/solr/collection1/conf/solrconfig-tlog.xml to /configs/conf1/solrconfig.xml
   [junit4]   2> 1969165 INFO  (TEST-TestSolrConfigHandlerCloud.test-seed#[496B9CBCB5E36BC8]) [    ] o.a.s.c.c.SolrZkClient makePath: /configs/conf1/solrconfig.xml
   [junit4]   2> 1969166 INFO  (TEST-TestSolrConfigHandlerCloud.test-seed#[496B9CBCB5E36BC8]) [    ] o.a.s.c.AbstractZkTestCase put /home/jenkins/workspace/Lucene-Solr-5.5-Linux/solr/core/src/test-files/solr/collection1/conf/schema.xml to /configs/conf1/schema.xml
   [junit4]   2> 1969166 INFO  (TEST-TestSolrConfigHandlerCloud.test-seed#[496B9CBCB5E36BC8]) [    ] o.a.s.c.c.SolrZkClient makePath: /configs/conf1/schema.xml
   [junit4]   2> 1969167 INFO  (TEST-TestSolrConfigHandlerCloud.test-seed#[496B9CBCB5E36BC8]) [    ] o.a.s.c.AbstractZkTestCase put /home/jenkins/workspace/Lucene-Solr-5.5-Linux/solr/core/src/test-files/solr/collection1/conf/solrconfig.snippet.randomindexconfig.xml to /configs/conf1/solrconfig.snippet.randomindexconfig.xml
   [junit4]   2> 1969167 INFO  (TEST-TestSolrConfigHandlerCloud.test-seed#[496B9CBCB5E36BC8]) [    ] o.a.s.c.c.SolrZkClient makePath: /configs/conf1/solrconfig.snippet.randomindexconfig.xml
   [junit4]   2> 1969167 INFO  (TEST-TestSolrConfigHandlerCloud.test-seed#[496B9CBCB5E36BC8]) [    ] o.a.s.c.AbstractZkTestCase put /home/jenkins/workspace/Lucene-Solr-5.5-Linux/solr/core/src/test-files/solr/collection1/conf/stopwords.txt to /configs/conf1/stopwords.txt
   [junit4]   2> 1969168 INFO  (TEST-TestSolrConfigHandlerCloud.test-seed#[496B9CBCB5E36BC8]) [    ] o.a.s.c.c.SolrZkClient makePath: /configs/conf1/stopwords.txt
   [junit4]   2> 1969168 INFO  (TEST-TestSolrConfigHandlerCloud.test-seed#[496B9CBCB5E36BC8]) [    ] o.a.s.c.AbstractZkTestCase put /home/jenkins/workspace/Lucene-Solr-5.5-Linux/solr/core/src/test-files/solr/collection1/conf/protwords.txt to /configs/conf1/protwords.txt
   [junit4]   2> 1969168 INFO  (TEST-TestSolrConfigHandlerCloud.test-seed#[496B9CBCB5E36BC8]) [    ] o.a.s.c.c.SolrZkClient makePath: /configs/conf1/protwords.txt
   [junit4]   2> 1969169 INFO  (TEST-TestSolrConfigHandlerCloud.test-seed#[496B9CBCB5E36BC8]) [    ] o.a.s.c.AbstractZkTestCase put /home/jenkins/workspace/Lucene-Solr-5.5-Linux/solr/core/src/test-files/solr/collection1/conf/currency.xml to /configs/conf1/currency.xml
   [junit4]   2> 1969169 INFO  (TEST-TestSolrConfigHandlerCloud.test-seed#[496B9CBCB5E36BC8]) [    ] o.a.s.c.c.SolrZkClient makePath: /configs/conf1/currency.xml
   [junit4]   2> 1969170 INFO  (TEST-TestSolrConfigHandlerCloud.test-seed#[496B9CBCB5E36BC8]) [    ] o.a.s.c.AbstractZkTestCase put /home/jenkins/workspace/Lucene-Solr-5.5-Linux/solr/core/src/test-files/solr/collection1/conf/enumsConfig.xml to /configs/conf1/enumsConfig.xml
   [junit4]   2> 1969170 INFO  (TEST-TestSolrConfigHandlerCloud.test-seed#[496B9CBCB5E36BC8]) [    ] o.a.s.c.c.SolrZkClient makePath: /configs/conf1/enumsConfig.xml
   [junit4]   2> 1969172 INFO  (TEST-TestSolrConfigHandlerCloud.test-seed#[496B9CBCB5E36BC8]) [    ] o.a.s.c.AbstractZkTestCase put /home/jenkins/workspace/Lucene-Solr-5.5-Linux/solr/core/src/test-files/solr/collection1/conf/open-exchange-rates.json to /configs/conf1/open-exchange-rates.json
   [junit4]   2> 1969172 INFO  (TEST-TestSolrConfigHandlerCloud.test-seed#[496B9CBCB5E36BC8]) [    ] o.a.s.c.c.SolrZkClient makePath: /configs/conf1/open-exchange-rates.json
   [junit4]   2> 1969173 INFO  (TEST-TestSolrConfigHandlerCloud.test-seed#[496B9CBCB5E36BC8]) [    ] o.a.s.c.AbstractZkTestCase put /home/jenkins/workspace/Lucene-Solr-5.5-Linux/solr/core/src/test-files/solr/collection1/conf/mapping-ISOLatin1Accent.txt to /configs/conf1/mapping-ISOLatin1Accent.txt
   [junit4]   2> 1969173 INFO  (TEST-TestSolrConfigHandlerCloud.test-seed#[496B9CBCB5E36BC8]) [    ] o.a.s.c.c.SolrZkClient makePath: /configs/conf1/mapping-ISOLatin1Accent.txt
   [junit4]   2> 1969173 INFO  (TEST-TestSolrConfigHandlerCloud.test-seed#[496B9CBCB5E36BC8]) [    ] o.a.s.c.AbstractZkTestCase put /home/jenkins/workspace/Lucene-Solr-5.5-Linux/solr/core/src/test-files/solr/collection1/conf/old_synonyms.txt to /configs/conf1/old_synonyms.txt
   [junit4]   2> 1969173 INFO  (TEST-TestSolrConfigHandlerCloud.test-seed#[496B9CBCB5E36BC8]) [    ] o.a.s.c.c.SolrZkClient makePath: /configs/conf1/old_synonyms.txt
   [junit4]   2> 1969174 INFO  (TEST-TestSolrConfigHandlerCloud.test-seed#[496B9CBCB5E36BC8]) [    ] o.a.s.c.AbstractZkTestCase put /home/jenkins/workspace/Lucene-Solr-5.5-Linux/solr/core/src/test-files/solr/collection1/conf/synonyms.txt to /configs/conf1/synonyms.txt
   [junit4]   2> 1969174 INFO  (TEST-TestSolrConfigHandlerCloud.test-seed#[496B9CBCB5E36BC8]) [    ] o.a.s.c.c.SolrZkClient makePath: /configs/conf1/synonyms.txt
   [junit4]   2> 1969237 INFO  (TEST-TestSolrConfigHandlerCloud.test-seed#[496B9CBCB5E36BC8]) [    ] o.a.s.SolrTestCaseJ4 Writing core.properties file to /home/jenkins/workspace/Lucene-Solr-5.5-Linux/solr/build/solr-core/test/J2/temp/solr.handler.TestSolrConfigHandlerCloud_496B9CBCB5E36BC8-001/control-001/cores/collection1
   [junit4]   2> 1969238 INFO  (TEST-TestSolrConfigHandlerCloud.test-seed#[496B9CBCB5E36BC8]) [    ] o.e.j.s.Server jetty-9.2.13.v20150730
   [junit4]   2> 1969239 INFO  (TEST-TestSolrConfigHandlerCloud.test-seed#[496B9CBCB5E36BC8]) [    ] o.e.j.s.h.ContextHandler Started o.e.j.s.ServletContextHandler@ff1ac{/,null,AVAILABLE}
   [junit4]   2> 1969239 INFO  (TEST-TestSolrConfigHandlerCloud.test-seed#[496B9CBCB5E36BC8]) [    ] o.e.j.s.ServerConnector Started ServerConnector@18d93d0{HTTP/1.1}{127.0.0.1:46539}
   [junit4]   2> 1969239 INFO  (TEST-TestSolrConfigHandlerCloud.test-seed#[496B9CBCB5E36BC8]) [    ] o.e.j.s.Server Started @1970687ms
   [junit4]   2> 1969239 INFO  (TEST-TestSolrConfigHandlerCloud.test-seed#[496B9CBCB5E36BC8]) [    ] o.a.s.c.s.e.JettySolrRunner Jetty properties: {solr.data.dir=/home/jenkins/workspace/Lucene-Solr-5.5-Linux/solr/build/solr-core/test/J2/temp/solr.handler.TestSolrConfigHandlerCloud_496B9CBCB5E36BC8-001/tempDir-001/control/data, coreRootDirectory=/home/jenkins/workspace/Lucene-Solr-5.5-Linux/solr/build/solr-core/test/J2/../../../../../../../../../home/jenkins/workspace/Lucene-Solr-5.5-Linux/solr/build/solr-core/test/J2/temp/solr.handler.TestSolrConfigHandlerCloud_496B9CBCB5E36BC8-001/control-001/cores, hostContext=/, hostPort=46539}
   [junit4]   2> 1969239 INFO  (TEST-TestSolrConfigHandlerCloud.test-seed#[496B9CBCB5E36BC8]) [    ] o.a.s.s.SolrDispatchFilter SolrDispatchFilter.init(): sun.misc.Launcher$AppClassLoader@327236
   [junit4]   2> 1969240 INFO  (TEST-TestSolrConfigHandlerCloud.test-seed#[496B9CBCB5E36BC8]) [    ] o.a.s.c.SolrResourceLoader new SolrResourceLoader for directory: '/home/jenkins/workspace/Lucene-Solr-5.5-Linux/solr/build/solr-core/test/J2/temp/solr.handler.TestSolrConfigHandlerCloud_496B9CBCB5E36BC8-001/control-001'
   [junit4]   2> 1969240 INFO  (TEST-TestSolrConfigHandlerCloud.test-seed#[496B9CBCB5E36BC8]) [    ] o.a.s.c.SolrResourceLoader JNDI not configured for solr (NoInitialContextEx)
   [junit4]   2> 1969240 INFO  (TEST-TestSolrConfigHandlerCloud.test-seed#[496B9CBCB5E36BC8]) [    ] o.a.s.c.SolrResourceLoader solr home defaulted to 'solr/' (could not find system property or JNDI)
   [junit4]   2> 1969240 INFO  (TEST-TestSolrConfigHandlerCloud.test-seed#[496B9CBCB5E36BC8]) [    ] o.a.s.c.c.SolrZkClient Using default ZkCredentialsProvider
   [junit4]   2> 1969240 INFO  (TEST-TestSolrConfigHandlerCloud.test-seed#[496B9CBCB5E36BC8]) [    ] o.a.s.c.c.ConnectionManager Waiting for client to connect to ZooKeeper
   [junit4]   2> 1969241 INFO  (zkCallback-1868-thread-1) [    ] o.a.s.c.c.ConnectionManager Watcher org.apache.solr.common.cloud.ConnectionManager@1c6cc3 name:ZooKeeperConnection Watcher:127.0.0.1:35163/solr got event WatchedEvent state:SyncConnected type:None path:null path:null type:None
   [junit4]   2> 1969241 INFO  (TEST-TestSolrConfigHandlerCloud.test-seed#[496B9CBCB5E36BC8]) [    ] o.a.s.c.c.ConnectionManager Client is connected to ZooKeeper
   [junit4]   2> 1969241 INFO  (TEST-TestSolrConfigHandlerCloud.test-seed#[496B9CBCB5E36BC8]) [    ] o.a.s.c.c.SolrZkClient Using default ZkACLProvider
   [junit4]   2> 1969242 INFO  (TEST-TestSolrConfigHandlerCloud.test-seed#[496B9CBCB5E36BC8]) [    ] o.a.s.s.SolrDispatchFilter Loading solr.xml from SolrHome (not found in ZooKeeper)
   [junit4]   2> 1969242 INFO  (TEST-TestSolrConfigHandlerCloud.test-seed#[496B9CBCB5E36BC8]) [    ] o.a.s.c.SolrXmlConfig Loading container configuration from /home/jenkins/workspace/Lucene-Solr-5.5-Linux/solr/build/solr-core/test/J2/temp/solr.handler.TestSolrConfigHandlerCloud_496B9CBCB5E36BC8-001/control-001/solr.xml
   [junit4]   2> 1969253 INFO  (TEST-TestSolrConfigHandlerCloud.test-seed#[496B9CBCB5E36BC8]) [    ] o.a.s.c.CorePropertiesLocator Config-defined core root directory: /home/jenkins/workspace/Lucene-Solr-5.5-Linux/solr/build/solr-core/test/J2/../../../../../../../../../home/jenkins/workspace/Lucene-Solr-5.5-Linux/solr/build/solr-core/test/J2/temp/solr.handler.TestSolrConfigHandlerCloud_496B9CBCB5E36BC8-001/control-001/cores
   [junit4]   2> 1969254 INFO  (TEST-TestSolrConfigHandlerCloud.test-seed#[496B9CBCB5E36BC8]) [    ] o.a.s.c.CoreContainer New CoreContainer 30994141
   [junit4]   2> 1969254 INFO  (TEST-TestSolrConfigHandlerCloud.test-seed#[496B9CBCB5E36BC8]) [    ] o.a.s.c.CoreContainer Loading cores into CoreContainer [instanceDir=/home/jenkins/workspace/Lucene-Solr-5.5-Linux/solr/build/solr-core/test/J2/temp/solr.handler.TestSolrConfigHandlerCloud_496B9CBCB5E36BC8-001/control-001]
   [junit4]   2> 1969254 WARN  (TEST-TestSolrConfigHandlerCloud.test-seed#[496B9CBCB5E36BC8]) [    ] o.a.s.c.CoreContainer Couldn't add files from /home/jenkins/workspace/Lucene-Solr-5.5-Linux/solr/build/solr-core/test/J2/temp/solr.handler.TestSolrConfigHandlerCloud_496B9CBCB5E36BC8-001/control-001/lib to classpath: /home/jenkins/workspace/Lucene-Solr-5.5-Linux/solr/build/solr-core/test/J2/temp/solr.handler.TestSolrConfigHandlerCloud_496B9CBCB5E36BC8-001/control-001/lib
   [junit4]   2> 1969254 INFO  (TEST-TestSolrConfigHandlerCloud.test-seed#[496B9CBCB5E36BC8]) [    ] o.a.s.h.c.HttpShardHandlerFactory created with socketTimeout : 90000,urlScheme : ,connTimeout : 15000,maxConnectionsPerHost : 20,maxConnections : 10000,corePoolSize : 0,maximumPoolSize : 2147483647,maxThreadIdleTime : 5,sizeOfQueue : -1,fairnessPolicy : false,useRetries : false,connectionsEvictorSleepDelay : 5000,maxConnectionIdleTime : 40000,
   [junit4]   2> 1969255 INFO  (TEST-TestSolrConfigHandlerCloud.test-seed#[496B9CBCB5E36BC8]) [    ] o.a.s.u.UpdateShardHandler Creating UpdateShardHandler HTTP client with params: socketTimeout=340000&connTimeout=45000&retry=true
   [junit4]   2> 1969256 INFO  (TEST-TestSolrConfigHandlerCloud.test-seed#[496B9CBCB5E36BC8]) [    ] o.a.s.l.LogWatcher SLF4J impl is org.slf4j.impl.Log4jLoggerFactory
   [junit4]   2> 1969256 INFO  (TEST-TestSolrConfigHandlerCloud.test-seed#[496B9CBCB5E36BC8]) [    ] o.a.s.l.LogWatcher Registering Log Listener [Log4j (org.slf4j.impl.Log4jLoggerFactory)]
   [junit4]   2> 1969256 INFO  (TEST-TestSolrConfigHandlerCloud.test-seed#[496B9CBCB5E36BC8]) [    ] o.a.s.c.ZkContainer Zookeeper client=127.0.0.1:35163/solr
   [junit4]   2> 1969256 INFO  (TEST-TestSolrConfigHandlerCloud.test-seed#[496B9CBCB5E36BC8]) [    ] o.a.s.c.ZkController zkHost includes chroot
   [junit4]   2> 1969256 INFO  (TEST-TestSolrConfigHandlerCloud.test-seed#[496B9CBCB5E36BC8]) [    ] o.a.s.c.c.SolrZkClient Using default ZkCredentialsProvider
   [junit4]   2> 1969256 INFO  (TEST-TestSolrConfigHandlerCloud.test-seed#[496B9CBCB5E36BC8]) [    ] o.a.s.c.c.ConnectionManager Waiting for client to connect to ZooKeeper
   [junit4]   2> 1969257 INFO  (zkCallback-1871-thread-1) [    ] o.a.s.c.c.ConnectionManager Watcher org.apache.solr.common.cloud.ConnectionManager@1c34630 name:ZooKeeperConnection Watcher:127.0.0.1:35163 got event WatchedEvent state:SyncConnected type:None path:null path:null type:None
   [junit4]   2> 1969257 INFO  (TEST-TestSolrConfigHandlerCloud.test-seed#[496B9CBCB5E36BC8]) [    ] o.a.s.c.c.ConnectionManager Client is connected to ZooKeeper
   [junit4]   2> 1969258 INFO  (TEST-TestSolrConfigHandlerCloud.test-seed#[496B9CBCB5E36BC8]) [    ] o.a.s.c.c.SolrZkClient Using default ZkACLProvider
   [junit4]   2> 1969258 INFO  (TEST-TestSolrConfigHandlerCloud.test-seed#[496B9CBCB5E36BC8]) [n:127.0.0.1:46539_    ] o.a.s.c.ZkController Added new OnReconnect listener org.apache.solr.cloud.ZkController$6@13f07e0
   [junit4]   2> 1969259 INFO  (TEST-TestSolrConfigHandlerCloud.test-seed#[496B9CBCB5E36BC8]) [n:127.0.0.1:46539_    ] o.a.s.c.c.ConnectionManager Waiting for client to connect to ZooKeeper
   [junit4]   2> 1969261 INFO  (zkCallback-1872-thread-1-processing-n:127.0.0.1:46539_) [n:127.0.0.1:46539_    ] o.a.s.c.c.ConnectionManager Watcher org.apache.solr.common.cloud.ConnectionManager@123ad04 name:ZooKeeperConnection Watcher:127.0.0.1:35163/solr got event WatchedEvent state:SyncConnected type:None path:null path:null type:None
   [junit4]   2> 1969261 INFO  (TEST-TestSolrConfigHandlerCloud.test-seed#[496B9CBCB5E36BC8]) [n:127.0.0.1:46539_    ] o.a.s.c.c.ConnectionManager Client is connected to ZooKeeper
   [junit4]   2> 1969262 INFO  (TEST-TestSolrConfigHandlerCloud.test-seed#[496B9CBCB5E36BC8]) [n:127.0.0.1:46539_    ] o.a.s.c.c.SolrZkClient makePath: /overseer/queue
   [junit4]   2> 1969263 INFO  (TEST-TestSolrConfigHandlerCloud.test-seed#[496B9CBCB5E36BC8]) [n:127.0.0.1:46539_    ] o.a.s.c.c.SolrZkClient makePath: /overseer/collection-queue-work
   [junit4]   2> 1969264 INFO  (TEST-TestSolrConfigHandlerCloud.test-seed#[496B9CBCB5E36BC8]) [n:127.0.0.1:46539_    ] o.a.s.c.c.SolrZkClient makePath: /overseer/collection-map-running
   [junit4]   2> 1969265 INFO  (TEST-TestSolrConfigHandlerCloud.test-seed#[496B9CBCB5E36BC8]) [n:127.0.0.1:46539_    ] o.a.s.c.c.SolrZkClient makePath: /overseer/collection-map-completed
   [junit4]   2> 1969266 INFO  (TEST-TestSolrConfigHandlerCloud.test-seed#[496B9CBCB5E36BC8]) [n:127.0.0.1:46539_    ] o.a.s.c.c.SolrZkClient makePath: /overseer/collection-map-failure
   [junit4]   2> 1969266 INFO  (TEST-TestSolrConfigHandlerCloud.test-seed#[496B9CBCB5E36BC8]) [n:127.0.0.1:46539_    ] o.a.s.c.c.SolrZkClient makePath: /live_nodes
   [junit4]   2> 1969267 INFO  (TEST-TestSolrConfigHandlerCloud.test-seed#[496B9CBCB5E36BC8]) [n:127.0.0.1:46539_    ] o.a.s.c.c.SolrZkClient makePath: /aliases.json
   [junit4]   2> 1969268 INFO  (TEST-TestSolrConfigHandlerCloud.test-seed#[496B9CBCB5E36BC8]) [n:127.0.0.1:46539_    ] o.a.s.c.c.SolrZkClient makePath: /clusterstate.json
   [junit4]   2> 1969268 INFO  (TEST-TestSolrConfigHandlerCloud.test-seed#[496B9CBCB5E36BC8]) [n:127.0.0.1:46539_    ] o.a.s.c.c.SolrZkClient makePath: /security.json
   [junit4]   2> 1969269 INFO  (TEST-TestSolrConfigHandlerCloud.test-seed#[496B9CBCB5E36BC8]) [n:127.0.0.1:46539_    ] o.a.s.c.ZkController Register node as live in ZooKeeper:/live_nodes/127.0.0.1:46539_
   [junit4]   2> 1969269 INFO  (TEST-TestSolrConfigHandlerCloud.test-seed#[496B9CBCB5E36BC8]) [n:127.0.0.1:46539_    ] o.a.s.c.c.SolrZkClient makePath: /live_nodes/127.0.0.1:46539_
   [junit4]   2> 1969270 INFO  (TEST-TestSolrConfigHandlerCloud.test-seed#[496B9CBCB5E36BC8]) [n:127.0.0.1:46539_    ] o.a.s.c.c.SolrZkClient makePath: /overseer_elect
   [junit4]   2> 1969271 INFO  (TEST-TestSolrConfigHandlerCloud.test-seed#[496B9CBCB5E36BC8]) [n:127.0.0.1:46539_    ] o.a.s.c.c.SolrZkClient makePath: /overseer_elect/election
   [junit4]   2> 1969273 INFO  (TEST-TestSolrConfigHandlerCloud.test-seed#[496B9CBCB5E36BC8]) [n:127.0.0.1:46539_    ] o.a.s.c.Overseer Overseer (id=null) closing
   [junit4]   2> 1969273 INFO  (TEST-TestSolrConfigHandlerCloud.test-seed#[496B9CBCB5E36BC8]) [n:127.0.0.1:46539_    ] o.a.s.c.LeaderElector Joined leadership election with path: /overseer_elect/election/96555521948450820-127.0.0.1:46539_-n_0000000000
   [junit4]   2> 1969274 INFO  (TEST-TestSolrConfigHandlerCloud.test-seed#[496B9CBCB5E36BC8]) [n:127.0.0.1:46539_    ] o.a.s.c.OverseerElectionContext I am going to be the leader 127.0.0.1:46539_
   [junit4]   2> 1969274 INFO  (TEST-TestSolrConfigHandlerCloud.test-seed#[496B9CBCB5E36BC8]) [n:127.0.0.1:46539_    ] o.a.s.c.c.SolrZkClient makePath: /overseer_elect/leader
   [junit4]   2> 1969275 INFO  (TEST-TestSolrConfigHandlerCloud.test-seed#[496B9CBCB5E36BC8]) [n:127.0.0.1:46539_    ] o.a.s.c.Overseer Overseer (id=96555521948450820-127.0.0.1:46539_-n_0000000000) starting
   [junit4]   2> 1969276 INFO  (TEST-TestSolrConfigHandlerCloud.test-seed#[496B9CBCB5E36BC8]) [n:127.0.0.1:46539_    ] o.a.s.c.c.SolrZkClient makePath: /overseer/queue-work
   [junit4]   2> 1969278 INFO  (TEST-TestSolrConfigHandlerCloud.test-seed#[496B9CBCB5E36BC8]) [n:127.0.0.1:46539_    ] o.a.s.c.OverseerAutoReplicaFailoverThread Starting OverseerAutoReplicaFailoverThread autoReplicaFailoverWorkLoopDelay=10000 autoReplicaFailoverWaitAfterExpiration=30000 autoReplicaFailoverBadNodeExpiration=60000
   [junit4]   2> 1969279 INFO  (OverseerCollectionConfigSetProcessor-96555521948450820-127.0.0.1:46539_-n_0000000000) [n:127.0.0.1:46539_    ] o.a.s.c.OverseerTaskProcessor Process current queue of overseer operations
   [junit4]   2> 1969279 INFO  (TEST-TestSolrConfigHandlerCloud.test-seed#[496B9CBCB5E36BC8]) [n:127.0.0.1:46539_    ] o.a.s.c.c.ZkStateReader Updating cluster state from ZooKeeper... 
   [junit4]   2> 1969279 INFO  (OverseerStateUpdate-96555521948450820-127.0.0.1:46539_-n_0000000000) [n:127.0.0.1:46539_    ] o.a.s.c.Overseer Starting to work on the main queue
   [junit4]   2> 1969313 INFO  (TEST-TestSolrConfigHandlerCloud.test-seed#[496B9CBCB5E36BC8]) [n:127.0.0.1:46539_    ] o.a.s.c.CoreContainer Security conf doesn't exist. Skipping setup for authorization module.
   [junit4]   2> 1969313 INFO  (TEST-TestSolrConfigHandlerCloud.test-seed#[496B9CBCB5E36BC8]) [n:127.0.0.1:46539_    ] o.a.s.c.CoreContainer No authentication plugin used.
   [junit4]   2> 1969314 INFO  (TEST-TestSolrConfigHandlerCloud.test-seed#[496B9CBCB5E36BC8]) [n:127.0.0.1:46539_    ] o.a.s.c.CorePropertiesLocator Looking for core definitions underneath /home/jenkins/workspace/Lucene-Solr-5.5-Linux/solr/build/solr-core/test/J2/../../../../../../../../../home/jenkins/workspace/Lucene-Solr-5.5-Linux/solr/build/solr-core/test/J2/temp/solr.handler.TestSolrConfigHandlerCloud_496B9CBCB5E36BC8-001/control-001/cores
   [junit4]   2> 1969314 INFO  (TEST-TestSolrConfigHandlerCloud.test-seed#[496B9CBCB5E36BC8]) [n:127.0.0.1:46539_    ] o.a.s.c.CoreDescriptor Created CoreDescriptor: {loadOnStartup=true, transient=false, dataDir=data/, schema=schema.xml, name=collection1, coreNodeName=, collection=control_collection, configSetProperties=configsetprops.json, shard=, config=solrconfig.xml}
   [junit4]   2> 1969314 INFO  (TEST-TestSolrConfigHandlerCloud.test-seed#[496B9CBCB5E36BC8]) [n:127.0.0.1:46539_    ] o.a.s.c.CorePropertiesLocator Found core collection1 in /home/jenkins/workspace/Lucene-Solr-5.5-Linux/solr/build/solr-core/test/J2/../../../../../../../../../home/jenkins/workspace/Lucene-Solr-5.5-Linux/solr/build/solr-core/test/J2/temp/solr.handler.TestSolrConfigHandlerCloud_496B9CBCB5E36BC8-001/control-001/cores/collection1
   [junit4]   2> 1969314 INFO  (TEST-TestSolrConfigHandlerCloud.test-seed#[496B9CBCB5E36BC8]) [n:127.0.0.1:46539_    ] o.a.s.c.CorePropertiesLocator Found 1 core definitions
   [junit4]   2> 1969315 INFO  (TEST-TestSolrConfigHandlerCloud.test-seed#[496B9CBCB5E36BC8]) [n:127.0.0.1:46539_    ] o.a.s.s.SolrDispatchFilter user.dir=/home/jenkins/workspace/Lucene-Solr-5.5-Linux/solr/build/solr-core/test/J2
   [junit4]   2> 1969315 INFO  (TEST-TestSolrConfigHandlerCloud.test-seed#[496B9CBCB5E36BC8]) [n:127.0.0.1:46539_    ] o.a.s.s.SolrDispatchFilter SolrDispatchFilter.init() done
   [junit4]   2> 1969315 INFO  (coreLoadExecutor-5394-thread-1-processing-n:127.0.0.1:46539_) [n:127.0.0.1:46539_ c:control_collection   x:collection1] o.a.s.c.ZkController publishing state=down
   [junit4]   2> 1969315 INFO  (coreLoadExecutor-5394-thread-1-processing-n:127.0.0.1:46539_) [n:127.0.0.1:46539_ c:control_collection   x:collection1] o.a.s.c.ZkController numShards not found on descriptor - reading it from system property
   [junit4]   2> 1969316 INFO  (coreLoadExecutor-5394-thread-1-processing-n:127.0.0.1:46539_) [n:127.0.0.1:46539_ c:control_collection   x:collection1] o.a.s.c.ZkController Collection control_collection not visible yet, but flagging it so a watch is registered when it becomes visible
   [junit4]   2> 1969316 INFO  (coreLoadExecutor-5394-thread-1-processing-n:127.0.0.1:46539_) [n:127.0.0.1:46539_ c:control_collection   x:collection1] o.a.s.c.c.ZkStateReader addZkWatch [control_collection]
   [junit4]   2> 1969316 INFO  (OverseerStateUpdate-96555521948450820-127.0.0.1:46539_-n_0000000000) [n:127.0.0.1:46539_    ] o.a.s.c.Overseer processMessage: queueSize: 1, message = {
   [junit4]   2>   "state":"down",
   [junit4]   2>   "numShards":"1",
   [junit4]   2>   "collection":"control_collection",
   [junit4]   2>   "core":"collection1",
   [junit4]   2>   "base_url":"http://127.0.0.1:46539",
   [junit4]   2>   "node_name":"127.0.0.1:46539_",
   [junit4]   2>   "roles":null,
   [junit4]   2>   "operation":"state",
   [junit4]   2>   "shard":null} current state version: 0
   [junit4]   2> 1969316 INFO  (coreLoadExecutor-5394-thread-1-processing-n:127.0.0.1:46539_) [n:127.0.0.1:46539_ c:control_collection   x:collection1] o.a.s.c.c.ZkStateReader Deleting data for [control_collection]
   [junit4]   2> 1969316 INFO  (OverseerStateUpdate-96555521948450820-127.0.0.1:46539_-n_0000000000) [n:127.0.0.1:46539_    ] o.a.s.c.o.ReplicaMutator Update state numShards=1 message={
   [junit4]   2>   "state":"down",
   [junit4]   2>   "numShards":"1",
   [junit4]   2>   "collection":"control_collection",
   [junit4]   2>   "core":"collection1",
   [junit4]   2>   "base_url":"http://127.0.0.1:46539",
   [junit4]   2>   "node_name":"127.0.0.1:46539_",
   [junit4]   2>   "roles":null,
   [junit4]   2>   "operation":"state",
   [junit4]   2>   "shard":null}
   [junit4]   2> 1969317 INFO  (OverseerStateUpdate-96555521948450820-127.0.0.1:46539_-n_0000000000) [n:127.0.0.1:46539_    ] o.a.s.c.o.ClusterStateMutator building a new cName: control_collection
   [junit4]   2> 1969317 INFO  (OverseerStateUpdate-96555521948450820-127.0.0.1:46539_-n_0000000000) [n:127.0.0.1:46539_    ] o.a.s.c.o.ReplicaMutator Assigning new node to shard shard=shard1
   [junit4]   2> 1969317 INFO  (coreLoadExecutor-5394-thread-1-processing-n:127.0.0.1:46539_) [n:127.0.0.1:46539_ c:control_collection   x:collection1] o.a.s.c.ZkController look for our core node name
   [junit4]   2> 1969318 INFO  (zkCallback-1872-thread-1-processing-n:127.0.0.1:46539_) [n:127.0.0.1:46539_    ] o.a.s.c.c.ZkStateReader A cluster state change: [WatchedEvent state:SyncConnected type:NodeDataChanged path:/clusterstate.json], has occurred - updating... (live nodes size: [1])
   [junit4]   2> 1970318 INFO  (coreLoadExecutor-5394-thread-1-processing-n:127.0.0.1:46539_) [n:127.0.0.1:46539_ c:control_collection   x:collection1] o.a.s.c.ZkController waiting to find shard id in clusterstate for collection1
   [junit4]   2> 1970318 INFO  (coreLoadExecutor-5394-thread-1-processing-n:127.0.0.1:46539_) [n:127.0.0.1:46539_ c:control_collection   x:collection1] o.a.s.c.ZkController Check for collection zkNode:control_collection
   [junit4]   2> 1970318 INFO  (coreLoadExecutor-5394-thread-1-processing-n:127.0.0.1:46539_) [n:127.0.0.1:46539_ c:control_collection   x:collection1] o.a.s.c.ZkController Collection zkNode exists
   [junit4]   2> 1970318 INFO  (coreLoadExecutor-5394-thread-1-processing-n:127.0.0.1:46539_) [n:127.0.0.1:46539_ c:control_collection   x:collection1] o.a.s.c.c.ZkStateReader Load collection config from: [/collections/control_collection]
   [junit4]   2> 1970318 INFO  (coreLoadExecutor-5394-thread-1-processing-n:127.0.0.1:46539_) [n:127.0.0.1:46539_ c:control_collection   x:collection1] o.a.s.c.c.ZkStateReader path=[/collections/control_collection] [configName]=[conf1] specified config exists in ZooKeeper
   [junit4]   2> 1970318 INFO  (coreLoadExecutor-5394-thread-1-processing-n:127.0.0.1:46539_) [n:127.0.0.1:46539_ c:control_collection   x:collection1] o.a.s.c.SolrResourceLoader new SolrResourceLoader for directory: '/home/jenkins/workspace/Lucene-Solr-5.5-Linux/solr/build/solr-core/test/J2/temp/solr.handler.TestSolrConfigHandlerCloud_496B9CBCB5E36BC8-001/control-001/cores/collection1'
   [junit4]   2> 1970319 INFO  (coreLoadExecutor-5394-thread-1-processing-n:127.0.0.1:46539_) [n:127.0.0.1:46539_ c:control_collection   x:collection1] o.a.s.c.SolrResourceLoader JNDI not configured for solr (NoInitialContextEx)
   [junit4]   2> 1970319 INFO  (coreLoadExecutor-5394-thread-1-processing-n:127.0.0.1:46539_) [n:127.0.0.1:46539_ c:control_collection   x:collection1] o.a.s.c.SolrResourceLoader solr home defaulted to 'solr/' (could not find system property or JNDI)
   [junit4]   2> 1970320 INFO  (coreLoadExecutor-5394-thread-1-processing-n:127.0.0.1:46539_) [n:127.0.0.1:46539_ c:control_collection   x:collection1] o.a.s.c.Config loaded config solrconfig.xml with version 0 
   [junit4]   2> 1970325 INFO  (coreLoadExecutor-5394-thread-1-processing-n:127.0.0.1:46539_) [n:127.0.0.1:46539_ c:control_collection   x:collection1] o.a.s.c.SolrConfig current version of requestparams : -1
   [junit4]   2> 1970341 INFO  (coreLoadExecutor-5394-thread-1-processing-n:127.0.0.1:46539_) [n:127.0.0.1:46539_ c:control_collection   x:collection1] o.a.s.c.SolrConfig Using Lucene MatchVersion: 5.5.3
   [junit4]   2> 1970370 INFO  (coreLoadExecutor-5394-thread-1-processing-n:127.0.0.1:46539_) [n:127.0.0.1:46539_ c:control_collection   x:collection1] o.a.s.c.SolrConfig Loaded SolrConfig: solrconfig.xml
   [junit4]   2> 1970379 INFO  (coreLoadExecutor-5394-thread-1-processing-n:127.0.0.1:46539_) [n:127.0.0.1:46539_ c:control_collection   x:collection1] o.a.s.s.IndexSchema [collection1] Schema name=test
   [junit4]   2> 1970603 INFO  (coreLoadExecutor-5394-thread-1-processing-n:127.0.0.1:46539_) [n:127.0.0.1:46539_ c:control_collection   x:collection1] o.a.s.s.OpenExchangeRatesOrgProvider Initialized with rates=open-exchange-rates.json, refreshInterval=1440.
   [junit4]   2> 1970609 INFO  (coreLoadExecutor-5394-thread-1-processing-n:127.0.0.1:46539_) [n:127.0.0.1:46539_ c:control_collection   x:collection1] o.a.s.s.IndexSchema default search field in schema is text
   [junit4]   2> 1970611 INFO  (coreLoadExecutor-5394-thread-1-processing-n:127.0.0.1:46539_) [n:127.0.0.1:46539_ c:control_collection   x:collection1] o.a.s.s.IndexSchema unique key field: id
   [junit4]   2> 1970616 INFO  (coreLoadExecutor-5394-thread-1-processing-n:127.0.0.1:46539_) [n:127.0.0.1:46539_ c:control_collection   x:collection1] o.a.s.s.FileExchangeRateProvider Reloading exchange rates from file currency.xml
   [junit4]   2> 1970618 INFO  (coreLoadExecutor-5394-thread-1-processing-n:127.0.0.1:46539_) [n:127.0.0.1:46539_ c:control_collection   x:collection1] o.a.s.s.FileExchangeRateProvider Reloading exchange rates from file currency.xml
   [junit4]   2> 1970620 INFO  (coreLoadExecutor-5394-thread-1-processing-n:127.0.0.1:46539_) [n:127.0.0.1:46539_ c:control_collection   x:collection1] o.a.s.s.OpenExchangeRatesOrgProvider Reloading exchange rates from open-exchange-rates.json
   [junit4]   2> 1970620 INFO  (coreLoadExecutor-5394-thread-1-processing-n:127.0.0.1:46539_) [n:127.0.0.1:46539_ c:control_collection   x:collection1] o.a.s.s.OpenExchangeRatesOrgProvider Reloading exchange rates from open-exchange-rates.json
   [junit4]   2> 1970621 INFO  (coreLoadExecutor-5394-thread-1-processing-n:127.0.0.1:46539_) [n:127.0.0.1:46539_ c:control_collection   x:collection1] o.a.s.c.ConfigSetProperties Did not find ConfigSet properties, assuming default properties: Can't find resource 'configsetprops.json' in classpath or '/configs/conf1', cwd=/home/jenkins/workspace/Lucene-Solr-5.5-Linux/solr/build/solr-core/test/J2
   [junit4]   2> 1970621 INFO  (coreLoadExecutor-5394-thread-1-processing-n:127.0.0.1:46539_) [n:127.0.0.1:46539_ c:control_collection   x:collection1] o.a.s.c.CoreContainer Creating SolrCore 'collection1' using configuration from collection control_collection
   [junit4]   2> 1970621 INFO  (coreLoadExecutor-5394-thread-1-processing-n:127.0.0.1:46539_) [n:127.0.0.1:46539_ c:control_collection s:shard1 r:core_node1 x:collection1] o.a.s.c.SolrCore org.apache.solr.core.MockDirectoryFactory
   [junit4]   2> 1970622 INFO  (coreLoadExecutor-5394-thread-1-processing-n:127.0.0.1:46539_) [n:127.0.0.1:46539_ c:control_collection s:shard1 r:core_node1 x:collection1] o.a.s.c.SolrCore [[collection1] ] Opening new SolrCore at [/home/jenkins/workspace/Lucene-Solr-5.5-Linux/solr/build/solr-core/test/J2/temp/solr.handler.TestSolrConfigHandlerCloud_496B9CBCB5E36BC8-001/control-001/cores/collection1], dataDir=[/home/jenkins/workspace/Lucene-Solr-5.5-Linux/solr/build/solr-core/test/J2/../../../../../../../../../home/jenkins/workspace/Lucene-Solr-5.5-Linux/solr/build/solr-core/test/J2/temp/solr.handler.TestSolrConfigHandlerCloud_496B9CBCB5E36BC8-001/control-001/cores/collection1/data/]
   [junit4]   2> 1970622 INFO  (coreLoadExecutor-5394-thread-1-processing-n:127.0.0.1:46539_) [n:127.0.0.1:46539_ c:control_collection s:shard1 r:core_node1 x:collection1] o.a.s.c.JmxMonitoredMap JMX monitoring is enabled. Adding Solr mbeans to JMX Server: com.sun.jmx.mbeanserver.JmxMBeanServer@3b50ff
   [junit4]   2> 1970622 INFO  (coreLoadExecutor-5394-thread-1-processing-n:127.0.0.1:46539_) [n:127.0.0.1:46539_ c:control_collection s:shard1 r:core_node1 x:collection1] o.a.s.c.CachingDirectoryFactory return new directory for /home/jenkins/workspace/Lucene-Solr-5.5-Linux/solr/build/solr-core/test/J2/../../../../../../../../../home/jenkins/workspace/Lucene-Solr-5.5-Linux/solr/build/solr-core/test/J2/temp/solr.handler.TestSolrConfigHandlerCloud_496B9CBCB5E36BC8-001/control-001/cores/collection1/data
   [junit4]   2> 1970622 INFO  (coreLoadExecutor-5394-thread-1-processing-n:127.0.0.1:46539_) [n:127.0.0.1:46539_ c:control_collection s:shard1 r:core_node1 x:collection1] o.a.s.c.SolrCore New index directory detected: old=null new=/home/jenkins/workspace/Lucene-Solr-5.5-Linux/solr/build/solr-core/test/J2/../../../../../../../../../home/jenkins/workspace/Lucene-Solr-5.5-Linux/solr/build/solr-core/test/J2/temp/solr.handler.TestSolrConfigHandlerCloud_496B9CBCB5E36BC8-001/control-001/cores/collection1/data/index/
   [junit4]   2> 1970622 WARN  (coreLoadExecutor-5394-thread-1-processing-n:127.0.0.1:46539_) [n:127.0.0.1:46539_ c:control_collection s:shard1 r:core_node1 x:collection1] o.a.s.c.SolrCore [collection1] Solr index directory '/home/jenkins/workspace/Lucene-Solr-5.5-Linux/solr/build/solr-core/test/J2/../../../../../../../../../home/jenkins/workspace/Lucene-Solr-5.5-Linux/solr/build/solr-core/test/J2/temp/solr.handler.TestSolrConfigHandlerCloud_496B9CBCB5E36BC8-001/control-001/cores/collection1/data/index' doesn't exist. Creating new index...
   [junit4]   2> 1970623 INFO  (coreLoadExecutor-5394-thread-1-processing-n:127.0.0.1:46539_) [n:127.0.0.1:46539_ c:control_collection s:shard1 r:core_node1 x:collection1] o.a.s.c.CachingDirectoryFactory return new directory for /home/jenkins/workspace/Lucene-Solr-5.5-Linux/solr/build/solr-core/test/J2/../../../../../../../../../home/jenkins/workspace/Lucene-Solr-5.5-Linux/solr/build/solr-core/test/J2/temp/solr.handler.TestSolrConfigHandlerCloud_496B9CBCB5E36BC8-001/control-001/cores/collection1/data/index
   [junit4]   2> 1970623 INFO  (coreLoadExecutor-5394-thread-1-processing-n:127.0.0.1:46539_) [n:127.0.0.1:46539_ c:control_collection s:shard1 r:core_node1 x:collection1] o.a.s.u.RandomMergePolicy RandomMergePolicy wrapping class org.apache.lucene.index.LogByteSizeMergePolicy: [LogByteSizeMergePolicy: minMergeSize=1677721, mergeFactor=30, maxMergeSize=2147483648, maxMergeSizeForForcedMerge=9223372036854775807, calibrateSizeByDeletes=true, maxMergeDocs=2147483647, maxCFSSegmentSizeMB=8.796093022207999E12, noCFSRatio=0.10088902104645872]
   [junit4]   2> 1970623 INFO  (coreLoadExecutor-5394-thread-1-processing-n:127.0.0.1:46539_) [n:127.0.0.1:46539_ c:control_collection s:shard1 r:core_node1 x:collection1] o.a.s.c.SolrDeletionPolicy SolrDeletionPolicy.onCommit: commits: num=1
   [junit4]   2> 	commit{dir=MockDirectoryWrapper(RAMDirectory@1edbd14 lockFactory=org.apache.lucene.store.SingleInstanceLockFactory@1188ee3),segFN=segments_1,generation=1}
   [junit4]   2> 1970623 INFO  (coreLoadExecutor-5394-thread-1-processing-n:127.0.0.1:46539_) [n:127.0.0.1:46539_ c:control_collection s:shard1 r:core_node1 x:collection1] o.a.s.c.SolrDeletionPolicy newest commit generation = 1
   [junit4]   2> 1970623 INFO  (OldIndexDirectoryCleanupThreadForCore-collection1) [n:127.0.0.1:46539_ c:control_collection s:shard1 r:core_node1 x:collection1] o.a.s.c.SolrCore Looking for old index directories to cleanup for core collection1 in /home/jenkins/workspace/Lucene-Solr-5.5-Linux/solr/build/solr-core/test/J2/../../../../../../../../../home/jenkins/workspace/Lucene-Solr-5.5-Linux/solr/build/solr-core/test/J2/temp/solr.handler.TestSolrConfigHandlerCloud_496B9CBCB5E36BC8-001/control-001/cores/collection1/data/
   [junit4]   2> 1970624 WARN  (OldIndexDirectoryCleanupThreadForCore-collection1) [n:127.0.0.1:46539_ c:control_collection s:shard1 r:core_node1 x:collection1] o.a.s.c.DirectoryFactory /home/jenkins/workspace/Lucene-Solr-5.5-Linux/solr/build/solr-core/test/J2/../../../../../../../../../home/jenkins/workspace/Lucene-Solr-5.5-Linux/solr/build/solr-core/test/J2/temp/solr.handler.TestSolrConfigHandlerCloud_496B9CBCB5E36BC8-001/control-001/cores/collection1/data/ does not point to a valid data directory; skipping clean-up of old index directories.
   [junit4]   2> 1970626 INFO  (coreLoadExecutor-5394-thread-1-processing-n:127.0.0.1:46539_) [n:127.0.0.1:46539_ c:control_collection s:shard1 r:core_node1 x:collection1] o.a.s.u.p.UpdateRequestProcessorChain creating updateRequestProcessorChain "nodistrib"
   [junit4]   2> 1970626 INFO  (coreLoadExecutor-5394-thread-1-processing-n:127.0.0.1:46539_) [n:127.0.0.1:46539_ c:control_collection s:shard1 r:core_node1 x:collection1] o.a.s.u.p.UpdateRequestProcessorChain creating updateRequestProcessorChain "dedupe"
   [junit4]   2> 1970626 INFO  (coreLoadExecutor-5394-thread-1-processing-n:127.0.0.1:46539_) [n:127.0.0.1:46539_ c:control_collection s:shard1 r:core_node1 x:collection1] o.a.s.u.p.UpdateRequestProcessorChain inserting DistributedUpdateProcessorFactory into updateRequestProcessorChain "dedupe"
   [junit4]   2> 1970626 INFO  (coreLoadExecutor-5394-thread-1-processing-n:127.0.0.1:46539_) [n:127.0.0.1:46539_ c:control_collection s:shard1 r:core_node1 x:collection1] o.a.s.u.p.UpdateRequestProcessorChain creating updateRequestProcessorChain "stored_sig"
   [junit4]   2> 1970626 INFO  (coreLoadExecutor-5394-thread-1-processing-n:127.0.0.1:46539_) [n:127.0.0.1:46539_ c:control_collection s:shard1 r:core_node1 x:collection1] o.a.s.u.p.UpdateRequestProcessorChain inserting DistributedUpdateProcessorFactory into updateRequestProcessorChain "stored_sig"
   [junit4]   2> 1970626 INFO  (coreLoadExecutor-5394-thread-1-processing-n:127.0.0.1:46539_) [n:127.0.0.1:46539_ c:control_collection s:shard1 r:core_node1 x:collection1] o.a.s.u.p.UpdateRequestProcessorChain creating updateRequestProcessorChain "distrib-dup-test-chain-explicit"
   [junit4]   2> 1970626 INFO  (coreLoadExecutor-5394-thread-1-processing-n:127.0.0.1:46539_) [n:127.0.0.1:46539_ c:control_collection s:shard1 r:core_node1 x:collection1] o.a.s.u.p.UpdateRequestProcessorChain creating updateRequestProcessorChain "distrib-dup-test-chain-implicit"
   [junit4]   2> 1970627 INFO  (coreLoadExecutor-5394-thread-1-processing-n:127.0.0.1:46539_) [n:127.0.0.1:46539_ c:control_collection s:shard1 r:core_node1 x:collection1] o.a.s.u.p.UpdateRequestProcessorChain inserting DistributedUpdateProcessorFactory into updateRequestProcessorChain "distrib-dup-test-chain-implicit"
   [junit4]   2> 1970627 INFO  (coreLoadExecutor-5394-thread-1-processing-n:127.0.0.1:46539_) [n:127.0.0.1:46539_ c:control_collection s:shard1 r:core_node1 x:collection1] o.a.s.c.SolrCore no updateRequestProcessorChain defined as default, creating implicit default
   [junit4]   2> 1970627 WARN  (coreLoadExecutor-5394-thread-1-processing-n:127.0.0.1:46539_) [n:127.0.0.1:46539_ c:control_collection s:shard1 r:core_node1 x:collection1] o.a.s.c.RequestHandlers INVALID paramSet a in requestHandler {type = requestHandler,name = /dump,class = DumpRequestHandler,args = {defaults={a=A,b=B}}}
   [junit4]   2> 1970629 INFO  (coreLoadExecutor-5394-thread-1-processing-n:127.0.0.1:46539_) [n:127.0.0.1:46539_ c:control_collection s:shard1 r:core_node1 x:collection1] o.a.s.h.l.XMLLoader xsltCacheLifetimeSeconds=60
   [junit4]   2> 1970630 INFO  (coreLoadExecutor-5394-thread-1-processing-n:127.0.0.1:46539_) [n:127.0.0.1:46539_ c:control_collection s:shard1 r:core_node1 x:collection1] o.a.s.h.l.XMLLoader xsltCacheLifetimeSeconds=60
   [junit4]   2> 1970631 INFO  (coreLoadExecutor-5394-thread-1-processing-n:127.0.0.1:46539_) [n:127.0.0.1:46539_ c:control_collection s:shard1 r:core_node1 x:collection1] o.a.s.h.l.XMLLoader xsltCacheLifetimeSeconds=60
   [junit4]   2> 1970632 INFO  (coreLoadExecutor-5394-thread-1-processing-n:127.0.0.1:46539_) [n:127.0.0.1:46539_ c:control_collection s:shard1 r:core_node1 x:collection1] o.a.s.h.l.XMLLoader xsltCacheLifetimeSeconds=60
   [junit4]   2> 1970635 INFO  (coreLoadExecutor-5394-thread-1-processing-n:127.0.0.1:46539_) [n:127.0.0.1:46539_ c:control_collection s:shard1 r:core_node1 x:collection1] o.a.s.c.RequestHandlers Registered paths: /dump,/admin/file,/config,/update/csv,/admin/ping,/update/json/docs,/replication,/admin/properties,/admin/threads,/update/json,/admin/luke,standard,/update,/admin/plugins,/get,/schema,/admin/segments,/admin/mbeans,/admin/system,/admin/logging
   [junit4]   2> 1970636 INFO  (coreLoadExecutor-5394-thread-1-processing-n:127.0.0.1:46539_) [n:127.0.0.1:46539_ c:control_collection s:shard1 r:core_node1 x:collection1] o.a.s.c.SolrCore Using default statsCache cache: org.apache.solr.search.stats.LocalStatsCache
   [junit4]   2> 1970636 INFO  (coreLoadExecutor-5394-thread-1-processing-n:127.0.0.1:46539_) [n:127.0.0.1:46539_ c:control_collection s:shard1 r:core_node1 x:collection1] o.a.s.u.UpdateHandler Using UpdateLog implementation: org.apache.solr.update.UpdateLog
   [junit4]   2> 1970636 INFO  (coreLoadExecutor-5394-thread-1-processing-n:127.0.0.1:46539_) [n:127.0.0.1:46539_ c:control_collection s:shard1 r:core_node1 x:collection1] o.a.s.u.UpdateLog Initializing UpdateLog: dataDir= defaultSyncLevel=FLUSH numRecordsToKeep=100 maxNumLogsToKeep=10 numVersionBuckets=65536
   [junit4]   2> 1970637 INFO  (coreLoadExecutor-5394-thread-1-processing-n:127.0.0.1:46539_) [n:127.0.0.1:46539_ c:control_collection s:shard1 r:core_node1 x:collection1] o.a.s.u.CommitTracker Hard AutoCommit: disabled
   [junit4]   2> 1970637 INFO  (coreLoadExecutor-5394-thread-1-processing-n:127.0.0.1:46539_) [n:127.0.0.1:46539_ c:control_collection s:shard1 r:core_node1 x:collection1] o.a.s.u.CommitTracker Soft AutoCommit: disabled
   [junit4]   2> 1970637 INFO  (coreLoadExecutor-5394-thread-1-processing-n:127.0.0.1:46539_) [n:127.0.0.1:46539_ c:control_collection s:shard1 r:core_node1 x:collection1] o.a.s.u.RandomMergePolicy RandomMergePolicy wrapping class org.apache.lucene.index.LogDocMergePolicy: [LogDocMergePolicy: minMergeSize=1000, mergeFactor=34, maxMergeSize=9223372036854775807, maxMergeSizeForForcedMerge=9223372036854775807, calibrateSizeByDeletes=true, maxMergeDocs=2147483647, maxCFSSegmentSizeMB=8.796093022207999E12, noCFSRatio=0.8829588521309263]
   [junit4]   2> 1970638 INFO  (coreLoadExecutor-5394-thread-1-processing-n:127.0.0.1:46539_) [n:127.0.0.1:46539_ c:control_collection s:shard1 r:core_node1 x:collection1] o.a.s.c.SolrDeletionPolicy SolrDeletionPolicy.onInit: commits: num=1
   [junit4]   2> 	commit{dir=MockDirectoryWrapper(RAMDirectory@1edbd14 lockFactory=org.apache.lucene.store.SingleInstanceLockFactory@1188ee3),segFN=segments_1,generation=1}
   [junit4]   2> 1970638 INFO  (coreLoadExecutor-5394-thread-1-processing-n:127.0.0.1:46539_) [n:127.0.0.1:46539_ c:control_collection s:shard1 r:core_node1 x:collection1] o.a.s.c.SolrDeletionPolicy newest commit generation = 1
   [junit4]   2> 1970638 INFO  (coreLoadExecutor-5394-thread-1-processing-n:127.0.0.1:46539_) [n:127.0.0.1:46539_ c:control_collection s:shard1 r:core_node1 x:collection1] o.a.s.s.SolrIndexSearcher Opening Searcher@52b699[collection1] main
   [junit4]   2> 1970638 INFO  (coreLoadExecutor-5394-thread-1-processing-n:127.0.0.1:46539_) [n:127.0.0.1:46539_ c:control_collection s:shard1 r:core_node1 x:collection1] o.a.s.c.c.ZkStateReader Load collection config from: [/collections/control_collection]
   [junit4]   2> 1970638 INFO  (coreLoadExecutor-5394-thread-1-processing-n:127.0.0.1:46539_) [n:127.0.0.1:46539_ c:control_collection s:shard1 r:core_node1 x:collection1] o.a.s.c.c.ZkStateReader path=[/collections/control_collection] [configName]=[conf1] specified config exists in ZooKeeper
   [junit4]   2> 1970638 INFO  (coreLoadExecutor-5394-thread-1-processing-n:127.0.0.1:46539_) [n:127.0.0.1:46539_ c:control_collection s:shard1 r:core_node1 x:collection1] o.a.s.r.ManagedResourceStorage Setting up ZooKeeper-based storage for the RestManager with znodeBase: /configs/conf1
   [junit4]   2> 1970639 INFO  (coreLoadExecutor-5394-thread-1-processing-n:127.0.0.1:46539_) [n:127.0.0.1:46539_ c:control_collection s:shard1 r:core_node1 x:collection1] o.a.s.r.ManagedResourceStorage Configured ZooKeeperStorageIO with znodeBase: /configs/conf1
   [junit4]   2> 1970639 INFO  (coreLoadExecutor-5394-thread-1-processing-n:127.0.0.1:46539_) [n:127.0.0.1:46539_ c:control_collection s:shard1 r:core_node1 x:collection1] o.a.s.r.RestManager Initializing RestManager with initArgs: {}
   [junit4]   2> 1970639 INFO  (coreLoadExecutor-5394-thread-1-processing-n:127.0.0.1:46539_) [n:127.0.0.1:46539_ c:control_collection s:shard1 r:core_node1 x:collection1] o.a.s.r.ManagedResourceStorage Reading _rest_managed.json using ZooKeeperStorageIO:path=/configs/conf1
   [junit4]   2> 1970640 INFO  (coreLoadExecutor-5394-thread-1-processing-n:127.0.0.1:46539_) [n:127.0.0.1:46539_ c:control_collection s:shard1 r:core_node1 x:collection1] o.a.s.r.ManagedResourceStorage No data found for znode /configs/conf1/_rest_managed.json
   [junit4]   2> 1970640 INFO  (coreLoadExecutor-5394-thread-1-processing-n:127.0.0.1:46539_) [n:127.0.0.1:46539_ c:control_collection s:shard1 r:core_node1 x:collection1] o.a.s.r.ManagedResourceStorage Loaded null at path _rest_managed.json using ZooKeeperStorageIO:path=/configs/conf1
   [junit4]   2> 1970640 INFO  (coreLoadExecutor-5394-thread-1-processing-n:127.0.0.1:46539_) [n:127.0.0.1:46539_ c:control_collection s:shard1 r:core_node1 x:collection1] o.a.s.r.RestManager Initializing 0 registered ManagedResources
   [junit4]   2> 1970640 INFO  (coreLoadExecutor-5394-thread-1-processing-n:127.0.0.1:46539_) [n:127.0.0.1:46539_ c:control_collection s:shard1 r:core_node1 x:collection1] o.a.s.h.ReplicationHandler Commits will be reserved for  10000
   [junit4]   2> 1970641 INFO  (searcherExecutor-5395-thread-1-processing-c:control_collection x:collection1 n:127.0.0.1:46539_ s:shard1 r:core_node1) [n:127.0.0.1:46539_ c:control_collection s:shard1 r:core_node1 x:collection1] o.a.s.c.SolrCore [collection1] Registered new searcher Searcher@52b699[collection1] main{ExitableDirectoryReader(UninvertingDirectoryReader())}
   [junit4]   2> 1970641 INFO  (coreLoadExecutor-5394-thread-1-processing-n:127.0.0.1:46539_) [n:127.0.0.1:46539_ c:control_collection s:shard1 r:core_node1 x:collection1] o.a.s.u.UpdateLog Looking up max value of version field to seed version buckets
   [junit4]   2> 1970641 INFO  (coreLoadExecutor-5394-thread-1-processing-n:127.0.0.1:46539_) [n:127.0.0.1:46539_ c:control_collection s:shard1 r:core_node1 x:collection1] o.a.s.u.VersionInfo Refreshing highest value of _version_ for 65536 version buckets from index
   [junit4]   2> 1970641 INFO  (coreLoadExecutor-5394-thread-1-processing-n:127.0.0.1:46539_) [n:127.0.0.1:46539_ c:control_collection s:shard1 r:core_node1 x:collection1] o.a.s.u.VersionInfo No terms found for _version_, cannot seed version bucket highest value from index
   [junit4]   2> 1970641 INFO  (coreLoadExecutor-5394-thread-1-processing-n:127.0.0.1:46539_) [n:127.0.0.1:46539_ c:control_collection s:shard1 r:core_node1 x:collection1] o.a.s.u.UpdateLog Could not find max version in index or recent updates, using new clock 1544888352839303168
   [junit4]   2> 1970642 INFO  (coreLoadExecutor-5394-thread-1-processing-n:127.0.0.1:46539_) [n:127.0.0.1:46539_ c:control_collection s:shard1 r:core_node1 x:collection1] o.a.s.u.UpdateLog Took 1.0ms to seed version buckets with highest version 1544888352839303168
   [junit4]   2> 1970642 INFO  (coreLoadExecutor-5394-thread-1-processing-n:127.0.0.1:46539_) [n:127.0.0.1:46539_ c:control_collection s:shard1 r:core_node1 x:collection1] o.a.s.c.ZkController watch zkdir /configs/conf1
   [junit4]   2> 1970643 INFO  (coreLoadExecutor-5394-thread-1-processing-n:127.0.0.1:46539_) [n:127.0.0.1:46539_ c:control_collection s:shard1 r:core_node1 x:collection1] o.a.s.c.CoreContainer registering core: collection1
   [junit4]   2> 1970643 INFO  (coreZkRegister-5388-thread-1-processing-c:control_collection x:collection1 n:127.0.0.1:46539_ s:shard1 r:core_node1) [n:127.0.0.1:46539_ c:control_collection s:shard1 r:core_node1 x:collection1] o.a.s.c.ZkController Register replica - core:collection1 address:http://127.0.0.1:46539 collection:control_collection shard:shard1
   [junit4]   2> 1970644 INFO  (coreZkRegister-5388-thread-1-processing-c:control_collection x:collection1 n:127.0.0.1:46539_ s:shard1 r:core_node1) [n:127.0.0.1:46539_ c:control_collection s:shard1 r:core_node1 x:collection1] o.a.s.c.c.SolrZkClient makePath: /collections/control_collection/leader_elect/shard1/election
   [junit4]   2> 1970645 INFO  (coreZkRegister-5388-thread-1-processing-c:control_collection x:collection1 n:127.0.0.1:46539_ s:shard1 r:core_node1) [n:127.0.0.1:46539_ c:control_collection s:shard1 r:core_node1 x:collection1] o.a.s.c.LeaderElector Joined leadership election with path: /collections/control_collection/leader_elect/shard1/election/96555521948450820-core_node1-n_0000000000
   [junit4]   2> 1970645 INFO  (coreZkRegister-5388-thread-1-processing-c:control_collection x:collection1 n:127.0.0.1:46539_ s:shard1 r:core_node1) [n:127.0.0.1:46539_ c:control_collection s:shard1 r:core_node1 x:collection1] o.a.s.c.ShardLeaderElectionContext Running the leader process for shard=shard1 and weAreReplacement=false and leaderVoteWait=10000
   [junit4]   2> 1970646 INFO  (coreZkRegister-5388-thread-1-processing-c:control_collection x:collection1 n:127.0.0.1:46539_ s:shard1 r:core_node1) [n:127.0.0.1:46539_ c:control_collection s:shard1 r:core_node1 x:collection1] o.a.s.c.ShardLeaderElectionContext Enough replicas found to continue.
   [junit4]   2> 1970646 INFO  (coreZkRegister-5388-thread-1-processing-c:control_collection x:collection1 n:127.0.0.1:46539_ s:shard1 r:core_node1) [n:127.0.0.1:46539_ c:control_collection s:shard1 r:core_node1 x:collection1] o.a.s.c.ShardLeaderElectionContext I may be the new leader - try and sync
   [junit4]   2> 1970646 INFO  (coreZkRegister-5388-thread-1-processing-c:control_collection x:collection1 n:127.0.0.1:46539_ s:shard1 r:core_node1) [n:127.0.0.1:46539_ c:control_collection s:shard1 r:core_node1 x:collection1] o.a.s.c.SyncStrategy Sync replicas to http://127.0.0.1:46539/collection1/
   [junit4]   2> 1970646 INFO  (coreZkRegister-5388-thread-1-processing-c:control_collection x:collection1 n:127.0.0.1:46539_ s:shard1 r:core_node1) [n:127.0.0.1:46539_ c:control_collection s:shard1 r:core_node1 x:collection1] o.a.s.c.SyncStrategy Sync Success - now sync replicas to me
   [junit4]   2> 1970646 INFO  (OverseerStateUpdate-96555521948450820-127.0.0.1:46539_-n_0000000000) [n:127.0.0.1:46539_    ] o.a.s.c.Overseer processMessage: queueSize: 1, message = {
   [junit4]   2>   "operation":"leader",
   [junit4]   2>   "shard":"shard1",
   [junit4]   2>   "collection":"control_collection"} current state version: 1
   [junit4]   2> 1970646 INFO  (coreZkRegister-5388-thread-1-processing-c:control_collection x:collection1 n:127.0.0.1:46539_ s:shard1 r:core_node1) [n:127.0.0.1:46539_ c:control_collection s:shard1 r:core_node1 x:collection1] o.a.s.c.SyncStrategy http://127.0.0.1:46539/collection1/ has no replicas
   [junit4]   2> 1970646 INFO  (coreZkRegister-5388-thread-1-processing-c:control_collection x:collection1 n:127.0.0.1:46539_ s:shard1 r:core_node1) [n:127.0.0.1:46539_ c:control_collection s:shard1 r:core_node1 x:collection1] o.a.s.c.c.SolrZkClient makePath: /collections/control_collection/leaders/shard1
   [junit4]   2> 1970647 INFO  (coreZkRegister-5388-thread-1-processing-c:control_collection x:collection1 n:127.0.0.1:46539_ s:shard1 r:core_node1) [n:127.0.0.1:46539_ c:control_collection s:shard1 r:core_node1 x:collection1] o.a.s.c.ShardLeaderElectionContextBase Creating leader registration node /collections/control_collection/leaders/shard1/leader after winning as /collections/control_collection/leader_elect/shard1/election/96555521948450820-core_node1-n_0000000000
   [junit4]   2> 1970648 INFO  (coreZkRegister-5388-thread-1-processing-c:control_collection x:collection1 n:127.0.0.1:46539_ s:shard1 r:core_node1) [n:127.0.0.1:46539_ c:control_collection s:shard1 r:core_node1 x:collection1] o.a.s.c.ShardLeaderElectionContext I am the new leader: http://127.0.0.1:46539/collection1/ shard1
   [junit4]   2> 1970648 INFO  (OverseerStateUpdate-96555521948450820-127.0.0.1:46539_-n_0000000000) [n:127.0.0.1:46539_    ] o.a.s.c.Overseer processMessage: queueSize: 1, message = {
   [junit4]   2>   "operation":"leader",
   [junit4]   2>   "shard":"shard1",
   [junit4]   2>   "collection":"control_collection",
   [junit4]   2>   "base_url":"http://127.0.0.1:46539",
   [junit4]   2>   "core":"collection1",
   [junit4]   2>   "state":"active"} current state version: 1
   [junit4]   2> 1970749 INFO  (zkCallback-1872-thread-1-processing-n:127.0.0.1:46539_) [n:127.0.0.1:46539_    ] o.a.s.c.c.ZkStateReader A cluster state change: [WatchedEvent state:SyncConnected type:NodeDataChanged path:/clusterstate.json], has occurred - updating... (live nodes size: [1])
   [junit4]   2> 1970799 INFO  (coreZkRegister-5388-thread-1-processing-c:control_collection x:collection1 n:127.0.0.1:46539_ s:shard1 r:core_node1) [n:127.0.0.1:46539_ c:control_collection s:shard1 r:core_node1 x:collection1] o.a.s.c.ZkController We are http://127.0.0.1:46539/collection1/ and leader is http://127.0.0.1:46539/collection1/
   [junit4]   2> 1970799 INFO  (coreZkRegister-5388-thread-1-processing-c:control_collection x:collection1 n:127.0.0.1:46539_ s:shard1 r:core_node1) [n:127.0.0.1:46539_ c:control_collection s:shard1 r:core_node1 x:collection1] o.a.s.c.ZkController No LogReplay needed for core=collection1 baseURL=http://127.0.0.1:46539
   [junit4]   2> 1970799 INFO  (coreZkRegister-5388-thread-1-processing-c:control_collection x:collection1 n:127.0.0.1:46539_ s:shard1 r:core_node1) [n:127.0.0.1:46539_ c:control_collection s:shard1 r:core_node1 x:collection1] o.a.s.c.ZkController I am the leader, no recovery necessary
   [junit4]   2> 1970799 INFO  (coreZkRegister-5388-thread-1-processing-c:control_collection x:collection1 n:127.0.0.1:46539_ s:shard1 r:core_node1) [n:127.0.0.1:46539_ c:control_collection s:shard1 r:core_node1 x:collection1] o.a.s.c.ZkController publishing state=active
   [junit4]   2> 1970799 INFO  (coreZkRegister-5388-thread-1-processing-c:control_collection x:collection1 n:127.0.0.1:46539_ s:shard1 r:core_node1) [n:127.0.0.1:46539_ c:control_collection s:shard1 r:core_node1 x:collection1] o.a.s.c.ZkController numShards not found on descriptor - reading it from system property
   [junit4]   2> 1970801 INFO  (OverseerStateUpdate-96555521948450820-127.0.0.1:46539_-n_0000000000) [n:127.0.0.1:46539_    ] o.a.s.c.Overseer processMessage: queueSize: 1, message = {
   [junit4]   2>   "core_node_name":"core_node1",
   [junit4]   2>   "state":"active",
   [junit4]   2>   "numShards":"1",
   [junit4]   2>   "collection":"control_collection",
   [junit4]   2>   "core":"collection1",
   [junit4]   2>   "base_url":"http://127.0.0.1:46539",
   [junit4]   2>   "node_name":"127.0.0.1:46539_",
   [junit4]   2>   "roles":null,
   [junit4]   2>   "operation":"state",
   [junit4]   2>   "shard":"shard1"} current state version: 2
   [junit4]   2> 1970801 INFO  (OverseerStateUpdate-96555521948450820-127.0.0.1:46539_-n_0000000000) [n:127.0.0.1:46539_    ] o.a.s.c.o.ReplicaMutator Update state numShards=1 message={
   [junit4]   2>   "core_node_name":"core_node1",
   [junit4]   2>   "state":"active",
   [junit4]   2>   "numShards":"1",
   [junit4]   2>   "collection":"control_collection",
   [junit4]   2>   "core":"collection1",
   [junit4]   2>   "base_url":"http://127.0.0.1:46539",
   [junit4]   2>   "node_name":"127.0.0.1:46539_",
   [junit4]   2>   "roles":null,
   [junit4]   2>   "operation":"state",
   [junit4]   2>   "shard":"shard1"}
   [junit4]   2> 1970817 INFO  (TEST-TestSolrConfigHandlerCloud.test-seed#[496B9CBCB5E36BC8]) [    ] o.a.s.c.c.SolrZkClient Using default ZkCredentialsProvider
   [junit4]   2> 1970818 INFO  (TEST-TestSolrConfigHandlerCloud.test-seed#[496B9CBCB5E36BC8]) [    ] o.a.s.c.c.ConnectionManager Waiting for client to connect to ZooKeeper
   [junit4]   2> 1970820 INFO  (zkCallback-1874-thread-1) [    ] o.a.s.c.c.ConnectionManager Watcher org.apache.solr.common.cloud.ConnectionManager@e9d2c name:ZooKeeperConnection Watcher:127.0.0.1:35163/solr got event WatchedEvent state:SyncConnected type:None path:null path:null type:None
   [junit4]   2> 1970820 INFO  (TEST-TestSolrConfigHandlerCloud.test-seed#[496B9CBCB5E36BC8]) [    ] o.a.s.c.c.ConnectionManager Client is connected to ZooKeeper
   [junit4]   2> 1970820 INFO  (TEST-TestSolrConfigHandlerCloud.test-seed#[496B9CBCB5E36BC8]) [    ] o.a.s.c.c.SolrZkClient Using default ZkACLProvider
   [junit4]   2> 1970820 INFO  (TEST-TestSolrConfigHandlerCloud.test-seed#[496B9CBCB5E36BC8]) [    ] o.a.s.c.c.ZkStateReader Updating cluster state from ZooKeeper... 
   [junit4]   2> 1970822 INFO  (TEST-TestSolrConfigHandlerCloud.test-seed#[496B9CBCB5E36BC8]) [    ] o.a.s.c.ChaosMonkey monkey: init - expire sessions:false cause connection loss:false
   [junit4]   2> 1970822 INFO  (TEST-TestSolrConfigHandlerCloud.test-seed#[496B9CBCB5E36BC8]) [    ] o.a.s.c.AbstractFullDistribZkTestBase Creating collection1 with stateFormat=2
   [junit4]   2> 1970822 INFO  (TEST-TestSolrConfigHandlerCloud.test-seed#[496B9CBCB5E36BC8]) [    ] o.a.s.c.c.SolrZkClient Using default ZkCredentialsProvider
   [junit4]   2> 1970822 INFO  (TEST-TestSolrConfigHandlerCloud.test-seed#[496B9CBCB5E36BC8]) [    ] o.a.s.c.c.ConnectionManager Waiting for client to connect to ZooKeeper
   [junit4]   2> 1970823 INFO  (zkCallback-1875-thread-1) [    ] o.a.s.c.c.ConnectionManager Watcher org.apache.solr.common.cloud.ConnectionManager@c4ae6 name:ZooKeeperConnection Watcher:127.0.0.1:35163/solr got event WatchedEvent state:SyncConnected type:None path:null path:null type:None
   [junit4]   2> 1970823 INFO  (TEST-TestSolrConfigHandlerCloud.test-seed#[496B9CBCB5E36BC8]) [    ] o.a.s.c.c.ConnectionManager Client is connected to ZooKeeper
   [junit4]   2> 1970823 INFO  (TEST-TestSolrConfigHandlerCloud.test-seed#[496B9CBCB5E36BC8]) [    ] o.a.s.c.c.SolrZkClient Using default ZkACLProvider
   [junit4]   2> 1970825 INFO  (OverseerStateUpdate-96555521948450820-127.0.0.1:46539_-n_0000000000) [n:127.0.0.1:46539_    ] o.a.s.c.Overseer processMessage: queueSize: 1, message = {
   [junit4]   2>   "operation":"create",
   [junit4]   2>   "name":"collection1",
   [junit4]   2>   "numShards":"2",
   [junit4]   2>   "stateFormat":"2"} current state version: 2
   [junit4]   2> 1970825 INFO  (OverseerStateUpdate-96555521948450820-127.0.0.1:46539_-n_0000000000) [n:127.0.0.1:46539_    ] o.a.s.c.o.ClusterStateMutator building a new cName: collection1
   [junit4]   2> 1970825 INFO  (zkCallback-1872-thread-2-processing-n:127.0.0.1:46539_) [n:127.0.0.1:46539_    ] o.a.s.c.c.ZkStateReader A cluster state change: [WatchedEvent state:SyncConnected type:NodeDataChanged path:/clusterstate.json], has occurred - updating... (live nodes size: [1])
   [junit4]   2> 1970826 INFO  (zkCallback-1874-thread-1) [    ] o.a.s.c.c.ZkStateReader A cluster state change: [WatchedEvent state:SyncConnected type:NodeDataChanged path:/clusterstate.json], has occurred - updating... (live nodes size: [1])
   [junit4]   2> 1970895 INFO  (TEST-TestSolrConfigHandlerCloud.test-seed#[496B9CBCB5E36BC8]) [    ] o.a.s.SolrTestCaseJ4 Writing core.properties file to /home/jenkins/workspace/Lucene-Solr-5.5-Linux/solr/build/solr-core/test/J2/temp/solr.handler.TestSolrConfigHandlerCloud_496B9CBCB5E36BC8-001/shard-1-001/cores/collection1
   [junit4]   2> 1970895 INFO  (TEST-TestSolrConfigHandlerCloud.test-seed#[496B9CBCB5E36BC8]) [    ] o.a.s.c.AbstractFullDistribZkTestBase create jetty 1 in directory /home/jenkins/workspace/Lucene-Solr-5.5-Linux/solr/build/solr-core/test/J2/temp/solr.handler.TestSolrConfigHandlerCloud_496B9CBCB5E36BC8-001/shard-1-001
   [junit4]   2> 1970896 INFO  (TEST-TestSolrConfigHandlerCloud.test-seed#[496B9CBCB5E36BC8]) [    ] o.e.j.s.Server jetty-9.2.13.v20150730
   [junit4]   2> 1970897 INFO  (TEST-TestSolrConfigHandlerCloud.test-seed#[496B9CBCB5E36BC8]) [    ] o.e.j.s.h.ContextHandler Started o.e.j.s.ServletContextHandler@12cc5d7{/,null,AVAILABLE}
   [junit4]   2> 1970897 INFO  (TEST-TestSolrConfigHandlerCloud.test-seed#[496B9CBCB5E36BC8]) [    ] o.e.j.s.ServerConnector Started ServerConnector@102b094{HTTP/1.1}{127.0.0.1:46793}
   [junit4]   2> 1970897 INFO  (TEST-TestSolrConfigHandlerCloud.test-seed#[496B9CBCB5E36BC8]) [    ] o.e.j.s.Server Started @1972345ms
   [junit4]   2> 1970897 INFO  (TEST-TestSolrConfigHandlerCloud.test-seed#[496B9CBCB5E36BC8]) [    ] o.a.s.c.s.e.JettySolrRunner Jetty properties: {hostContext=/, solrconfig=solrconfig.xml, hostPort=46793, solr.data.dir=/home/jenkins/workspace/Lucene-Solr-5.5-Linux/solr/build/solr-core/test/J2/temp/solr.handler.TestSolrConfigHandlerCloud_496B9CBCB5E36BC8-001/tempDir-001/jetty1, coreRootDirectory=/home/jenkins/workspace/Lucene-Solr-5.5-Linux/solr/build/solr-core/test/J2/temp/solr.handler.TestSolrConfigHandlerCloud_496B9CBCB5E36BC8-001/shard-1-001/cores}
   [junit4]   2> 1970897 INFO  (TEST-TestSolrConfigHandlerCloud.test-seed#[496B9CBCB5E36BC8]) [    ] o.a.s.s.SolrDispatchFilter SolrDispatchFilter.init(): sun.misc.Launcher$AppClassLoader@327236
   [junit4]   2> 1970897 INFO  (TEST-TestSolrConfigHandlerCloud.test-seed#[496B9CBCB5E36BC8]) [    ] o.a.s.c.SolrResourceLoader new SolrResourceLoader for directory: '/home/jenkins/workspace/Lucene-Solr-5.5-Linux/solr/build/solr-core/test/J2/temp/solr.handler.TestSolrConfigHandlerCloud_496B9CBCB5E36BC8-001/shard-1-001'
   [junit4]   2> 1970897 INFO  (TEST-TestSolrConfigHandlerCloud.test-seed#[496B9CBCB5E36BC8]) [    ] o.a.s.c.SolrResourceLoader JNDI not configured for solr (NoInitialContextEx)
   [junit4]   2> 1970897 INFO  (TEST-TestSolrConfigHandlerCloud.test-seed#[496B9CBCB5E36BC8]) [    ] o.a.s.c.SolrResourceLoader solr home defaulted to 'solr/' (could not find system property or JNDI)
   [junit4]   2> 1970898 INFO  (TEST-TestSolrConfigHandlerCloud.test-seed#[496B9CBCB5E36BC8]) [    ] o.a.s.c.c.SolrZkClient Using default ZkCredentialsProvider
   [junit4]   2> 1970898 INFO  (TEST-TestSolrConfigHandlerCloud.test-seed#[496B9CBCB5E36BC8]) [    ] o.a.s.c.c.ConnectionManager Waiting for client to connect to ZooKeeper
   [junit4]   2> 1970899 INFO  (zkCallback-1876-thread-1) [    ] o.a.s.c.c.ConnectionManager Watcher org.apache.solr.common.cloud.ConnectionManager@16cdbc3 name:ZooKeeperConnection Watcher:127.0.0.1:35163/solr got event WatchedEvent state:SyncConnected type:None path:null path:null type:None
   [junit4]   2> 1970899 INFO  (TEST-TestSolrConfigHandlerCloud.test-seed#[496B9CBCB5E36BC8]) [    ] o.a.s.c.c.ConnectionManager Client is connected to ZooKeeper
   [junit4]   2> 1970899 INFO  (TEST-TestSolrConfigHandlerCloud.test-seed#[496B9CBCB5E36BC8]) [    ] o.a.s.c.c.SolrZkClient Using default ZkACLProvider
   [junit4]   2> 1970900 INFO  (TEST-TestSolrConfigHandlerCloud.test-seed#[496B9CBCB5E36BC8]) [    ] o.a.s.s.SolrDispatchFilter Loading solr.xml from SolrHome (not found in ZooKeeper)
   [junit4]   2> 1970900 INFO  (TEST-TestSolrConfigHandlerCloud.test-seed#[496B9CBCB5E36BC8]) [    ] o.a.s.c.SolrXmlConfig Loading container configuration from /home/jenkins/workspace/Lucene-Solr-5.5-Linux/solr/build/solr-core/test/J2/temp/solr.handler.TestSolrConfigHandlerCloud_496B9CBCB5E36BC8-001/shard-1-001/solr.xml
   [junit4]   2> 1970912 INFO  (TEST-TestSolrConfigHandlerCloud.test-seed#[496B9CBCB5E36BC8]) [    ] o.a.s.c.CorePropertiesLocator Config-defined core root directory: /home/jenkins/workspace/Lucene-Solr-5.5-Linux/solr/build/solr-core/test/J2/temp/solr.handler.TestSolrConfigHandlerCloud_496B9CBCB5E36BC8-001/shard-1-001/cores
   [junit4]   2> 1970912 INFO  (TEST-TestSolrConfigHandlerCloud.test-seed#[496B9CBCB5E36BC8]) [    ] o.a.s.c.CoreContainer New CoreContainer 26056875
   [junit4]   2> 1970912 INFO  (TEST-TestSolrConfigHandlerCloud.test-seed#[496B9CBCB5E36BC8]) [    ] o.a.s.c.CoreContainer Loading cores into CoreContainer [instanceDir=/home/jenkins/workspace/Lucene-Solr-5.5-Linux/solr/build/solr-core/test/J2/temp/solr.handler.TestSolrConfigHandlerCloud_496B9CBCB5E36BC8-001/shard-1-001]
   [junit4]   2> 1970912 WARN  (TEST-TestSolrConfigHandlerCloud.test-seed#[496B9CBCB5E36BC8]) [    ] o.a.s.c.CoreContainer Couldn't add files from /home/jenkins/workspace/Lucene-Solr-5.5-Linux/solr/build/solr-core/test/J2/temp/solr.handler.TestSolrConfigHandlerCloud_496B9CBCB5E36BC8-001/shard-1-001/lib to classpath: /home/jenkins/workspace/Lucene-Solr-5.5-Linux/solr/build/solr-core/test/J2/temp/solr.handler.TestSolrConfigHandlerCloud_496B9CBCB5E36BC8-001/shard-1-001/lib
   [junit4]   2> 1970912 INFO  (TEST-TestSolrConfigHandlerCloud.test-seed#[496B9CBCB5E36BC8]) [    ] o.a.s.h.c.HttpShardHandlerFactory created with socketTimeout : 90000,urlScheme : ,connTimeout : 15000,maxConnectionsPerHost : 20,maxConnections : 10000,corePoolSize : 0,maximumPoolSize : 2147483647,maxThreadIdleTime : 5,sizeOfQueue : -1,fairnessPolicy : false,useRetries : false,connectionsEvictorSleepDelay : 5000,maxConnectionIdleTime : 40000,
   [junit4]   2> 1970913 INFO  (TEST-TestSolrConfigHandlerCloud.test-seed#[496B9CBCB5E36BC8]) [    ] o.a.s.u.UpdateShardHandler Creating UpdateShardHandler HTTP client with params: socketTimeout=340000&connTimeout=45000&retry=true
   [junit4]   2> 1970914 INFO  (TEST-TestSolrConfigHandlerCloud.test-seed#[496B9CBCB5E36BC8]) [    ] o.a.s.l.LogWatcher SLF4J impl is org.slf4j.impl.Log4jLoggerFactory
   [junit4]   2> 1970914 INFO  (TEST-TestSolrConfigHandlerCloud.test-seed#[496B9CBCB5E36BC8]) [    ] o.a.s.l.LogWatcher Registering Log Listener [Log4j (org.slf4j.impl.Log4jLoggerFactory)]
   [junit4]   2> 1970914 INFO  (TEST-TestSolrConfigHandlerCloud.test-seed#[496B9CBCB5E36BC8]) [    ] o.a.s.c.ZkContainer Zookeeper client=127.0.0.1:35163/solr
   [junit4]   2> 1970914 INFO  (TEST-TestSolrConfigHandlerCloud.test-seed#[496B9CBCB5E36BC8]) [    ] o.a.s.c.ZkController zkHost includes chroot
   [junit4]   2> 1970914 INFO  (TEST-TestSolrConfigHandlerCloud.test-seed#[496B9CBCB5E36BC8]) [    ] o.a.s.c.c.SolrZkClient Using default ZkCredentialsProvider
   [junit4]   2> 1970914 INFO  (TEST-TestSolrConfigHandlerCloud.test-seed#[496B9CBCB5E36BC8]) [    ] o.a.s.c.c.ConnectionManager Waiting for client to connect to ZooKeeper
   [junit4]   2> 1970916 INFO  (zkCallback-1879-thread-1) [    ] o.a.s.c.c.ConnectionManager Watcher org.apache.solr.common.cloud.ConnectionManager@b4db21 name:ZooKeeperConnection Watcher:127.0.0.1:35163 got event WatchedEvent state:SyncConnected type:None path:null path:null type:None
   [junit4]   2> 1970917 INFO  (TEST-TestSolrConfigHandlerCloud.test-seed#[496B9CBCB5E36BC8]) [    ] o.a.s.c.c.ConnectionManager Client is connected to ZooKeeper
   [junit4]   2> 1970917 INFO  (TEST-TestSolrConfigHandlerCloud.test-seed#[496B9CBCB5E36BC8]) [    ] o.a.s.c.c.SolrZkClient Using default ZkACLProvider
   [junit4]   2> 1970917 INFO  (TEST-TestSolrConfigHandlerCloud.test-seed#[496B9CBCB5E36BC8]) [n:127.0.0.1:46793_    ] o.a.s.c.ZkController Added new OnReconnect listener org.apache.solr.cloud.ZkController$6@1f01409
   [junit4]   2> 1970918 INFO  (TEST-TestSolrConfigHandlerCloud.test-seed#[496B9CBCB5E36BC8]) [n:127.0.0.1:46793_    ] o.a.s.c.c.ConnectionManager Waiting for client to connect to ZooKeeper
   [junit4]   2> 1970919 INFO  (zkCallback-1880-thread-1-processing-n:127.0.0.1:46793_) [n:127.0.0.1:46793_    ] o.a.s.c.c.ConnectionManager Watcher org.apache.solr.common.cloud.ConnectionManager@18831e3 name:ZooKeeperConnection Watcher:127.0.0.1:35163/solr got event WatchedEvent state:SyncConnected type:None path:null path:null type:None
   [junit4]   2> 1970919 INFO  (TEST-TestSolrConfigHandlerCloud.test-seed#[496B9CBCB5E36BC8]) [n:127.0.0.1:46793_    ] o.a.s.c.c.ConnectionManager Client is connected to ZooKeeper
   [junit4]   2> 1970921 INFO  (TEST-TestSolrConfigHandlerCloud.test-seed#[496B9CBCB5E36BC8]) [n:127.0.0.1:46793_    ] o.a.s.c.c.ZkStateReader Updating cluster state from ZooKeeper... 
   [junit4]   2> 1970928 INFO  (OverseerStateUpdate-96555521948450820-127.0.0.1:46539_-n_0000000000) [n:127.0.0.1:46539_    ] o.a.s.c.o.ZkStateWriter going to create_collection /collections/collection1/state.json
   [junit4]   2> 1971925 INFO  (TEST-TestSolrConfigHandlerCloud.test-seed#[496B9CBCB5E36BC8]) [n:127.0.0.1:46793_    ] o.a.s.c.ZkController Register node as live in ZooKeeper:/live_nodes/127.0.0.1:46793_
   [junit4]   2> 1971926 INFO  (TEST-TestSolrConfigHandlerCloud.test-seed#[496B9CBCB5E36BC8]) [n:127.0.0.1:46793_    ] o.a.s.c.c.SolrZkClient makePath: /live_nodes/127.0.0.1:46793_
   [junit4]   2> 1971926 INFO  (zkCallback-1880-thread-1-processing-n:127.0.0.1:46793_) [n:127.0.0.1:46793_    ] o.a.s.c.c.ZkStateReader A live node change: [WatchedEvent state:SyncConnected type:NodeChildrenChanged path:/live_nodes], has occurred - updating... (live nodes size: [1])
   [junit4]   2> 1971926 INFO  (zkCallback-1872-thread-2-processing-n:127.0.0.1:46539_) [n:127.0.0.1:46539_    ] o.a.s.c.c.ZkStateReader A live node change: [WatchedEvent state:SyncConnected type:NodeChildrenChanged path:/live_nodes], has occurred - updating... (live nodes size: [1])
   [junit4]   2> 1971926 INFO  (zkCallback-1874-thread-1) [    ] o.a.s.c.c.ZkStateReader A live node change: [WatchedEvent state:SyncConnected type:NodeChildrenChanged path:/live_nodes], has occurred - updating... (live nodes size: [1])
   [junit4]   2> 1971927 INFO  (TEST-TestSolrConfigHandlerCloud.test-seed#[496B9CBCB5E36BC8]) [n:127.0.0.1:46793_    ] o.a.s.c.Overseer Overseer (id=null) closing
   [junit4]   2> 1971927 INFO  (TEST-TestSolrConfigHandlerCloud.test-seed#[496B9CBCB5E36BC8]) [n:127.0.0.1:46793_    ] o.a.s.c.LeaderElector Joined leadership election with path: /overseer_elect/election/96555521948450825-127.0.0.1:46793_-n_0000000001
   [junit4]   2> 1971927 INFO  (TEST-TestSolrConfigHandlerCloud.test-seed#[496B9CBCB5E36BC8]) [n:127.0.0.1:46793_    ] o.a.s.c.LeaderElector Watching path /overseer_elect/election/96555521948450820-127.0.0.1:46539_-n_0000000000 to know if I could be the leader
   [junit4]   2> 1971955 INFO  (TEST-TestSolrConfigHandlerCloud.test-seed#[496B9CBCB5E36BC8]) [n:127.0.0.1:46793_    ] o.a.s.c.CoreContainer Security conf doesn't exist. Skipping setup for authorization module.
   [junit4]   2> 1971956 INFO  (TEST-TestSolrConfigHandlerCloud.test-seed#[496B9CBCB5E36BC8]) [n:127.0.0.1:46793_    ] o.a.s.c.CoreContainer No authentication plugin used.
   [junit4]   2> 1971956 INFO  (TEST-TestSolrConfigHandlerCloud.test-seed#[496B9CBCB5E36BC8]) [n:127.0.0.1:46793_    ] o.a.s.c.CorePropertiesLocator Looking for core definitions underneath /home/jenkins/workspace/Lucene-Solr-5.5-Linux/solr/build/solr-core/test/J2/temp/solr.handler.TestSolrConfigHandlerCloud_496B9CBCB5E36BC8-001/shard-1-001/cores
   [junit4]   2> 1971957 INFO  (TEST-TestSolrConfigHandlerCloud.test-seed#[496B9CBCB5E36BC8]) [n:127.0.0.1:46793_    ] o.a.s.c.CoreDescriptor Created CoreDescriptor: {coreNodeName=, loadOnStartup=true, schema=schema.xml, config=solrconfig.xml, name=collection1, transient=false, shard=, collection=collection1, dataDir=data/, configSetProperties=configsetprops.json}
   [junit4]   2> 1971957 INFO  (TEST-TestSolrConfigHandlerCloud.test-seed#[496B9CBCB5E36BC8]) [n:127.0.0.1:46793_    ] o.a.s.c.CorePropertiesLocator Found core collection1 in /home/jenkins/workspace/Lucene-Solr-5.5-Linux/solr/build/solr-core/test/J2/temp/solr.handler.TestSolrConfigHandlerCloud_496B9CBCB5E36BC8-001/shard-1-001/cores/collection1
   [junit4]   2> 1971957 INFO  (TEST-TestSolrConfigHandlerCloud.test-seed#[496B9CBCB5E36BC8]) [n:127.0.0.1:46793_    ] o.a.s.c.CorePropertiesLocator Found 1 core definitions
   [junit4]   2> 1971959 INFO  (coreLoadExecutor-5405-thread-1-processing-n:127.0.0.1:46793_) [n:127.0.0.1:46793_ c:collection1   x:collection1] o.a.s.c.ZkController publishing state=down
   [junit4]   2> 1971959 INFO  (coreLoadExecutor-5405-thread-1-processing-n:127.0.0.1:46793_) [n:127.0.0.1:46793_ c:collection1   x:collection1] o.a.s.c.ZkController numShards not found on descriptor - reading it from system property
   [junit4]   2> 1971962 INFO  (TEST-TestSolrConfigHandlerCloud.test-seed#[496B9CBCB5E36BC8]) [n:127.0.0.1:46793_    ] o.a.s.s.SolrDispatchFilter user.dir=/home/jenkins/workspace/Lucene-Solr-5.5-Linux/solr/build/solr-core/test/J2
   [junit4]   2> 1971962 INFO  (TEST-TestSolrConfigHandlerCloud.test-seed#[496B9CBCB5E36BC8]) [n:127.0.0.1:46793_    ] o.a.s.s.SolrDispatchFilter SolrDispatchFilter.init() done
   [junit4]   2> 1971962 INFO  (coreLoadExecutor-5405-thread-1-processing-n:127.0.0.1:46793_) [n:127.0.0.1:46793_ c:collection1   x:collection1] o.a.s.c.ZkController Registering watch for collection collection1
   [junit4]   2> 1971962 INFO  (coreLoadExecutor-5405-thread-1-processing-n:127.0.0.1:46793_) [n:127.0.0.1:46793_ c:collection1   x:collection1] o.a.s.c.c.ZkStateReader addZkWatch [collection1]
   [junit4]   2> 1971962 INFO  (OverseerStateUpdate-96555521948450820-127.0.0.1:46539_-n_0000000000) [n:127.0.0.1:46539_    ] o.a.s.c.Overseer processMessage: queueSize: 1, message = {
   [junit4]   2>   "state":"down",
   [junit4]   2>   "numShards":"2",
   [junit4]   2>   "collection":"collection1",
   [junit4]   2>   "core":"collection1",
   [junit4]   2>   "base_url":"http://127.0.0.1:46793",
   [junit4]   2>   "node_name":"127.0.0.1:46793_",
   [junit4]   2>   "roles":null,
   [junit4]   2>   "operation":"state",
   [junit4]   2>   "shard":null} current state version: 3
   [junit4]   2> 1971962 INFO  (coreLoadExecutor-5405-thread-1-processing-n:127.0.0.1:46793_) [n:127.0.0.1:46793_ c:collection1   x:collection1] o.a.s.c.c.ZkStateReader Add data for [collection1] ver [0]
   [junit4]   2> 1971962 INFO  (coreLoadExecutor-5405-thread-1-processing-n:127.0.0.1:46793_) [n:127.0.0.1:46793_ c:collection1   x:collection1] o.a.s.c.ZkController look for our core node name
   [junit4]   2> 1971962 INFO  (OverseerStateUpdate-96555521948450820-127.0.0.1:46539_-n_0000000000) [n:127.0.0.1:46539_    ] o.a.s.c.o.ReplicaMutator Update state numShards=2 message={
   [junit4]   2>   "state":"down",
   [junit4]   2>   "numShards":"2",
   [junit4]   2>   "collection":"collection1",
   [junit4]   2>   "core":"collection1",
   [junit4]   2>   "base_url":"http://127.0.0.1:46793",
   [junit4]   2>   "node_name":"127.0.0.1:46793_",
   [junit4]   2>   "roles":null,
   [junit4]   2>   "operation":"state",
   [junit4]   2>   "shard":null}
   [junit4]   2> 1971962 INFO  (OverseerStateUpdate-96555521948450820-127.0.0.1:46539_-n_0000000000) [n:127.0.0.1:46539_    ] o.a.s.c.o.ReplicaMutator Collection already exists with numShards=2
   [junit4]   2> 1971962 INFO  (OverseerStateUpdate-96555521948450820-127.0.0.1:46539_-n_0000000000) [n:127.0.0.1:46539_    ] o.a.s.c.o.ReplicaMutator Assigning new node to shard shard=shard2
   [junit4]   2> 1972064 INFO  (OverseerStateUpdate-96555521948450820-127.0.0.1:46539_-n_0000000000) [n:127.0.0.1:46539_    ] o.a.s.c.o.ZkStateWriter going to update_collection /collections/collection1/state.json version: 0
   [junit4]   2> 1972064 INFO  (zkCallback-1880-thread-1-processing-n:127.0.0.1:46793_) [n:127.0.0.1:46793_    ] o.a.s.c.c.ZkStateReader A cluster state change: [WatchedEvent state:SyncConnected type:NodeDataChanged path:/collections/collection1/state.json] for collection [collection1] has occurred - updating... (live nodes size: [2])
   [junit4]   2> 1972064 INFO  (zkCallback-1880-thread-1-processing-n:127.0.0.1:46793_) [n:127.0.0.1:46793_    ] o.a.s.c.c.ZkStateReader Updating data for [collection1] from [0] to [1]
   [junit4]   2> 1972962 INFO  (coreLoadExecutor-5405-thread-1-processing-n:127.0.0.1:46793_) [n:127.0.0.1:46793_ c:collection1   x:collection1] o.a.s.c.ZkController waiting to find shard id in clusterstate for collection1
   [junit4]   2> 1972963 INFO  (coreLoadExecutor-5405-thread-1-processing-n:127.0.0.1:46793_) [n:127.0.0.1:46793_ c:collection1   x:collection1] o.a.s.c.ZkController Check for collection zkNode:collection1
   [junit4]   2> 1972963 INFO  (coreLoadExecutor-5405-thread-1-processing-n:127.0.0.1:46793_) [n:127.0.0.1:46793_ c:collection1   x:collection1] o.a.s.c.ZkController Collection zkNode exists
   [junit4]   2> 1972963 INFO  (coreLoadExecutor-5405-thread-1-processing-n:127.0.0.1:46793_) [n:127.0.0.1:46793_ c:collection1   x:collection1] o.a.s.c.c.ZkStateReader Load collection config from: [/collections/collection1]
   [junit4]   2> 1972964 INFO  (coreLoadExecutor-5405-thread-1-processing-n:127.0.0.1:46793_) [n:127.0.0.1:46793_ c:collection1   x:collection1] o.a.s.c.c.ZkStateReader path=[/collections/collection1] [configName]=[conf1] specified config exists in ZooKeeper
   [junit4]   2> 1972964 INFO  (coreLoadExecutor-5405-thread-1-processing-n:127.0.0.1:46793_) [n:127.0.0.1:46793_ c:collection1   x:collection1] o.a.s.c.SolrResourceLoader new SolrResourceLoader for directory: '/home/jenkins/workspace/Lucene-Solr-5.5-Linux/solr/build/solr-core/test/J2/temp/solr.handler.TestSolrConfigHandlerCloud_496B9CBCB5E36BC8-001/shard-1-001/cores/collection1'
   [junit4]   2> 1972964 INFO  (coreLoadExecutor-5405-thread-1-processing-n:127.0.0.1:46793_) [n:127.0.0.1:46793_ c:collection1   x:collection1] o.a.s.c.SolrResourceLoader JNDI not configured for solr (NoInitialContextEx)
   [junit4]   2> 1972964 INFO  (coreLoadExecutor-5405-thread-1-processing-n:127.0.0.1:46793_) [n:127.0.0.1:46793_ c:collection1   x:collection1] o.a.s.c.SolrResourceLoader solr home defaulted to 'solr/' (could not find system property or JNDI)
   [junit4]   2> 1972966 INFO  (coreLoadExecutor-5405-thread-1-processing-n:127.0.0.1:46793_) [n:127.0.0.1:46793_ c:collection1   x:collection1] o.a.s.c.Config loaded config solrconfig.xml with version 0 
   [junit4]   2> 1972972 INFO  (coreLoadExecutor-5405-thread-1-processing-n:127.0.0.1:46793_) [n:127.0.0.1:46793_ c:collection1   x:collection1] o.a.s.c.SolrConfig current version of requestparams : -1
   [junit4]   2> 1972985 INFO  (coreLoadExecutor-5405-thread-1-processing-n:127.0.0.1:46793_) [n:127.0.0.1:46793_ c:collection1   x:collection1] o.a.s.c.SolrConfig Using Lucene MatchVersion: 5.5.3
   [junit4]   2> 1973012 INFO  (coreLoadExecutor-5405-thread-1-processing-n:127.0.0.1:46793_) [n:127.0.0.1:46793_ c:collection1   x:collection1] o.a.s.c.SolrConfig Loaded SolrConfig: solrconfig.xml
   [junit4]   2> 1973020 INFO  (coreLoadExecutor-5405-thread-1-processing-n:127.0.0.1:46793_) [n:127.0.0.1:46793_ c:collection1   x:collection1] o.a.s.s.IndexSchema [collection1] Schema name=test
   [junit4]   2> 1973276 INFO  (coreLoadExecutor-5405-thread-1-processing-n:127.0.0.1:46793_) [n:127.0.0.1:46793_ c:collection1   x:collection1] o.a.s.s.OpenExchangeRatesOrgProvider Initialized with rates=open-exchange-rates.json, refreshInterval=1440.
   [junit4]   2> 1973283 INFO  (coreLoadExecutor-5405-thread-1-processing-n:127.0.0.1:46793_) [n:127.0.0.1:46793_ c:collection1   x:collection1] o.a.s.s.IndexSchema default search field in schema is text
   [junit4]   2> 1973285 INFO  (coreLoadExecutor-5405-thread-1-processing-n:127.0.0.1:46793_) [n:127.0.0.1:46793_ c:collection1   x:collection1] o.a.s.s.IndexSchema unique key field: id
   [junit4]   2> 1973290 INFO  (coreLoadExecutor-5405-thread-1-processing-n:127.0.0.1:46793_) [n:127.0.0.1:46793_ c:collection1   x:collection1] o.a.s.s.FileExchangeRateProvider Reloading exchange rates from file currency.xml
   [junit4]   2> 1973292 INFO  (coreLoadExecutor-5405-thread-1-processing-n:127.0.0.1:46793_) [n:127.0.0.1:46793_ c:collection1   x:collection1] o.a.s.s.FileExchangeRateProvider Reloading exchange rates from file currency.xml
   [junit4]   2> 1973294 INFO  (coreLoadExecutor-5405-thread-1-processing-n:127.0.0.1:46793_) [n:127.0.0.1:46793_ c:collection1   x:collection1] o.a.s.s.OpenExchangeRatesOrgProvider Reloading exchange rates from open-exchange-rates.json
   [junit4]   2> 1973294 INFO  (coreLoadExecutor-5405-thread-1-processing-n:127.0.0.1:46793_) [n:127.0.0.1:46793_ c:collection1   x:collection1] o.a.s.s.OpenExchangeRatesOrgProvider Reloading exchange rates from open-exchange-rates.json
   [junit4]   2> 1973295 INFO  (coreLoadExecutor-5405-thread-1-processing-n:127.0.0.1:46793_) [n:127.0.0.1:46793_ c:collection1   x:collection1] o.a.s.c.ConfigSetProperties Did not find ConfigSet properties, assuming default properties: Can't find resource 'configsetprops.json' in classpath or '/configs/conf1', cwd=/home/jenkins/workspace/Lucene-Solr-5.5-Linux/solr/build/solr-core/test/J2
   [junit4]   2> 1973295 INFO  (coreLoadExecutor-5405-thread-1-processing-n:127.0.0.1:46793_) [n:127.0.0.1:46793_ c:collection1   x:collection1] o.a.s.c.CoreContainer Creating SolrCore 'collection1' using configuration from collection collection1
   [junit4]   2> 1973296 INFO  (coreLoadExecutor-5405-thread-1-processing-n:127.0.0.1:46793_) [n:127.0.0.1:46793_ c:collection1 s:shard2 r:core_node1 x:collection1] o.a.s.c.SolrCore org.apache.solr.core.MockDirectoryFactory
   [junit4]   2> 1973296 INFO  (coreLoadExecutor-5405-thread-1-processing-n:127.0.0.1:46793_) [n:127.0.0.1:46793_ c:collection1 s:shard2 r:core_node1 x:collection1] o.a.s.c.SolrCore [[collection1] ] Opening new SolrCore at [/home/jenkins/workspace/Lucene-Solr-5.5-Linux/solr/build/solr-core/test/J2/temp/solr.handler.TestSolrConfigHandlerCloud_496B9CBCB5E36BC8-001/shard-1-001/cores/collection1], dataDir=[/home/jenkins/workspace/Lucene-Solr-5.5-Linux/solr/build/solr-core/test/J2/temp/solr.handler.TestSolrConfigHandlerCloud_496B9CBCB5E36BC8-001/shard-1-001/cores/collection1/data/]
   [junit4]   2> 1973296 INFO  (coreLoadExecutor-5405-thread-1-processing-n:127.0.0.1:46793_) [n:127.0.0.1:46793_ c:collection1 s:shard2 r:core_node1 x:collection1] o.a.s.c.JmxMonitoredMap JMX monitoring is enabled. Adding Solr mbeans to JMX Server: com.sun.jmx.mbeanserver.JmxMBeanServer@3b50ff
   [junit4]   2> 1973297 INFO  (coreLoadExecutor-5405-thread-1-processing-n:127.0.0.1:46793_) [n:127.0.0.1:46793_ c:collection1 s:shard2 r:core_node1 x:collection1] o.a.s.c.CachingDirectoryFactory return new directory for /home/jenkins/workspace/Lucene-Solr-5.5-Linux/solr/build/solr-core/test/J2/temp/solr.handler.TestSolrConfigHandlerCloud_496B9CBCB5E36BC8-001/shard-1-001/cores/collection1/data
   [junit4]   2> 1973297 INFO  (coreLoadExecutor-5405-thread-1-processing-n:127.0.0.1:46793_) [n:127.0.0.1:46793_ c:collection1 s:shard2 r:core_node1 x:collection1] o.a.s.c.SolrCore New index directory detected: old=null new=/home/jenkins/workspace/Lucene-Solr-5.5-Linux/solr/build/solr-core/test/J2/temp/solr.handler.TestSolrConfigHandlerCloud_496B9CBCB5E36BC8-001/shard-1-001/cores/collection1/data/index/
   [junit4]   2> 1973297 WARN  (coreLoadExecutor-5405-thread-1-processing-n:127.0.0.1:46793_) [n:127.0.0.1:46793_ c:collection1 s:shard2 r:core_node1 x:collection1] o.a.s.c.SolrCore [collection1] Solr index directory '/home/jenkins/workspace/Lucene-Solr-5.5-Linux/solr/build/solr-core/test/J2/temp/solr.handler.TestSolrConfigHandlerCloud_496B9CBCB5E36BC8-001/shard-1-001/cores/collection1/data/index' doesn't exist. Creating new index...
   [junit4]   2> 1973297 INFO  (coreLoadExecutor-5405-thread-1-processing-n:127.0.0.1:46793_) [n:127.0.0.1:46793_ c:collection1 s:shard2 r:core_node1 x:collection1] o.a.s.c.CachingDirectoryFactory return new directory for /home/jenkins/workspace/Lucene-Solr-5.5-Linux/solr/build/solr-core/test/J2/temp/solr.handler.TestSolrConfigHandlerCloud_496B9CBCB5E36BC8-001/shard-1-001/cores/collection1/data/index
   [junit4]   2> 1973297 INFO  (coreLoadExecutor-5405-thread-1-processing-n:127.0.0.1:46793_) [n:127.0.0.1:46793_ c:collection1 s:shard2 r:core_node1 x:collection1] o.a.s.u.RandomMergePolicy RandomMergePolicy wrapping class org.apache.lucene.index.LogByteSizeMergePolicy: [LogByteSizeMergePolicy: minMergeSize=1677721, mergeFactor=30, maxMergeSize=2147483648, maxMergeSizeForForcedMerge=9223372036854775807, calibrateSizeByDeletes=true, maxMergeDocs=2147483647, maxCFSSegmentSizeMB=8.796093022207999E12, noCFSRatio=0.10088902104645872]
   [junit4]   2> 1973297 INFO  (coreLoadExecutor-5405-thread-1-processing-n:127.0.0.1:46793_) [n:127.0.0.1:46793_ c:collection1 s:shard2 r:core_node1 x:collection1] o.a.s.c.SolrDeletionPolicy SolrDeletionPolicy.onCommit: commits: num=1
   [junit4]   2> 	commit{dir=MockDirectoryWrapper(RAMDirectory@1306883 lockFactory=org.apache.lucene.store.SingleInstanceLockFactory@11d93f1),segFN=segments_1,generation=1}
   [junit4]   2> 1973297 INFO  (coreLoadExecutor-5405-thread-1-processing-n:127.0.0.1:46793_) [n:127.0.0.1:46793_ c:collection1 s:shard2 r:core_node1 x:collection1] o.a.s.c.SolrDeletionPolicy newest commit generation = 1
   [junit4]   2> 1973298 INFO  (OldIndexDirectoryCleanupThreadForCore-collection1) [n:127.0.0.1:46793_ c:collection1 s:shard2 r:core_node1 x:collection1] o.a.s.c.SolrCore Looking for old index directories to cleanup for core collection1 in /home/jenkins/workspace/Lucene-Solr-5.5-Linux/solr/build/solr-core/test/J2/temp/solr.handler.TestSolrConfigHandlerCloud_496B9CBCB5E36BC8-001/shard-1-001/cores/collection1/data/
   [junit4]   2> 1973298 WARN  (OldIndexDirectoryCleanupThreadForCore-collection1) [n:127.0.0.1:46793_ c:collection1 s:shard2 r:core_node1 x:collection1] o.a.s.c.DirectoryFactory /home/jenkins/workspace/Lucene-Solr-5.5-Linux/solr/build/solr-core/test/J2/temp/solr.handler.TestSolrConfigHandlerCloud_496B9CBCB5E36BC8-001/shard-1-001/cores/collection1/data/ does not point to a valid data directory; skipping clean-up of old index directories.
   [junit4]   2> 1973301 INFO  (coreLoadExecutor-5405-thread-1-processing-n:127.0.0.1:46793_) [n:127.0.0.1:46793_ c:coll

[...truncated too long message...]

cloud.ZkController$5.run(ZkController.java:2480)
   [junit4]   2> Sep 08, 2016 7:40:24 AM com.carrotsearch.randomizedtesting.ThreadLeakControl tryToInterruptAll
   [junit4]   2> INFO: Starting to interrupt leaked threads:
   [junit4]   2>    1) Thread[id=14244, name=Thread-4561, state=TIMED_WAITING, group=TGRP-TestSolrConfigHandlerCloud]
   [junit4]   2> 2051320 ERROR (Thread-4561) [n:127.0.0.1:41201_    ] o.a.s.s.IndexSchemaFactory Error loading schema resource schema.xml
   [junit4]   2> java.io.IOException: Could not load resource=schema.xml
   [junit4]   2> 	at org.apache.solr.cloud.ZkSolrResourceLoader.openResource(ZkSolrResourceLoader.java:105)
   [junit4]   2> 	at org.apache.solr.core.SolrResourceLoader.openSchema(SolrResourceLoader.java:355)
   [junit4]   2> 	at org.apache.solr.schema.IndexSchemaFactory.create(IndexSchemaFactory.java:48)
   [junit4]   2> 	at org.apache.solr.schema.IndexSchemaFactory.buildIndexSchema(IndexSchemaFactory.java:70)
   [junit4]   2> 	at org.apache.solr.core.ConfigSetService.createIndexSchema(ConfigSetService.java:108)
   [junit4]   2> 	at org.apache.solr.core.ConfigSetService.getConfig(ConfigSetService.java:79)
   [junit4]   2> 	at org.apache.solr.core.CoreContainer.reload(CoreContainer.java:920)
   [junit4]   2> 	at org.apache.solr.core.SolrCore$11.run(SolrCore.java:2623)
   [junit4]   2> 	at org.apache.solr.cloud.ZkController$5.run(ZkController.java:2480)
   [junit4]   2> Caused by: java.lang.InterruptedException: sleep interrupted
   [junit4]   2> 	at java.lang.Thread.sleep(Native Method)
   [junit4]   2> 	at org.apache.solr.cloud.ZkSolrResourceLoader.openResource(ZkSolrResourceLoader.java:101)
   [junit4]   2> 	... 8 more
   [junit4]   2> 2051321 WARN  (Thread-4561) [n:127.0.0.1:41201_    ] o.a.s.c.SolrCores Tried to remove core collection1 from pendingCoreOps and it wasn't there. 
   [junit4]   2> 2051321 WARN  (Thread-4561) [n:127.0.0.1:41201_    ] o.a.s.c.ZkController listener throws error
   [junit4]   2> org.apache.solr.common.SolrException: Unable to reload core [collection1]
   [junit4]   2> 	at org.apache.solr.core.CoreContainer.reload(CoreContainer.java:927)
   [junit4]   2> 	at org.apache.solr.core.SolrCore$11.run(SolrCore.java:2623)
   [junit4]   2> 	at org.apache.solr.cloud.ZkController$5.run(ZkController.java:2480)
   [junit4]   2> Caused by: org.apache.solr.common.SolrException: Could not load conf for core collection1: Error loading schema resource schema.xml
   [junit4]   2> 	at org.apache.solr.core.ConfigSetService.getConfig(ConfigSetService.java:84)
   [junit4]   2> 	at org.apache.solr.core.CoreContainer.reload(CoreContainer.java:920)
   [junit4]   2> 	... 2 more
   [junit4]   2> Caused by: org.apache.solr.common.SolrException: Error loading schema resource schema.xml
   [junit4]   2> 	at org.apache.solr.schema.IndexSchemaFactory.create(IndexSchemaFactory.java:52)
   [junit4]   2> 	at org.apache.solr.schema.IndexSchemaFactory.buildIndexSchema(IndexSchemaFactory.java:70)
   [junit4]   2> 	at org.apache.solr.core.ConfigSetService.createIndexSchema(ConfigSetService.java:108)
   [junit4]   2> 	at org.apache.solr.core.ConfigSetService.getConfig(ConfigSetService.java:79)
   [junit4]   2> 	... 3 more
   [junit4]   2> Caused by: java.io.IOException: Could not load resource=schema.xml
   [junit4]   2> 	at org.apache.solr.cloud.ZkSolrResourceLoader.openResource(ZkSolrResourceLoader.java:105)
   [junit4]   2> 	at org.apache.solr.core.SolrResourceLoader.openSchema(SolrResourceLoader.java:355)
   [junit4]   2> 	at org.apache.solr.schema.IndexSchemaFactory.create(IndexSchemaFactory.java:48)
   [junit4]   2> 	... 6 more
   [junit4]   2> Caused by: java.lang.InterruptedException: sleep interrupted
   [junit4]   2> 	at java.lang.Thread.sleep(Native Method)
   [junit4]   2> 	at org.apache.solr.cloud.ZkSolrResourceLoader.openResource(ZkSolrResourceLoader.java:101)
   [junit4]   2> 	... 8 more
   [junit4]   2> Sep 08, 2016 7:40:24 AM com.carrotsearch.randomizedtesting.ThreadLeakControl tryToInterruptAll
   [junit4]   2> INFO: All leaked threads terminated.
   [junit4]   2> NOTE: test params are: codec=Asserting(Lucene54): {}, docValues:{}, sim=RandomSimilarity(queryNorm=false,coord=crazy): {}, locale=no-NO, timezone=Greenwich
   [junit4]   2> NOTE: Linux 4.4.0-36-generic i386/Oracle Corporation 1.7.0_80 (32-bit)/cpus=12,threads=1,free=242276888,total=518979584
   [junit4]   2> NOTE: All tests run in this JVM: [TestSearcherReuse, TestTrieFacet, StatsComponentTest, SearchHandlerTest, DistributedSuggestComponentTest, CurrencyFieldXmlFileTest, TestConfigReload, SolrTestCaseJ4Test, DebugComponentTest, BadCopyFieldTest, TestSweetSpotSimilarityFactory, TestUniqueKeyFieldResource, CursorMarkTest, TestUseDocValuesAsStored2, TestSha256AuthenticationProvider, DirectSolrConnectionTest, CircularListTest, HdfsUnloadDistributedZkTest, RecoveryZkTest, TestRequestForwarding, AutoCommitTest, TestXIncludeConfig, TestStressRecovery, DistribCursorPagingTest, TestManagedSchemaFieldTypeResource, TestFreeTextSuggestions, TestFieldTypeResource, DistributedFacetPivotLongTailTest, HdfsLockFactoryTest, TestExpandComponent, BadIndexSchemaTest, CollectionsAPIAsyncDistributedZkTest, TestStressReorder, OverseerTest, TestConfigSetImmutable, IgnoreCommitOptimizeUpdateProcessorFactoryTest, SharedFSAutoReplicaFailoverTest, TestRestoreCore, TestRawTransformer, SuggestComponentContextFilterQueryTest, BlockDirectoryTest, HdfsNNFailoverTest, TestNamedUpdateProcessors, TestFastWriter, TestReversedWildcardFilterFactory, DocValuesMissingTest, TestWriterPerf, TestDistribIDF, TestCollationField, TestReload, TestIndexingPerformance, TestCSVResponseWriter, TestDistributedMissingSort, TestFieldSortValues, InfoHandlerTest, TestChildDocTransformer, TestSolrJ, BinaryUpdateRequestHandlerTest, AssignTest, CustomCollectionTest, HardAutoCommitTest, TestSerializedLuceneMatchVersion, UpdateParamsTest, TestJsonRequest, TestPerFieldSimilarityWithDefaultOverride, TestJettySolrRunner, ConfigSetsAPITest, TestCharFilters, TestCloudSchemaless, TestSchemaResource, DirectUpdateHandlerOptimizeTest, TestClassicSimilarityFactory, CollectionReloadTest, TestLRUStatsCache, TestFieldCollectionResource, TestCollapseQParserPlugin, QueryParsingTest, TestSolrCloudWithKerberosAlt, FieldAnalysisRequestHandlerTest, TestRandomRequestDistribution, HighlighterConfigTest, TestLeaderInitiatedRecoveryThread, BitVectorTest, BlockJoinFacetSimpleTest, TestSolrQueryParser, TestInitParams, ReplicationFactorTest, DistributedFacetPivotWhiteBoxTest, TestSolrXml, TestAnalyzeInfixSuggestions, TestClusterStateMutator, TestGroupingSearch, BasicDistributedZk2Test, CollectionsAPIDistributedZkTest, FullSolrCloudDistribCmdsTest, ShardRoutingCustomTest, TestDistributedSearch, DocumentAnalysisRequestHandlerTest, TestOmitPositions, TermVectorComponentTest, LoggingHandlerTest, ReturnFieldsTest, MBeansHandlerTest, CSVRequestHandlerTest, AlternateDirectoryTest, CopyFieldTest, BadComponentTest, TestMergePolicyConfig, TestDocSet, TestSearchPerf, MinimalSchemaTest, TestFuzzyAnalyzedSuggestions, TestPostingsSolrHighlighter, TestLuceneMatchVersion, TestLMDirichletSimilarityFactory, TestLMJelinekMercerSimilarityFactory, TestJmxMonitoredMap, TimeZoneUtilsTest, ScriptEngineTest, PluginInfoTest, DateMathParserTest, PreAnalyzedFieldTest, TestSystemIdResolver, TestSuggestSpellingConverter, SpellingQueryConverterTest, RAMDirectoryFactoryTest, ClusterStateTest, TestLRUCache, TestUtils, TestDocumentBuilder, SliceStateTest, SystemInfoHandlerTest, UUIDFieldTest, FileUtilsTest, DistributedMLTComponentTest, TestRTGBase, CursorPagingTest, DistributedIntervalFacetingTest, TestTolerantSearch, ConnectionReuseTest, CleanupOldIndexTest, CollectionTooManyReplicasTest, DeleteLastCustomShardedReplicaTest, DeleteReplicaTest, HttpPartitionTest, SharedFSAutoReplicaFailoverUtilsTest, SimpleCollectionCreateDeleteTest, TestCollectionAPI, TestReplicaProperties, CoreSorterTest, DirectoryFactoryTest, HdfsDirectoryFactoryTest, QueryResultKeyTest, TestImplicitCoreProperties, TestInfoStreamLogging, TestReloadAndDeleteDocs, TestShardHandlerFactory, TestSolrConfigHandler, TestSolrDynamicMBean, TestReplicationHandlerBackup, TestSolrConfigHandlerCloud]
   [junit4]   2> NOTE: reproduce with: ant test  -Dtestcase=TestSolrConfigHandlerCloud -Dtests.seed=496B9CBCB5E36BC8 -Dtests.multiplier=3 -Dtests.slow=true -Dtests.locale=no-NO -Dtests.timezone=Greenwich -Dtests.asserts=true -Dtests.file.encoding=US-ASCII
   [junit4] ERROR   0.00s J2 | TestSolrConfigHandlerCloud (suite) <<<
   [junit4]    > Throwable #1: com.carrotsearch.randomizedtesting.ThreadLeakError: 1 thread leaked from SUITE scope at org.apache.solr.handler.TestSolrConfigHandlerCloud: 
   [junit4]    >    1) Thread[id=14244, name=Thread-4561, state=TIMED_WAITING, group=TGRP-TestSolrConfigHandlerCloud]
   [junit4]    >         at java.lang.Thread.sleep(Native Method)
   [junit4]    >         at org.apache.solr.cloud.ZkSolrResourceLoader.openResource(ZkSolrResourceLoader.java:101)
   [junit4]    >         at org.apache.solr.core.SolrResourceLoader.openSchema(SolrResourceLoader.java:355)
   [junit4]    >         at org.apache.solr.schema.IndexSchemaFactory.create(IndexSchemaFactory.java:48)
   [junit4]    >         at org.apache.solr.schema.IndexSchemaFactory.buildIndexSchema(IndexSchemaFactory.java:70)
   [junit4]    >         at org.apache.solr.core.ConfigSetService.createIndexSchema(ConfigSetService.java:108)
   [junit4]    >         at org.apache.solr.core.ConfigSetService.getConfig(ConfigSetService.java:79)
   [junit4]    >         at org.apache.solr.core.CoreContainer.reload(CoreContainer.java:920)
   [junit4]    >         at org.apache.solr.core.SolrCore$11.run(SolrCore.java:2623)
   [junit4]    >         at org.apache.solr.cloud.ZkController$5.run(ZkController.java:2480)
   [junit4]    > 	at __randomizedtesting.SeedInfo.seed([496B9CBCB5E36BC8]:0)
   [junit4] Completed [525/575 (1!)] on J2 in 82.30s, 1 test, 1 error <<< FAILURES!

[...truncated 49297 lines...]


Mime
View raw message