lucene-dev mailing list archives

Site index · List index
Message view « Date » · « Thread »
Top « Date » · « Thread »
From Apache Jenkins Server <jenk...@builds.apache.org>
Subject [JENKINS] Lucene-Solr-NightlyTests-5.5 - Build # 2 - Still Failing
Date Thu, 01 Sep 2016 12:23:38 GMT
Build: https://builds.apache.org/job/Lucene-Solr-NightlyTests-5.5/2/

10 tests failed.
FAILED:  org.apache.solr.cloud.CollectionsAPIDistributedZkTest.test

Error Message:
Test abandoned because suite timeout was reached.

Stack Trace:
java.lang.Exception: Test abandoned because suite timeout was reached.
	at __randomizedtesting.SeedInfo.seed([9B3584A7695CFF52]:0)


FAILED:  junit.framework.TestSuite.org.apache.solr.cloud.CollectionsAPIDistributedZkTest

Error Message:
Suite timeout exceeded (>= 7200000 msec).

Stack Trace:
java.lang.Exception: Suite timeout exceeded (>= 7200000 msec).
	at __randomizedtesting.SeedInfo.seed([9B3584A7695CFF52]:0)


FAILED:  junit.framework.TestSuite.org.apache.solr.cloud.CollectionsAPIDistributedZkTest

Error Message:
Captured an uncaught exception in thread: Thread[id=13683, name=collection0, state=RUNNABLE, group=TGRP-CollectionsAPIDistributedZkTest]

Stack Trace:
com.carrotsearch.randomizedtesting.UncaughtExceptionError: Captured an uncaught exception in thread: Thread[id=13683, name=collection0, state=RUNNABLE, group=TGRP-CollectionsAPIDistributedZkTest]
Caused by: org.apache.solr.client.solrj.impl.HttpSolrClient$RemoteSolrException: Error from server at http://127.0.0.1:46953: collection already exists: awholynewstresscollection_collection0_5
	at __randomizedtesting.SeedInfo.seed([9B3584A7695CFF52]:0)
	at org.apache.solr.client.solrj.impl.HttpSolrClient.executeMethod(HttpSolrClient.java:577)
	at org.apache.solr.client.solrj.impl.HttpSolrClient.request(HttpSolrClient.java:241)
	at org.apache.solr.client.solrj.impl.HttpSolrClient.request(HttpSolrClient.java:230)
	at org.apache.solr.client.solrj.impl.LBHttpSolrClient.doRequest(LBHttpSolrClient.java:372)
	at org.apache.solr.client.solrj.impl.LBHttpSolrClient.request(LBHttpSolrClient.java:325)
	at org.apache.solr.client.solrj.impl.CloudSolrClient.sendRequest(CloudSolrClient.java:1121)
	at org.apache.solr.client.solrj.impl.CloudSolrClient.requestWithRetryOnStaleState(CloudSolrClient.java:891)
	at org.apache.solr.client.solrj.impl.CloudSolrClient.request(CloudSolrClient.java:827)
	at org.apache.solr.client.solrj.SolrClient.request(SolrClient.java:1219)
	at org.apache.solr.cloud.AbstractFullDistribZkTestBase.createCollection(AbstractFullDistribZkTestBase.java:1575)
	at org.apache.solr.cloud.AbstractFullDistribZkTestBase.createCollection(AbstractFullDistribZkTestBase.java:1596)
	at org.apache.solr.cloud.CollectionsAPIDistributedZkTest$1CollectionThread.run(CollectionsAPIDistributedZkTest.java:984)


FAILED:  junit.framework.TestSuite.org.apache.solr.cloud.CollectionsAPIDistributedZkTest

Error Message:
Captured an uncaught exception in thread: Thread[id=13688, name=collection5, state=RUNNABLE, group=TGRP-CollectionsAPIDistributedZkTest]

Stack Trace:
com.carrotsearch.randomizedtesting.UncaughtExceptionError: Captured an uncaught exception in thread: Thread[id=13688, name=collection5, state=RUNNABLE, group=TGRP-CollectionsAPIDistributedZkTest]
Caused by: org.apache.solr.client.solrj.impl.HttpSolrClient$RemoteSolrException: Error from server at http://127.0.0.1:46953: collection already exists: awholynewstresscollection_collection5_5
	at __randomizedtesting.SeedInfo.seed([9B3584A7695CFF52]:0)
	at org.apache.solr.client.solrj.impl.HttpSolrClient.executeMethod(HttpSolrClient.java:577)
	at org.apache.solr.client.solrj.impl.HttpSolrClient.request(HttpSolrClient.java:241)
	at org.apache.solr.client.solrj.impl.HttpSolrClient.request(HttpSolrClient.java:230)
	at org.apache.solr.client.solrj.impl.LBHttpSolrClient.doRequest(LBHttpSolrClient.java:372)
	at org.apache.solr.client.solrj.impl.LBHttpSolrClient.request(LBHttpSolrClient.java:325)
	at org.apache.solr.client.solrj.impl.CloudSolrClient.sendRequest(CloudSolrClient.java:1121)
	at org.apache.solr.client.solrj.impl.CloudSolrClient.requestWithRetryOnStaleState(CloudSolrClient.java:891)
	at org.apache.solr.client.solrj.impl.CloudSolrClient.request(CloudSolrClient.java:827)
	at org.apache.solr.client.solrj.SolrClient.request(SolrClient.java:1219)
	at org.apache.solr.cloud.AbstractFullDistribZkTestBase.createCollection(AbstractFullDistribZkTestBase.java:1575)
	at org.apache.solr.cloud.AbstractFullDistribZkTestBase.createCollection(AbstractFullDistribZkTestBase.java:1596)
	at org.apache.solr.cloud.CollectionsAPIDistributedZkTest$1CollectionThread.run(CollectionsAPIDistributedZkTest.java:984)


FAILED:  junit.framework.TestSuite.org.apache.solr.cloud.CollectionsAPIDistributedZkTest

Error Message:
Captured an uncaught exception in thread: Thread[id=13685, name=collection2, state=RUNNABLE, group=TGRP-CollectionsAPIDistributedZkTest]

Stack Trace:
com.carrotsearch.randomizedtesting.UncaughtExceptionError: Captured an uncaught exception in thread: Thread[id=13685, name=collection2, state=RUNNABLE, group=TGRP-CollectionsAPIDistributedZkTest]
Caused by: org.apache.solr.client.solrj.impl.HttpSolrClient$RemoteSolrException: Error from server at http://127.0.0.1:37518: collection already exists: awholynewstresscollection_collection2_5
	at __randomizedtesting.SeedInfo.seed([9B3584A7695CFF52]:0)
	at org.apache.solr.client.solrj.impl.HttpSolrClient.executeMethod(HttpSolrClient.java:577)
	at org.apache.solr.client.solrj.impl.HttpSolrClient.request(HttpSolrClient.java:241)
	at org.apache.solr.client.solrj.impl.HttpSolrClient.request(HttpSolrClient.java:230)
	at org.apache.solr.client.solrj.impl.LBHttpSolrClient.doRequest(LBHttpSolrClient.java:372)
	at org.apache.solr.client.solrj.impl.LBHttpSolrClient.request(LBHttpSolrClient.java:325)
	at org.apache.solr.client.solrj.impl.CloudSolrClient.sendRequest(CloudSolrClient.java:1121)
	at org.apache.solr.client.solrj.impl.CloudSolrClient.requestWithRetryOnStaleState(CloudSolrClient.java:891)
	at org.apache.solr.client.solrj.impl.CloudSolrClient.request(CloudSolrClient.java:827)
	at org.apache.solr.client.solrj.SolrClient.request(SolrClient.java:1219)
	at org.apache.solr.cloud.AbstractFullDistribZkTestBase.createCollection(AbstractFullDistribZkTestBase.java:1575)
	at org.apache.solr.cloud.AbstractFullDistribZkTestBase.createCollection(AbstractFullDistribZkTestBase.java:1596)
	at org.apache.solr.cloud.CollectionsAPIDistributedZkTest$1CollectionThread.run(CollectionsAPIDistributedZkTest.java:984)


FAILED:  junit.framework.TestSuite.org.apache.solr.cloud.CollectionsAPIDistributedZkTest

Error Message:
Captured an uncaught exception in thread: Thread[id=13687, name=collection4, state=RUNNABLE, group=TGRP-CollectionsAPIDistributedZkTest]

Stack Trace:
com.carrotsearch.randomizedtesting.UncaughtExceptionError: Captured an uncaught exception in thread: Thread[id=13687, name=collection4, state=RUNNABLE, group=TGRP-CollectionsAPIDistributedZkTest]
Caused by: java.lang.RuntimeException: org.apache.solr.client.solrj.SolrServerException: No live SolrServers available to handle this request:[http://127.0.0.1:40526, http://127.0.0.1:44683, http://127.0.0.1:46953, http://127.0.0.1:37518, http://127.0.0.1:45216]
	at __randomizedtesting.SeedInfo.seed([9B3584A7695CFF52]:0)
	at org.apache.solr.cloud.CollectionsAPIDistributedZkTest$1CollectionThread.run(CollectionsAPIDistributedZkTest.java:994)
Caused by: org.apache.solr.client.solrj.SolrServerException: No live SolrServers available to handle this request:[http://127.0.0.1:40526, http://127.0.0.1:44683, http://127.0.0.1:46953, http://127.0.0.1:37518, http://127.0.0.1:45216]
	at org.apache.solr.client.solrj.impl.LBHttpSolrClient.request(LBHttpSolrClient.java:352)
	at org.apache.solr.client.solrj.impl.CloudSolrClient.sendRequest(CloudSolrClient.java:1121)
	at org.apache.solr.client.solrj.impl.CloudSolrClient.requestWithRetryOnStaleState(CloudSolrClient.java:891)
	at org.apache.solr.client.solrj.impl.CloudSolrClient.request(CloudSolrClient.java:827)
	at org.apache.solr.client.solrj.SolrClient.request(SolrClient.java:1219)
	at org.apache.solr.cloud.AbstractFullDistribZkTestBase.createCollection(AbstractFullDistribZkTestBase.java:1575)
	at org.apache.solr.cloud.AbstractFullDistribZkTestBase.createCollection(AbstractFullDistribZkTestBase.java:1596)
	at org.apache.solr.cloud.CollectionsAPIDistributedZkTest$1CollectionThread.run(CollectionsAPIDistributedZkTest.java:984)
Caused by: org.apache.solr.client.solrj.SolrServerException: Timeout occured while waiting response from server at: http://127.0.0.1:40526
	at org.apache.solr.client.solrj.impl.HttpSolrClient.executeMethod(HttpSolrClient.java:586)
	at org.apache.solr.client.solrj.impl.HttpSolrClient.request(HttpSolrClient.java:241)
	at org.apache.solr.client.solrj.impl.HttpSolrClient.request(HttpSolrClient.java:230)
	at org.apache.solr.client.solrj.impl.LBHttpSolrClient.doRequest(LBHttpSolrClient.java:372)
	at org.apache.solr.client.solrj.impl.LBHttpSolrClient.request(LBHttpSolrClient.java:325)
	... 7 more
Caused by: java.net.SocketTimeoutException: Read timed out
	at java.net.SocketInputStream.socketRead0(Native Method)
	at java.net.SocketInputStream.read(SocketInputStream.java:152)
	at java.net.SocketInputStream.read(SocketInputStream.java:122)
	at org.apache.http.impl.io.AbstractSessionInputBuffer.fillBuffer(AbstractSessionInputBuffer.java:160)
	at org.apache.http.impl.io.SocketInputBuffer.fillBuffer(SocketInputBuffer.java:84)
	at org.apache.http.impl.io.AbstractSessionInputBuffer.readLine(AbstractSessionInputBuffer.java:273)
	at org.apache.http.impl.conn.DefaultHttpResponseParser.parseHead(DefaultHttpResponseParser.java:140)
	at org.apache.http.impl.conn.DefaultHttpResponseParser.parseHead(DefaultHttpResponseParser.java:57)
	at org.apache.http.impl.io.AbstractMessageParser.parse(AbstractMessageParser.java:261)
	at org.apache.http.impl.AbstractHttpClientConnection.receiveResponseHeader(AbstractHttpClientConnection.java:283)
	at org.apache.http.impl.conn.DefaultClientConnection.receiveResponseHeader(DefaultClientConnection.java:251)
	at org.apache.http.impl.conn.ManagedClientConnectionImpl.receiveResponseHeader(ManagedClientConnectionImpl.java:197)
	at org.apache.http.protocol.HttpRequestExecutor.doReceiveResponse(HttpRequestExecutor.java:272)
	at org.apache.http.protocol.HttpRequestExecutor.execute(HttpRequestExecutor.java:124)
	at org.apache.http.impl.client.DefaultRequestDirector.tryExecute(DefaultRequestDirector.java:685)
	at org.apache.http.impl.client.DefaultRequestDirector.execute(DefaultRequestDirector.java:487)
	at org.apache.http.impl.client.AbstractHttpClient.doExecute(AbstractHttpClient.java:882)
	at org.apache.http.impl.client.CloseableHttpClient.execute(CloseableHttpClient.java:82)
	at org.apache.http.impl.client.CloseableHttpClient.execute(CloseableHttpClient.java:107)
	at org.apache.http.impl.client.CloseableHttpClient.execute(CloseableHttpClient.java:55)
	at org.apache.solr.client.solrj.impl.HttpSolrClient.executeMethod(HttpSolrClient.java:482)
	... 11 more


FAILED:  junit.framework.TestSuite.org.apache.solr.cloud.CollectionsAPIDistributedZkTest

Error Message:
Captured an uncaught exception in thread: Thread[id=13684, name=collection1, state=RUNNABLE, group=TGRP-CollectionsAPIDistributedZkTest]

Stack Trace:
com.carrotsearch.randomizedtesting.UncaughtExceptionError: Captured an uncaught exception in thread: Thread[id=13684, name=collection1, state=RUNNABLE, group=TGRP-CollectionsAPIDistributedZkTest]
Caused by: java.lang.RuntimeException: org.apache.solr.client.solrj.SolrServerException: No live SolrServers available to handle this request:[http://127.0.0.1:40526, http://127.0.0.1:44683, http://127.0.0.1:46953, http://127.0.0.1:37518, http://127.0.0.1:45216]
	at __randomizedtesting.SeedInfo.seed([9B3584A7695CFF52]:0)
	at org.apache.solr.cloud.CollectionsAPIDistributedZkTest$1CollectionThread.run(CollectionsAPIDistributedZkTest.java:994)
Caused by: org.apache.solr.client.solrj.SolrServerException: No live SolrServers available to handle this request:[http://127.0.0.1:40526, http://127.0.0.1:44683, http://127.0.0.1:46953, http://127.0.0.1:37518, http://127.0.0.1:45216]
	at org.apache.solr.client.solrj.impl.LBHttpSolrClient.request(LBHttpSolrClient.java:352)
	at org.apache.solr.client.solrj.impl.CloudSolrClient.sendRequest(CloudSolrClient.java:1121)
	at org.apache.solr.client.solrj.impl.CloudSolrClient.requestWithRetryOnStaleState(CloudSolrClient.java:891)
	at org.apache.solr.client.solrj.impl.CloudSolrClient.request(CloudSolrClient.java:827)
	at org.apache.solr.client.solrj.SolrClient.request(SolrClient.java:1219)
	at org.apache.solr.cloud.AbstractFullDistribZkTestBase.createCollection(AbstractFullDistribZkTestBase.java:1575)
	at org.apache.solr.cloud.AbstractFullDistribZkTestBase.createCollection(AbstractFullDistribZkTestBase.java:1596)
	at org.apache.solr.cloud.CollectionsAPIDistributedZkTest$1CollectionThread.run(CollectionsAPIDistributedZkTest.java:984)
Caused by: org.apache.solr.client.solrj.SolrServerException: Timeout occured while waiting response from server at: http://127.0.0.1:40526
	at org.apache.solr.client.solrj.impl.HttpSolrClient.executeMethod(HttpSolrClient.java:586)
	at org.apache.solr.client.solrj.impl.HttpSolrClient.request(HttpSolrClient.java:241)
	at org.apache.solr.client.solrj.impl.HttpSolrClient.request(HttpSolrClient.java:230)
	at org.apache.solr.client.solrj.impl.LBHttpSolrClient.doRequest(LBHttpSolrClient.java:372)
	at org.apache.solr.client.solrj.impl.LBHttpSolrClient.request(LBHttpSolrClient.java:325)
	... 7 more
Caused by: java.net.SocketTimeoutException: Read timed out
	at java.net.SocketInputStream.socketRead0(Native Method)
	at java.net.SocketInputStream.read(SocketInputStream.java:152)
	at java.net.SocketInputStream.read(SocketInputStream.java:122)
	at org.apache.http.impl.io.AbstractSessionInputBuffer.fillBuffer(AbstractSessionInputBuffer.java:160)
	at org.apache.http.impl.io.SocketInputBuffer.fillBuffer(SocketInputBuffer.java:84)
	at org.apache.http.impl.io.AbstractSessionInputBuffer.readLine(AbstractSessionInputBuffer.java:273)
	at org.apache.http.impl.conn.DefaultHttpResponseParser.parseHead(DefaultHttpResponseParser.java:140)
	at org.apache.http.impl.conn.DefaultHttpResponseParser.parseHead(DefaultHttpResponseParser.java:57)
	at org.apache.http.impl.io.AbstractMessageParser.parse(AbstractMessageParser.java:261)
	at org.apache.http.impl.AbstractHttpClientConnection.receiveResponseHeader(AbstractHttpClientConnection.java:283)
	at org.apache.http.impl.conn.DefaultClientConnection.receiveResponseHeader(DefaultClientConnection.java:251)
	at org.apache.http.impl.conn.ManagedClientConnectionImpl.receiveResponseHeader(ManagedClientConnectionImpl.java:197)
	at org.apache.http.protocol.HttpRequestExecutor.doReceiveResponse(HttpRequestExecutor.java:272)
	at org.apache.http.protocol.HttpRequestExecutor.execute(HttpRequestExecutor.java:124)
	at org.apache.http.impl.client.DefaultRequestDirector.tryExecute(DefaultRequestDirector.java:685)
	at org.apache.http.impl.client.DefaultRequestDirector.execute(DefaultRequestDirector.java:487)
	at org.apache.http.impl.client.AbstractHttpClient.doExecute(AbstractHttpClient.java:882)
	at org.apache.http.impl.client.CloseableHttpClient.execute(CloseableHttpClient.java:82)
	at org.apache.http.impl.client.CloseableHttpClient.execute(CloseableHttpClient.java:107)
	at org.apache.http.impl.client.CloseableHttpClient.execute(CloseableHttpClient.java:55)
	at org.apache.solr.client.solrj.impl.HttpSolrClient.executeMethod(HttpSolrClient.java:482)
	... 11 more


FAILED:  junit.framework.TestSuite.org.apache.solr.cloud.CollectionsAPIDistributedZkTest

Error Message:
Captured an uncaught exception in thread: Thread[id=13686, name=collection3, state=RUNNABLE, group=TGRP-CollectionsAPIDistributedZkTest]

Stack Trace:
com.carrotsearch.randomizedtesting.UncaughtExceptionError: Captured an uncaught exception in thread: Thread[id=13686, name=collection3, state=RUNNABLE, group=TGRP-CollectionsAPIDistributedZkTest]
Caused by: java.lang.RuntimeException: org.apache.solr.client.solrj.SolrServerException: No live SolrServers available to handle this request:[http://127.0.0.1:40526, http://127.0.0.1:44683, http://127.0.0.1:46953, http://127.0.0.1:37518, http://127.0.0.1:45216]
	at __randomizedtesting.SeedInfo.seed([9B3584A7695CFF52]:0)
	at org.apache.solr.cloud.CollectionsAPIDistributedZkTest$1CollectionThread.run(CollectionsAPIDistributedZkTest.java:994)
Caused by: org.apache.solr.client.solrj.SolrServerException: No live SolrServers available to handle this request:[http://127.0.0.1:40526, http://127.0.0.1:44683, http://127.0.0.1:46953, http://127.0.0.1:37518, http://127.0.0.1:45216]
	at org.apache.solr.client.solrj.impl.LBHttpSolrClient.request(LBHttpSolrClient.java:352)
	at org.apache.solr.client.solrj.impl.CloudSolrClient.sendRequest(CloudSolrClient.java:1121)
	at org.apache.solr.client.solrj.impl.CloudSolrClient.requestWithRetryOnStaleState(CloudSolrClient.java:891)
	at org.apache.solr.client.solrj.impl.CloudSolrClient.request(CloudSolrClient.java:827)
	at org.apache.solr.client.solrj.SolrClient.request(SolrClient.java:1219)
	at org.apache.solr.cloud.AbstractFullDistribZkTestBase.createCollection(AbstractFullDistribZkTestBase.java:1575)
	at org.apache.solr.cloud.AbstractFullDistribZkTestBase.createCollection(AbstractFullDistribZkTestBase.java:1596)
	at org.apache.solr.cloud.CollectionsAPIDistributedZkTest$1CollectionThread.run(CollectionsAPIDistributedZkTest.java:984)
Caused by: org.apache.solr.client.solrj.SolrServerException: Timeout occured while waiting response from server at: http://127.0.0.1:40526
	at org.apache.solr.client.solrj.impl.HttpSolrClient.executeMethod(HttpSolrClient.java:586)
	at org.apache.solr.client.solrj.impl.HttpSolrClient.request(HttpSolrClient.java:241)
	at org.apache.solr.client.solrj.impl.HttpSolrClient.request(HttpSolrClient.java:230)
	at org.apache.solr.client.solrj.impl.LBHttpSolrClient.doRequest(LBHttpSolrClient.java:372)
	at org.apache.solr.client.solrj.impl.LBHttpSolrClient.request(LBHttpSolrClient.java:325)
	... 7 more
Caused by: java.net.SocketTimeoutException: Read timed out
	at java.net.SocketInputStream.socketRead0(Native Method)
	at java.net.SocketInputStream.read(SocketInputStream.java:152)
	at java.net.SocketInputStream.read(SocketInputStream.java:122)
	at org.apache.http.impl.io.AbstractSessionInputBuffer.fillBuffer(AbstractSessionInputBuffer.java:160)
	at org.apache.http.impl.io.SocketInputBuffer.fillBuffer(SocketInputBuffer.java:84)
	at org.apache.http.impl.io.AbstractSessionInputBuffer.readLine(AbstractSessionInputBuffer.java:273)
	at org.apache.http.impl.conn.DefaultHttpResponseParser.parseHead(DefaultHttpResponseParser.java:140)
	at org.apache.http.impl.conn.DefaultHttpResponseParser.parseHead(DefaultHttpResponseParser.java:57)
	at org.apache.http.impl.io.AbstractMessageParser.parse(AbstractMessageParser.java:261)
	at org.apache.http.impl.AbstractHttpClientConnection.receiveResponseHeader(AbstractHttpClientConnection.java:283)
	at org.apache.http.impl.conn.DefaultClientConnection.receiveResponseHeader(DefaultClientConnection.java:251)
	at org.apache.http.impl.conn.ManagedClientConnectionImpl.receiveResponseHeader(ManagedClientConnectionImpl.java:197)
	at org.apache.http.protocol.HttpRequestExecutor.doReceiveResponse(HttpRequestExecutor.java:272)
	at org.apache.http.protocol.HttpRequestExecutor.execute(HttpRequestExecutor.java:124)
	at org.apache.http.impl.client.DefaultRequestDirector.tryExecute(DefaultRequestDirector.java:685)
	at org.apache.http.impl.client.DefaultRequestDirector.execute(DefaultRequestDirector.java:487)
	at org.apache.http.impl.client.AbstractHttpClient.doExecute(AbstractHttpClient.java:882)
	at org.apache.http.impl.client.CloseableHttpClient.execute(CloseableHttpClient.java:82)
	at org.apache.http.impl.client.CloseableHttpClient.execute(CloseableHttpClient.java:107)
	at org.apache.http.impl.client.CloseableHttpClient.execute(CloseableHttpClient.java:55)
	at org.apache.solr.client.solrj.impl.HttpSolrClient.executeMethod(HttpSolrClient.java:482)
	... 11 more


FAILED:  junit.framework.TestSuite.org.apache.solr.cloud.hdfs.HdfsChaosMonkeyNothingIsSafeTest

Error Message:
ObjectTracker found 1 object(s) that were not released!!! [HdfsTransactionLog]

Stack Trace:
java.lang.AssertionError: ObjectTracker found 1 object(s) that were not released!!! [HdfsTransactionLog]
	at __randomizedtesting.SeedInfo.seed([9B3584A7695CFF52]:0)
	at org.junit.Assert.fail(Assert.java:93)
	at org.junit.Assert.assertTrue(Assert.java:43)
	at org.junit.Assert.assertNull(Assert.java:551)
	at org.apache.solr.SolrTestCaseJ4.afterClass(SolrTestCaseJ4.java:238)
	at sun.reflect.GeneratedMethodAccessor26.invoke(Unknown Source)
	at sun.reflect.DelegatingMethodAccessorImpl.invoke(DelegatingMethodAccessorImpl.java:43)
	at java.lang.reflect.Method.invoke(Method.java:606)
	at com.carrotsearch.randomizedtesting.RandomizedRunner.invoke(RandomizedRunner.java:1764)
	at com.carrotsearch.randomizedtesting.RandomizedRunner$7.evaluate(RandomizedRunner.java:834)
	at com.carrotsearch.randomizedtesting.rules.StatementAdapter.evaluate(StatementAdapter.java:36)
	at com.carrotsearch.randomizedtesting.rules.SystemPropertiesRestoreRule$1.evaluate(SystemPropertiesRestoreRule.java:57)
	at org.apache.lucene.util.AbstractBeforeAfterRule$1.evaluate(AbstractBeforeAfterRule.java:45)
	at com.carrotsearch.randomizedtesting.rules.StatementAdapter.evaluate(StatementAdapter.java:36)
	at org.apache.lucene.util.TestRuleStoreClassName$1.evaluate(TestRuleStoreClassName.java:41)
	at com.carrotsearch.randomizedtesting.rules.NoShadowingOrOverridesOnMethodsRule$1.evaluate(NoShadowingOrOverridesOnMethodsRule.java:40)
	at com.carrotsearch.randomizedtesting.rules.NoShadowingOrOverridesOnMethodsRule$1.evaluate(NoShadowingOrOverridesOnMethodsRule.java:40)
	at com.carrotsearch.randomizedtesting.rules.StatementAdapter.evaluate(StatementAdapter.java:36)
	at com.carrotsearch.randomizedtesting.rules.StatementAdapter.evaluate(StatementAdapter.java:36)
	at com.carrotsearch.randomizedtesting.rules.StatementAdapter.evaluate(StatementAdapter.java:36)
	at org.apache.lucene.util.TestRuleAssertionsRequired$1.evaluate(TestRuleAssertionsRequired.java:53)
	at org.apache.lucene.util.TestRuleMarkFailure$1.evaluate(TestRuleMarkFailure.java:47)
	at org.apache.lucene.util.TestRuleIgnoreAfterMaxFailures$1.evaluate(TestRuleIgnoreAfterMaxFailures.java:64)
	at org.apache.lucene.util.TestRuleIgnoreTestSuites$1.evaluate(TestRuleIgnoreTestSuites.java:54)
	at com.carrotsearch.randomizedtesting.rules.StatementAdapter.evaluate(StatementAdapter.java:36)
	at com.carrotsearch.randomizedtesting.ThreadLeakControl$StatementRunner.run(ThreadLeakControl.java:367)
	at java.lang.Thread.run(Thread.java:745)


FAILED:  org.apache.solr.update.HardAutoCommitTest.testCommitWithin

Error Message:
Exception during query

Stack Trace:
java.lang.RuntimeException: Exception during query
	at __randomizedtesting.SeedInfo.seed([9B3584A7695CFF52:21E7EBDFEA721147]:0)
	at org.apache.solr.SolrTestCaseJ4.assertQ(SolrTestCaseJ4.java:764)
	at org.apache.solr.update.HardAutoCommitTest.testCommitWithin(HardAutoCommitTest.java:99)
	at sun.reflect.NativeMethodAccessorImpl.invoke0(Native Method)
	at sun.reflect.NativeMethodAccessorImpl.invoke(NativeMethodAccessorImpl.java:57)
	at sun.reflect.DelegatingMethodAccessorImpl.invoke(DelegatingMethodAccessorImpl.java:43)
	at java.lang.reflect.Method.invoke(Method.java:606)
	at com.carrotsearch.randomizedtesting.RandomizedRunner.invoke(RandomizedRunner.java:1764)
	at com.carrotsearch.randomizedtesting.RandomizedRunner$8.evaluate(RandomizedRunner.java:871)
	at com.carrotsearch.randomizedtesting.RandomizedRunner$9.evaluate(RandomizedRunner.java:907)
	at com.carrotsearch.randomizedtesting.RandomizedRunner$10.evaluate(RandomizedRunner.java:921)
	at com.carrotsearch.randomizedtesting.rules.SystemPropertiesRestoreRule$1.evaluate(SystemPropertiesRestoreRule.java:57)
	at org.apache.lucene.util.TestRuleSetupTeardownChained$1.evaluate(TestRuleSetupTeardownChained.java:49)
	at org.apache.lucene.util.AbstractBeforeAfterRule$1.evaluate(AbstractBeforeAfterRule.java:45)
	at org.apache.lucene.util.TestRuleThreadAndTestName$1.evaluate(TestRuleThreadAndTestName.java:48)
	at org.apache.lucene.util.TestRuleIgnoreAfterMaxFailures$1.evaluate(TestRuleIgnoreAfterMaxFailures.java:64)
	at org.apache.lucene.util.TestRuleMarkFailure$1.evaluate(TestRuleMarkFailure.java:47)
	at com.carrotsearch.randomizedtesting.rules.StatementAdapter.evaluate(StatementAdapter.java:36)
	at com.carrotsearch.randomizedtesting.ThreadLeakControl$StatementRunner.run(ThreadLeakControl.java:367)
	at com.carrotsearch.randomizedtesting.ThreadLeakControl.forkTimeoutingTask(ThreadLeakControl.java:809)
	at com.carrotsearch.randomizedtesting.ThreadLeakControl$3.evaluate(ThreadLeakControl.java:460)
	at com.carrotsearch.randomizedtesting.RandomizedRunner.runSingleTest(RandomizedRunner.java:880)
	at com.carrotsearch.randomizedtesting.RandomizedRunner$5.evaluate(RandomizedRunner.java:781)
	at com.carrotsearch.randomizedtesting.RandomizedRunner$6.evaluate(RandomizedRunner.java:816)
	at com.carrotsearch.randomizedtesting.RandomizedRunner$7.evaluate(RandomizedRunner.java:827)
	at com.carrotsearch.randomizedtesting.rules.StatementAdapter.evaluate(StatementAdapter.java:36)
	at com.carrotsearch.randomizedtesting.rules.SystemPropertiesRestoreRule$1.evaluate(SystemPropertiesRestoreRule.java:57)
	at org.apache.lucene.util.AbstractBeforeAfterRule$1.evaluate(AbstractBeforeAfterRule.java:45)
	at com.carrotsearch.randomizedtesting.rules.StatementAdapter.evaluate(StatementAdapter.java:36)
	at org.apache.lucene.util.TestRuleStoreClassName$1.evaluate(TestRuleStoreClassName.java:41)
	at com.carrotsearch.randomizedtesting.rules.NoShadowingOrOverridesOnMethodsRule$1.evaluate(NoShadowingOrOverridesOnMethodsRule.java:40)
	at com.carrotsearch.randomizedtesting.rules.NoShadowingOrOverridesOnMethodsRule$1.evaluate(NoShadowingOrOverridesOnMethodsRule.java:40)
	at com.carrotsearch.randomizedtesting.rules.StatementAdapter.evaluate(StatementAdapter.java:36)
	at com.carrotsearch.randomizedtesting.rules.StatementAdapter.evaluate(StatementAdapter.java:36)
	at com.carrotsearch.randomizedtesting.rules.StatementAdapter.evaluate(StatementAdapter.java:36)
	at org.apache.lucene.util.TestRuleAssertionsRequired$1.evaluate(TestRuleAssertionsRequired.java:53)
	at org.apache.lucene.util.TestRuleMarkFailure$1.evaluate(TestRuleMarkFailure.java:47)
	at org.apache.lucene.util.TestRuleIgnoreAfterMaxFailures$1.evaluate(TestRuleIgnoreAfterMaxFailures.java:64)
	at org.apache.lucene.util.TestRuleIgnoreTestSuites$1.evaluate(TestRuleIgnoreTestSuites.java:54)
	at com.carrotsearch.randomizedtesting.rules.StatementAdapter.evaluate(StatementAdapter.java:36)
	at com.carrotsearch.randomizedtesting.ThreadLeakControl$StatementRunner.run(ThreadLeakControl.java:367)
	at java.lang.Thread.run(Thread.java:745)
Caused by: java.lang.RuntimeException: REQUEST FAILED: xpath=//result[@numFound=1]
	xml response was: <?xml version="1.0" encoding="UTF-8"?>
<response>
<lst name="responseHeader"><int name="status">0</int><int name="QTime">0</int></lst><result name="response" numFound="0" start="0"></result>
</response>

	request was:qt=standard&rows=20&start=0&version=2.2&q=id:529
	at org.apache.solr.SolrTestCaseJ4.assertQ(SolrTestCaseJ4.java:757)
	... 40 more




Build Log:
[...truncated 11181 lines...]
   [junit4] Suite: org.apache.solr.cloud.hdfs.HdfsChaosMonkeyNothingIsSafeTest
   [junit4]   2> Creating dataDir: /x1/jenkins/jenkins-slave/workspace/Lucene-Solr-NightlyTests-5.5/checkout/solr/build/solr-core/test/J2/temp/solr.cloud.hdfs.HdfsChaosMonkeyNothingIsSafeTest_9B3584A7695CFF52-001/init-core-data-001
   [junit4]   2> 301696 INFO  (SUITE-HdfsChaosMonkeyNothingIsSafeTest-seed#[9B3584A7695CFF52]-worker) [    ] o.a.s.BaseDistributedSearchTestCase Setting hostContext system property: /
   [junit4]   2> 302346 WARN  (SUITE-HdfsChaosMonkeyNothingIsSafeTest-seed#[9B3584A7695CFF52]-worker) [    ] o.a.h.u.NativeCodeLoader Unable to load native-hadoop library for your platform... using builtin-java classes where applicable
   [junit4]   1> Formatting using clusterid: testClusterID
   [junit4]   2> 303080 WARN  (SUITE-HdfsChaosMonkeyNothingIsSafeTest-seed#[9B3584A7695CFF52]-worker) [    ] o.a.h.m.i.MetricsConfig Cannot locate configuration: tried hadoop-metrics2-namenode.properties,hadoop-metrics2.properties
   [junit4]   2> 303337 INFO  (SUITE-HdfsChaosMonkeyNothingIsSafeTest-seed#[9B3584A7695CFF52]-worker) [    ] o.m.log Logging to org.slf4j.impl.Log4jLoggerAdapter(org.mortbay.log) via org.mortbay.log.Slf4jLog
   [junit4]   2> 303345 WARN  (SUITE-HdfsChaosMonkeyNothingIsSafeTest-seed#[9B3584A7695CFF52]-worker) [    ] o.a.h.h.HttpRequestLog Jetty request log can only be enabled using Log4j
   [junit4]   2> 303402 INFO  (SUITE-HdfsChaosMonkeyNothingIsSafeTest-seed#[9B3584A7695CFF52]-worker) [    ] o.m.log jetty-6.1.26
   [junit4]   2> 303443 INFO  (SUITE-HdfsChaosMonkeyNothingIsSafeTest-seed#[9B3584A7695CFF52]-worker) [    ] o.m.log Extract jar:file:/x1/jenkins/.ivy2/cache/org.apache.hadoop/hadoop-hdfs/tests/hadoop-hdfs-2.6.0-tests.jar!/webapps/hdfs to ./temp/Jetty_localhost_49979_hdfs____1qoxy8/webapp
   [junit4]   2> 303910 INFO  (SUITE-HdfsChaosMonkeyNothingIsSafeTest-seed#[9B3584A7695CFF52]-worker) [    ] o.m.log NO JSP Support for /, did not find org.apache.jasper.servlet.JspServlet
   [junit4]   2> 304700 INFO  (SUITE-HdfsChaosMonkeyNothingIsSafeTest-seed#[9B3584A7695CFF52]-worker) [    ] o.m.log Started HttpServer2$SelectChannelConnectorWithSafeStartup@localhost:49979
   [junit4]   2> 306438 WARN  (SUITE-HdfsChaosMonkeyNothingIsSafeTest-seed#[9B3584A7695CFF52]-worker) [    ] o.a.h.h.HttpRequestLog Jetty request log can only be enabled using Log4j
   [junit4]   2> 306450 INFO  (SUITE-HdfsChaosMonkeyNothingIsSafeTest-seed#[9B3584A7695CFF52]-worker) [    ] o.m.log jetty-6.1.26
   [junit4]   2> 306472 INFO  (SUITE-HdfsChaosMonkeyNothingIsSafeTest-seed#[9B3584A7695CFF52]-worker) [    ] o.m.log Extract jar:file:/x1/jenkins/.ivy2/cache/org.apache.hadoop/hadoop-hdfs/tests/hadoop-hdfs-2.6.0-tests.jar!/webapps/datanode to ./temp/Jetty_localhost_39461_datanode____uickz4/webapp
   [junit4]   2> 306907 INFO  (SUITE-HdfsChaosMonkeyNothingIsSafeTest-seed#[9B3584A7695CFF52]-worker) [    ] o.m.log NO JSP Support for /, did not find org.apache.jasper.servlet.JspServlet
   [junit4]   2> 307102 INFO  (SUITE-HdfsChaosMonkeyNothingIsSafeTest-seed#[9B3584A7695CFF52]-worker) [    ] o.m.log Started HttpServer2$SelectChannelConnectorWithSafeStartup@localhost:39461
   [junit4]   2> 307450 WARN  (SUITE-HdfsChaosMonkeyNothingIsSafeTest-seed#[9B3584A7695CFF52]-worker) [    ] o.a.h.h.HttpRequestLog Jetty request log can only be enabled using Log4j
   [junit4]   2> 307452 INFO  (SUITE-HdfsChaosMonkeyNothingIsSafeTest-seed#[9B3584A7695CFF52]-worker) [    ] o.m.log jetty-6.1.26
   [junit4]   2> 307492 INFO  (SUITE-HdfsChaosMonkeyNothingIsSafeTest-seed#[9B3584A7695CFF52]-worker) [    ] o.m.log Extract jar:file:/x1/jenkins/.ivy2/cache/org.apache.hadoop/hadoop-hdfs/tests/hadoop-hdfs-2.6.0-tests.jar!/webapps/datanode to ./temp/Jetty_localhost_41941_datanode____.max9s0/webapp
   [junit4]   2> 307806 INFO  (SUITE-HdfsChaosMonkeyNothingIsSafeTest-seed#[9B3584A7695CFF52]-worker) [    ] o.m.log NO JSP Support for /, did not find org.apache.jasper.servlet.JspServlet
   [junit4]   2> 308086 INFO  (SUITE-HdfsChaosMonkeyNothingIsSafeTest-seed#[9B3584A7695CFF52]-worker) [    ] o.m.log Started HttpServer2$SelectChannelConnectorWithSafeStartup@localhost:41941
   [junit4]   2> 308976 INFO  (IPC Server handler 0 on 50146) [    ] BlockStateChange BLOCK* processReport: from storage DS-93067167-34ab-4e6b-ae06-2badf451703c node DatanodeRegistration(127.0.0.1, datanodeUuid=2f377817-68e2-4638-bfe0-e5f2b8394c64, infoPort=39461, ipcPort=59700, storageInfo=lv=-56;cid=testClusterID;nsid=323319340;c=0), blocks: 0, hasStaleStorages: true, processing time: 2 msecs
   [junit4]   2> 308977 INFO  (IPC Server handler 1 on 50146) [    ] BlockStateChange BLOCK* processReport: from storage DS-0efb0876-ee2c-4e3f-92d0-ea9fd849a4bc node DatanodeRegistration(127.0.0.1, datanodeUuid=4e16c01f-26fd-4267-b071-6afd238c3ec3, infoPort=41941, ipcPort=52125, storageInfo=lv=-56;cid=testClusterID;nsid=323319340;c=0), blocks: 0, hasStaleStorages: true, processing time: 1 msecs
   [junit4]   2> 308977 INFO  (IPC Server handler 0 on 50146) [    ] BlockStateChange BLOCK* processReport: from storage DS-06bf77e9-6478-4de8-bafd-d076812ea7d0 node DatanodeRegistration(127.0.0.1, datanodeUuid=2f377817-68e2-4638-bfe0-e5f2b8394c64, infoPort=39461, ipcPort=59700, storageInfo=lv=-56;cid=testClusterID;nsid=323319340;c=0), blocks: 0, hasStaleStorages: false, processing time: 0 msecs
   [junit4]   2> 308985 INFO  (IPC Server handler 1 on 50146) [    ] BlockStateChange BLOCK* processReport: from storage DS-2972fa33-bc2a-4dd2-91c1-a21b5b4d8ce6 node DatanodeRegistration(127.0.0.1, datanodeUuid=4e16c01f-26fd-4267-b071-6afd238c3ec3, infoPort=41941, ipcPort=52125, storageInfo=lv=-56;cid=testClusterID;nsid=323319340;c=0), blocks: 0, hasStaleStorages: false, processing time: 0 msecs
   [junit4]   2> 309392 INFO  (TEST-HdfsChaosMonkeyNothingIsSafeTest.test-seed#[9B3584A7695CFF52]) [    ] o.a.s.c.ZkTestServer STARTING ZK TEST SERVER
   [junit4]   2> 309392 INFO  (Thread-664) [    ] o.a.s.c.ZkTestServer client port:0.0.0.0/0.0.0.0:0
   [junit4]   2> 309392 INFO  (Thread-664) [    ] o.a.s.c.ZkTestServer Starting server
   [junit4]   2> 309492 INFO  (TEST-HdfsChaosMonkeyNothingIsSafeTest.test-seed#[9B3584A7695CFF52]) [    ] o.a.s.c.ZkTestServer start zk server on port:55893
   [junit4]   2> 309492 INFO  (TEST-HdfsChaosMonkeyNothingIsSafeTest.test-seed#[9B3584A7695CFF52]) [    ] o.a.s.c.c.SolrZkClient Using default ZkCredentialsProvider
   [junit4]   2> 309518 INFO  (TEST-HdfsChaosMonkeyNothingIsSafeTest.test-seed#[9B3584A7695CFF52]) [    ] o.a.s.c.c.ConnectionManager Waiting for client to connect to ZooKeeper
   [junit4]   2> 309537 INFO  (zkCallback-313-thread-1) [    ] o.a.s.c.c.ConnectionManager Watcher org.apache.solr.common.cloud.ConnectionManager@16e217be name:ZooKeeperConnection Watcher:127.0.0.1:55893 got event WatchedEvent state:SyncConnected type:None path:null path:null type:None
   [junit4]   2> 309537 INFO  (TEST-HdfsChaosMonkeyNothingIsSafeTest.test-seed#[9B3584A7695CFF52]) [    ] o.a.s.c.c.ConnectionManager Client is connected to ZooKeeper
   [junit4]   2> 309537 INFO  (TEST-HdfsChaosMonkeyNothingIsSafeTest.test-seed#[9B3584A7695CFF52]) [    ] o.a.s.c.c.SolrZkClient Using default ZkACLProvider
   [junit4]   2> 309537 INFO  (TEST-HdfsChaosMonkeyNothingIsSafeTest.test-seed#[9B3584A7695CFF52]) [    ] o.a.s.c.c.SolrZkClient makePath: /solr
   [junit4]   2> 309540 INFO  (TEST-HdfsChaosMonkeyNothingIsSafeTest.test-seed#[9B3584A7695CFF52]) [    ] o.a.s.c.c.SolrZkClient Using default ZkCredentialsProvider
   [junit4]   2> 309549 INFO  (TEST-HdfsChaosMonkeyNothingIsSafeTest.test-seed#[9B3584A7695CFF52]) [    ] o.a.s.c.c.ConnectionManager Waiting for client to connect to ZooKeeper
   [junit4]   2> 309570 INFO  (zkCallback-314-thread-1) [    ] o.a.s.c.c.ConnectionManager Watcher org.apache.solr.common.cloud.ConnectionManager@17e089c2 name:ZooKeeperConnection Watcher:127.0.0.1:55893/solr got event WatchedEvent state:SyncConnected type:None path:null path:null type:None
   [junit4]   2> 309570 INFO  (TEST-HdfsChaosMonkeyNothingIsSafeTest.test-seed#[9B3584A7695CFF52]) [    ] o.a.s.c.c.ConnectionManager Client is connected to ZooKeeper
   [junit4]   2> 309570 INFO  (TEST-HdfsChaosMonkeyNothingIsSafeTest.test-seed#[9B3584A7695CFF52]) [    ] o.a.s.c.c.SolrZkClient Using default ZkACLProvider
   [junit4]   2> 309571 INFO  (TEST-HdfsChaosMonkeyNothingIsSafeTest.test-seed#[9B3584A7695CFF52]) [    ] o.a.s.c.c.SolrZkClient makePath: /collections/collection1
   [junit4]   2> 309573 INFO  (TEST-HdfsChaosMonkeyNothingIsSafeTest.test-seed#[9B3584A7695CFF52]) [    ] o.a.s.c.c.SolrZkClient makePath: /collections/collection1/shards
   [junit4]   2> 309574 INFO  (TEST-HdfsChaosMonkeyNothingIsSafeTest.test-seed#[9B3584A7695CFF52]) [    ] o.a.s.c.c.SolrZkClient makePath: /collections/control_collection
   [junit4]   2> 309575 INFO  (TEST-HdfsChaosMonkeyNothingIsSafeTest.test-seed#[9B3584A7695CFF52]) [    ] o.a.s.c.c.SolrZkClient makePath: /collections/control_collection/shards
   [junit4]   2> 309577 INFO  (TEST-HdfsChaosMonkeyNothingIsSafeTest.test-seed#[9B3584A7695CFF52]) [    ] o.a.s.c.AbstractZkTestCase put /x1/jenkins/jenkins-slave/workspace/Lucene-Solr-NightlyTests-5.5/checkout/solr/core/src/test-files/solr/collection1/conf/solrconfig-tlog.xml to /configs/conf1/solrconfig.xml
   [junit4]   2> 309577 INFO  (TEST-HdfsChaosMonkeyNothingIsSafeTest.test-seed#[9B3584A7695CFF52]) [    ] o.a.s.c.c.SolrZkClient makePath: /configs/conf1/solrconfig.xml
   [junit4]   2> 309580 INFO  (TEST-HdfsChaosMonkeyNothingIsSafeTest.test-seed#[9B3584A7695CFF52]) [    ] o.a.s.c.AbstractZkTestCase put /x1/jenkins/jenkins-slave/workspace/Lucene-Solr-NightlyTests-5.5/checkout/solr/core/src/test-files/solr/collection1/conf/schema15.xml to /configs/conf1/schema.xml
   [junit4]   2> 309580 INFO  (TEST-HdfsChaosMonkeyNothingIsSafeTest.test-seed#[9B3584A7695CFF52]) [    ] o.a.s.c.c.SolrZkClient makePath: /configs/conf1/schema.xml
   [junit4]   2> 309581 INFO  (TEST-HdfsChaosMonkeyNothingIsSafeTest.test-seed#[9B3584A7695CFF52]) [    ] o.a.s.c.AbstractZkTestCase put /x1/jenkins/jenkins-slave/workspace/Lucene-Solr-NightlyTests-5.5/checkout/solr/core/src/test-files/solr/collection1/conf/solrconfig.snippet.randomindexconfig.xml to /configs/conf1/solrconfig.snippet.randomindexconfig.xml
   [junit4]   2> 309582 INFO  (TEST-HdfsChaosMonkeyNothingIsSafeTest.test-seed#[9B3584A7695CFF52]) [    ] o.a.s.c.c.SolrZkClient makePath: /configs/conf1/solrconfig.snippet.randomindexconfig.xml
   [junit4]   2> 309583 INFO  (TEST-HdfsChaosMonkeyNothingIsSafeTest.test-seed#[9B3584A7695CFF52]) [    ] o.a.s.c.AbstractZkTestCase put /x1/jenkins/jenkins-slave/workspace/Lucene-Solr-NightlyTests-5.5/checkout/solr/core/src/test-files/solr/collection1/conf/stopwords.txt to /configs/conf1/stopwords.txt
   [junit4]   2> 309583 INFO  (TEST-HdfsChaosMonkeyNothingIsSafeTest.test-seed#[9B3584A7695CFF52]) [    ] o.a.s.c.c.SolrZkClient makePath: /configs/conf1/stopwords.txt
   [junit4]   2> 309585 INFO  (TEST-HdfsChaosMonkeyNothingIsSafeTest.test-seed#[9B3584A7695CFF52]) [    ] o.a.s.c.AbstractZkTestCase put /x1/jenkins/jenkins-slave/workspace/Lucene-Solr-NightlyTests-5.5/checkout/solr/core/src/test-files/solr/collection1/conf/protwords.txt to /configs/conf1/protwords.txt
   [junit4]   2> 309585 INFO  (TEST-HdfsChaosMonkeyNothingIsSafeTest.test-seed#[9B3584A7695CFF52]) [    ] o.a.s.c.c.SolrZkClient makePath: /configs/conf1/protwords.txt
   [junit4]   2> 309586 INFO  (TEST-HdfsChaosMonkeyNothingIsSafeTest.test-seed#[9B3584A7695CFF52]) [    ] o.a.s.c.AbstractZkTestCase put /x1/jenkins/jenkins-slave/workspace/Lucene-Solr-NightlyTests-5.5/checkout/solr/core/src/test-files/solr/collection1/conf/currency.xml to /configs/conf1/currency.xml
   [junit4]   2> 309586 INFO  (TEST-HdfsChaosMonkeyNothingIsSafeTest.test-seed#[9B3584A7695CFF52]) [    ] o.a.s.c.c.SolrZkClient makePath: /configs/conf1/currency.xml
   [junit4]   2> 309588 INFO  (TEST-HdfsChaosMonkeyNothingIsSafeTest.test-seed#[9B3584A7695CFF52]) [    ] o.a.s.c.AbstractZkTestCase put /x1/jenkins/jenkins-slave/workspace/Lucene-Solr-NightlyTests-5.5/checkout/solr/core/src/test-files/solr/collection1/conf/enumsConfig.xml to /configs/conf1/enumsConfig.xml
   [junit4]   2> 309588 INFO  (TEST-HdfsChaosMonkeyNothingIsSafeTest.test-seed#[9B3584A7695CFF52]) [    ] o.a.s.c.c.SolrZkClient makePath: /configs/conf1/enumsConfig.xml
   [junit4]   2> 309589 INFO  (TEST-HdfsChaosMonkeyNothingIsSafeTest.test-seed#[9B3584A7695CFF52]) [    ] o.a.s.c.AbstractZkTestCase put /x1/jenkins/jenkins-slave/workspace/Lucene-Solr-NightlyTests-5.5/checkout/solr/core/src/test-files/solr/collection1/conf/open-exchange-rates.json to /configs/conf1/open-exchange-rates.json
   [junit4]   2> 309590 INFO  (TEST-HdfsChaosMonkeyNothingIsSafeTest.test-seed#[9B3584A7695CFF52]) [    ] o.a.s.c.c.SolrZkClient makePath: /configs/conf1/open-exchange-rates.json
   [junit4]   2> 309591 INFO  (TEST-HdfsChaosMonkeyNothingIsSafeTest.test-seed#[9B3584A7695CFF52]) [    ] o.a.s.c.AbstractZkTestCase put /x1/jenkins/jenkins-slave/workspace/Lucene-Solr-NightlyTests-5.5/checkout/solr/core/src/test-files/solr/collection1/conf/mapping-ISOLatin1Accent.txt to /configs/conf1/mapping-ISOLatin1Accent.txt
   [junit4]   2> 309591 INFO  (TEST-HdfsChaosMonkeyNothingIsSafeTest.test-seed#[9B3584A7695CFF52]) [    ] o.a.s.c.c.SolrZkClient makePath: /configs/conf1/mapping-ISOLatin1Accent.txt
   [junit4]   2> 309593 INFO  (TEST-HdfsChaosMonkeyNothingIsSafeTest.test-seed#[9B3584A7695CFF52]) [    ] o.a.s.c.AbstractZkTestCase put /x1/jenkins/jenkins-slave/workspace/Lucene-Solr-NightlyTests-5.5/checkout/solr/core/src/test-files/solr/collection1/conf/old_synonyms.txt to /configs/conf1/old_synonyms.txt
   [junit4]   2> 309593 INFO  (TEST-HdfsChaosMonkeyNothingIsSafeTest.test-seed#[9B3584A7695CFF52]) [    ] o.a.s.c.c.SolrZkClient makePath: /configs/conf1/old_synonyms.txt
   [junit4]   2> 309594 INFO  (TEST-HdfsChaosMonkeyNothingIsSafeTest.test-seed#[9B3584A7695CFF52]) [    ] o.a.s.c.AbstractZkTestCase put /x1/jenkins/jenkins-slave/workspace/Lucene-Solr-NightlyTests-5.5/checkout/solr/core/src/test-files/solr/collection1/conf/synonyms.txt to /configs/conf1/synonyms.txt
   [junit4]   2> 309594 INFO  (TEST-HdfsChaosMonkeyNothingIsSafeTest.test-seed#[9B3584A7695CFF52]) [    ] o.a.s.c.c.SolrZkClient makePath: /configs/conf1/synonyms.txt
   [junit4]   2> 309673 INFO  (TEST-HdfsChaosMonkeyNothingIsSafeTest.test-seed#[9B3584A7695CFF52]) [    ] o.a.s.SolrTestCaseJ4 Writing core.properties file to /x1/jenkins/jenkins-slave/workspace/Lucene-Solr-NightlyTests-5.5/checkout/solr/build/solr-core/test/J2/temp/solr.cloud.hdfs.HdfsChaosMonkeyNothingIsSafeTest_9B3584A7695CFF52-001/control-001/cores/collection1
   [junit4]   2> 309685 INFO  (TEST-HdfsChaosMonkeyNothingIsSafeTest.test-seed#[9B3584A7695CFF52]) [    ] o.e.j.s.Server jetty-9.2.13.v20150730
   [junit4]   2> 309748 INFO  (TEST-HdfsChaosMonkeyNothingIsSafeTest.test-seed#[9B3584A7695CFF52]) [    ] o.e.j.s.h.ContextHandler Started o.e.j.s.ServletContextHandler@2fddcc30{/,null,AVAILABLE}
   [junit4]   2> 309748 INFO  (TEST-HdfsChaosMonkeyNothingIsSafeTest.test-seed#[9B3584A7695CFF52]) [    ] o.e.j.s.ServerConnector Started ServerConnector@a887bdd{HTTP/1.1}{127.0.0.1:50888}
   [junit4]   2> 309748 INFO  (TEST-HdfsChaosMonkeyNothingIsSafeTest.test-seed#[9B3584A7695CFF52]) [    ] o.e.j.s.Server Started @312657ms
   [junit4]   2> 309749 INFO  (TEST-HdfsChaosMonkeyNothingIsSafeTest.test-seed#[9B3584A7695CFF52]) [    ] o.a.s.c.s.e.JettySolrRunner Jetty properties: {solr.data.dir=hdfs://localhost:50146/hdfs__localhost_50146__x1_jenkins_jenkins-slave_workspace_Lucene-Solr-NightlyTests-5.5_checkout_solr_build_solr-core_test_J2_temp_solr.cloud.hdfs.HdfsChaosMonkeyNothingIsSafeTest_9B3584A7695CFF52-001_tempDir-002_control_data, hostPort=50888, coreRootDirectory=/x1/jenkins/jenkins-slave/workspace/Lucene-Solr-NightlyTests-5.5/checkout/solr/build/solr-core/test/J2/temp/solr.cloud.hdfs.HdfsChaosMonkeyNothingIsSafeTest_9B3584A7695CFF52-001/control-001/cores, hostContext=/}
   [junit4]   2> 309864 INFO  (TEST-HdfsChaosMonkeyNothingIsSafeTest.test-seed#[9B3584A7695CFF52]) [    ] o.a.s.s.SolrDispatchFilter SolrDispatchFilter.init(): sun.misc.Launcher$AppClassLoader@19789a96
   [junit4]   2> 309865 INFO  (TEST-HdfsChaosMonkeyNothingIsSafeTest.test-seed#[9B3584A7695CFF52]) [    ] o.a.s.c.SolrResourceLoader new SolrResourceLoader for directory: '/x1/jenkins/jenkins-slave/workspace/Lucene-Solr-NightlyTests-5.5/checkout/solr/build/solr-core/test/J2/temp/solr.cloud.hdfs.HdfsChaosMonkeyNothingIsSafeTest_9B3584A7695CFF52-001/control-001'
   [junit4]   2> 309865 INFO  (TEST-HdfsChaosMonkeyNothingIsSafeTest.test-seed#[9B3584A7695CFF52]) [    ] o.a.s.c.SolrResourceLoader JNDI not configured for solr (NoInitialContextEx)
   [junit4]   2> 309865 INFO  (TEST-HdfsChaosMonkeyNothingIsSafeTest.test-seed#[9B3584A7695CFF52]) [    ] o.a.s.c.SolrResourceLoader solr home defaulted to 'solr/' (could not find system property or JNDI)
   [junit4]   2> 309865 INFO  (TEST-HdfsChaosMonkeyNothingIsSafeTest.test-seed#[9B3584A7695CFF52]) [    ] o.a.s.c.c.SolrZkClient Using default ZkCredentialsProvider
   [junit4]   2> 309867 INFO  (TEST-HdfsChaosMonkeyNothingIsSafeTest.test-seed#[9B3584A7695CFF52]) [    ] o.a.s.c.c.ConnectionManager Waiting for client to connect to ZooKeeper
   [junit4]   2> 309913 INFO  (zkCallback-315-thread-1) [    ] o.a.s.c.c.ConnectionManager Watcher org.apache.solr.common.cloud.ConnectionManager@6b663215 name:ZooKeeperConnection Watcher:127.0.0.1:55893/solr got event WatchedEvent state:SyncConnected type:None path:null path:null type:None
   [junit4]   2> 309913 INFO  (TEST-HdfsChaosMonkeyNothingIsSafeTest.test-seed#[9B3584A7695CFF52]) [    ] o.a.s.c.c.ConnectionManager Client is connected to ZooKeeper
   [junit4]   2> 309913 INFO  (TEST-HdfsChaosMonkeyNothingIsSafeTest.test-seed#[9B3584A7695CFF52]) [    ] o.a.s.c.c.SolrZkClient Using default ZkACLProvider
   [junit4]   2> 309914 WARN  (NIOServerCxn.Factory:0.0.0.0/0.0.0.0:0) [    ] o.a.z.s.NIOServerCnxn caught end of stream exception
   [junit4]   2> EndOfStreamException: Unable to read additional data from client sessionid 0x156e501c0860002, likely client has closed socket
   [junit4]   2> 	at org.apache.zookeeper.server.NIOServerCnxn.doIO(NIOServerCnxn.java:228)
   [junit4]   2> 	at org.apache.zookeeper.server.NIOServerCnxnFactory.run(NIOServerCnxnFactory.java:208)
   [junit4]   2> 	at java.lang.Thread.run(Thread.java:745)
   [junit4]   2> 309915 INFO  (TEST-HdfsChaosMonkeyNothingIsSafeTest.test-seed#[9B3584A7695CFF52]) [    ] o.a.s.s.SolrDispatchFilter Loading solr.xml from SolrHome (not found in ZooKeeper)
   [junit4]   2> 309915 INFO  (TEST-HdfsChaosMonkeyNothingIsSafeTest.test-seed#[9B3584A7695CFF52]) [    ] o.a.s.c.SolrXmlConfig Loading container configuration from /x1/jenkins/jenkins-slave/workspace/Lucene-Solr-NightlyTests-5.5/checkout/solr/build/solr-core/test/J2/temp/solr.cloud.hdfs.HdfsChaosMonkeyNothingIsSafeTest_9B3584A7695CFF52-001/control-001/solr.xml
   [junit4]   2> 309927 INFO  (TEST-HdfsChaosMonkeyNothingIsSafeTest.test-seed#[9B3584A7695CFF52]) [    ] o.a.s.c.CorePropertiesLocator Config-defined core root directory: /x1/jenkins/jenkins-slave/workspace/Lucene-Solr-NightlyTests-5.5/checkout/solr/build/solr-core/test/J2/temp/solr.cloud.hdfs.HdfsChaosMonkeyNothingIsSafeTest_9B3584A7695CFF52-001/control-001/cores
   [junit4]   2> 309927 INFO  (TEST-HdfsChaosMonkeyNothingIsSafeTest.test-seed#[9B3584A7695CFF52]) [    ] o.a.s.c.CoreContainer New CoreContainer 1297042215
   [junit4]   2> 309927 INFO  (TEST-HdfsChaosMonkeyNothingIsSafeTest.test-seed#[9B3584A7695CFF52]) [    ] o.a.s.c.CoreContainer Loading cores into CoreContainer [instanceDir=/x1/jenkins/jenkins-slave/workspace/Lucene-Solr-NightlyTests-5.5/checkout/solr/build/solr-core/test/J2/temp/solr.cloud.hdfs.HdfsChaosMonkeyNothingIsSafeTest_9B3584A7695CFF52-001/control-001]
   [junit4]   2> 309927 WARN  (TEST-HdfsChaosMonkeyNothingIsSafeTest.test-seed#[9B3584A7695CFF52]) [    ] o.a.s.c.CoreContainer Couldn't add files from /x1/jenkins/jenkins-slave/workspace/Lucene-Solr-NightlyTests-5.5/checkout/solr/build/solr-core/test/J2/temp/solr.cloud.hdfs.HdfsChaosMonkeyNothingIsSafeTest_9B3584A7695CFF52-001/control-001/lib to classpath: /x1/jenkins/jenkins-slave/workspace/Lucene-Solr-NightlyTests-5.5/checkout/solr/build/solr-core/test/J2/temp/solr.cloud.hdfs.HdfsChaosMonkeyNothingIsSafeTest_9B3584A7695CFF52-001/control-001/lib
   [junit4]   2> 309928 INFO  (TEST-HdfsChaosMonkeyNothingIsSafeTest.test-seed#[9B3584A7695CFF52]) [    ] o.a.s.h.c.HttpShardHandlerFactory created with socketTimeout : 90000,urlScheme : ,connTimeout : 15000,maxConnectionsPerHost : 20,maxConnections : 10000,corePoolSize : 0,maximumPoolSize : 2147483647,maxThreadIdleTime : 5,sizeOfQueue : -1,fairnessPolicy : false,useRetries : false,connectionsEvictorSleepDelay : 5000,maxConnectionIdleTime : 40000,
   [junit4]   2> 309929 INFO  (TEST-HdfsChaosMonkeyNothingIsSafeTest.test-seed#[9B3584A7695CFF52]) [    ] o.a.s.u.UpdateShardHandler Creating UpdateShardHandler HTTP client with params: socketTimeout=340000&connTimeout=45000&retry=true
   [junit4]   2> 309933 INFO  (TEST-HdfsChaosMonkeyNothingIsSafeTest.test-seed#[9B3584A7695CFF52]) [    ] o.a.s.l.LogWatcher SLF4J impl is org.slf4j.impl.Log4jLoggerFactory
   [junit4]   2> 309933 INFO  (TEST-HdfsChaosMonkeyNothingIsSafeTest.test-seed#[9B3584A7695CFF52]) [    ] o.a.s.l.LogWatcher Registering Log Listener [Log4j (org.slf4j.impl.Log4jLoggerFactory)]
   [junit4]   2> 309933 INFO  (TEST-HdfsChaosMonkeyNothingIsSafeTest.test-seed#[9B3584A7695CFF52]) [    ] o.a.s.c.ZkContainer Zookeeper client=127.0.0.1:55893/solr
   [junit4]   2> 309933 INFO  (TEST-HdfsChaosMonkeyNothingIsSafeTest.test-seed#[9B3584A7695CFF52]) [    ] o.a.s.c.ZkController zkHost includes chroot
   [junit4]   2> 309933 INFO  (TEST-HdfsChaosMonkeyNothingIsSafeTest.test-seed#[9B3584A7695CFF52]) [    ] o.a.s.c.c.SolrZkClient Using default ZkCredentialsProvider
   [junit4]   2> 309945 INFO  (TEST-HdfsChaosMonkeyNothingIsSafeTest.test-seed#[9B3584A7695CFF52]) [    ] o.a.s.c.c.ConnectionManager Waiting for client to connect to ZooKeeper
   [junit4]   2> 309945 INFO  (zkCallback-318-thread-1) [    ] o.a.s.c.c.ConnectionManager Watcher org.apache.solr.common.cloud.ConnectionManager@75dc9ed4 name:ZooKeeperConnection Watcher:127.0.0.1:55893 got event WatchedEvent state:SyncConnected type:None path:null path:null type:None
   [junit4]   2> 309946 INFO  (TEST-HdfsChaosMonkeyNothingIsSafeTest.test-seed#[9B3584A7695CFF52]) [    ] o.a.s.c.c.ConnectionManager Client is connected to ZooKeeper
   [junit4]   2> 309946 INFO  (TEST-HdfsChaosMonkeyNothingIsSafeTest.test-seed#[9B3584A7695CFF52]) [    ] o.a.s.c.c.SolrZkClient Using default ZkACLProvider
   [junit4]   2> 309947 INFO  (TEST-HdfsChaosMonkeyNothingIsSafeTest.test-seed#[9B3584A7695CFF52]) [n:127.0.0.1:50888_    ] o.a.s.c.ZkController Added new OnReconnect listener org.apache.solr.cloud.ZkController$6@76633029
   [junit4]   2> 309948 INFO  (TEST-HdfsChaosMonkeyNothingIsSafeTest.test-seed#[9B3584A7695CFF52]) [n:127.0.0.1:50888_    ] o.a.s.c.c.ConnectionManager Waiting for client to connect to ZooKeeper
   [junit4]   2> 309949 INFO  (zkCallback-319-thread-1-processing-n:127.0.0.1:50888_) [n:127.0.0.1:50888_    ] o.a.s.c.c.ConnectionManager Watcher org.apache.solr.common.cloud.ConnectionManager@3192a656 name:ZooKeeperConnection Watcher:127.0.0.1:55893/solr got event WatchedEvent state:SyncConnected type:None path:null path:null type:None
   [junit4]   2> 309949 INFO  (TEST-HdfsChaosMonkeyNothingIsSafeTest.test-seed#[9B3584A7695CFF52]) [n:127.0.0.1:50888_    ] o.a.s.c.c.ConnectionManager Client is connected to ZooKeeper
   [junit4]   2> 309950 INFO  (TEST-HdfsChaosMonkeyNothingIsSafeTest.test-seed#[9B3584A7695CFF52]) [n:127.0.0.1:50888_    ] o.a.s.c.c.SolrZkClient makePath: /overseer/queue
   [junit4]   2> 309952 INFO  (TEST-HdfsChaosMonkeyNothingIsSafeTest.test-seed#[9B3584A7695CFF52]) [n:127.0.0.1:50888_    ] o.a.s.c.c.SolrZkClient makePath: /overseer/collection-queue-work
   [junit4]   2> 309955 INFO  (TEST-HdfsChaosMonkeyNothingIsSafeTest.test-seed#[9B3584A7695CFF52]) [n:127.0.0.1:50888_    ] o.a.s.c.c.SolrZkClient makePath: /overseer/collection-map-running
   [junit4]   2> 309957 INFO  (TEST-HdfsChaosMonkeyNothingIsSafeTest.test-seed#[9B3584A7695CFF52]) [n:127.0.0.1:50888_    ] o.a.s.c.c.SolrZkClient makePath: /overseer/collection-map-completed
   [junit4]   2> 309959 INFO  (TEST-HdfsChaosMonkeyNothingIsSafeTest.test-seed#[9B3584A7695CFF52]) [n:127.0.0.1:50888_    ] o.a.s.c.c.SolrZkClient makePath: /overseer/collection-map-failure
   [junit4]   2> 309961 INFO  (TEST-HdfsChaosMonkeyNothingIsSafeTest.test-seed#[9B3584A7695CFF52]) [n:127.0.0.1:50888_    ] o.a.s.c.c.SolrZkClient makePath: /live_nodes
   [junit4]   2> 309962 INFO  (TEST-HdfsChaosMonkeyNothingIsSafeTest.test-seed#[9B3584A7695CFF52]) [n:127.0.0.1:50888_    ] o.a.s.c.c.SolrZkClient makePath: /aliases.json
   [junit4]   2> 309963 INFO  (TEST-HdfsChaosMonkeyNothingIsSafeTest.test-seed#[9B3584A7695CFF52]) [n:127.0.0.1:50888_    ] o.a.s.c.c.SolrZkClient makePath: /clusterstate.json
   [junit4]   2> 309965 INFO  (TEST-HdfsChaosMonkeyNothingIsSafeTest.test-seed#[9B3584A7695CFF52]) [n:127.0.0.1:50888_    ] o.a.s.c.c.SolrZkClient makePath: /security.json
   [junit4]   2> 309966 INFO  (TEST-HdfsChaosMonkeyNothingIsSafeTest.test-seed#[9B3584A7695CFF52]) [n:127.0.0.1:50888_    ] o.a.s.c.ZkController Register node as live in ZooKeeper:/live_nodes/127.0.0.1:50888_
   [junit4]   2> 309966 INFO  (TEST-HdfsChaosMonkeyNothingIsSafeTest.test-seed#[9B3584A7695CFF52]) [n:127.0.0.1:50888_    ] o.a.s.c.c.SolrZkClient makePath: /live_nodes/127.0.0.1:50888_
   [junit4]   2> 309967 INFO  (TEST-HdfsChaosMonkeyNothingIsSafeTest.test-seed#[9B3584A7695CFF52]) [n:127.0.0.1:50888_    ] o.a.s.c.c.SolrZkClient makePath: /overseer_elect
   [junit4]   2> 309969 INFO  (TEST-HdfsChaosMonkeyNothingIsSafeTest.test-seed#[9B3584A7695CFF52]) [n:127.0.0.1:50888_    ] o.a.s.c.c.SolrZkClient makePath: /overseer_elect/election
   [junit4]   2> 309970 INFO  (TEST-HdfsChaosMonkeyNothingIsSafeTest.test-seed#[9B3584A7695CFF52]) [n:127.0.0.1:50888_    ] o.a.s.c.Overseer Overseer (id=null) closing
   [junit4]   2> 309971 INFO  (TEST-HdfsChaosMonkeyNothingIsSafeTest.test-seed#[9B3584A7695CFF52]) [n:127.0.0.1:50888_    ] o.a.s.c.LeaderElector Joined leadership election with path: /overseer_elect/election/96516237722779652-127.0.0.1:50888_-n_0000000000
   [junit4]   2> 309971 INFO  (TEST-HdfsChaosMonkeyNothingIsSafeTest.test-seed#[9B3584A7695CFF52]) [n:127.0.0.1:50888_    ] o.a.s.c.OverseerElectionContext I am going to be the leader 127.0.0.1:50888_
   [junit4]   2> 309971 INFO  (TEST-HdfsChaosMonkeyNothingIsSafeTest.test-seed#[9B3584A7695CFF52]) [n:127.0.0.1:50888_    ] o.a.s.c.c.SolrZkClient makePath: /overseer_elect/leader
   [junit4]   2> 309972 INFO  (TEST-HdfsChaosMonkeyNothingIsSafeTest.test-seed#[9B3584A7695CFF52]) [n:127.0.0.1:50888_    ] o.a.s.c.Overseer Overseer (id=96516237722779652-127.0.0.1:50888_-n_0000000000) starting
   [junit4]   2> 309974 INFO  (TEST-HdfsChaosMonkeyNothingIsSafeTest.test-seed#[9B3584A7695CFF52]) [n:127.0.0.1:50888_    ] o.a.s.c.c.SolrZkClient makePath: /overseer/queue-work
   [junit4]   2> 309980 INFO  (TEST-HdfsChaosMonkeyNothingIsSafeTest.test-seed#[9B3584A7695CFF52]) [n:127.0.0.1:50888_    ] o.a.s.c.OverseerAutoReplicaFailoverThread Starting OverseerAutoReplicaFailoverThread autoReplicaFailoverWorkLoopDelay=10000 autoReplicaFailoverWaitAfterExpiration=30000 autoReplicaFailoverBadNodeExpiration=60000
   [junit4]   2> 309994 INFO  (OverseerStateUpdate-96516237722779652-127.0.0.1:50888_-n_0000000000) [n:127.0.0.1:50888_    ] o.a.s.c.Overseer Starting to work on the main queue
   [junit4]   2> 309994 INFO  (OverseerStateUpdate-96516237722779652-127.0.0.1:50888_-n_0000000000) [n:127.0.0.1:50888_    ] o.a.s.c.c.ZkStateReader Updating cluster state from ZooKeeper... 
   [junit4]   2> 309999 INFO  (OverseerCollectionConfigSetProcessor-96516237722779652-127.0.0.1:50888_-n_0000000000) [n:127.0.0.1:50888_    ] o.a.s.c.OverseerTaskProcessor Process current queue of overseer operations
   [junit4]   2> 310015 INFO  (TEST-HdfsChaosMonkeyNothingIsSafeTest.test-seed#[9B3584A7695CFF52]) [n:127.0.0.1:50888_    ] o.a.s.c.c.ZkStateReader Updating cluster state from ZooKeeper... 
   [junit4]   2> 310030 INFO  (TEST-HdfsChaosMonkeyNothingIsSafeTest.test-seed#[9B3584A7695CFF52]) [n:127.0.0.1:50888_    ] o.a.s.c.CoreContainer Security conf doesn't exist. Skipping setup for authorization module.
   [junit4]   2> 310030 INFO  (TEST-HdfsChaosMonkeyNothingIsSafeTest.test-seed#[9B3584A7695CFF52]) [n:127.0.0.1:50888_    ] o.a.s.c.CoreContainer No authentication plugin used.
   [junit4]   2> 310031 INFO  (TEST-HdfsChaosMonkeyNothingIsSafeTest.test-seed#[9B3584A7695CFF52]) [n:127.0.0.1:50888_    ] o.a.s.c.CorePropertiesLocator Looking for core definitions underneath /x1/jenkins/jenkins-slave/workspace/Lucene-Solr-NightlyTests-5.5/checkout/solr/build/solr-core/test/J2/temp/solr.cloud.hdfs.HdfsChaosMonkeyNothingIsSafeTest_9B3584A7695CFF52-001/control-001/cores
   [junit4]   2> 310032 INFO  (TEST-HdfsChaosMonkeyNothingIsSafeTest.test-seed#[9B3584A7695CFF52]) [n:127.0.0.1:50888_    ] o.a.s.c.CoreDescriptor Created CoreDescriptor: {collection=control_collection, schema=schema.xml, dataDir=data/, name=collection1, configSetProperties=configsetprops.json, shard=, coreNodeName=, config=solrconfig.xml, transient=false, loadOnStartup=true}
   [junit4]   2> 310032 INFO  (TEST-HdfsChaosMonkeyNothingIsSafeTest.test-seed#[9B3584A7695CFF52]) [n:127.0.0.1:50888_    ] o.a.s.c.CorePropertiesLocator Found core collection1 in /x1/jenkins/jenkins-slave/workspace/Lucene-Solr-NightlyTests-5.5/checkout/solr/build/solr-core/test/J2/temp/solr.cloud.hdfs.HdfsChaosMonkeyNothingIsSafeTest_9B3584A7695CFF52-001/control-001/cores/collection1
   [junit4]   2> 310032 INFO  (TEST-HdfsChaosMonkeyNothingIsSafeTest.test-seed#[9B3584A7695CFF52]) [n:127.0.0.1:50888_    ] o.a.s.c.CorePropertiesLocator Found 1 core definitions
   [junit4]   2> 310033 INFO  (coreLoadExecutor-772-thread-1-processing-n:127.0.0.1:50888_) [n:127.0.0.1:50888_ c:control_collection   x:collection1] o.a.s.c.ZkController publishing state=down
   [junit4]   2> 310033 INFO  (coreLoadExecutor-772-thread-1-processing-n:127.0.0.1:50888_) [n:127.0.0.1:50888_ c:control_collection   x:collection1] o.a.s.c.ZkController numShards not found on descriptor - reading it from system property
   [junit4]   2> 310036 INFO  (TEST-HdfsChaosMonkeyNothingIsSafeTest.test-seed#[9B3584A7695CFF52]) [n:127.0.0.1:50888_    ] o.a.s.s.SolrDispatchFilter user.dir=/x1/jenkins/jenkins-slave/workspace/Lucene-Solr-NightlyTests-5.5/checkout/solr/build/solr-core/test/J2
   [junit4]   2> 310036 INFO  (TEST-HdfsChaosMonkeyNothingIsSafeTest.test-seed#[9B3584A7695CFF52]) [n:127.0.0.1:50888_    ] o.a.s.s.SolrDispatchFilter SolrDispatchFilter.init() done
   [junit4]   2> 310036 INFO  (coreLoadExecutor-772-thread-1-processing-n:127.0.0.1:50888_) [n:127.0.0.1:50888_ c:control_collection   x:collection1] o.a.s.c.ZkController Collection control_collection not visible yet, but flagging it so a watch is registered when it becomes visible
   [junit4]   2> 310036 INFO  (coreLoadExecutor-772-thread-1-processing-n:127.0.0.1:50888_) [n:127.0.0.1:50888_ c:control_collection   x:collection1] o.a.s.c.c.ZkStateReader addZkWatch [control_collection]
   [junit4]   2> 310037 INFO  (OverseerStateUpdate-96516237722779652-127.0.0.1:50888_-n_0000000000) [n:127.0.0.1:50888_    ] o.a.s.c.Overseer processMessage: queueSize: 1, message = {
   [junit4]   2>   "numShards":"1",
   [junit4]   2>   "operation":"state",
   [junit4]   2>   "collection":"control_collection",
   [junit4]   2>   "core":"collection1",
   [junit4]   2>   "base_url":"http://127.0.0.1:50888",
   [junit4]   2>   "shard":null,
   [junit4]   2>   "node_name":"127.0.0.1:50888_",
   [junit4]   2>   "roles":null,
   [junit4]   2>   "state":"down"} current state version: 0
   [junit4]   2> 310037 INFO  (coreLoadExecutor-772-thread-1-processing-n:127.0.0.1:50888_) [n:127.0.0.1:50888_ c:control_collection   x:collection1] o.a.s.c.c.ZkStateReader Deleting data for [control_collection]
   [junit4]   2> 310037 INFO  (OverseerStateUpdate-96516237722779652-127.0.0.1:50888_-n_0000000000) [n:127.0.0.1:50888_    ] o.a.s.c.o.ReplicaMutator Update state numShards=1 message={
   [junit4]   2>   "numShards":"1",
   [junit4]   2>   "operation":"state",
   [junit4]   2>   "collection":"control_collection",
   [junit4]   2>   "core":"collection1",
   [junit4]   2>   "base_url":"http://127.0.0.1:50888",
   [junit4]   2>   "shard":null,
   [junit4]   2>   "node_name":"127.0.0.1:50888_",
   [junit4]   2>   "roles":null,
   [junit4]   2>   "state":"down"}
   [junit4]   2> 310038 INFO  (OverseerStateUpdate-96516237722779652-127.0.0.1:50888_-n_0000000000) [n:127.0.0.1:50888_    ] o.a.s.c.o.ClusterStateMutator building a new cName: control_collection
   [junit4]   2> 310039 INFO  (OverseerStateUpdate-96516237722779652-127.0.0.1:50888_-n_0000000000) [n:127.0.0.1:50888_    ] o.a.s.c.o.ReplicaMutator Assigning new node to shard shard=shard1
   [junit4]   2> 310039 INFO  (coreLoadExecutor-772-thread-1-processing-n:127.0.0.1:50888_) [n:127.0.0.1:50888_ c:control_collection   x:collection1] o.a.s.c.ZkController look for our core node name
   [junit4]   2> 310040 INFO  (zkCallback-319-thread-1-processing-n:127.0.0.1:50888_) [n:127.0.0.1:50888_    ] o.a.s.c.c.ZkStateReader A cluster state change: [WatchedEvent state:SyncConnected type:NodeDataChanged path:/clusterstate.json], has occurred - updating... (live nodes size: [1])
   [junit4]   2> 310053 INFO  (zkCallback-319-thread-2-processing-n:127.0.0.1:50888_) [n:127.0.0.1:50888_    ] o.a.s.c.c.ZkStateReader A cluster state change: [WatchedEvent state:SyncConnected type:NodeDataChanged path:/clusterstate.json], has occurred - updating... (live nodes size: [1])
   [junit4]   2> 311040 INFO  (coreLoadExecutor-772-thread-1-processing-n:127.0.0.1:50888_) [n:127.0.0.1:50888_ c:control_collection   x:collection1] o.a.s.c.ZkController waiting to find shard id in clusterstate for collection1
   [junit4]   2> 311040 INFO  (coreLoadExecutor-772-thread-1-processing-n:127.0.0.1:50888_) [n:127.0.0.1:50888_ c:control_collection   x:collection1] o.a.s.c.ZkController Check for collection zkNode:control_collection
   [junit4]   2> 311041 INFO  (coreLoadExecutor-772-thread-1-processing-n:127.0.0.1:50888_) [n:127.0.0.1:50888_ c:control_collection   x:collection1] o.a.s.c.ZkController Collection zkNode exists
   [junit4]   2> 311041 INFO  (coreLoadExecutor-772-thread-1-processing-n:127.0.0.1:50888_) [n:127.0.0.1:50888_ c:control_collection   x:collection1] o.a.s.c.c.ZkStateReader Load collection config from: [/collections/control_collection]
   [junit4]   2> 311041 INFO  (coreLoadExecutor-772-thread-1-processing-n:127.0.0.1:50888_) [n:127.0.0.1:50888_ c:control_collection   x:collection1] o.a.s.c.c.ZkStateReader path=[/collections/control_collection] [configName]=[conf1] specified config exists in ZooKeeper
   [junit4]   2> 311042 INFO  (coreLoadExecutor-772-thread-1-processing-n:127.0.0.1:50888_) [n:127.0.0.1:50888_ c:control_collection   x:collection1] o.a.s.c.SolrResourceLoader new SolrResourceLoader for directory: '/x1/jenkins/jenkins-slave/workspace/Lucene-Solr-NightlyTests-5.5/checkout/solr/build/solr-core/test/J2/temp/solr.cloud.hdfs.HdfsChaosMonkeyNothingIsSafeTest_9B3584A7695CFF52-001/control-001/cores/collection1'
   [junit4]   2> 311042 INFO  (coreLoadExecutor-772-thread-1-processing-n:127.0.0.1:50888_) [n:127.0.0.1:50888_ c:control_collection   x:collection1] o.a.s.c.SolrResourceLoader JNDI not configured for solr (NoInitialContextEx)
   [junit4]   2> 311042 INFO  (coreLoadExecutor-772-thread-1-processing-n:127.0.0.1:50888_) [n:127.0.0.1:50888_ c:control_collection   x:collection1] o.a.s.c.SolrResourceLoader solr home defaulted to 'solr/' (could not find system property or JNDI)
   [junit4]   2> 311077 INFO  (coreLoadExecutor-772-thread-1-processing-n:127.0.0.1:50888_) [n:127.0.0.1:50888_ c:control_collection   x:collection1] o.a.s.c.Config loaded config solrconfig.xml with version 0 
   [junit4]   2> 311094 INFO  (coreLoadExecutor-772-thread-1-processing-n:127.0.0.1:50888_) [n:127.0.0.1:50888_ c:control_collection   x:collection1] o.a.s.c.SolrConfig current version of requestparams : -1
   [junit4]   2> 311106 WARN  (coreLoadExecutor-772-thread-1-processing-n:127.0.0.1:50888_) [n:127.0.0.1:50888_ c:control_collection   x:collection1] o.a.s.c.Config Beginning with Solr 5.5, <mergePolicy> is deprecated, use <mergePolicyFactory> instead.
   [junit4]   2> 311109 INFO  (coreLoadExecutor-772-thread-1-processing-n:127.0.0.1:50888_) [n:127.0.0.1:50888_ c:control_collection   x:collection1] o.a.s.c.SolrConfig Using Lucene MatchVersion: 5.5.3
   [junit4]   2> 311174 INFO  (coreLoadExecutor-772-thread-1-processing-n:127.0.0.1:50888_) [n:127.0.0.1:50888_ c:control_collection   x:collection1] o.a.s.c.SolrConfig Loaded SolrConfig: solrconfig.xml
   [junit4]   2> 311195 INFO  (coreLoadExecutor-772-thread-1-processing-n:127.0.0.1:50888_) [n:127.0.0.1:50888_ c:control_collection   x:collection1] o.a.s.s.IndexSchema [collection1] Schema name=test
   [junit4]   2> 311619 INFO  (coreLoadExecutor-772-thread-1-processing-n:127.0.0.1:50888_) [n:127.0.0.1:50888_ c:control_collection   x:collection1] o.a.s.s.IndexSchema default search field in schema is text
   [junit4]   2> 311620 INFO  (coreLoadExecutor-772-thread-1-processing-n:127.0.0.1:50888_) [n:127.0.0.1:50888_ c:control_collection   x:collection1] o.a.s.s.IndexSchema unique key field: id
   [junit4]   2> 311622 INFO  (coreLoadExecutor-772-thread-1-processing-n:127.0.0.1:50888_) [n:127.0.0.1:50888_ c:control_collection   x:collection1] o.a.s.s.FileExchangeRateProvider Reloading exchange rates from file currency.xml
   [junit4]   2> 311625 INFO  (coreLoadExecutor-772-thread-1-processing-n:127.0.0.1:50888_) [n:127.0.0.1:50888_ c:control_collection   x:collection1] o.a.s.s.FileExchangeRateProvider Reloading exchange rates from file currency.xml
   [junit4]   2> 311649 INFO  (coreLoadExecutor-772-thread-1-processing-n:127.0.0.1:50888_) [n:127.0.0.1:50888_ c:control_collection   x:collection1] o.a.s.c.ConfigSetProperties Did not find ConfigSet properties, assuming default properties: Can't find resource 'configsetprops.json' in classpath or '/configs/conf1', cwd=/x1/jenkins/jenkins-slave/workspace/Lucene-Solr-NightlyTests-5.5/checkout/solr/build/solr-core/test/J2
   [junit4]   2> 311649 INFO  (coreLoadExecutor-772-thread-1-processing-n:127.0.0.1:50888_) [n:127.0.0.1:50888_ c:control_collection   x:collection1] o.a.s.c.CoreContainer Creating SolrCore 'collection1' using configuration from collection control_collection
   [junit4]   2> 311649 INFO  (coreLoadExecutor-772-thread-1-processing-n:127.0.0.1:50888_) [n:127.0.0.1:50888_ c:control_collection s:shard1 r:core_node1 x:collection1] o.a.s.c.SolrCore org.apache.solr.core.HdfsDirectoryFactory
   [junit4]   2> 311654 INFO  (coreLoadExecutor-772-thread-1-processing-n:127.0.0.1:50888_) [n:127.0.0.1:50888_ c:control_collection s:shard1 r:core_node1 x:collection1] o.a.s.c.HdfsDirectoryFactory solr.hdfs.home=hdfs://localhost:50146/solr_hdfs_home
   [junit4]   2> 311654 INFO  (coreLoadExecutor-772-thread-1-processing-n:127.0.0.1:50888_) [n:127.0.0.1:50888_ c:control_collection s:shard1 r:core_node1 x:collection1] o.a.s.c.HdfsDirectoryFactory Solr Kerberos Authentication disabled
   [junit4]   2> 311654 INFO  (coreLoadExecutor-772-thread-1-processing-n:127.0.0.1:50888_) [n:127.0.0.1:50888_ c:control_collection s:shard1 r:core_node1 x:collection1] o.a.s.c.SolrCore [[collection1] ] Opening new SolrCore at [/x1/jenkins/jenkins-slave/workspace/Lucene-Solr-NightlyTests-5.5/checkout/solr/build/solr-core/test/J2/temp/solr.cloud.hdfs.HdfsChaosMonkeyNothingIsSafeTest_9B3584A7695CFF52-001/control-001/cores/collection1], dataDir=[hdfs://localhost:50146/solr_hdfs_home/control_collection/core_node1/data/]
   [junit4]   2> 311654 INFO  (coreLoadExecutor-772-thread-1-processing-n:127.0.0.1:50888_) [n:127.0.0.1:50888_ c:control_collection s:shard1 r:core_node1 x:collection1] o.a.s.c.JmxMonitoredMap JMX monitoring is enabled. Adding Solr mbeans to JMX Server: com.sun.jmx.mbeanserver.JmxMBeanServer@3646bfed
   [junit4]   2> 311655 INFO  (coreLoadExecutor-772-thread-1-processing-n:127.0.0.1:50888_) [n:127.0.0.1:50888_ c:control_collection s:shard1 r:core_node1 x:collection1] o.a.s.c.HdfsDirectoryFactory creating directory factory for path hdfs://localhost:50146/solr_hdfs_home/control_collection/core_node1/data
   [junit4]   2> 311705 INFO  (coreLoadExecutor-772-thread-1-processing-n:127.0.0.1:50888_) [n:127.0.0.1:50888_ c:control_collection s:shard1 r:core_node1 x:collection1] o.a.s.c.CachingDirectoryFactory return new directory for hdfs://localhost:50146/solr_hdfs_home/control_collection/core_node1/data
   [junit4]   2> 311707 INFO  (coreLoadExecutor-772-thread-1-processing-n:127.0.0.1:50888_) [n:127.0.0.1:50888_ c:control_collection s:shard1 r:core_node1 x:collection1] o.a.s.c.SolrCore New index directory detected: old=null new=hdfs://localhost:50146/solr_hdfs_home/control_collection/core_node1/data/index/
   [junit4]   2> 311722 WARN  (coreLoadExecutor-772-thread-1-processing-n:127.0.0.1:50888_) [n:127.0.0.1:50888_ c:control_collection s:shard1 r:core_node1 x:collection1] o.a.s.c.SolrCore [collection1] Solr index directory 'hdfs:/localhost:50146/solr_hdfs_home/control_collection/core_node1/data/index' doesn't exist. Creating new index...
   [junit4]   2> 311722 INFO  (coreLoadExecutor-772-thread-1-processing-n:127.0.0.1:50888_) [n:127.0.0.1:50888_ c:control_collection s:shard1 r:core_node1 x:collection1] o.a.s.c.HdfsDirectoryFactory creating directory factory for path hdfs://localhost:50146/solr_hdfs_home/control_collection/core_node1/data/index
   [junit4]   2> 311732 INFO  (coreLoadExecutor-772-thread-1-processing-n:127.0.0.1:50888_) [n:127.0.0.1:50888_ c:control_collection s:shard1 r:core_node1 x:collection1] o.a.s.c.HdfsDirectoryFactory Number of slabs of block cache [1] with direct memory allocation set to [true]
   [junit4]   2> 311732 INFO  (coreLoadExecutor-772-thread-1-processing-n:127.0.0.1:50888_) [n:127.0.0.1:50888_ c:control_collection s:shard1 r:core_node1 x:collection1] o.a.s.c.HdfsDirectoryFactory Block cache target memory usage, slab size of [8388608] will allocate [1] slabs and use ~[8388608] bytes
   [junit4]   2> 311732 INFO  (coreLoadExecutor-772-thread-1-processing-n:127.0.0.1:50888_) [n:127.0.0.1:50888_ c:control_collection s:shard1 r:core_node1 x:collection1] o.a.s.c.HdfsDirectoryFactory Creating new global HDFS BlockCache
   [junit4]   2> 311746 INFO  (coreLoadExecutor-772-thread-1-processing-n:127.0.0.1:50888_) [n:127.0.0.1:50888_ c:control_collection s:shard1 r:core_node1 x:collection1] o.a.s.s.b.BlockDirectory Block cache on write is disabled
   [junit4]   2> 311746 INFO  (coreLoadExecutor-772-thread-1-processing-n:127.0.0.1:50888_) [n:127.0.0.1:50888_ c:control_collection s:shard1 r:core_node1 x:collection1] o.a.s.c.CachingDirectoryFactory return new directory for hdfs://localhost:50146/solr_hdfs_home/control_collection/core_node1/data/index
   [junit4]   2> 311746 INFO  (coreLoadExecutor-772-thread-1-processing-n:127.0.0.1:50888_) [n:127.0.0.1:50888_ c:control_collection s:shard1 r:core_node1 x:collection1] o.a.s.u.RandomMergePolicy RandomMergePolicy wrapping class org.apache.lucene.index.LogDocMergePolicy: [LogDocMergePolicy: minMergeSize=1000, mergeFactor=34, maxMergeSize=9223372036854775807, maxMergeSizeForForcedMerge=9223372036854775807, calibrateSizeByDeletes=true, maxMergeDocs=2147483647, maxCFSSegmentSizeMB=8.796093022207999E12, noCFSRatio=1.0]
   [junit4]   2> 312114 INFO  (IPC Server handler 3 on 50146) [    ] BlockStateChange BLOCK* addStoredBlock: blockMap updated: 127.0.0.1:46184 is added to blk_1073741825_1001{blockUCState=UNDER_CONSTRUCTION, primaryNodeIndex=-1, replicas=[ReplicaUnderConstruction[[DISK]DS-93067167-34ab-4e6b-ae06-2badf451703c:NORMAL:127.0.0.1:46184|RBW], ReplicaUnderConstruction[[DISK]DS-2972fa33-bc2a-4dd2-91c1-a21b5b4d8ce6:NORMAL:127.0.0.1:47177|RBW]]} size 0
   [junit4]   2> 312120 INFO  (IPC Server handler 5 on 50146) [    ] BlockStateChange BLOCK* addStoredBlock: blockMap updated: 127.0.0.1:47177 is added to blk_1073741825_1001 size 71
   [junit4]   2> 312130 INFO  (coreLoadExecutor-772-thread-1-processing-n:127.0.0.1:50888_) [n:127.0.0.1:50888_ c:control_collection s:shard1 r:core_node1 x:collection1] o.a.s.c.SolrDeletionPolicy SolrDeletionPolicy.onCommit: commits: num=1
   [junit4]   2> 	commit{dir=NRTCachingDirectory(BlockDirectory(HdfsDirectory@hdfs://localhost:50146/solr_hdfs_home/control_collection/core_node1/data/index lockFactory=org.apache.lucene.store.SingleInstanceLockFactory@5c21ed7f); maxCacheMB=192.0 maxMergeSizeMB=16.0),segFN=segments_1,generation=1}
   [junit4]   2> 312130 INFO  (coreLoadExecutor-772-thread-1-processing-n:127.0.0.1:50888_) [n:127.0.0.1:50888_ c:control_collection s:shard1 r:core_node1 x:collection1] o.a.s.c.SolrDeletionPolicy newest commit generation = 1
   [junit4]   2> 312137 INFO  (coreLoadExecutor-772-thread-1-processing-n:127.0.0.1:50888_) [n:127.0.0.1:50888_ c:control_collection s:shard1 r:core_node1 x:collection1] o.a.s.u.p.UpdateRequestProcessorChain creating updateRequestProcessorChain "nodistrib"
   [junit4]   2> 312137 INFO  (coreLoadExecutor-772-thread-1-processing-n:127.0.0.1:50888_) [n:127.0.0.1:50888_ c:control_collection s:shard1 r:core_node1 x:collection1] o.a.s.u.p.UpdateRequestProcessorChain creating updateRequestProcessorChain "dedupe"
   [junit4]   2> 312138 INFO  (coreLoadExecutor-772-thread-1-processing-n:127.0.0.1:50888_) [n:127.0.0.1:50888_ c:control_collection s:shard1 r:core_node1 x:collection1] o.a.s.u.p.UpdateRequestProcessorChain inserting DistributedUpdateProcessorFactory into updateRequestProcessorChain "dedupe"
   [junit4]   2> 312138 INFO  (coreLoadExecutor-772-thread-1-processing-n:127.0.0.1:50888_) [n:127.0.0.1:50888_ c:control_collection s:shard1 r:core_node1 x:collection1] o.a.s.u.p.UpdateRequestProcessorChain creating updateRequestProcessorChain "stored_sig"
   [junit4]   2> 312138 INFO  (coreLoadExecutor-772-thread-1-processing-n:127.0.0.1:50888_) [n:127.0.0.1:50888_ c:control_collection s:shard1 r:core_node1 x:collection1] o.a.s.u.p.UpdateRequestProcessorChain inserting DistributedUpdateProcessorFactory into updateRequestProcessorChain "stored_sig"
   [junit4]   2> 312138 INFO  (coreLoadExecutor-772-thread-1-processing-n:127.0.0.1:50888_) [n:127.0.0.1:50888_ c:control_collection s:shard1 r:core_node1 x:collection1] o.a.s.u.p.UpdateRequestProcessorChain creating updateRequestProcessorChain "distrib-dup-test-chain-explicit"
   [junit4]   2> 312138 INFO  (coreLoadExecutor-772-thread-1-processing-n:127.0.0.1:50888_) [n:127.0.0.1:50888_ c:control_collection s:shard1 r:core_node1 x:collection1] o.a.s.u.p.UpdateRequestProcessorChain creating updateRequestProcessorChain "distrib-dup-test-chain-implicit"
   [junit4]   2> 312138 INFO  (coreLoadExecutor-772-thread-1-processing-n:127.0.0.1:50888_) [n:127.0.0.1:50888_ c:control_collection s:shard1 r:core_node1 x:collection1] o.a.s.u.p.UpdateRequestProcessorChain inserting DistributedUpdateProcessorFactory into updateRequestProcessorChain "distrib-dup-test-chain-implicit"
   [junit4]   2> 312138 INFO  (coreLoadExecutor-772-thread-1-processing-n:127.0.0.1:50888_) [n:127.0.0.1:50888_ c:control_collection s:shard1 r:core_node1 x:collection1] o.a.s.c.SolrCore no updateRequestProcessorChain defined as default, creating implicit default
   [junit4]   2> 312139 WARN  (coreLoadExecutor-772-thread-1-processing-n:127.0.0.1:50888_) [n:127.0.0.1:50888_ c:control_collection s:shard1 r:core_node1 x:collection1] o.a.s.c.RequestHandlers INVALID paramSet a in requestHandler {type = requestHandler,name = /dump,class = DumpRequestHandler,args = {defaults={a=A,b=B}}}
   [junit4]   2> 312140 INFO  (coreLoadExecutor-772-thread-1-processing-n:127.0.0.1:50888_) [n:127.0.0.1:50888_ c:control_collection s:shard1 r:core_node1 x:collection1] o.a.s.h.l.XMLLoader xsltCacheLifetimeSeconds=60
   [junit4]   2> 312141 INFO  (coreLoadExecutor-772-thread-1-processing-n:127.0.0.1:50888_) [n:127.0.0.1:50888_ c:control_collection s:shard1 r:core_node1 x:collection1] o.a.s.h.l.XMLLoader xsltCacheLifetimeSeconds=60
   [junit4]   2> 312141 INFO  (coreLoadExecutor-772-thread-1-processing-n:127.0.0.1:50888_) [n:127.0.0.1:50888_ c:control_collection s:shard1 r:core_node1 x:collection1] o.a.s.h.l.XMLLoader xsltCacheLifetimeSeconds=60
   [junit4]   2> 312142 INFO  (coreLoadExecutor-772-thread-1-processing-n:127.0.0.1:50888_) [n:127.0.0.1:50888_ c:control_collection s:shard1 r:core_node1 x:collection1] o.a.s.h.l.XMLLoader xsltCacheLifetimeSeconds=60
   [junit4]   2> 312145 INFO  (coreLoadExecutor-772-thread-1-processing-n:127.0.0.1:50888_) [n:127.0.0.1:50888_ c:control_collection s:shard1 r:core_node1 x:collection1] o.a.s.c.RequestHandlers Registered paths: /dump,/get,/admin/ping,/schema,/admin/luke,/admin/threads,standard,/config,/admin/segments,/admin/system,/admin/mbeans,/update/csv,/update/json/docs,/admin/plugins,/admin/properties,/admin/file,/update,/admin/logging,/replication,/update/json
   [junit4]   2> 312146 INFO  (OldIndexDirectoryCleanupThreadForCore-collection1) [n:127.0.0.1:50888_ c:control_collection s:shard1 r:core_node1 x:collection1] o.a.s.c.SolrCore Looking for old index directories to cleanup for core collection1 in hdfs://localhost:50146/solr_hdfs_home/control_collection/core_node1/data/
   [junit4]   2> 312157 INFO  (coreLoadExecutor-772-thread-1-processing-n:127.0.0.1:50888_) [n:127.0.0.1:50888_ c:control_collection s:shard1 r:core_node1 x:collection1] o.a.s.c.SolrCore Using default statsCache cache: org.apache.solr.search.stats.LocalStatsCache
   [junit4]   2> 312175 INFO  (coreLoadExecutor-772-thread-1-processing-n:127.0.0.1:50888_) [n:127.0.0.1:50888_ c:control_collection s:shard1 r:core_node1 x:collection1] o.a.s.u.UpdateHandler Using UpdateLog implementation: org.apache.solr.update.HdfsUpdateLog
   [junit4]   2> 312175 INFO  (coreLoadExecutor-772-thread-1-processing-n:127.0.0.1:50888_) [n:127.0.0.1:50888_ c:control_collection s:shard1 r:core_node1 x:collection1] o.a.s.u.UpdateLog Initializing UpdateLog: dataDir= defaultSyncLevel=FLUSH numRecordsToKeep=100 maxNumLogsToKeep=10 numVersionBuckets=65536
   [junit4]   2> 312175 INFO  (coreLoadExecutor-772-thread-1-processing-n:127.0.0.1:50888_) [n:127.0.0.1:50888_ c:control_collection s:shard1 r:core_node1 x:collection1] o.a.s.u.HdfsUpdateLog Initializing HdfsUpdateLog: tlogDfsReplication=2
   [junit4]   2> 312202 INFO  (coreLoadExecutor-772-thread-1-processing-n:127.0.0.1:50888_) [n:127.0.0.1:50888_ c:control_collection s:shard1 r:core_node1 x:collection1] o.a.s.u.CommitTracker Hard AutoCommit: if uncommited for 15000ms; 
   [junit4]   2> 312202 INFO  (coreLoadExecutor-772-thread-1-processing-n:127.0.0.1:50888_) [n:127.0.0.1:50888_ c:control_collection s:shard1 r:core_node1 x:collection1] o.a.s.u.CommitTracker Soft AutoCommit: disabled
   [junit4]   2> 312206 INFO  (coreLoadExecutor-772-thread-1-processing-n:127.0.0.1:50888_) [n:127.0.0.1:50888_ c:control_collection s:shard1 r:core_node1 x:collection1] o.a.s.u.RandomMergePolicy RandomMergePolicy wrapping class org.apache.lucene.index.TieredMergePolicy: [TieredMergePolicy: maxMergeAtOnce=3, maxMergeAtOnceExplicit=3, maxMergedSegmentMB=73.2353515625, floorSegmentMB=0.9111328125, forceMergeDeletesPctAllowed=26.600244630675935, segmentsPerTier=25.0, maxCFSSegmentSizeMB=8.796093022207999E12, noCFSRatio=0.7454197194594905
   [junit4]   2> 312272 INFO  (coreLoadExecutor-772-thread-1-processing-n:127.0.0.1:50888_) [n:127.0.0.1:50888_ c:control_collection s:shard1 r:core_node1 x:collection1] o.a.s.c.SolrDeletionPolicy SolrDeletionPolicy.onInit: commits: num=1
   [junit4]   2> 	commit{dir=NRTCachingDirectory(BlockDirectory(HdfsDirectory@hdfs://localhost:50146/solr_hdfs_home/control_collection/core_node1/data/index lockFactory=org.apache.lucene.store.SingleInstanceLockFactory@5c21ed7f); maxCacheMB=192.0 maxMergeSizeMB=16.0),segFN=segments_1,generation=1}
   [junit4]   2> 312273 INFO  (coreLoadExecutor-772-thread-1-processing-n:127.0.0.1:50888_) [n:127.0.0.1:50888_ c:control_collection s:shard1 r:core_node1 x:collection1] o.a.s.c.SolrDeletionPolicy newest commit generation = 1
   [junit4]   2> 312273 INFO  (coreLoadExecutor-772-thread-1-processing-n:127.0.0.1:50888_) [n:127.0.0.1:50888_ c:control_collection s:shard1 r:core_node1 x:collection1] o.a.s.s.SolrIndexSearcher Opening Searcher@29094f08[collection1] main
   [junit4]   2> 312273 INFO  (coreLoadExecutor-772-thread-1-processing-n:127.0.0.1:50888_) [n:127.0.0.1:50888_ c:control_collection s:shard1 r:core_node1 x:collection1] o.a.s.c.c.ZkStateReader Load collection config from: [/collections/control_collection]
   [junit4]   2> 312274 INFO  (coreLoadExecutor-772-thread-1-processing-n:127.0.0.1:50888_) [n:127.0.0.1:50888_ c:control_collection s:shard1 r:core_node1 x:collection1] o.a.s.c.c.ZkStateReader path=[/collections/control_collection] [configName]=[conf1] specified config exists in ZooKeeper
   [junit4]   2> 312274 INFO  (coreLoadExecutor-772-thread-1-processing-n:127.0.0.1:50888_) [n:127.0.0.1:50888_ c:control_collection s:shard1 r:core_node1 x:collection1] o.a.s.r.ManagedResourceStorage Setting up ZooKeeper-based storage for the RestManager with znodeBase: /configs/conf1
   [junit4]   2> 312275 INFO  (coreLoadExecutor-772-thread-1-processing-n:127.0.0.1:50888_) [n:127.0.0.1:50888_ c:control_collection s:shard1 r:core_node1 x:collection1] o.a.s.r.ManagedResourceStorage Configured ZooKeeperStorageIO with znodeBase: /configs/conf1
   [junit4]   2> 312275 INFO  (coreLoadExecutor-772-thread-1-processing-n:127.0.0.1:50888_) [n:127.0.0.1:50888_ c:control_collection s:shard1 r:core_node1 x:collection1] o.a.s.r.RestManager Initializing RestManager with initArgs: {}
   [junit4]   2> 312275 INFO  (coreLoadExecutor-772-thread-1-processing-n:127.0.0.1:50888_) [n:127.0.0.1:50888_ c:control_collection s:shard1 r:core_node1 x:collection1] o.a.s.r.ManagedResourceStorage Reading _rest_managed.json using ZooKeeperStorageIO:path=/configs/conf1
   [junit4]   2> 312275 INFO  (coreLoadExecutor-772-thread-1-processing-n:127.0.0.1:50888_) [n:127.0.0.1:50888_ c:control_collection s:shard1 r:core_node1 x:collection1] o.a.s.r.ManagedResourceStorage No data found for znode /configs/conf1/_rest_managed.json
   [junit4]   2> 312275 INFO  (coreLoadExecutor-772-thread-1-processing-n:127.0.0.1:50888_) [n:127.0.0.1:50888_ c:control_collection s:shard1 r:core_node1 x:collection1] o.a.s.r.ManagedResourceStorage Loaded null at path _rest_managed.json using ZooKeeperStorageIO:path=/configs/conf1
   [junit4]   2> 312276 INFO  (coreLoadExecutor-772-thread-1-processing-n:127.0.0.1:50888_) [n:127.0.0.1:50888_ c:control_collection s:shard1 r:core_node1 x:collection1] o.a.s.r.RestManager Initializing 0 registered ManagedResources
   [junit4]   2> 312277 INFO  (coreLoadExecutor-772-thread-1-processing-n:127.0.0.1:50888_) [n:127.0.0.1:50888_ c:control_collection s:shard1 r:core_node1 x:collection1] o.a.s.h.ReplicationHandler Commits will be reserved for  10000
   [junit4]   2> 312450 INFO  (coreLoadExecutor-772-thread-1-processing-n:127.0.0.1:50888_) [n:127.0.0.1:50888_ c:control_collection s:shard1 r:core_node1 x:collection1] o.a.s.u.UpdateLog Looking up max value of version field to seed version buckets
   [junit4]   2> 312450 INFO  (coreLoadExecutor-772-thread-1-processing-n:127.0.0.1:50888_) [n:127.0.0.1:50888_ c:control_collection s:shard1 r:core_node1 x:collection1] o.a.s.u.VersionInfo Refreshing highest value of _version_ for 65536 version buckets from index
   [junit4]   2> 312450 INFO  (coreLoadExecutor-772-thread-1-processing-n:127.0.0.1:50888_) [n:127.0.0.1:50888_ c:control_collection s:shard1 r:core_node1 x:collection1] o.a.s.u.VersionInfo No terms found for _version_, cannot seed version bucket highest value from index
   [junit4]   2> 312450 INFO  (coreLoadExecutor-772-thread-1-processing-n:127.0.0.1:50888_) [n:127.0.0.1:50888_ c:control_collection s:shard1 r:core_node1 x:collection1] o.a.s.u.UpdateLog Could not find max version in index or recent updates, using new clock 1544259806768922624
   [junit4]   2> 312452 INFO  (coreLoadExecutor-772-thread-1-processing-n:127.0.0.1:50888_) [n:127.0.0.1:50888_ c:control_collection s:shard1 r:core_node1 x:collection1] o.a.s.u.UpdateLog Took 1.0ms to seed version buckets with highest version 1544259806768922624
   [junit4]   2> 312452 INFO  (coreLoadExecutor-772-thread-1-processing-n:127.0.0.1:50888_) [n:127.0.0.1:50888_ c:control_collection s:shard1 r:core_node1 x:collection1] o.a.s.c.ZkController watch zkdir /configs/conf1
   [junit4]   2> 312512 INFO  (searcherExecutor-773-thread-1-processing-r:core_node1 c:control_collection x:collection1 s:shard1 n:127.0.0.1:50888_) [n:127.0.0.1:50888_ c:control_collection s:shard1 r:core_node1 x:collection1] o.a.s.c.SolrCore [collection1] Registered new searcher Searcher@29094f08[collection1] main{ExitableDirectoryReader(UninvertingDirectoryReader())}
   [junit4]   2> 312513 INFO  (coreLoadExecutor-772-thread-1-processing-n:127.0.0.1:50888_) [n:127.0.0.1:50888_ c:control_collection s:shard1 r:core_node1 x:collection1] o.a.s.c.CoreContainer registering core: collection1
   [junit4]   2> 312525 INFO  (coreZkRegister-766-thread-1-processing-r:core_node1 c:control_collection x:collection1 s:shard1 n:127.0.0.1:50888_) [n:127.0.0.1:50888_ c:control_collection s:shard1 r:core_node1 x:collection1] o.a.s.c.ZkController Register replica - core:collection1 address:http://127.0.0.1:50888 collection:control_collection shard:shard1
   [junit4]   2> 312526 INFO  (coreZkRegister-766-thread-1-processing-r:core_node1 c:control_collection x:collection1 s:shard1 n:127.0.0.1:50888_) [n:127.0.0.1:50888_ c:control_collection s:shard1 r:core_node1 x:collection1] o.a.s.c.c.SolrZkClient makePath: /collections/control_collection/leader_elect/shard1/election
   [junit4]   2> 312530 INFO  (coreZkRegister-766-thread-1-processing-r:core_node1 c:control_collection x:collection1 s:shard1 n:127.0.0.1:50888_) [n:127.0.0.1:50888_ c:control_collection s:shard1 r:core_node1 x:collection1] o.a.s.c.LeaderElector Joined leadership election with path: /collections/control_collection/leader_elect/shard1/election/96516237722779652-core_node1-n_0000000000
   [junit4]   2> 312531 INFO  (coreZkRegister-766-thread-1-processing-r:core_node1 c:control_collection x:collection1 s:shard1 n:127.0.0.1:50888_) [n:127.0.0.1:50888_ c:control_collection s:shard1 r:core_node1 x:collection1] o.a.s.c.ShardLeaderElectionContext Running the leader process for shard=shard1 and weAreReplacement=false and leaderVoteWait=10000
   [junit4]   2> 312532 INFO  (coreZkRegister-766-thread-1-processing-r:core_node1 c:control_collection x:collection1 s:shard1 n:127.0.0.1:50888_) [n:127.0.0.1:50888_ c:control_collection s:shard1 r:core_node1 x:collection1] o.a.s.c.ShardLeaderElectionContext Enough replicas found to continue.
   [junit4]   2> 312533 INFO  (coreZkRegister-766-thread-1-processing-r:core_node1 c:control_collection x:collection1 s:shard1 n:127.0.0.1:50888_) [n:127.0.0.1:50888_ c:control_collection s:shard1 r:core_node1 x:collection1] o.a.s.c.ShardLeaderElectionContext I may be the new leader - try and sync
   [junit4]   2> 312533 INFO  (coreZkRegister-766-thread-1-processing-r:core_node1 c:control_collection x:collection1 s:shard1 n:127.0.0.1:50888_) [n:127.0.0.1:50888_ c:control_collection s:shard1 r:core_node1 x:collection1] o.a.s.c.SyncStrategy Sync replicas to http://127.0.0.1:50888/collection1/
   [junit4]   2> 312533 INFO  (coreZkRegister-766-thread-1-processing-r:core_node1 c:control_collection x:collection1 s:shard1 n:127.0.0.1:50888_) [n:127.0.0.1:50888_ c:control_collection s:shard1 r:core_node1 x:collection1] o.a.s.c.SyncStrategy Sync Success - now sync replicas to me
   [junit4]   2> 312533 INFO  (coreZkRegister-766-thread-1-processing-r:core_node1 c:control_collection x:collection1 s:shard1 n:127.0.0.1:50888_) [n:127.0.0.1:50888_ c:control_collection s:shard1 r:core_node1 x:collection1] o.a.s.c.SyncStrategy http://127.0.0.1:50888/collection1/ has no replicas
   [junit4]   2> 312533 INFO  (OverseerStateUpdate-96516237722779652-127.0.0.1:50888_-n_0000000000) [n:127.0.0.1:50888_    ] o.a.s.c.Overseer processMessage: queueSize: 1, message = {
   [junit4]   2>   "operation":"leader",
   [junit4]   2>   "shard":"shard1",
   [junit4]   2>   "collection":"control_collection"} current state version: 1
   [junit4]   2> 312535 INFO  (zkCallback-319-thread-2-processing-n:127.0.0.1:50888_) [n:127.0.0.1:50888_    ] o.a.s.c.c.ZkStateReader A cluster state change: [WatchedEvent state:SyncConnected type:NodeDataChanged path:/clusterstate.json], has occurred - updating... (live nodes size: [1])
   [junit4]   2> 312535 INFO  (zkCallback-319-thread-1-processing-n:127.0.0.1:50888_) [n:127.0.0.1:50888_    ] o.a.s.c.c.ZkStateReader A cluster state change: [WatchedEvent state:SyncConnected type:NodeDataChanged path:/clusterstate.json], has occurred - updating... (live nodes size: [1])
   [junit4]   2> 312539 INFO  (coreZkRegister-766-thread-1-processing-r:core_node1 c:control_collection x:collection1 s:shard1 n:127.0.0.1:50888_) [n:127.0.0.1:50888_ c:control_collection s:shard1 r:core_node1 x:collection1] o.a.s.c.c.SolrZkClient makePath: /collections/control_collection/leaders/shard1
   [junit4]   2> 312541 INFO  (coreZkRegister-766-thread-1-processing-r:core_node1 c:control_collection x:collection1 s:shard1 n:127.0.0.1:50888_) [n:127.0.0.1:50888_ c:control_collection s:shard1 r:core_node1 x:collection1] o.a.s.c.ShardLeaderElectionContextBase Creating leader registration node /collections/control_collection/leaders/shard1/leader after winning as /collections/control_collection/leader_elect/shard1/election/96516237722779652-core_node1-n_0000000000
   [junit4]   2> 312543 INFO  (coreZkRegister-766-thread-1-processing-r:core_node1 c:control_collection x:collection1 s:shard1 n:127.0.0.1:50888_) [n:127.0.0.1:50888_ c:control_collection s:shard1 r:core_node1 x:collection1] o.a.s.c.ShardLeaderElectionContext I am the new leader: http://127.0.0.1:50888/collection1/ shard1
   [junit4]   2> 312544 INFO  (OverseerStateUpdate-96516237722779652-127.0.0.1:50888_-n_0000000000) [n:127.0.0.1:50888_    ] o.a.s.c.Overseer processMessage: queueSize: 1, message = {
   [junit4]   2>   "o

[...truncated too long message...]

-M15.jar:/x1/jenkins/jenkins-slave/workspace/Lucene-Solr-NightlyTests-5.5/checkout/solr/core/test-lib/apacheds-interceptor-kerberos-2.0.0-M15.jar:/x1/jenkins/jenkins-slave/workspace/Lucene-Solr-NightlyTests-5.5/checkout/solr/core/test-lib/apacheds-interceptors-admin-2.0.0-M15.jar:/x1/jenkins/jenkins-slave/workspace/Lucene-Solr-NightlyTests-5.5/checkout/solr/core/test-lib/apacheds-interceptors-authn-2.0.0-M15.jar:/x1/jenkins/jenkins-slave/workspace/Lucene-Solr-NightlyTests-5.5/checkout/solr/core/test-lib/apacheds-interceptors-authz-2.0.0-M15.jar:/x1/jenkins/jenkins-slave/workspace/Lucene-Solr-NightlyTests-5.5/checkout/solr/core/test-lib/apacheds-interceptors-changelog-2.0.0-M15.jar:/x1/jenkins/jenkins-slave/workspace/Lucene-Solr-NightlyTests-5.5/checkout/solr/core/test-lib/apacheds-interceptors-collective-2.0.0-M15.jar:/x1/jenkins/jenkins-slave/workspace/Lucene-Solr-NightlyTests-5.5/checkout/solr/core/test-lib/apacheds-interceptors-event-2.0.0-M15.jar:/x1/jenkins/jenkins-slave/workspace/Lucene-Solr-NightlyTests-5.5/checkout/solr/core/test-lib/apacheds-interceptors-exception-2.0.0-M15.jar:/x1/jenkins/jenkins-slave/workspace/Lucene-Solr-NightlyTests-5.5/checkout/solr/core/test-lib/apacheds-interceptors-journal-2.0.0-M15.jar:/x1/jenkins/jenkins-slave/workspace/Lucene-Solr-NightlyTests-5.5/checkout/solr/core/test-lib/apacheds-interceptors-normalization-2.0.0-M15.jar:/x1/jenkins/jenkins-slave/workspace/Lucene-Solr-NightlyTests-5.5/checkout/solr/core/test-lib/apacheds-interceptors-operational-2.0.0-M15.jar:/x1/jenkins/jenkins-slave/workspace/Lucene-Solr-NightlyTests-5.5/checkout/solr/core/test-lib/apacheds-interceptors-referral-2.0.0-M15.jar:/x1/jenkins/jenkins-slave/workspace/Lucene-Solr-NightlyTests-5.5/checkout/solr/core/test-lib/apacheds-interceptors-schema-2.0.0-M15.jar:/x1/jenkins/jenkins-slave/workspace/Lucene-Solr-NightlyTests-5.5/checkout/solr/core/test-lib/apacheds-interceptors-subtree-2.0.0-M15.jar:/x1/jenkins/jenkins-slave/workspace/Lucene-Solr-NightlyTests-5.5/checkout/solr/core/test-lib/apacheds-interceptors-trigger-2.0.0-M15.jar:/x1/jenkins/jenkins-slave/workspace/Lucene-Solr-NightlyTests-5.5/checkout/solr/core/test-lib/apacheds-jdbm-partition-2.0.0-M15.jar:/x1/jenkins/jenkins-slave/workspace/Lucene-Solr-NightlyTests-5.5/checkout/solr/core/test-lib/apacheds-jdbm1-2.0.0-M2.jar:/x1/jenkins/jenkins-slave/workspace/Lucene-Solr-NightlyTests-5.5/checkout/solr/core/test-lib/apacheds-kerberos-codec-2.0.0-M15.jar:/x1/jenkins/jenkins-slave/workspace/Lucene-Solr-NightlyTests-5.5/checkout/solr/core/test-lib/apacheds-ldif-partition-2.0.0-M15.jar:/x1/jenkins/jenkins-slave/workspace/Lucene-Solr-NightlyTests-5.5/checkout/solr/core/test-lib/apacheds-mavibot-partition-2.0.0-M15.jar:/x1/jenkins/jenkins-slave/workspace/Lucene-Solr-NightlyTests-5.5/checkout/solr/core/test-lib/apacheds-protocol-kerberos-2.0.0-M15.jar:/x1/jenkins/jenkins-slave/workspace/Lucene-Solr-NightlyTests-5.5/checkout/solr/core/test-lib/apacheds-protocol-ldap-2.0.0-M15.jar:/x1/jenkins/jenkins-slave/workspace/Lucene-Solr-NightlyTests-5.5/checkout/solr/core/test-lib/apacheds-protocol-shared-2.0.0-M15.jar:/x1/jenkins/jenkins-slave/workspace/Lucene-Solr-NightlyTests-5.5/checkout/solr/core/test-lib/apacheds-xdbm-partition-2.0.0-M15.jar:/x1/jenkins/jenkins-slave/workspace/Lucene-Solr-NightlyTests-5.5/checkout/solr/core/test-lib/api-all-1.0.0-M20.jar:/x1/jenkins/jenkins-slave/workspace/Lucene-Solr-NightlyTests-5.5/checkout/solr/core/test-lib/bcprov-jdk15-1.45.jar:/x1/jenkins/jenkins-slave/workspace/Lucene-Solr-NightlyTests-5.5/checkout/solr/core/test-lib/cglib-nodep-2.2.jar:/x1/jenkins/jenkins-slave/workspace/Lucene-Solr-NightlyTests-5.5/checkout/solr/core/test-lib/commons-collections-3.2.2.jar:/x1/jenkins/jenkins-slave/workspace/Lucene-Solr-NightlyTests-5.5/checkout/solr/core/test-lib/commons-math3-3.4.1.jar:/x1/jenkins/jenkins-slave/workspace/Lucene-Solr-NightlyTests-5.5/checkout/solr/core/test-lib/easymock-3.0.jar:/x1/jenkins/jenkins-slave/workspace/Lucene-Solr-NightlyTests-5.5/checkout/solr/core/test-lib/ehcache-core-2.4.4.jar:/x1/jenkins/jenkins-slave/workspace/Lucene-Solr-NightlyTests-5.5/checkout/solr/core/test-lib/hadoop-common-2.6.0-tests.jar:/x1/jenkins/jenkins-slave/workspace/Lucene-Solr-NightlyTests-5.5/checkout/solr/core/test-lib/hadoop-hdfs-2.6.0-tests.jar:/x1/jenkins/jenkins-slave/workspace/Lucene-Solr-NightlyTests-5.5/checkout/solr/core/test-lib/hadoop-minikdc-2.6.0.jar:/x1/jenkins/jenkins-slave/workspace/Lucene-Solr-NightlyTests-5.5/checkout/solr/core/test-lib/jackson-annotations-2.5.4.jar:/x1/jenkins/jenkins-slave/workspace/Lucene-Solr-NightlyTests-5.5/checkout/solr/core/test-lib/jackson-databind-2.5.4.jar:/x1/jenkins/jenkins-slave/workspace/Lucene-Solr-NightlyTests-5.5/checkout/solr/core/test-lib/jersey-core-1.9.jar:/x1/jenkins/jenkins-slave/workspace/Lucene-Solr-NightlyTests-5.5/checkout/solr/core/test-lib/jersey-server-1.9.jar:/x1/jenkins/jenkins-slave/workspace/Lucene-Solr-NightlyTests-5.5/checkout/solr/core/test-lib/jetty-6.1.26.jar:/x1/jenkins/jenkins-slave/workspace/Lucene-Solr-NightlyTests-5.5/checkout/solr/core/test-lib/jetty-util-6.1.26.jar:/x1/jenkins/jenkins-slave/workspace/Lucene-Solr-NightlyTests-5.5/checkout/solr/core/test-lib/mina-core-2.0.0-M5.jar:/x1/jenkins/jenkins-slave/workspace/Lucene-Solr-NightlyTests-5.5/checkout/solr/core/test-lib/objenesis-1.2.jar:/x1/jenkins/jenkins-slave/workspace/Lucene-Solr-NightlyTests-5.5/checkout/lucene/build/analysis/icu/lucene-analyzers-icu-5.5.3-SNAPSHOT.jar:/x1/jenkins/jenkins-slave/workspace/Lucene-Solr-NightlyTests-5.5/checkout/solr/build/contrib/solr-analysis-extras/classes/java:/x1/jenkins/jenkins-slave/workspace/Lucene-Solr-NightlyTests-5.5/checkout/lucene/build/queryparser/classes/test:/x1/jenkins/jenkins-slave/workspace/Lucene-Solr-NightlyTests-5.5/checkout/solr/contrib/analysis-extras/lib/icu4j-54.1.jar:/home/jenkins/tools/ant/apache-ant-1.8.4/lib/ant-launcher.jar:/x1/jenkins/.ant/lib/ivy-2.3.0.jar:/home/jenkins/tools/ant/apache-ant-1.8.4/lib/ant-junit.jar:/home/jenkins/tools/ant/apache-ant-1.8.4/lib/ant-apache-log4j.jar:/home/jenkins/tools/ant/apache-ant-1.8.4/lib/ant-junit4.jar:/home/jenkins/tools/ant/apache-ant-1.8.4/lib/ant-jai.jar:/home/jenkins/tools/ant/apache-ant-1.8.4/lib/ant-javamail.jar:/home/jenkins/tools/ant/apache-ant-1.8.4/lib/ant-apache-bsf.jar:/home/jenkins/tools/ant/apache-ant-1.8.4/lib/ant-commons-net.jar:/home/jenkins/tools/ant/apache-ant-1.8.4/lib/ant-antlr.jar:/home/jenkins/tools/ant/apache-ant-1.8.4/lib/ant-jsch.jar:/home/jenkins/tools/ant/apache-ant-1.8.4/lib/ant-apache-oro.jar:/home/jenkins/tools/ant/apache-ant-1.8.4/lib/ant-commons-logging.jar:/home/jenkins/tools/ant/apache-ant-1.8.4/lib/ant.jar:/home/jenkins/tools/ant/apache-ant-1.8.4/lib/ant-netrexx.jar:/home/jenkins/tools/ant/apache-ant-1.8.4/lib/ant-testutil.jar:/home/jenkins/tools/ant/apache-ant-1.8.4/lib/ant-jdepend.jar:/home/jenkins/tools/ant/apache-ant-1.8.4/lib/ant-apache-bcel.jar:/home/jenkins/tools/ant/apache-ant-1.8.4/lib/ant-apache-xalan2.jar:/home/jenkins/tools/ant/apache-ant-1.8.4/lib/ant-apache-resolver.jar:/home/jenkins/tools/ant/apache-ant-1.8.4/lib/ant-jmf.jar:/home/jenkins/tools/ant/apache-ant-1.8.4/lib/ant-apache-regexp.jar:/home/jenkins/tools/ant/apache-ant-1.8.4/lib/ant-swing.jar:/usr/local/asfpackages/java/jdk1.7.0_80/lib/tools.jar:/x1/jenkins/.ivy2/cache/com.carrotsearch.randomizedtesting/junit4-ant/jars/junit4-ant-2.3.2.jar com.carrotsearch.ant.tasks.junit4.slave.SlaveMainSafe -eventsfile /x1/jenkins/jenkins-slave/workspace/Lucene-Solr-NightlyTests-5.5/checkout/solr/build/solr-core/test/temp/junit4-J1-20160901_090320_106.events @/x1/jenkins/jenkins-slave/workspace/Lucene-Solr-NightlyTests-5.5/checkout/solr/build/solr-core/test/temp/junit4-J1-20160901_090320_106.suites -stdin
   [junit4] ERROR: JVM J1 ended with an exception: Quit event not received from the forked process? This may indicate JVM crash or runner bugs.
   [junit4] 	at com.carrotsearch.ant.tasks.junit4.JUnit4.executeSlave(JUnit4.java:1501)
   [junit4] 	at com.carrotsearch.ant.tasks.junit4.JUnit4.access$000(JUnit4.java:121)
   [junit4] 	at com.carrotsearch.ant.tasks.junit4.JUnit4$2.call(JUnit4.java:955)
   [junit4] 	at com.carrotsearch.ant.tasks.junit4.JUnit4$2.call(JUnit4.java:952)
   [junit4] 	at java.util.concurrent.FutureTask.run(FutureTask.java:262)
   [junit4] 	at java.util.concurrent.ThreadPoolExecutor.runWorker(ThreadPoolExecutor.java:1145)
   [junit4] 	at java.util.concurrent.ThreadPoolExecutor$Worker.run(ThreadPoolExecutor.java:615)
   [junit4] 	at java.lang.Thread.run(Thread.java:745)

BUILD FAILED
/x1/jenkins/jenkins-slave/workspace/Lucene-Solr-NightlyTests-5.5/checkout/build.xml:757: The following error occurred while executing this line:
/x1/jenkins/jenkins-slave/workspace/Lucene-Solr-NightlyTests-5.5/checkout/build.xml:694: The following error occurred while executing this line:
/x1/jenkins/jenkins-slave/workspace/Lucene-Solr-NightlyTests-5.5/checkout/build.xml:59: The following error occurred while executing this line:
/x1/jenkins/jenkins-slave/workspace/Lucene-Solr-NightlyTests-5.5/checkout/solr/build.xml:233: The following error occurred while executing this line:
/x1/jenkins/jenkins-slave/workspace/Lucene-Solr-NightlyTests-5.5/checkout/solr/common-build.xml:534: The following error occurred while executing this line:
/x1/jenkins/jenkins-slave/workspace/Lucene-Solr-NightlyTests-5.5/checkout/lucene/common-build.xml:1477: The following error occurred while executing this line:
/x1/jenkins/jenkins-slave/workspace/Lucene-Solr-NightlyTests-5.5/checkout/lucene/common-build.xml:1033: At least one slave process threw an exception, first: Quit event not received from the forked process? This may indicate JVM crash or runner bugs.

Total time: 333 minutes 42 seconds
Build step 'Invoke Ant' marked build as failure
Archiving artifacts
No prior successful build to compare, so performing full copy of artifacts
Recording test results
Email was triggered for: Failure - Any
Sending email for trigger: Failure - Any




Mime
View raw message