lucene-dev mailing list archives

Site index · List index
Message view « Date » · « Thread »
Top « Date » · « Thread »
From Policeman Jenkins Server <jenk...@thetaphi.de>
Subject [JENKINS-EA] Lucene-Solr-6.x-Linux (32bit/jdk-9-ea+134) - Build # 1687 - Unstable!
Date Thu, 08 Sep 2016 20:47:25 GMT
Build: http://jenkins.thetaphi.de/job/Lucene-Solr-6.x-Linux/1687/
Java: 32bit/jdk-9-ea+134 -client -XX:+UseSerialGC

1 tests failed.
FAILED:  org.apache.solr.security.BasicAuthIntegrationTest.testBasicAuth

Error Message:
IOException occured when talking to server at: https://127.0.0.1:45062/solr

Stack Trace:
org.apache.solr.client.solrj.SolrServerException: IOException occured when talking to server at: https://127.0.0.1:45062/solr
	at __randomizedtesting.SeedInfo.seed([DE61965EA597D88B:620FE04C01C45BF1]:0)
	at org.apache.solr.client.solrj.impl.HttpSolrClient.executeMethod(HttpSolrClient.java:606)
	at org.apache.solr.client.solrj.impl.HttpSolrClient.request(HttpSolrClient.java:261)
	at org.apache.solr.client.solrj.impl.HttpSolrClient.request(HttpSolrClient.java:250)
	at org.apache.solr.client.solrj.SolrClient.request(SolrClient.java:1219)
	at org.apache.solr.security.BasicAuthIntegrationTest.testBasicAuth(BasicAuthIntegrationTest.java:157)
	at jdk.internal.reflect.NativeMethodAccessorImpl.invoke0(java.base@9-ea/Native Method)
	at jdk.internal.reflect.NativeMethodAccessorImpl.invoke(java.base@9-ea/NativeMethodAccessorImpl.java:62)
	at jdk.internal.reflect.DelegatingMethodAccessorImpl.invoke(java.base@9-ea/DelegatingMethodAccessorImpl.java:43)
	at java.lang.reflect.Method.invoke(java.base@9-ea/Method.java:535)
	at com.carrotsearch.randomizedtesting.RandomizedRunner.invoke(RandomizedRunner.java:1764)
	at com.carrotsearch.randomizedtesting.RandomizedRunner$8.evaluate(RandomizedRunner.java:871)
	at com.carrotsearch.randomizedtesting.RandomizedRunner$9.evaluate(RandomizedRunner.java:907)
	at com.carrotsearch.randomizedtesting.RandomizedRunner$10.evaluate(RandomizedRunner.java:921)
	at com.carrotsearch.randomizedtesting.rules.SystemPropertiesRestoreRule$1.evaluate(SystemPropertiesRestoreRule.java:57)
	at org.apache.lucene.util.TestRuleSetupTeardownChained$1.evaluate(TestRuleSetupTeardownChained.java:49)
	at org.apache.lucene.util.AbstractBeforeAfterRule$1.evaluate(AbstractBeforeAfterRule.java:45)
	at org.apache.lucene.util.TestRuleThreadAndTestName$1.evaluate(TestRuleThreadAndTestName.java:48)
	at org.apache.lucene.util.TestRuleIgnoreAfterMaxFailures$1.evaluate(TestRuleIgnoreAfterMaxFailures.java:64)
	at org.apache.lucene.util.TestRuleMarkFailure$1.evaluate(TestRuleMarkFailure.java:47)
	at com.carrotsearch.randomizedtesting.rules.StatementAdapter.evaluate(StatementAdapter.java:36)
	at com.carrotsearch.randomizedtesting.ThreadLeakControl$StatementRunner.run(ThreadLeakControl.java:367)
	at com.carrotsearch.randomizedtesting.ThreadLeakControl.forkTimeoutingTask(ThreadLeakControl.java:809)
	at com.carrotsearch.randomizedtesting.ThreadLeakControl$3.evaluate(ThreadLeakControl.java:460)
	at com.carrotsearch.randomizedtesting.RandomizedRunner.runSingleTest(RandomizedRunner.java:880)
	at com.carrotsearch.randomizedtesting.RandomizedRunner$5.evaluate(RandomizedRunner.java:781)
	at com.carrotsearch.randomizedtesting.RandomizedRunner$6.evaluate(RandomizedRunner.java:816)
	at com.carrotsearch.randomizedtesting.RandomizedRunner$7.evaluate(RandomizedRunner.java:827)
	at com.carrotsearch.randomizedtesting.rules.StatementAdapter.evaluate(StatementAdapter.java:36)
	at com.carrotsearch.randomizedtesting.rules.SystemPropertiesRestoreRule$1.evaluate(SystemPropertiesRestoreRule.java:57)
	at org.apache.lucene.util.AbstractBeforeAfterRule$1.evaluate(AbstractBeforeAfterRule.java:45)
	at com.carrotsearch.randomizedtesting.rules.StatementAdapter.evaluate(StatementAdapter.java:36)
	at org.apache.lucene.util.TestRuleStoreClassName$1.evaluate(TestRuleStoreClassName.java:41)
	at com.carrotsearch.randomizedtesting.rules.NoShadowingOrOverridesOnMethodsRule$1.evaluate(NoShadowingOrOverridesOnMethodsRule.java:40)
	at com.carrotsearch.randomizedtesting.rules.NoShadowingOrOverridesOnMethodsRule$1.evaluate(NoShadowingOrOverridesOnMethodsRule.java:40)
	at com.carrotsearch.randomizedtesting.rules.StatementAdapter.evaluate(StatementAdapter.java:36)
	at com.carrotsearch.randomizedtesting.rules.StatementAdapter.evaluate(StatementAdapter.java:36)
	at com.carrotsearch.randomizedtesting.rules.StatementAdapter.evaluate(StatementAdapter.java:36)
	at org.apache.lucene.util.TestRuleAssertionsRequired$1.evaluate(TestRuleAssertionsRequired.java:53)
	at org.apache.lucene.util.TestRuleMarkFailure$1.evaluate(TestRuleMarkFailure.java:47)
	at org.apache.lucene.util.TestRuleIgnoreAfterMaxFailures$1.evaluate(TestRuleIgnoreAfterMaxFailures.java:64)
	at org.apache.lucene.util.TestRuleIgnoreTestSuites$1.evaluate(TestRuleIgnoreTestSuites.java:54)
	at com.carrotsearch.randomizedtesting.rules.StatementAdapter.evaluate(StatementAdapter.java:36)
	at com.carrotsearch.randomizedtesting.ThreadLeakControl$StatementRunner.run(ThreadLeakControl.java:367)
	at java.lang.Thread.run(java.base@9-ea/Thread.java:843)
Caused by: javax.net.ssl.SSLHandshakeException: sun.security.validator.ValidatorException: PKIX path building failed: sun.security.provider.certpath.SunCertPathBuilderException: unable to find valid certification path to requested target
	at sun.security.ssl.Alerts.getSSLException(java.base@9-ea/Alerts.java:198)
	at sun.security.ssl.SSLSocketImpl.fatal(java.base@9-ea/SSLSocketImpl.java:1962)
	at sun.security.ssl.Handshaker.fatalSE(java.base@9-ea/Handshaker.java:309)
	at sun.security.ssl.Handshaker.fatalSE(java.base@9-ea/Handshaker.java:303)
	at sun.security.ssl.ClientHandshaker.checkServerCerts(java.base@9-ea/ClientHandshaker.java:1843)
	at sun.security.ssl.ClientHandshaker.serverCertificate(java.base@9-ea/ClientHandshaker.java:1652)
	at sun.security.ssl.ClientHandshaker.processMessage(java.base@9-ea/ClientHandshaker.java:260)
	at sun.security.ssl.Handshaker.processLoop(java.base@9-ea/Handshaker.java:1061)
	at sun.security.ssl.Handshaker.processRecord(java.base@9-ea/Handshaker.java:995)
	at sun.security.ssl.SSLSocketImpl.processInputRecord(java.base@9-ea/SSLSocketImpl.java:1132)
	at sun.security.ssl.SSLSocketImpl.readRecord(java.base@9-ea/SSLSocketImpl.java:1069)
	at sun.security.ssl.SSLSocketImpl.readRecord(java.base@9-ea/SSLSocketImpl.java:968)
	at sun.security.ssl.SSLSocketImpl.performInitialHandshake(java.base@9-ea/SSLSocketImpl.java:1395)
	at sun.security.ssl.SSLSocketImpl.startHandshake(java.base@9-ea/SSLSocketImpl.java:1422)
	at sun.security.ssl.SSLSocketImpl.startHandshake(java.base@9-ea/SSLSocketImpl.java:1406)
	at org.apache.http.conn.ssl.SSLSocketFactory.connectSocket(SSLSocketFactory.java:543)
	at org.apache.http.conn.ssl.SSLSocketFactory.connectSocket(SSLSocketFactory.java:409)
	at org.apache.http.impl.conn.DefaultClientConnectionOperator.openConnection(DefaultClientConnectionOperator.java:177)
	at org.apache.http.impl.conn.ManagedClientConnectionImpl.open(ManagedClientConnectionImpl.java:304)
	at org.apache.http.impl.client.DefaultRequestDirector.tryConnect(DefaultRequestDirector.java:611)
	at org.apache.http.impl.client.DefaultRequestDirector.execute(DefaultRequestDirector.java:446)
	at org.apache.http.impl.client.AbstractHttpClient.doExecute(AbstractHttpClient.java:882)
	at org.apache.http.impl.client.CloseableHttpClient.execute(CloseableHttpClient.java:82)
	at org.apache.http.impl.client.CloseableHttpClient.execute(CloseableHttpClient.java:107)
	at org.apache.http.impl.client.CloseableHttpClient.execute(CloseableHttpClient.java:55)
	at org.apache.solr.client.solrj.impl.HttpSolrClient.executeMethod(HttpSolrClient.java:497)
	... 43 more
Caused by: sun.security.validator.ValidatorException: PKIX path building failed: sun.security.provider.certpath.SunCertPathBuilderException: unable to find valid certification path to requested target
	at sun.security.validator.PKIXValidator.doBuild(java.base@9-ea/PKIXValidator.java:386)
	at sun.security.validator.PKIXValidator.engineValidate(java.base@9-ea/PKIXValidator.java:291)
	at sun.security.validator.Validator.validate(java.base@9-ea/Validator.java:264)
	at sun.security.ssl.X509TrustManagerImpl.validate(java.base@9-ea/X509TrustManagerImpl.java:343)
	at sun.security.ssl.X509TrustManagerImpl.checkTrusted(java.base@9-ea/X509TrustManagerImpl.java:237)
	at sun.security.ssl.X509TrustManagerImpl.checkServerTrusted(java.base@9-ea/X509TrustManagerImpl.java:124)
	at sun.security.ssl.ClientHandshaker.checkServerCerts(java.base@9-ea/ClientHandshaker.java:1822)
	... 64 more
Caused by: sun.security.provider.certpath.SunCertPathBuilderException: unable to find valid certification path to requested target
	at sun.security.provider.certpath.SunCertPathBuilder.build(java.base@9-ea/SunCertPathBuilder.java:141)
	at sun.security.provider.certpath.SunCertPathBuilder.engineBuild(java.base@9-ea/SunCertPathBuilder.java:126)
	at java.security.cert.CertPathBuilder.build(java.base@9-ea/CertPathBuilder.java:288)
	at sun.security.validator.PKIXValidator.doBuild(java.base@9-ea/PKIXValidator.java:381)
	... 70 more




Build Log:
[...truncated 11159 lines...]
   [junit4] Suite: org.apache.solr.security.BasicAuthIntegrationTest
   [junit4]   2> Creating dataDir: /home/jenkins/workspace/Lucene-Solr-6.x-Linux/solr/build/solr-core/test/J2/temp/solr.security.BasicAuthIntegrationTest_DE61965EA597D88B-001/init-core-data-001
   [junit4]   2> 468595 INFO  (SUITE-BasicAuthIntegrationTest-seed#[DE61965EA597D88B]-worker) [    ] o.a.s.SolrTestCaseJ4 Randomized ssl (true) and clientAuth (true) via: @org.apache.solr.util.RandomizeSSL(reason="", ssl=0.0/0.0, value=0.0/0.0, clientAuth=0.0/0.0)
   [junit4]   2> 468596 INFO  (SUITE-BasicAuthIntegrationTest-seed#[DE61965EA597D88B]-worker) [    ] o.a.s.c.ZkTestServer STARTING ZK TEST SERVER
   [junit4]   2> 468596 INFO  (Thread-947) [    ] o.a.s.c.ZkTestServer client port:0.0.0.0/0.0.0.0:0
   [junit4]   2> 468596 INFO  (Thread-947) [    ] o.a.s.c.ZkTestServer Starting server
   [junit4]   2> 468696 INFO  (SUITE-BasicAuthIntegrationTest-seed#[DE61965EA597D88B]-worker) [    ] o.a.s.c.ZkTestServer start zk server on port:38805
   [junit4]   2> 468696 INFO  (SUITE-BasicAuthIntegrationTest-seed#[DE61965EA597D88B]-worker) [    ] o.a.s.c.c.SolrZkClient Using default ZkCredentialsProvider
   [junit4]   2> 468697 INFO  (SUITE-BasicAuthIntegrationTest-seed#[DE61965EA597D88B]-worker) [    ] o.a.s.c.c.ConnectionManager Waiting for client to connect to ZooKeeper
   [junit4]   2> 468698 INFO  (zkCallback-601-thread-1) [    ] o.a.s.c.c.ConnectionManager Watcher org.apache.solr.common.cloud.ConnectionManager@d322e5 name:ZooKeeperConnection Watcher:127.0.0.1:38805 got event WatchedEvent state:SyncConnected type:None path:null path:null type:None
   [junit4]   2> 468698 INFO  (SUITE-BasicAuthIntegrationTest-seed#[DE61965EA597D88B]-worker) [    ] o.a.s.c.c.ConnectionManager Client is connected to ZooKeeper
   [junit4]   2> 468699 INFO  (SUITE-BasicAuthIntegrationTest-seed#[DE61965EA597D88B]-worker) [    ] o.a.s.c.c.SolrZkClient Using default ZkACLProvider
   [junit4]   2> 468699 INFO  (SUITE-BasicAuthIntegrationTest-seed#[DE61965EA597D88B]-worker) [    ] o.a.s.c.c.SolrZkClient makePath: /solr/solr.xml
   [junit4]   2> 468700 INFO  (SUITE-BasicAuthIntegrationTest-seed#[DE61965EA597D88B]-worker) [    ] o.a.s.c.c.SolrZkClient makePath: /solr/clusterprops.json
   [junit4]   2> 468702 INFO  (jetty-launcher-600-thread-1) [    ] o.e.j.s.Server jetty-9.3.8.v20160314
   [junit4]   2> 468702 INFO  (jetty-launcher-600-thread-2) [    ] o.e.j.s.Server jetty-9.3.8.v20160314
   [junit4]   2> 468702 INFO  (jetty-launcher-600-thread-3) [    ] o.e.j.s.Server jetty-9.3.8.v20160314
   [junit4]   2> 468712 INFO  (jetty-launcher-600-thread-1) [    ] o.e.j.s.h.ContextHandler Started o.e.j.s.ServletContextHandler@5c9140{/solr,null,AVAILABLE}
   [junit4]   2> 468712 INFO  (jetty-launcher-600-thread-2) [    ] o.e.j.s.h.ContextHandler Started o.e.j.s.ServletContextHandler@a625f2{/solr,null,AVAILABLE}
   [junit4]   2> 468712 INFO  (jetty-launcher-600-thread-3) [    ] o.e.j.s.h.ContextHandler Started o.e.j.s.ServletContextHandler@5c7b39{/solr,null,AVAILABLE}
   [junit4]   2> 468714 INFO  (jetty-launcher-600-thread-3) [    ] o.e.j.s.ServerConnector Started ServerConnector@10d43b3{SSL,[ssl, http/1.1]}{127.0.0.1:41980}
   [junit4]   2> 468714 INFO  (jetty-launcher-600-thread-1) [    ] o.e.j.s.ServerConnector Started ServerConnector@1ae0c0a{SSL,[ssl, http/1.1]}{127.0.0.1:45062}
   [junit4]   2> 468714 INFO  (jetty-launcher-600-thread-3) [    ] o.e.j.s.Server Started @470668ms
   [junit4]   2> 468714 INFO  (jetty-launcher-600-thread-1) [    ] o.e.j.s.Server Started @470668ms
   [junit4]   2> 468714 INFO  (jetty-launcher-600-thread-3) [    ] o.a.s.c.s.e.JettySolrRunner Jetty properties: {hostContext=/solr, hostPort=41980}
   [junit4]   2> 468714 INFO  (jetty-launcher-600-thread-1) [    ] o.a.s.c.s.e.JettySolrRunner Jetty properties: {hostContext=/solr, hostPort=45062}
   [junit4]   2> 468714 INFO  (jetty-launcher-600-thread-2) [    ] o.e.j.s.ServerConnector Started ServerConnector@182506{SSL,[ssl, http/1.1]}{127.0.0.1:41048}
   [junit4]   2> 468714 INFO  (jetty-launcher-600-thread-2) [    ] o.e.j.s.Server Started @470668ms
   [junit4]   2> 468714 INFO  (jetty-launcher-600-thread-2) [    ] o.a.s.c.s.e.JettySolrRunner Jetty properties: {hostContext=/solr, hostPort=41048}
   [junit4]   2> 468714 INFO  (jetty-launcher-600-thread-1) [    ] o.a.s.s.SolrDispatchFilter SolrDispatchFilter.init(): jdk.internal.loader.ClassLoaders$AppClassLoader@17b1517
   [junit4]   2> 468714 INFO  (jetty-launcher-600-thread-3) [    ] o.a.s.s.SolrDispatchFilter SolrDispatchFilter.init(): jdk.internal.loader.ClassLoaders$AppClassLoader@17b1517
   [junit4]   2> 468714 INFO  (jetty-launcher-600-thread-1) [    ] o.a.s.c.SolrResourceLoader new SolrResourceLoader for directory: '/home/jenkins/workspace/Lucene-Solr-6.x-Linux/solr/build/solr-core/test/J2/temp/solr.security.BasicAuthIntegrationTest_DE61965EA597D88B-001/tempDir-001/node1'
   [junit4]   2> 468714 INFO  (jetty-launcher-600-thread-3) [    ] o.a.s.c.SolrResourceLoader new SolrResourceLoader for directory: '/home/jenkins/workspace/Lucene-Solr-6.x-Linux/solr/build/solr-core/test/J2/temp/solr.security.BasicAuthIntegrationTest_DE61965EA597D88B-001/tempDir-001/node3'
   [junit4]   2> 468714 INFO  (jetty-launcher-600-thread-2) [    ] o.a.s.s.SolrDispatchFilter SolrDispatchFilter.init(): jdk.internal.loader.ClassLoaders$AppClassLoader@17b1517
   [junit4]   2> 468714 INFO  (jetty-launcher-600-thread-2) [    ] o.a.s.c.SolrResourceLoader new SolrResourceLoader for directory: '/home/jenkins/workspace/Lucene-Solr-6.x-Linux/solr/build/solr-core/test/J2/temp/solr.security.BasicAuthIntegrationTest_DE61965EA597D88B-001/tempDir-001/node2'
   [junit4]   2> 468714 INFO  (jetty-launcher-600-thread-1) [    ] o.a.s.c.SolrResourceLoader JNDI not configured for solr (NoInitialContextEx)
   [junit4]   2> 468714 INFO  (jetty-launcher-600-thread-3) [    ] o.a.s.c.SolrResourceLoader JNDI not configured for solr (NoInitialContextEx)
   [junit4]   2> 468714 INFO  (jetty-launcher-600-thread-1) [    ] o.a.s.c.SolrResourceLoader solr home defaulted to 'solr/' (could not find system property or JNDI)
   [junit4]   2> 468714 INFO  (jetty-launcher-600-thread-3) [    ] o.a.s.c.SolrResourceLoader solr home defaulted to 'solr/' (could not find system property or JNDI)
   [junit4]   2> 468714 INFO  (jetty-launcher-600-thread-2) [    ] o.a.s.c.SolrResourceLoader JNDI not configured for solr (NoInitialContextEx)
   [junit4]   2> 468715 INFO  (jetty-launcher-600-thread-2) [    ] o.a.s.c.SolrResourceLoader solr home defaulted to 'solr/' (could not find system property or JNDI)
   [junit4]   2> 468715 INFO  (jetty-launcher-600-thread-3) [    ] o.a.s.c.c.SolrZkClient Using default ZkCredentialsProvider
   [junit4]   2> 468715 INFO  (jetty-launcher-600-thread-2) [    ] o.a.s.c.c.SolrZkClient Using default ZkCredentialsProvider
   [junit4]   2> 468715 INFO  (jetty-launcher-600-thread-1) [    ] o.a.s.c.c.SolrZkClient Using default ZkCredentialsProvider
   [junit4]   2> 468715 INFO  (jetty-launcher-600-thread-2) [    ] o.a.s.c.c.ConnectionManager Waiting for client to connect to ZooKeeper
   [junit4]   2> 468715 INFO  (jetty-launcher-600-thread-3) [    ] o.a.s.c.c.ConnectionManager Waiting for client to connect to ZooKeeper
   [junit4]   2> 468715 INFO  (jetty-launcher-600-thread-1) [    ] o.a.s.c.c.ConnectionManager Waiting for client to connect to ZooKeeper
   [junit4]   2> 468716 INFO  (zkCallback-604-thread-1) [    ] o.a.s.c.c.ConnectionManager Watcher org.apache.solr.common.cloud.ConnectionManager@1d6288e name:ZooKeeperConnection Watcher:127.0.0.1:38805/solr got event WatchedEvent state:SyncConnected type:None path:null path:null type:None
   [junit4]   2> 468716 INFO  (jetty-launcher-600-thread-2) [    ] o.a.s.c.c.ConnectionManager Client is connected to ZooKeeper
   [junit4]   2> 468716 INFO  (jetty-launcher-600-thread-2) [    ] o.a.s.c.c.SolrZkClient Using default ZkACLProvider
   [junit4]   2> 468716 INFO  (zkCallback-603-thread-1) [    ] o.a.s.c.c.ConnectionManager Watcher org.apache.solr.common.cloud.ConnectionManager@13c4227 name:ZooKeeperConnection Watcher:127.0.0.1:38805/solr got event WatchedEvent state:SyncConnected type:None path:null path:null type:None
   [junit4]   2> 468716 INFO  (jetty-launcher-600-thread-3) [    ] o.a.s.c.c.ConnectionManager Client is connected to ZooKeeper
   [junit4]   2> 468716 INFO  (jetty-launcher-600-thread-2) [    ] o.a.s.s.SolrDispatchFilter solr.xml found in ZooKeeper. Loading...
   [junit4]   2> 468716 INFO  (zkCallback-602-thread-1) [    ] o.a.s.c.c.ConnectionManager Watcher org.apache.solr.common.cloud.ConnectionManager@7df1b name:ZooKeeperConnection Watcher:127.0.0.1:38805/solr got event WatchedEvent state:SyncConnected type:None path:null path:null type:None
   [junit4]   2> 468716 INFO  (jetty-launcher-600-thread-1) [    ] o.a.s.c.c.ConnectionManager Client is connected to ZooKeeper
   [junit4]   2> 468716 INFO  (jetty-launcher-600-thread-3) [    ] o.a.s.c.c.SolrZkClient Using default ZkACLProvider
   [junit4]   2> 468716 INFO  (jetty-launcher-600-thread-1) [    ] o.a.s.c.c.SolrZkClient Using default ZkACLProvider
   [junit4]   2> 468716 INFO  (jetty-launcher-600-thread-3) [    ] o.a.s.s.SolrDispatchFilter solr.xml found in ZooKeeper. Loading...
   [junit4]   2> 468717 INFO  (jetty-launcher-600-thread-1) [    ] o.a.s.s.SolrDispatchFilter solr.xml found in ZooKeeper. Loading...
   [junit4]   2> 468736 INFO  (jetty-launcher-600-thread-3) [    ] o.a.s.c.CorePropertiesLocator Config-defined core root directory: /home/jenkins/workspace/Lucene-Solr-6.x-Linux/solr/build/solr-core/test/J2/temp/solr.security.BasicAuthIntegrationTest_DE61965EA597D88B-001/tempDir-001/node3/.
   [junit4]   2> 468736 INFO  (jetty-launcher-600-thread-1) [    ] o.a.s.c.CorePropertiesLocator Config-defined core root directory: /home/jenkins/workspace/Lucene-Solr-6.x-Linux/solr/build/solr-core/test/J2/temp/solr.security.BasicAuthIntegrationTest_DE61965EA597D88B-001/tempDir-001/node1/.
   [junit4]   2> 468736 INFO  (jetty-launcher-600-thread-2) [    ] o.a.s.c.CorePropertiesLocator Config-defined core root directory: /home/jenkins/workspace/Lucene-Solr-6.x-Linux/solr/build/solr-core/test/J2/temp/solr.security.BasicAuthIntegrationTest_DE61965EA597D88B-001/tempDir-001/node2/.
   [junit4]   2> 468736 INFO  (jetty-launcher-600-thread-1) [    ] o.a.s.c.CoreContainer New CoreContainer 23008321
   [junit4]   2> 468736 WARN  (NIOServerCxn.Factory:0.0.0.0/0.0.0.0:0) [    ] o.a.z.s.NIOServerCnxn caught end of stream exception
   [junit4]   2> EndOfStreamException: Unable to read additional data from client sessionid 0x1570b6f70440001, likely client has closed socket
   [junit4]   2> 	at org.apache.zookeeper.server.NIOServerCnxn.doIO(NIOServerCnxn.java:228)
   [junit4]   2> 	at org.apache.zookeeper.server.NIOServerCnxnFactory.run(NIOServerCnxnFactory.java:208)
   [junit4]   2> 	at java.lang.Thread.run(java.base@9-ea/Thread.java:843)
   [junit4]   2> 468736 INFO  (jetty-launcher-600-thread-2) [    ] o.a.s.c.CoreContainer New CoreContainer 3539244
   [junit4]   2> 468736 INFO  (jetty-launcher-600-thread-2) [    ] o.a.s.c.CoreContainer Loading cores into CoreContainer [instanceDir=/home/jenkins/workspace/Lucene-Solr-6.x-Linux/solr/build/solr-core/test/J2/temp/solr.security.BasicAuthIntegrationTest_DE61965EA597D88B-001/tempDir-001/node2]
   [junit4]   2> 468736 INFO  (jetty-launcher-600-thread-1) [    ] o.a.s.c.CoreContainer Loading cores into CoreContainer [instanceDir=/home/jenkins/workspace/Lucene-Solr-6.x-Linux/solr/build/solr-core/test/J2/temp/solr.security.BasicAuthIntegrationTest_DE61965EA597D88B-001/tempDir-001/node1]
   [junit4]   2> 468736 INFO  (jetty-launcher-600-thread-3) [    ] o.a.s.c.CoreContainer New CoreContainer 1063239
   [junit4]   2> 468736 INFO  (jetty-launcher-600-thread-3) [    ] o.a.s.c.CoreContainer Loading cores into CoreContainer [instanceDir=/home/jenkins/workspace/Lucene-Solr-6.x-Linux/solr/build/solr-core/test/J2/temp/solr.security.BasicAuthIntegrationTest_DE61965EA597D88B-001/tempDir-001/node3]
   [junit4]   2> 468736 WARN  (jetty-launcher-600-thread-2) [    ] o.a.s.c.CoreContainer Couldn't add files from /home/jenkins/workspace/Lucene-Solr-6.x-Linux/solr/build/solr-core/test/J2/temp/solr.security.BasicAuthIntegrationTest_DE61965EA597D88B-001/tempDir-001/node2/lib to classpath: /home/jenkins/workspace/Lucene-Solr-6.x-Linux/solr/build/solr-core/test/J2/temp/solr.security.BasicAuthIntegrationTest_DE61965EA597D88B-001/tempDir-001/node2/lib
   [junit4]   2> 468736 WARN  (jetty-launcher-600-thread-1) [    ] o.a.s.c.CoreContainer Couldn't add files from /home/jenkins/workspace/Lucene-Solr-6.x-Linux/solr/build/solr-core/test/J2/temp/solr.security.BasicAuthIntegrationTest_DE61965EA597D88B-001/tempDir-001/node1/lib to classpath: /home/jenkins/workspace/Lucene-Solr-6.x-Linux/solr/build/solr-core/test/J2/temp/solr.security.BasicAuthIntegrationTest_DE61965EA597D88B-001/tempDir-001/node1/lib
   [junit4]   2> 468736 INFO  (jetty-launcher-600-thread-2) [    ] o.a.s.h.c.HttpShardHandlerFactory created with socketTimeout : 90000,urlScheme : https,connTimeout : 15000,maxConnectionsPerHost : 20,maxConnections : 10000,corePoolSize : 0,maximumPoolSize : 2147483647,maxThreadIdleTime : 5,sizeOfQueue : -1,fairnessPolicy : false,useRetries : false,connectionsEvictorSleepDelay : 5000,maxConnectionIdleTime : 40000,
   [junit4]   2> 468736 WARN  (jetty-launcher-600-thread-3) [    ] o.a.s.c.CoreContainer Couldn't add files from /home/jenkins/workspace/Lucene-Solr-6.x-Linux/solr/build/solr-core/test/J2/temp/solr.security.BasicAuthIntegrationTest_DE61965EA597D88B-001/tempDir-001/node3/lib to classpath: /home/jenkins/workspace/Lucene-Solr-6.x-Linux/solr/build/solr-core/test/J2/temp/solr.security.BasicAuthIntegrationTest_DE61965EA597D88B-001/tempDir-001/node3/lib
   [junit4]   2> 468736 INFO  (jetty-launcher-600-thread-1) [    ] o.a.s.h.c.HttpShardHandlerFactory created with socketTimeout : 90000,urlScheme : https,connTimeout : 15000,maxConnectionsPerHost : 20,maxConnections : 10000,corePoolSize : 0,maximumPoolSize : 2147483647,maxThreadIdleTime : 5,sizeOfQueue : -1,fairnessPolicy : false,useRetries : false,connectionsEvictorSleepDelay : 5000,maxConnectionIdleTime : 40000,
   [junit4]   2> 468737 INFO  (jetty-launcher-600-thread-3) [    ] o.a.s.h.c.HttpShardHandlerFactory created with socketTimeout : 90000,urlScheme : https,connTimeout : 15000,maxConnectionsPerHost : 20,maxConnections : 10000,corePoolSize : 0,maximumPoolSize : 2147483647,maxThreadIdleTime : 5,sizeOfQueue : -1,fairnessPolicy : false,useRetries : false,connectionsEvictorSleepDelay : 5000,maxConnectionIdleTime : 40000,
   [junit4]   2> 468737 INFO  (jetty-launcher-600-thread-2) [    ] o.a.s.u.UpdateShardHandler Creating UpdateShardHandler HTTP client with params: socketTimeout=340000&connTimeout=45000&retry=true
   [junit4]   2> 468737 INFO  (jetty-launcher-600-thread-1) [    ] o.a.s.u.UpdateShardHandler Creating UpdateShardHandler HTTP client with params: socketTimeout=340000&connTimeout=45000&retry=true
   [junit4]   2> 468738 INFO  (jetty-launcher-600-thread-3) [    ] o.a.s.u.UpdateShardHandler Creating UpdateShardHandler HTTP client with params: socketTimeout=340000&connTimeout=45000&retry=true
   [junit4]   2> 468738 INFO  (jetty-launcher-600-thread-2) [    ] o.a.s.l.LogWatcher SLF4J impl is org.slf4j.impl.Log4jLoggerFactory
   [junit4]   2> 468738 INFO  (jetty-launcher-600-thread-2) [    ] o.a.s.l.LogWatcher Registering Log Listener [Log4j (org.slf4j.impl.Log4jLoggerFactory)]
   [junit4]   2> 468738 INFO  (jetty-launcher-600-thread-2) [    ] o.a.s.c.ZkContainer Zookeeper client=127.0.0.1:38805/solr
   [junit4]   2> 468738 INFO  (jetty-launcher-600-thread-2) [    ] o.a.s.c.ZkController zkHost includes chroot
   [junit4]   2> 468738 INFO  (jetty-launcher-600-thread-2) [    ] o.a.s.c.c.SolrZkClient Using default ZkCredentialsProvider
   [junit4]   2> 468738 INFO  (jetty-launcher-600-thread-1) [    ] o.a.s.l.LogWatcher SLF4J impl is org.slf4j.impl.Log4jLoggerFactory
   [junit4]   2> 468738 INFO  (jetty-launcher-600-thread-3) [    ] o.a.s.l.LogWatcher SLF4J impl is org.slf4j.impl.Log4jLoggerFactory
   [junit4]   2> 468738 INFO  (jetty-launcher-600-thread-1) [    ] o.a.s.l.LogWatcher Registering Log Listener [Log4j (org.slf4j.impl.Log4jLoggerFactory)]
   [junit4]   2> 468738 INFO  (jetty-launcher-600-thread-3) [    ] o.a.s.l.LogWatcher Registering Log Listener [Log4j (org.slf4j.impl.Log4jLoggerFactory)]
   [junit4]   2> 468738 INFO  (jetty-launcher-600-thread-2) [    ] o.a.s.c.c.ConnectionManager Waiting for client to connect to ZooKeeper
   [junit4]   2> 468738 INFO  (jetty-launcher-600-thread-3) [    ] o.a.s.c.ZkContainer Zookeeper client=127.0.0.1:38805/solr
   [junit4]   2> 468738 INFO  (jetty-launcher-600-thread-1) [    ] o.a.s.c.ZkContainer Zookeeper client=127.0.0.1:38805/solr
   [junit4]   2> 468738 INFO  (jetty-launcher-600-thread-3) [    ] o.a.s.c.ZkController zkHost includes chroot
   [junit4]   2> 468739 INFO  (jetty-launcher-600-thread-1) [    ] o.a.s.c.ZkController zkHost includes chroot
   [junit4]   2> 468739 INFO  (jetty-launcher-600-thread-3) [    ] o.a.s.c.c.SolrZkClient Using default ZkCredentialsProvider
   [junit4]   2> 468739 INFO  (jetty-launcher-600-thread-1) [    ] o.a.s.c.c.SolrZkClient Using default ZkCredentialsProvider
   [junit4]   2> 468739 INFO  (jetty-launcher-600-thread-1) [    ] o.a.s.c.c.ConnectionManager Waiting for client to connect to ZooKeeper
   [junit4]   2> 468739 INFO  (jetty-launcher-600-thread-3) [    ] o.a.s.c.c.ConnectionManager Waiting for client to connect to ZooKeeper
   [junit4]   2> 468739 INFO  (zkCallback-611-thread-1) [    ] o.a.s.c.c.ConnectionManager Watcher org.apache.solr.common.cloud.ConnectionManager@6f2fff name:ZooKeeperConnection Watcher:127.0.0.1:38805 got event WatchedEvent state:SyncConnected type:None path:null path:null type:None
   [junit4]   2> 468740 INFO  (jetty-launcher-600-thread-2) [    ] o.a.s.c.c.ConnectionManager Client is connected to ZooKeeper
   [junit4]   2> 468740 INFO  (jetty-launcher-600-thread-2) [    ] o.a.s.c.c.SolrZkClient Using default ZkACLProvider
   [junit4]   2> 468740 INFO  (zkCallback-613-thread-1) [    ] o.a.s.c.c.ConnectionManager Watcher org.apache.solr.common.cloud.ConnectionManager@f3b5be name:ZooKeeperConnection Watcher:127.0.0.1:38805 got event WatchedEvent state:SyncConnected type:None path:null path:null type:None
   [junit4]   2> 468740 INFO  (jetty-launcher-600-thread-1) [    ] o.a.s.c.c.ConnectionManager Client is connected to ZooKeeper
   [junit4]   2> 468740 INFO  (zkCallback-612-thread-1) [    ] o.a.s.c.c.ConnectionManager Watcher org.apache.solr.common.cloud.ConnectionManager@14302a5 name:ZooKeeperConnection Watcher:127.0.0.1:38805 got event WatchedEvent state:SyncConnected type:None path:null path:null type:None
   [junit4]   2> 468740 INFO  (jetty-launcher-600-thread-1) [    ] o.a.s.c.c.SolrZkClient Using default ZkACLProvider
   [junit4]   2> 468740 INFO  (jetty-launcher-600-thread-3) [    ] o.a.s.c.c.ConnectionManager Client is connected to ZooKeeper
   [junit4]   2> 468740 INFO  (jetty-launcher-600-thread-2) [    ] o.a.s.c.ZkController Added new OnReconnect listener org.apache.solr.cloud.ZkController$$Lambda$210/755381@155b13b
   [junit4]   2> 468740 INFO  (jetty-launcher-600-thread-3) [    ] o.a.s.c.c.SolrZkClient Using default ZkACLProvider
   [junit4]   2> 468740 INFO  (jetty-launcher-600-thread-2) [    ] o.a.s.c.c.ConnectionManager Waiting for client to connect to ZooKeeper
   [junit4]   2> 468741 INFO  (jetty-launcher-600-thread-1) [    ] o.a.s.c.ZkController Added new OnReconnect listener org.apache.solr.cloud.ZkController$$Lambda$210/755381@ca9c92
   [junit4]   2> 468741 INFO  (jetty-launcher-600-thread-1) [    ] o.a.s.c.c.ConnectionManager Waiting for client to connect to ZooKeeper
   [junit4]   2> 468742 INFO  (jetty-launcher-600-thread-3) [    ] o.a.s.c.ZkController Added new OnReconnect listener org.apache.solr.cloud.ZkController$$Lambda$210/755381@c59232
   [junit4]   2> 468742 INFO  (zkCallback-614-thread-1) [    ] o.a.s.c.c.ConnectionManager Watcher org.apache.solr.common.cloud.ConnectionManager@991c3f name:ZooKeeperConnection Watcher:127.0.0.1:38805/solr got event WatchedEvent state:SyncConnected type:None path:null path:null type:None
   [junit4]   2> 468742 INFO  (jetty-launcher-600-thread-2) [    ] o.a.s.c.c.ConnectionManager Client is connected to ZooKeeper
   [junit4]   2> 468742 INFO  (jetty-launcher-600-thread-3) [    ] o.a.s.c.c.ConnectionManager Waiting for client to connect to ZooKeeper
   [junit4]   2> 468743 INFO  (zkCallback-615-thread-1) [    ] o.a.s.c.c.ConnectionManager Watcher org.apache.solr.common.cloud.ConnectionManager@cce79 name:ZooKeeperConnection Watcher:127.0.0.1:38805/solr got event WatchedEvent state:SyncConnected type:None path:null path:null type:None
   [junit4]   2> 468743 INFO  (jetty-launcher-600-thread-1) [    ] o.a.s.c.c.ConnectionManager Client is connected to ZooKeeper
   [junit4]   2> 468743 INFO  (jetty-launcher-600-thread-2) [    ] o.a.s.c.c.SolrZkClient makePath: /overseer/queue
   [junit4]   2> 468743 INFO  (jetty-launcher-600-thread-1) [    ] o.a.s.c.c.SolrZkClient makePath: /overseer/queue
   [junit4]   2> 468743 INFO  (zkCallback-616-thread-1) [    ] o.a.s.c.c.ConnectionManager Watcher org.apache.solr.common.cloud.ConnectionManager@ec099b name:ZooKeeperConnection Watcher:127.0.0.1:38805/solr got event WatchedEvent state:SyncConnected type:None path:null path:null type:None
   [junit4]   2> 468743 INFO  (jetty-launcher-600-thread-3) [    ] o.a.s.c.c.ConnectionManager Client is connected to ZooKeeper
   [junit4]   2> 468744 INFO  (jetty-launcher-600-thread-2) [    ] o.a.s.c.c.SolrZkClient makePath: /overseer/collection-queue-work
   [junit4]   2> 468744 INFO  (jetty-launcher-600-thread-3) [    ] o.a.s.c.c.SolrZkClient makePath: /overseer/collection-queue-work
   [junit4]   2> 468744 INFO  (jetty-launcher-600-thread-1) [    ] o.a.s.c.c.SolrZkClient makePath: /overseer/collection-queue-work
   [junit4]   2> 468745 INFO  (jetty-launcher-600-thread-3) [    ] o.a.s.c.c.SolrZkClient makePath: /overseer/collection-map-running
   [junit4]   2> 468745 INFO  (jetty-launcher-600-thread-2) [    ] o.a.s.c.c.SolrZkClient makePath: /overseer/collection-map-running
   [junit4]   2> 468745 INFO  (jetty-launcher-600-thread-1) [    ] o.a.s.c.c.SolrZkClient makePath: /overseer/collection-map-running
   [junit4]   2> 468746 INFO  (jetty-launcher-600-thread-2) [    ] o.a.s.c.c.SolrZkClient makePath: /overseer/collection-map-completed
   [junit4]   2> 468746 INFO  (jetty-launcher-600-thread-3) [    ] o.a.s.c.c.SolrZkClient makePath: /overseer/collection-map-completed
   [junit4]   2> 468746 INFO  (jetty-launcher-600-thread-1) [    ] o.a.s.c.c.SolrZkClient makePath: /overseer/collection-map-completed
   [junit4]   2> 468746 INFO  (jetty-launcher-600-thread-3) [    ] o.a.s.c.c.SolrZkClient makePath: /overseer/collection-map-failure
   [junit4]   2> 468746 INFO  (jetty-launcher-600-thread-2) [    ] o.a.s.c.c.SolrZkClient makePath: /overseer/collection-map-failure
   [junit4]   2> 468746 INFO  (jetty-launcher-600-thread-1) [    ] o.a.s.c.c.SolrZkClient makePath: /overseer/collection-map-failure
   [junit4]   2> 468747 INFO  (jetty-launcher-600-thread-2) [    ] o.a.s.c.c.SolrZkClient makePath: /live_nodes
   [junit4]   2> 468747 INFO  (jetty-launcher-600-thread-1) [    ] o.a.s.c.c.SolrZkClient makePath: /live_nodes
   [junit4]   2> 468747 INFO  (jetty-launcher-600-thread-3) [    ] o.a.s.c.c.SolrZkClient makePath: /live_nodes
   [junit4]   2> 468747 INFO  (jetty-launcher-600-thread-1) [    ] o.a.s.c.c.SolrZkClient makePath: /collections
   [junit4]   2> 468747 INFO  (jetty-launcher-600-thread-3) [    ] o.a.s.c.c.SolrZkClient makePath: /collections
   [junit4]   2> 468747 INFO  (jetty-launcher-600-thread-2) [    ] o.a.s.c.c.SolrZkClient makePath: /collections
   [junit4]   2> 468748 INFO  (jetty-launcher-600-thread-3) [    ] o.a.s.c.c.SolrZkClient makePath: /aliases.json
   [junit4]   2> 468748 INFO  (jetty-launcher-600-thread-2) [    ] o.a.s.c.c.SolrZkClient makePath: /aliases.json
   [junit4]   2> 468748 INFO  (jetty-launcher-600-thread-1) [    ] o.a.s.c.c.SolrZkClient makePath: /aliases.json
   [junit4]   2> 468748 INFO  (jetty-launcher-600-thread-2) [    ] o.a.s.c.c.SolrZkClient makePath: /clusterstate.json
   [junit4]   2> 468748 INFO  (jetty-launcher-600-thread-1) [    ] o.a.s.c.c.SolrZkClient makePath: /clusterstate.json
   [junit4]   2> 468748 INFO  (jetty-launcher-600-thread-3) [    ] o.a.s.c.c.SolrZkClient makePath: /clusterstate.json
   [junit4]   2> 468749 INFO  (jetty-launcher-600-thread-1) [    ] o.a.s.c.c.SolrZkClient makePath: /security.json
   [junit4]   2> 468749 INFO  (jetty-launcher-600-thread-2) [    ] o.a.s.c.c.SolrZkClient makePath: /security.json
   [junit4]   2> 468749 INFO  (jetty-launcher-600-thread-3) [    ] o.a.s.c.c.SolrZkClient makePath: /security.json
   [junit4]   2> 468761 INFO  (jetty-launcher-600-thread-2) [    ] o.a.s.c.c.ZkStateReader Updating cluster state from ZooKeeper... 
   [junit4]   2> 468761 INFO  (jetty-launcher-600-thread-1) [    ] o.a.s.c.c.ZkStateReader Updating cluster state from ZooKeeper... 
   [junit4]   2> 468761 INFO  (jetty-launcher-600-thread-3) [    ] o.a.s.c.c.ZkStateReader Updating cluster state from ZooKeeper... 
   [junit4]   2> 468761 INFO  (jetty-launcher-600-thread-2) [    ] o.a.s.c.c.ZkStateReader Loaded cluster properties: {urlScheme=https}
   [junit4]   2> 468761 INFO  (jetty-launcher-600-thread-3) [    ] o.a.s.c.c.ZkStateReader Loaded cluster properties: {urlScheme=https}
   [junit4]   2> 468761 INFO  (jetty-launcher-600-thread-1) [    ] o.a.s.c.c.ZkStateReader Loaded cluster properties: {urlScheme=https}
   [junit4]   2> 468761 INFO  (jetty-launcher-600-thread-2) [    ] o.a.s.c.c.ZkStateReader Updated live nodes from ZooKeeper... (0) -> (0)
   [junit4]   2> 468762 INFO  (jetty-launcher-600-thread-3) [    ] o.a.s.c.c.ZkStateReader Updated live nodes from ZooKeeper... (0) -> (0)
   [junit4]   2> 468762 INFO  (jetty-launcher-600-thread-1) [    ] o.a.s.c.c.ZkStateReader Updated live nodes from ZooKeeper... (0) -> (0)
   [junit4]   2> 468762 INFO  (jetty-launcher-600-thread-2) [    ] o.a.s.c.c.SolrZkClient makePath: /overseer_elect
   [junit4]   2> 468762 INFO  (jetty-launcher-600-thread-3) [    ] o.a.s.c.c.SolrZkClient makePath: /overseer_elect
   [junit4]   2> 468762 INFO  (jetty-launcher-600-thread-1) [    ] o.a.s.c.c.SolrZkClient makePath: /overseer_elect
   [junit4]   2> 468763 INFO  (jetty-launcher-600-thread-2) [    ] o.a.s.c.c.SolrZkClient makePath: /overseer_elect/election
   [junit4]   2> 468763 INFO  (jetty-launcher-600-thread-3) [    ] o.a.s.c.c.SolrZkClient makePath: /overseer_elect/election
   [junit4]   2> 468763 INFO  (jetty-launcher-600-thread-1) [    ] o.a.s.c.c.SolrZkClient makePath: /overseer_elect/election
   [junit4]   2> 468763 INFO  (jetty-launcher-600-thread-3) [    ] o.a.s.c.Overseer Overseer (id=null) closing
   [junit4]   2> 468763 INFO  (jetty-launcher-600-thread-1) [    ] o.a.s.c.Overseer Overseer (id=null) closing
   [junit4]   2> 468763 INFO  (jetty-launcher-600-thread-2) [    ] o.a.s.c.Overseer Overseer (id=null) closing
   [junit4]   2> 468763 INFO  (jetty-launcher-600-thread-3) [    ] o.a.s.c.LeaderElector Joined leadership election with path: /overseer_elect/election/96558490264535049-127.0.0.1:41980_solr-n_0000000000
   [junit4]   2> 468764 INFO  (jetty-launcher-600-thread-1) [    ] o.a.s.c.LeaderElector Joined leadership election with path: /overseer_elect/election/96558490264535048-127.0.0.1:45062_solr-n_0000000001
   [junit4]   2> 468764 INFO  (jetty-launcher-600-thread-2) [    ] o.a.s.c.LeaderElector Joined leadership election with path: /overseer_elect/election/96558490264535047-127.0.0.1:41048_solr-n_0000000002
   [junit4]   2> 468764 INFO  (jetty-launcher-600-thread-3) [    ] o.a.s.c.OverseerElectionContext I am going to be the leader 127.0.0.1:41980_solr
   [junit4]   2> 468764 INFO  (jetty-launcher-600-thread-3) [    ] o.a.s.c.c.SolrZkClient makePath: /overseer_elect/leader
   [junit4]   2> 468764 INFO  (jetty-launcher-600-thread-1) [    ] o.a.s.c.LeaderElector Watching path /overseer_elect/election/96558490264535049-127.0.0.1:41980_solr-n_0000000000 to know if I could be the leader
   [junit4]   2> 468764 INFO  (jetty-launcher-600-thread-2) [    ] o.a.s.c.LeaderElector Watching path /overseer_elect/election/96558490264535048-127.0.0.1:45062_solr-n_0000000001 to know if I could be the leader
   [junit4]   2> 468764 INFO  (jetty-launcher-600-thread-1) [    ] o.a.s.c.ZkController Register node as live in ZooKeeper:/live_nodes/127.0.0.1:45062_solr
   [junit4]   2> 468764 INFO  (jetty-launcher-600-thread-1) [    ] o.a.s.c.c.SolrZkClient makePath: /live_nodes/127.0.0.1:45062_solr
   [junit4]   2> 468764 INFO  (jetty-launcher-600-thread-2) [    ] o.a.s.c.ZkController Register node as live in ZooKeeper:/live_nodes/127.0.0.1:41048_solr
   [junit4]   2> 468764 INFO  (jetty-launcher-600-thread-2) [    ] o.a.s.c.c.SolrZkClient makePath: /live_nodes/127.0.0.1:41048_solr
   [junit4]   2> 468764 INFO  (jetty-launcher-600-thread-3) [    ] o.a.s.c.Overseer Overseer (id=96558490264535049-127.0.0.1:41980_solr-n_0000000000) starting
   [junit4]   2> 468764 INFO  (zkCallback-615-thread-1) [    ] o.a.s.c.c.ZkStateReader A live node change: [WatchedEvent state:SyncConnected type:NodeChildrenChanged path:/live_nodes], has occurred - updating... (live nodes size: [0])
   [junit4]   2> 468764 INFO  (zkCallback-616-thread-1) [    ] o.a.s.c.c.ZkStateReader A live node change: [WatchedEvent state:SyncConnected type:NodeChildrenChanged path:/live_nodes], has occurred - updating... (live nodes size: [0])
   [junit4]   2> 468764 INFO  (zkCallback-614-thread-1) [    ] o.a.s.c.c.ZkStateReader A live node change: [WatchedEvent state:SyncConnected type:NodeChildrenChanged path:/live_nodes], has occurred - updating... (live nodes size: [0])
   [junit4]   2> 468766 INFO  (zkCallback-615-thread-1) [    ] o.a.s.c.c.ZkStateReader Updated live nodes from ZooKeeper... (0) -> (2)
   [junit4]   2> 468766 INFO  (zkCallback-616-thread-1) [    ] o.a.s.c.c.ZkStateReader Updated live nodes from ZooKeeper... (0) -> (2)
   [junit4]   2> 468766 INFO  (zkCallback-614-thread-1) [    ] o.a.s.c.c.ZkStateReader Updated live nodes from ZooKeeper... (0) -> (2)
   [junit4]   2> 468767 INFO  (jetty-launcher-600-thread-3) [    ] o.a.s.c.c.SolrZkClient makePath: /overseer/queue-work
   [junit4]   2> 468769 INFO  (jetty-launcher-600-thread-3) [    ] o.a.s.c.OverseerAutoReplicaFailoverThread Starting OverseerAutoReplicaFailoverThread autoReplicaFailoverWorkLoopDelay=10000 autoReplicaFailoverWaitAfterExpiration=30000 autoReplicaFailoverBadNodeExpiration=60000
   [junit4]   2> 468769 INFO  (OverseerCollectionConfigSetProcessor-96558490264535049-127.0.0.1:41980_solr-n_0000000000) [    ] o.a.s.c.OverseerTaskProcessor Process current queue of overseer operations
   [junit4]   2> 468769 INFO  (jetty-launcher-600-thread-3) [    ] o.a.s.c.ZkController Publish node=127.0.0.1:41980_solr as DOWN
   [junit4]   2> 468769 INFO  (OverseerStateUpdate-96558490264535049-127.0.0.1:41980_solr-n_0000000000) [    ] o.a.s.c.Overseer Starting to work on the main queue
   [junit4]   2> 468770 INFO  (jetty-launcher-600-thread-3) [    ] o.a.s.c.ZkController Register node as live in ZooKeeper:/live_nodes/127.0.0.1:41980_solr
   [junit4]   2> 468770 INFO  (OverseerStateUpdate-96558490264535049-127.0.0.1:41980_solr-n_0000000000) [    ] o.a.s.c.c.ZkStateReader Updated live nodes from ZooKeeper... (2) -> (2)
   [junit4]   2> 468770 INFO  (jetty-launcher-600-thread-3) [    ] o.a.s.c.c.SolrZkClient makePath: /live_nodes/127.0.0.1:41980_solr
   [junit4]   2> 468770 INFO  (zkCallback-615-thread-1) [    ] o.a.s.c.c.ZkStateReader A live node change: [WatchedEvent state:SyncConnected type:NodeChildrenChanged path:/live_nodes], has occurred - updating... (live nodes size: [2])
   [junit4]   2> 468770 INFO  (zkCallback-614-thread-1) [    ] o.a.s.c.c.ZkStateReader A live node change: [WatchedEvent state:SyncConnected type:NodeChildrenChanged path:/live_nodes], has occurred - updating... (live nodes size: [2])
   [junit4]   2> 468770 INFO  (OverseerStateUpdate-96558490264535049-127.0.0.1:41980_solr-n_0000000000) [    ] o.a.s.c.Overseer processMessage: queueSize: 1, message = {
   [junit4]   2>   "operation":"downnode",
   [junit4]   2>   "node_name":"127.0.0.1:41980_solr"} current state version: 0
   [junit4]   2> 468770 INFO  (zkCallback-616-thread-1) [    ] o.a.s.c.c.ZkStateReader A live node change: [WatchedEvent state:SyncConnected type:NodeChildrenChanged path:/live_nodes], has occurred - updating... (live nodes size: [2])
   [junit4]   2> 468770 INFO  (OverseerStateUpdate-96558490264535049-127.0.0.1:41980_solr-n_0000000000) [    ] o.a.s.c.o.NodeMutator DownNode state invoked for node: 127.0.0.1:41980_solr
   [junit4]   2> 468770 INFO  (zkCallback-616-thread-1) [    ] o.a.s.c.c.ZkStateReader Updated live nodes from ZooKeeper... (2) -> (3)
   [junit4]   2> 468770 INFO  (zkCallback-614-thread-1) [    ] o.a.s.c.c.ZkStateReader Updated live nodes from ZooKeeper... (2) -> (3)
   [junit4]   2> 468770 INFO  (zkCallback-615-thread-1) [    ] o.a.s.c.c.ZkStateReader Updated live nodes from ZooKeeper... (2) -> (3)
   [junit4]   2> 468782 INFO  (jetty-launcher-600-thread-2) [    ] o.a.s.c.CoreContainer Security conf doesn't exist. Skipping setup for authorization module.
   [junit4]   2> 468782 INFO  (jetty-launcher-600-thread-2) [    ] o.a.s.c.CoreContainer No authentication plugin used.
   [junit4]   2> 468783 INFO  (jetty-launcher-600-thread-2) [    ] o.a.s.c.CorePropertiesLocator Looking for core definitions underneath /home/jenkins/workspace/Lucene-Solr-6.x-Linux/solr/build/solr-core/test/J2/temp/solr.security.BasicAuthIntegrationTest_DE61965EA597D88B-001/tempDir-001/node2/.
   [junit4]   2> 468783 INFO  (jetty-launcher-600-thread-2) [    ] o.a.s.c.CorePropertiesLocator Found 0 core definitions
   [junit4]   2> 468784 INFO  (jetty-launcher-600-thread-2) [    ] o.a.s.s.SolrDispatchFilter user.dir=/home/jenkins/workspace/Lucene-Solr-6.x-Linux/solr/build/solr-core/test/J2
   [junit4]   2> 468784 INFO  (jetty-launcher-600-thread-2) [    ] o.a.s.s.SolrDispatchFilter SolrDispatchFilter.init() done
   [junit4]   2> 468789 INFO  (jetty-launcher-600-thread-1) [    ] o.a.s.c.CoreContainer Security conf doesn't exist. Skipping setup for authorization module.
   [junit4]   2> 468789 INFO  (jetty-launcher-600-thread-1) [    ] o.a.s.c.CoreContainer No authentication plugin used.
   [junit4]   2> 468789 INFO  (jetty-launcher-600-thread-1) [    ] o.a.s.c.CorePropertiesLocator Looking for core definitions underneath /home/jenkins/workspace/Lucene-Solr-6.x-Linux/solr/build/solr-core/test/J2/temp/solr.security.BasicAuthIntegrationTest_DE61965EA597D88B-001/tempDir-001/node1/.
   [junit4]   2> 468789 INFO  (jetty-launcher-600-thread-1) [    ] o.a.s.c.CorePropertiesLocator Found 0 core definitions
   [junit4]   2> 468789 INFO  (jetty-launcher-600-thread-1) [    ] o.a.s.s.SolrDispatchFilter user.dir=/home/jenkins/workspace/Lucene-Solr-6.x-Linux/solr/build/solr-core/test/J2
   [junit4]   2> 468790 INFO  (jetty-launcher-600-thread-1) [    ] o.a.s.s.SolrDispatchFilter SolrDispatchFilter.init() done
   [junit4]   2> 468794 INFO  (jetty-launcher-600-thread-3) [    ] o.a.s.c.CoreContainer Security conf doesn't exist. Skipping setup for authorization module.
   [junit4]   2> 468794 INFO  (jetty-launcher-600-thread-3) [    ] o.a.s.c.CoreContainer No authentication plugin used.
   [junit4]   2> 468795 INFO  (jetty-launcher-600-thread-3) [    ] o.a.s.c.CorePropertiesLocator Looking for core definitions underneath /home/jenkins/workspace/Lucene-Solr-6.x-Linux/solr/build/solr-core/test/J2/temp/solr.security.BasicAuthIntegrationTest_DE61965EA597D88B-001/tempDir-001/node3/.
   [junit4]   2> 468807 INFO  (jetty-launcher-600-thread-3) [    ] o.a.s.c.CorePropertiesLocator Found 0 core definitions
   [junit4]   2> 468808 INFO  (jetty-launcher-600-thread-3) [    ] o.a.s.s.SolrDispatchFilter user.dir=/home/jenkins/workspace/Lucene-Solr-6.x-Linux/solr/build/solr-core/test/J2
   [junit4]   2> 468808 INFO  (jetty-launcher-600-thread-3) [    ] o.a.s.s.SolrDispatchFilter SolrDispatchFilter.init() done
   [junit4]   2> 468808 INFO  (SUITE-BasicAuthIntegrationTest-seed#[DE61965EA597D88B]-worker) [    ] o.a.s.c.c.SolrZkClient Using default ZkCredentialsProvider
   [junit4]   2> 468808 INFO  (SUITE-BasicAuthIntegrationTest-seed#[DE61965EA597D88B]-worker) [    ] o.a.s.c.c.ConnectionManager Waiting for client to connect to ZooKeeper
   [junit4]   2> 468809 INFO  (zkCallback-620-thread-1) [    ] o.a.s.c.c.ConnectionManager Watcher org.apache.solr.common.cloud.ConnectionManager@1ba9968 name:ZooKeeperConnection Watcher:127.0.0.1:38805 got event WatchedEvent state:SyncConnected type:None path:null path:null type:None
   [junit4]   2> 468809 INFO  (SUITE-BasicAuthIntegrationTest-seed#[DE61965EA597D88B]-worker) [    ] o.a.s.c.c.ConnectionManager Client is connected to ZooKeeper
   [junit4]   2> 468809 INFO  (SUITE-BasicAuthIntegrationTest-seed#[DE61965EA597D88B]-worker) [    ] o.a.s.c.c.SolrZkClient Using default ZkACLProvider
   [junit4]   2> 468810 INFO  (SUITE-BasicAuthIntegrationTest-seed#[DE61965EA597D88B]-worker) [    ] o.a.s.c.c.SolrZkClient Using default ZkCredentialsProvider
   [junit4]   2> 468810 INFO  (SUITE-BasicAuthIntegrationTest-seed#[DE61965EA597D88B]-worker) [    ] o.a.s.c.c.ConnectionManager Waiting for client to connect to ZooKeeper
   [junit4]   2> 468811 INFO  (zkCallback-623-thread-1) [    ] o.a.s.c.c.ConnectionManager Watcher org.apache.solr.common.cloud.ConnectionManager@193b0fe name:ZooKeeperConnection Watcher:127.0.0.1:38805/solr got event WatchedEvent state:SyncConnected type:None path:null path:null type:None
   [junit4]   2> 468811 INFO  (SUITE-BasicAuthIntegrationTest-seed#[DE61965EA597D88B]-worker) [    ] o.a.s.c.c.ConnectionManager Client is connected to ZooKeeper
   [junit4]   2> 468811 INFO  (SUITE-BasicAuthIntegrationTest-seed#[DE61965EA597D88B]-worker) [    ] o.a.s.c.c.SolrZkClient Using default ZkACLProvider
   [junit4]   2> 468811 INFO  (SUITE-BasicAuthIntegrationTest-seed#[DE61965EA597D88B]-worker) [    ] o.a.s.c.c.ZkStateReader Updating cluster state from ZooKeeper... 
   [junit4]   2> 468811 INFO  (SUITE-BasicAuthIntegrationTest-seed#[DE61965EA597D88B]-worker) [    ] o.a.s.c.c.ZkStateReader Loaded cluster properties: {urlScheme=https}
   [junit4]   2> 468811 INFO  (SUITE-BasicAuthIntegrationTest-seed#[DE61965EA597D88B]-worker) [    ] o.a.s.c.c.ZkStateReader Updated live nodes from ZooKeeper... (0) -> (3)
   [junit4]   2> 468812 INFO  (SUITE-BasicAuthIntegrationTest-seed#[DE61965EA597D88B]-worker) [    ] o.a.s.c.c.SolrZkClient makePath: /configs/conf/solrconfig.xml
   [junit4]   2> 468813 INFO  (SUITE-BasicAuthIntegrationTest-seed#[DE61965EA597D88B]-worker) [    ] o.a.s.c.c.SolrZkClient makePath: /configs/conf/schema.xml
   [junit4]   2> 468880 INFO  (qtp29893848-3810) [    ] o.a.s.h.a.CollectionsHandler Invoked Collection Action :create with params replicationFactor=1&collection.configName=conf&name=authCollection&action=CREATE&numShards=3&wt=javabin&version=2 and sendToOCPQueue=true
   [junit4]   2> 468882 INFO  (OverseerCollectionConfigSetProcessor-96558490264535049-127.0.0.1:41980_solr-n_0000000000) [    ] o.a.s.c.OverseerTaskProcessor Overseer Collection Message Handler: Get the message id:/overseer/collection-queue-work/qn-0000000000 message:{
   [junit4]   2>   "name":"authCollection",
   [junit4]   2>   "fromApi":"true",
   [junit4]   2>   "replicationFactor":"1",
   [junit4]   2>   "collection.configName":"conf",
   [junit4]   2>   "numShards":"3",
   [junit4]   2>   "stateFormat":"2",
   [junit4]   2>   "operation":"create"}
   [junit4]   2> 468882 INFO  (OverseerThreadFactory-1589-thread-1) [    ] o.a.s.c.OverseerCollectionMessageHandler OverseerCollectionMessageHandler.processMessage : create , {
   [junit4]   2>   "name":"authCollection",
   [junit4]   2>   "fromApi":"true",
   [junit4]   2>   "replicationFactor":"1",
   [junit4]   2>   "collection.configName":"conf",
   [junit4]   2>   "numShards":"3",
   [junit4]   2>   "stateFormat":"2",
   [junit4]   2>   "operation":"create"}
   [junit4]   2> 468882 INFO  (OverseerThreadFactory-1589-thread-1) [    ] o.a.s.c.CreateCollectionCmd Create collection authCollection
   [junit4]   2> 468882 INFO  (OverseerThreadFactory-1589-thread-1) [    ] o.a.s.c.OverseerCollectionMessageHandler creating collections conf node /collections/authCollection 
   [junit4]   2> 468882 INFO  (OverseerThreadFactory-1589-thread-1) [    ] o.a.s.c.c.SolrZkClient makePath: /collections/authCollection
   [junit4]   2> 468883 INFO  (zkCallback-615-thread-1) [    ] o.a.s.c.c.ZkStateReader A collections change: [WatchedEvent state:SyncConnected type:NodeChildrenChanged path:/collections], has occurred - updating...
   [junit4]   2> 468883 INFO  (zkCallback-623-thread-1) [    ] o.a.s.c.c.ZkStateReader A collections change: [WatchedEvent state:SyncConnected type:NodeChildrenChanged path:/collections], has occurred - updating...
   [junit4]   2> 468883 INFO  (zkCallback-616-thread-1) [    ] o.a.s.c.c.ZkStateReader A collections change: [WatchedEvent state:SyncConnected type:NodeChildrenChanged path:/collections], has occurred - updating...
   [junit4]   2> 468883 INFO  (zkCallback-614-thread-1) [    ] o.a.s.c.c.ZkStateReader A collections change: [WatchedEvent state:SyncConnected type:NodeChildrenChanged path:/collections], has occurred - updating...
   [junit4]   2> 468884 INFO  (OverseerStateUpdate-96558490264535049-127.0.0.1:41980_solr-n_0000000000) [    ] o.a.s.c.Overseer processMessage: queueSize: 1, message = {
   [junit4]   2>   "name":"authCollection",
   [junit4]   2>   "fromApi":"true",
   [junit4]   2>   "replicationFactor":"1",
   [junit4]   2>   "collection.configName":"conf",
   [junit4]   2>   "numShards":"3",
   [junit4]   2>   "stateFormat":"2",
   [junit4]   2>   "operation":"create"} current state version: 0
   [junit4]   2> 468884 INFO  (OverseerStateUpdate-96558490264535049-127.0.0.1:41980_solr-n_0000000000) [    ] o.a.s.c.o.ClusterStateMutator building a new cName: authCollection
   [junit4]   2> 468884 INFO  (OverseerStateUpdate-96558490264535049-127.0.0.1:41980_solr-n_0000000000) [    ] o.a.s.c.o.ZkStateWriter going to create_collection /collections/authCollection/state.json
   [junit4]   2> 468984 INFO  (OverseerThreadFactory-1589-thread-1) [    ] o.a.s.c.CreateCollectionCmd Creating SolrCores for new collection authCollection, shardNames [shard1, shard2, shard3] , replicationFactor : 1
   [junit4]   2> 468984 INFO  (OverseerThreadFactory-1589-thread-1) [    ] o.a.s.c.CreateCollectionCmd Creating core authCollection_shard2_replica1 as part of shard shard2 of collection authCollection on 127.0.0.1:45062_solr
   [junit4]   2> 468984 INFO  (OverseerThreadFactory-1589-thread-1) [    ] o.a.s.c.CreateCollectionCmd Creating core authCollection_shard3_replica1 as part of shard shard3 of collection authCollection on 127.0.0.1:41980_solr
   [junit4]   2> 468985 INFO  (OverseerThreadFactory-1589-thread-1) [    ] o.a.s.c.CreateCollectionCmd Creating core authCollection_shard1_replica1 as part of shard shard1 of collection authCollection on 127.0.0.1:41048_solr
   [junit4]   2> 468988 INFO  (qtp29893848-3813) [    ] o.a.s.h.a.CoreAdminOperation core create command qt=/admin/cores&collection.configName=conf&name=authCollection_shard2_replica1&action=CREATE&numShards=3&collection=authCollection&shard=shard2&wt=javabin&version=2
   [junit4]   2> 468988 INFO  (qtp29893848-3813) [    ] o.a.s.c.CoreDescriptor Created CoreDescriptor: {schema=schema.xml, dataDir=data/, collection.configName=conf, collection=authCollection, loadOnStartup=true, transient=false, name=authCollection_shard2_replica1, numShards=3, shard=shard2, config=solrconfig.xml, configSetProperties=configsetprops.json}
   [junit4]   2> 468988 INFO  (qtp29893848-3813) [    ] o.a.s.c.ZkController publishing state=down
   [junit4]   2> 468989 INFO  (qtp29893848-3813) [    ] o.a.s.c.ZkController Registering watch for collection authCollection
   [junit4]   2> 468989 INFO  (OverseerStateUpdate-96558490264535049-127.0.0.1:41980_solr-n_0000000000) [    ] o.a.s.c.Overseer processMessage: queueSize: 1, message = {
   [junit4]   2>   "core":"authCollection_shard2_replica1",
   [junit4]   2>   "roles":null,
   [junit4]   2>   "base_url":"https://127.0.0.1:45062/solr",
   [junit4]   2>   "node_name":"127.0.0.1:45062_solr",
   [junit4]   2>   "numShards":"3",
   [junit4]   2>   "state":"down",
   [junit4]   2>   "shard":"shard2",
   [junit4]   2>   "collection":"authCollection",
   [junit4]   2>   "operation":"state"} current state version: 0
   [junit4]   2> 468989 INFO  (qtp29893848-3813) [    ] o.a.s.c.c.ZkStateReader Add data for [authCollection] ver [0]
   [junit4]   2> 468989 INFO  (OverseerStateUpdate-96558490264535049-127.0.0.1:41980_solr-n_0000000000) [    ] o.a.s.c.o.ReplicaMutator Update state numShards=3 message={
   [junit4]   2>   "core":"authCollection_shard2_replica1",
   [junit4]   2>   "roles":null,
   [junit4]   2>   "base_url":"https://127.0.0.1:45062/solr",
   [junit4]   2>   "node_name":"127.0.0.1:45062_solr",
   [junit4]   2>   "numShards":"3",
   [junit4]   2>   "state":"down",
   [junit4]   2>   "shard":"shard2",
   [junit4]   2>   "collection":"authCollection",
   [junit4]   2>   "operation":"state"}
   [junit4]   2> 468989 INFO  (qtp29893848-3813) [    ] o.a.s.c.ZkController look for our core node name
   [junit4]   2> 469051 INFO  (qtp3679195-3812) [    ] o.a.s.h.a.CoreAdminOperation core create command qt=/admin/cores&collection.configName=conf&name=authCollection_shard1_replica1&action=CREATE&numShards=3&collection=authCollection&shard=shard1&wt=javabin&version=2
   [junit4]   2> 469052 INFO  (qtp3679195-3812) [    ] o.a.s.c.CoreDescriptor Created CoreDescriptor: {schema=schema.xml, dataDir=data/, collection.configName=conf, collection=authCollection, loadOnStartup=true, transient=false, name=authCollection_shard1_replica1, numShards=3, shard=shard1, config=solrconfig.xml, configSetProperties=configsetprops.json}
   [junit4]   2> 469052 INFO  (qtp4757234-3811) [    ] o.a.s.h.a.CoreAdminOperation core create command qt=/admin/cores&collection.configName=conf&name=authCollection_shard3_replica1&action=CREATE&numShards=3&collection=authCollection&shard=shard3&wt=javabin&version=2
   [junit4]   2> 469052 INFO  (qtp3679195-3812) [    ] o.a.s.c.ZkController publishing state=down
   [junit4]   2> 469052 INFO  (qtp4757234-3811) [    ] o.a.s.c.CoreDescriptor Created CoreDescriptor: {schema=schema.xml, dataDir=data/, collection.configName=conf, collection=authCollection, loadOnStartup=true, transient=false, name=authCollection_shard3_replica1, numShards=3, shard=shard3, config=solrconfig.xml, configSetProperties=configsetprops.json}
   [junit4]   2> 469052 INFO  (qtp4757234-3811) [    ] o.a.s.c.ZkController publishing state=down
   [junit4]   2> 469053 INFO  (qtp3679195-3812) [    ] o.a.s.c.ZkController Registering watch for collection authCollection
   [junit4]   2> 469053 INFO  (OverseerStateUpdate-96558490264535049-127.0.0.1:41980_solr-n_0000000000) [    ] o.a.s.c.Overseer processMessage: queueSize: 1, message = {
   [junit4]   2>   "core":"authCollection_shard1_replica1",
   [junit4]   2>   "roles":null,
   [junit4]   2>   "base_url":"https://127.0.0.1:41048/solr",
   [junit4]   2>   "node_name":"127.0.0.1:41048_solr",
   [junit4]   2>   "numShards":"3",
   [junit4]   2>   "state":"down",
   [junit4]   2>   "shard":"shard1",
   [junit4]   2>   "collection":"authCollection",
   [junit4]   2>   "operation":"state"} current state version: 0
   [junit4]   2> 469053 INFO  (qtp3679195-3812) [    ] o.a.s.c.c.ZkStateReader Add data for [authCollection] ver [0]
   [junit4]   2> 469053 INFO  (OverseerStateUpdate-96558490264535049-127.0.0.1:41980_solr-n_0000000000) [    ] o.a.s.c.o.ReplicaMutator Update state numShards=3 message={
   [junit4]   2>   "core":"authCollection_shard1_replica1",
   [junit4]   2>   "roles":null,
   [junit4]   2>   "base_url":"https://127.0.0.1:41048/solr",
   [junit4]   2>   "node_name":"127.0.0.1:41048_solr",
   [junit4]   2>   "numShards":"3",
   [junit4]   2>   "state":"down",
   [junit4]   2>   "shard":"shard1",
   [junit4]   2>   "collection":"authCollection",
   [junit4]   2>   "operation":"state"}
   [junit4]   2> 469053 INFO  (qtp4757234-3811) [    ] o.a.s.c.ZkController Registering watch for collection authCollection
   [junit4]   2> 469053 INFO  (qtp3679195-3812) [    ] o.a.s.c.ZkController look for our core node name
   [junit4]   2> 469053 INFO  (qtp4757234-3811) [    ] o.a.s.c.c.ZkStateReader Add data for [authCollection] ver [0]
   [junit4]   2> 469054 INFO  (qtp4757234-3811) [    ] o.a.s.c.ZkController look for our core node name
   [junit4]   2> 469054 INFO  (OverseerStateUpdate-96558490264535049-127.0.0.1:41980_solr-n_0000000000) [    ] o.a.s.c.Overseer processMessage: queueSize: 1, message = {
   [junit4]   2>   "core":"authCollection_shard3_replica1",
   [junit4]   2>   "roles":null,
   [junit4]   2>   "base_url":"https://127.0.0.1:41980/solr",
   [junit4]   2>   "node_name":"127.0.0.1:41980_solr",
   [junit4]   2>   "numShards":"3",
   [junit4]   2>   "state":"down",
   [junit4]   2>   "shard":"shard3",
   [junit4]   2>   "collection":"authCollection",
   [junit4]   2>   "operation":"state"} current state version: 0
   [junit4]   2> 469054 INFO  (OverseerStateUpdate-96558490264535049-127.0.0.1:41980_solr-n_0000000000) [    ] o.a.s.c.o.ReplicaMutator Update state numShards=3 message={
   [junit4]   2>   "core":"authCollection_shard3_replica1",
   [junit4]   2>   "roles":null,
   [junit4]   2>   "base_url":"https://127.0.0.1:41980/solr",
   [junit4]   2>   "node_name":"127.0.0.1:41980_solr",
   [junit4]   2>   "numShards":"3",
   [junit4]   2>   "state":"down",
   [junit4]   2>   "shard":"shard3",
   [junit4]   2>   "collection":"authCollection",
   [junit4]   2>   "operation":"state"}
   [junit4]   2> 469155 INFO  (OverseerStateUpdate-96558490264535049-127.0.0.1:41980_solr-n_0000000000) [    ] o.a.s.c.o.ZkStateWriter going to update_collection /collections/authCollection/state.json version: 0
   [junit4]   2> 469155 INFO  (zkCallback-616-thread-1) [    ] o.a.s.c.c.ZkStateReader A cluster state change: [WatchedEvent state:SyncConnected type:NodeDataChanged path:/collections/authCollection/state.json] for collection [authCollection] has occurred - updating... (live nodes size: [3])
   [junit4]   2> 469155 INFO  (zkCallback-614-thread-1) [    ] o.a.s.c.c.ZkStateReader A cluster state change: [WatchedEvent state:SyncConnected type:NodeDataChanged path:/collections/authCollection/state.json] for collection [authCollection] has occurred - updating... (live nodes size: [3])
   [junit4]   2> 469155 INFO  (zkCallback-615-thread-1) [    ] o.a.s.c.c.ZkStateReader A cluster state change: [WatchedEvent state:SyncConnected type:NodeDataChanged path:/collections/authCollection/state.json] for collection [authCollection] has occurred - updating... (live nodes size: [3])
   [junit4]   2> 469156 INFO  (zkCallback-616-thread-1) [    ] o.a.s.c.c.ZkStateReader Updating data for [authCollection] from [0] to [1]
   [junit4]   2> 469156 INFO  (zkCallback-614-thread-1) [    ] o.a.s.c.c.ZkStateReader Updating data for [authCollection] from [0] to [1]
   [junit4]   2> 469156 INFO  (zkCallback-615-thread-1) [    ] o.a.s.c.c.ZkStateReader Updating data for [authCollection] from [0] to [1]
   [junit4]   2> 469990 INFO  (qtp29893848-3813) [    ] o.a.s.c.ZkController waiting to find shard id in clusterstate for authCollection_shard2_replica1
   [junit4]   2> 469990 INFO  (qtp29893848-3813) [    ] o.a.s.c.ZkController Check for collection zkNode:authCollection
   [junit4]   2> 469990 INFO  (qtp29893848-3813) [    ] o.a.s.c.ZkController Collection zkNode exists
   [junit4]   2> 469990 INFO  (qtp29893848-3813) [    ] o.a.s.c.c.ZkStateReader Load collection config from: [/collections/authCollection]
   [junit4]   2> 469990 INFO  (qtp29893848-3813) [    ] o.a.s.c.c.ZkStateReader path=[/collections/authCollection] [configName]=[conf] specified config exists in ZooKeeper
   [junit4]   2> 469990 INFO  (qtp29893848-3813) [    ] o.a.s.c.SolrResourceLoader new SolrResourceLoader for directory: '/home/jenkins/workspace/Lucene-Solr-6.x-Linux/solr/build/solr-core/test/J2/temp/solr.security.BasicAuthIntegrationTest_DE61965EA597D88B-001/tempDir-001/node1/authCollection_shard2_replica1'
   [junit4]   2> 469990 INFO  (qtp29893848-3813) [    ] o.a.s.c.SolrResourceLoader JNDI not configured for solr (NoInitialContextEx)
   [junit4]   2> 469990 INFO  (qtp29893848-3813) [    ] o.a.s.c.SolrResourceLoader solr home defaulted to 'solr/' (could not find system property or JNDI)
   [junit4]   2> 469991 INFO  (qtp29893848-3813) [    ] o.a.s.c.Config loaded config solrconfig.xml with version 0 
   [junit4]   2> 469994 INFO  (qtp29893848-3813) [    ] o.a.s.c.SolrConfig current version of requestparams : -1
   [junit4]   2> 469995 INFO  (qtp29893848-3813) [    ] o.a.s.c.SolrConfig Using Lucene MatchVersion: 6.3.0
   [junit4]   2> 469998 INFO  (qtp29893848-3813) [    ] o.a.s.c.SolrConfig Loaded SolrConfig: solrconfig.xml
   [junit4]   2> 470000 INFO  (qtp29893848-3813) [    ] o.a.s.s.IndexSchema [authCollection_shard2_replica1] Schema name=minimal
   [junit4]   2> 470009 INFO  (qtp29893848-3813) [    ] o.a.s.s.IndexSchema unique key field: id
   [junit4]   2> 470010 INFO  (qtp29893848-3813) [    ] o.a.s.c.ConfigSetProperties Did not find ConfigSet properties, assuming default properties: Can't find resource 'configsetprops.json' in classpath or '/configs/conf', cwd=/home/jenkins/workspace/Lucene-Solr-6.x-Linux/solr/build/solr-core/test/J2
   [junit4]   2> 470010 INFO  (qtp29893848-3813) [    ] o.a.s.c.CoreContainer Creating SolrCore 'authCollection_shard2_replica1' using configuration from collection authCollection
   [junit4]   2> 470010 INFO  (qtp29893848-3813) [    ] o.a.s.c.SolrCore org.apache.solr.core.MockDirectoryFactory
   [junit4]   2> 470010 INFO  (qtp29893848-3813) [    ] o.a.s.c.SolrCore [[authCollection_shard2_replica1] ] Opening new SolrCore at [/home/jenkins/workspace/Lucene-Solr-6.x-Linux/solr/build/solr-core/test/J2/temp/solr.security.BasicAuthIntegrationTest_DE61965EA597D88B-001/tempDir-001/node1/authCollection_shard2_replica1], dataDir=[/home/jenkins/workspace/Lucene-Solr-6.x-Linux/solr/build/solr-core/test/J2/temp/solr.security.BasicAuthIntegrationTest_DE61965EA597D88B-001/tempDir-001/node1/./authCollection_shard2_replica1/data/]
   [junit4]   2> 470010 INFO  (qtp29893848-3813) [    ] o.a.s.c.SolrCore JMX monitoring not detected for core: authCollection_shard2_replica1
   [junit4]   2> 470011 INFO  (qtp29893848-3813) [    ] o.a.s.c.CachingDirectoryFactory return new directory for /home/jenkins/workspace/Lucene-Solr-6.x-Linux/solr/build/solr-core/test/J2/temp/solr.security.BasicAuthIntegrationTest_DE61965EA597D88B-001/tempDir-001/node1/./authCollection_shard2_replica1/data/snapshot_metadata
   [junit4]   2> 470011 INFO  (qtp29893848-3813) [    ] o.a.s.c.s.SolrSnapshotMetaDataManager Loading from snapshot metadata file...
   [junit4]   2> 470011 INFO  (qtp29893848-3813) [    ] o.a.s.c.CachingDirectoryFactory return new directory for /home/jenkins/workspace/Lucene-Solr-6.x-Linux/solr/build/solr-core/test/J2/temp/solr.security.BasicAuthIntegrationTest_DE61965EA597D88B-001/tempDir-001/node1/./authCollection_shard2_replica1/data
   [junit4]   2> 470011 INFO  (qtp29893848-3813) [    ] o.a.s.c.SolrCore New index directory detected: old=null new=/home/jenkins/workspace/Lucene-Solr-6.x-Linux/solr/build/solr-core/test/J2/temp/solr.security.BasicAuthIntegrationTest_DE61965EA597D88B-001/tempDir-001/node1/./authCollection_shard2_replica1/data/index/
   [junit4]   2> 470011 WARN  (qtp29893848-3813) [    ] o.a.s.c.SolrCore [authCollection_shard2_replica1] Solr index directory '/home/jenkins/workspace/Lucene-Solr-6.x-Linux/solr/build/solr-core/test/J2/temp/solr.security.BasicAuthIntegrationTest_DE61965EA597D88B-001/tempDir-001/node1/./authCollection_shard2_replica1/data/index' doesn't exist. Creating new index...
   [junit4]   2> 470012 INFO  (qtp29893848-3813) [    ] o.a.s.c.CachingDirectoryFactory return new directory for /home/jenkins/workspace/Lucene-Solr-6.x-Linux/solr/build/solr-core/test/J2/temp/solr.security.BasicAuthIntegrationTest_DE61965EA597D88B-001/tempDir-001/node1/./authCollection_shard2_replica1/data/index
   [junit4]   2> 470012 INFO  (qtp29893848-3813) [    ] o.a.s.c.SolrDeletionPolicy SolrDeletionPolicy.onCommit: commits: num=1
   [junit4]   2> 	commit{dir=MockDirectoryWrapper(RAMDirectory@53e474 lockFactory=org.apache.lucene.store.SingleInstanceLockFactory@8ae23a),segFN=segments_1,generation=1}
   [junit4]   2> 470012 INFO  (qtp29893848-3813) [    ] o.a.s.c.SolrDeletionPolicy newest commit generation = 1
   [junit4]   2> 470012 INFO  (OldIndexDirectoryCleanupThreadForCore-authCollection_shard2_replica1) [    ] o.a.s.c.SolrCore Looking for old index directories to cleanup for core authCollection_shard2_replica1 in /home/jenkins/workspace/Lucene-Solr-6.x-Linux/solr/build/solr-core/test/J2/temp/solr.security.BasicAuthIntegrationTest_DE61965EA597D88B-001/tempDir-001/node1/./authCollection_shard2_replica1/data/
   [junit4]   2> 470012 WARN  (OldIndexDirectoryCleanupThreadForCore-authCollection_shard2_replica1) [    ] o.a.s.c.DirectoryFactory /home/jenkins/workspace/Lucene-Solr-6.x-Linux/solr/build/solr-core/test/J2/temp/solr.security.BasicAuthIntegrationTest_DE61965EA597D88B-001/tempDir-001/node1/./authCollection_shard2_replica1/data/ does not point to a valid data directory; skipping clean-up of old index directories.
   [junit4]   2> 470015 INFO  (qtp29893848-3813) [    ] o.a.s.c.SolrCore no updateRequestProcessorChain defined as default, creating implicit default
   [junit4]   2> 470016 INFO  (qtp29893848-3813) [    ] o.a.s.h.l.XMLLoader xsltCacheLifetimeSeconds=60
   [junit4]   2> 470016 INFO  (qtp29893848-3813) [    ] o.a.s.h.l.XMLLoader xsltCacheLifetimeSeconds=60
   [junit4]   2> 470017 INFO  (qtp29893848-3813) [    ] o.a.s.h.l.XMLLoader xsltCacheLifetimeSeconds=60
   [junit4]   2> 470017 INFO  (qtp29893848-3813) [    ] o.a.s.h.l.XMLLoader xsltCacheLifetimeSeconds=60
   [junit4]   2> 470018 INFO  (qtp29893848-3813) [    ] o.a.s.c.RequestHandlers Registered paths: /admin/mbeans,/update/json/docs,/admin/luke,/export,/get,/admin/properties,/update/json,/admin/threads,/update/csv,/sql,/graph,/select,/admin/segments,/admin/system,/replication,/config,/stream,/schema,/admin/plugins,/admin/logging,/admin/ping,/update,/admin/file,/terms
   [junit4]   2> 470018 INFO  (qtp29893848-3813) [    ] o.a.s.c.SolrCore Using default statsCache cache: org.apache.solr.search.stats.LocalStatsCache
   [junit4]   2> 470018 INFO  (qtp29893848-3813) [    ] o.a.s.u.UpdateHandler Using UpdateLog implementation: org.apache.solr.update.UpdateLog
   [junit4]   2> 470018 INFO  (qtp29893848-3813) [    ] o.a.s.u.UpdateLog Initializing UpdateLog: dataDir=null defaultSyncLevel=FLUSH numRecordsToKeep=100 maxNumLogsToKeep=10 numVersionBuckets=65536
   [junit4]   2> 470019 INFO  (qtp29893848-3813) [    ] o.a.s.u.CommitTracker Hard AutoCommit: disabled
   [junit4]   2> 470019 INFO  (qtp29893848-3813) [    ] o.a.s.u.CommitTracker Soft AutoCommit: disabled
   [junit4]   2> 470019 INFO  (qtp29893848-3813) [    ] o.a.s.c.SolrDeletionPolicy SolrDeletionPolicy.onInit: commits: num=1
   [junit4]   2> 	commit{dir=MockDirectoryWrapper(RAMDirectory@53e474 lockFactory=org.apache.lucene.store.SingleInstanceLockFactory@8ae23a),segFN=segments_1,generation=1}
   [junit4]   2> 470019 INFO  (qtp29893848-3813) [    ] o.a.s.c.SolrDeletionPolicy newest commit generation = 1
   [junit4]   2> 470019 INFO  (qtp29893848-3813) [    ] o.a.s.s.SolrIndexSearcher Opening [Searcher@181031c[authCollection_shard2_replica1] main]
   [junit4]   2> 470019 INFO  (qtp29893848-3813) [    ] o.a.s.c.c.ZkStateReader Load collection config from: [/collections/authCollection]
   [junit4]   2> 470020 INFO  (qtp29893848-3813) [    ] o.a.s.c.c.ZkStateReader path=[/collections/authCollection] [configName]=[conf] specified config exists in ZooKeeper
   [junit4]   2> 470020 INFO  (qtp29893848-3813) [    ] o.a.s.r.ManagedResourceStorage Setting up ZooKeeper-based storage for the RestManager with znodeBase: /configs/conf
   [junit4]   2> 470020 INFO  (qtp29893848-3813) [    ] o.a.s.r.ManagedResourceStorage Configured ZooKeeperStorageIO with znodeBase: /configs/conf
   [junit4]   2> 470020 INFO  (qtp29893848-3813) [    ] o.a.s.r.RestManager Initializing RestManager with initArgs: {}
   [junit4]   2> 470020 INFO  (qtp29893848-3813) [    ] o.a.s.r.ManagedResourceStorage Reading _rest_managed.json using ZooKeeperStorageIO:path=/configs/conf
   [junit4]   2> 470020 INFO  (qtp29893848-3813) [    ] o.a.s.r.ManagedResourceStorage No data found for znode /configs/conf/_rest_managed.json
   [junit4]   2> 470020 INFO  (qtp29893848-3813) [    ] o.a.s.r.ManagedResourceStorage Loaded null at path _rest_managed.json using ZooKeeperStorageIO:path=/configs/conf
   [junit4]   2> 470020 INFO  (qtp29893848-3813) [    ] o.a.s.r.RestManager Initializing 0 registered ManagedResources
   [junit4]   2> 470020 INFO  (qtp29893848-3813) [    ] o.a.s.h.ReplicationHandler Commits will be reserved for  10000
   [junit4]   2> 470020 INFO  (searcherExecutor-1596-thread-1) [    ] o.a.s.c.SolrCore [authCollection_shard2_replica1] Registered new searcher Searcher@181031c[authCollection_shard2_replica1] main{ExitableDirectoryReader(UninvertingDirectoryReader())}
   [junit4]   2> 470020 INFO  (qtp29893848-3813) [    ] o.a.s.u.UpdateLog Looking up max value of version field to seed version buckets
   [junit4]   2> 470020 INFO  (qtp29893848-3813) [    ] o.a.s.u.VersionInfo Refreshing highest value of _version_ for 65536 version buckets from index
   [junit4]   2> 470020 INFO  (qtp29893848-3813) [    ] o.a.s.u.VersionInfo No terms found for _version_, cannot seed version bucket highest value from index
   [junit4]   2> 470021 INFO  (qtp29893848-3813) [    ] o.a.s.u.UpdateLog Could not find max version in index or recent updates, using new clock 1544935845725732864
   [junit4]   2> 470022 INFO  (qtp29893848-3813) [    ] o.a.s.u.UpdateLog Took 1.0ms to seed version buckets with highest version 1544935845725732864
   [junit4]   2> 470022 INFO  (qtp29893848-3813) [    ] o.a.s.c.ZkController watch zkdir /configs/conf
   [junit4]   2> 470023 INFO  (qtp29893848-3813) [    ] o.a.s.c.CoreContainer registering core: authCollection_shard2_replica1
   [junit4]   2> 470023 INFO  (qtp29893848-3813) [    ] o.a.s.c.ZkController Register replica - core:authCollection_shard2_replica1 address:https://127.0.0.1:45062/solr collection:authCollection shard:shard2
   [junit4]   2> 470023 INFO  (qtp29893848-3813) [    ] o.a.s.c.c.SolrZkClient makePath: /collections/authCollection/leader_elect/shard2/election
   [junit4]   2> 470024 INFO  (qtp29893848-3813) [    ] o.a.s.c.LeaderElector Joined leadership election with path: /collections/authCollection/leader_elect/shard2/election/96558490264535048-core_node1-n_0000000000
   [junit4]   2> 470024 INFO  (qtp29893848-3813) [    ] o.a.s.c.ShardLeaderElectionContext Running the leader process for shard=shard2 and weAreReplacement=false and leaderVoteWait=10000
   [junit4]   2> 470026 INFO  (qtp29893848-3813) [    ] o.a.s.c.ShardLeaderElectionContext Enough replicas found to continue.
   [junit4]   2> 470026 INFO  (qtp29893848-3813) [    ] o.a.s.c.ShardLeaderElectionContext I may be the new leader - try and sync
   [junit4]   2> 470026 INFO  (qtp29893848-3813) [    ] o.a.s.c.SyncStrategy Sync replicas to https://127.0.0.1:45062/solr/authCollection_shard2_replica1/
   [junit4]   2> 470026 INFO  (qtp29893848-3813) [    ] o.a.s.c.SyncStrategy Sync Success - now sync replicas to me
   [junit4]   2> 470026 INFO  (qtp29893848-3813) [    ] o.a.s.c.SyncStrategy https://127.0.0.1:45062/solr/authCollection_shard2_replica1/ has no replicas
   [junit4]   2> 470026 INFO  (OverseerStateUpdate-96558490264535049-127.0.0.1:41980_solr-n_0000000000) [    ] o.a.s.c.Overseer processMessage: queueSize: 1, message = {
   [junit4]   2>   "operation":"leader",
   [junit4]   2>   "shard":"shard2",
   [junit4]   2>   "collection":"authCollection"} current state version: 0
   [junit4]   2> 470026 INFO  (qtp29893848-3813) [    ] o.a.s.c.c.SolrZkClient makePath: /collections/authCollection/leaders/shard2
   [junit4]   2> 470027 INFO  (qtp29893848-3813) [    ] o.a.s.c.ShardLeaderElectionContextBase Creating leader registration node /collections/authCollection/leaders/shard2/leader after winning as /collections/authCollection/leader_elect/shard2/election/96558490264535048-core_node1-n_0000000000
   [junit4]   2> 470028 INFO  (qtp29893848-3813) [    ] o.a.s.c.ShardLeaderElectionContext I am the new leader: https://127.0.0.1:45062/solr/authCollection_shard2_replica1/ shard2
   [junit4]   2> 470028 INFO  (OverseerStateUpdate-96558490264535049-127.0.0.1:41980_solr-n_0000000000) [    ] o.a.s.c.Overseer processMessage: queueSize: 1, message = {
   [junit4]   2>   "operation":"leader",
   [junit4]   2>   "shard":"shard2",
   [junit4]   2>   "collection":"authCollection",
   [junit4]   2>   "base_url":"https://127.0.0.1:45062/solr",
   [junit4]   2>   "core":"authCollection_shard2_replica1",
   [junit4]   2>   "state":"active"} current state version: 0
   [junit4]   2> 470053 INFO  (qtp3679195-3812) [    ] o.a.s.c.ZkController waiting to find shard id in clusterstate for authCollection_shard1_replica1
   [junit4]   2> 470054 INFO  (qtp3679195-3812) [    ] o.a.s.c.ZkController Check for collection zkNode:authCollection
   [junit4]   2> 470054 INFO  (qtp4757234-3811) [    ] o.a.s.c.ZkController waiting to find shard id in clusterstate for authCollection_shard3_replica1
   [junit4]   2> 470054 INFO  (qtp4757234-3811) [    ] o.a.s.c.ZkController Check for collection zkNode:authCollection
   [junit4]   2> 470054 INFO  (qtp3679195-3812) [    ] o.a.s.c.ZkController Collection zkNode exists
   [junit4]   2> 470054 INFO  (qtp3679195-3812) [    ] o.a.s.c.c.ZkStateReader Load collection config from: [/collections/authCollection]
   [junit4]   2> 470054 INFO  (qtp4757234-3811) [    ] o.a.s.c.ZkController Collection zkNode exists
   [junit4]   2> 470054 INFO  (qtp4757234-3811) [    ] o.a.s.c.c.ZkStateReader Load collection config from: [/collections/authCollection]
   [junit4]   2> 470054 INFO  (qtp3679195-3812) [    ] o.a.s.c.c.ZkStateReader path=[/collections/authCollection] [configName]=[conf] specified config exists in ZooKeeper
   [junit4]   2> 470054 INFO  (qtp3679195-3812) [    ] o.a.s.c.SolrResourceLoader new SolrResourceLoader for directory: '/home/jenkins/workspace/Lucene-Solr-6.x-Linux/solr/build/solr-core/test/J2/temp/solr.security.BasicAuthIntegrationTest_DE61965EA597D88B-001/tempDir-001/node2/authCollection_shard1_replica1'
   [junit4]   2> 470054 INFO  (qtp4757234-3811) [    ] o.a.s.c.c.ZkStateReader path=[/collections/authCollection] [configName]=[conf] specified config exists in ZooKeeper
   [junit4]   2> 470054 INFO  (qtp4757234-3811) [    ] o.a.s.c.SolrResourceLoader new SolrResourceLoader for directory: '/home/jenkins/workspace/Lucene-Solr-6.x-Linux/solr/build/solr-core/test/J2/temp/solr.security.BasicAuthIntegrationTest_DE61965EA597D88B-001/tempDir-001/node3/authCollection_shard3_replica1'
   [junit4]   2> 470054 INFO  (qtp3679195-3812) [    ] o.a.s.c.SolrResourceLoader JNDI not configured for solr (NoInitialContextEx)
   [junit4]   2> 470054 INFO  (qtp4757234-3811) [    ] o.a.s.c.SolrResourceLoader JNDI not configured for solr (NoInitialContextEx)
   [junit4]   2> 470054 INFO  (qtp3679195-3812) [    ] o.a.s.c.SolrResourceLoader solr home defaulted to 'solr/' (could not find system property or JNDI)
   [junit4]   2> 470054 INFO  (qtp4757234-3811) [    ] o.a.s.c.SolrResourceLoader solr home defaulted to 'solr/' (could not find system property or JNDI)
   [junit4]   2> 470055 INFO  (qtp4757234-3811) [    ] o.a.s.c.Config loaded config solrconfig.xml with version 0 
   [junit4]   2> 470055 INFO  (qtp3679195-3812) [    ] o.a.s.c.Config loaded config solrconfig.xml with version 0 
   [junit4]   2> 470057 INFO  (qtp4757234-3811) [    ] o.a.s.c.SolrConfig current version of requestparams : -1
   [junit4]   2> 470057 INFO  (qtp3679195-3812) [    ] o.a.s.c.SolrConfig current version of requestparams : -1
   [junit4]   2> 470058 INFO  (qtp4757234-3811) [    ] o.a.s.c.SolrConfig Using Lucene MatchVersion: 6.3.0
   [junit4]   2> 470058 INFO  (qtp3679195-3812) [    ] o.a.s.c.SolrConfig Using Lucene MatchVersion: 6.3.0
   [junit4]   2> 470060 INFO  (qtp4757234-3811) [    ] o.a.s.c.SolrConfig Loaded SolrConfig: solrconfig.xml
   [junit4]   2> 470060 INFO  (qtp3679195-3812) [    ] o.a.s.c.SolrConfig Loaded SolrConfig: solrconfig.xml
   [junit4]   2> 470063 INFO  (qtp4757234-3811) [    ] o.a.s.s.IndexSchema [authCollection_shard3_replica1] Schema name=minimal
   [junit4]   2> 470063 INFO  (qtp3679195-3812) [    ] o.a.s.s.IndexSchema [authCollection_shard1_replica1] Schema name=minimal
   [junit4]   2> 470064 INFO  (qtp4757234-3811) [    ] o.a.s.s.IndexSchema unique key field: id
   [junit4]   2> 470064 INFO  (qtp3679195-3812) [    ] o.a.s.s.IndexSchema unique key field: id
   [junit4]   2> 470065 INFO  (qtp3679195-3812) [    ] o.a.s.c.ConfigSetProperties Did not find ConfigSet properties, assuming default properties: Can't find resource 'configsetprops.json' in classpath or '/configs/conf', cwd=/home/jenkins/workspace/Lucene-Solr-6.x-Linux/solr/build/solr-core/test/J2
   [junit4]   2> 470065 INFO  (qtp4757234-3811) [    ] o.a.s.c.ConfigSetProperties Did not find ConfigSet properties, assuming default properties: Can't find resource 'configsetprops.json' in classpath or '/configs/conf', cwd=/home/jenkins/workspace/Lucene-Solr-6.x-Linux/solr/build/solr-core/test/J2
   [junit4]   2> 470065 INFO  (qtp3679195-3812) [    ] o.a.s.c.CoreContainer Creating SolrCore 'authCollection_shard1_replica1' using configuration from collection authCollection
   [junit4]   2> 470065 INFO  (qtp4757234-3811) [    ] o.a.s.c.CoreContainer Creating SolrCore 'authCollection_shard3_replica1' using configuration from collection authCollection
   [junit4]   2> 470066 INFO  (qtp3679195-3812) [    ] o.a.s.c.SolrCore org.apache.solr.core.MockDirectoryFactory
   [junit4]   2> 470066 INFO  (qtp4757234-3811) [    ] o.a.s.c.SolrCore org.apache.solr.core.MockDirectoryFactory
   [junit4]   2> 470066 INFO  (qtp3679195-3812) [    ] o.a.s.c.SolrCore [[authCollection_shard1_replica1] ] Opening new SolrCore at [/home/jenkins/workspace/Lucene-Solr-6.x-Linux/solr/build/solr-core/test/J2/temp/solr.security.BasicAuthIntegrationTest_DE61965EA597D88B-001/tempDir-001/node2/authCollection_shard1_replica1], dataDir=[/home/jenkins/workspace/Lucene-Solr-6.x-Linux/solr/build/solr-core/test/J2/temp/solr.security.BasicAuthIntegrationTest_DE61965EA597D88B-001/tempDir-001/node2/./authCollection_shard1_replica1/data/]
   [junit4]   2> 470066 INFO  (qtp4757234-3811) [    ] o.a.s.c.SolrCore [[authCollection_shard3_replica1] ] Opening new SolrCore at [/home/jenkins/workspace/Lucene-Solr-6.x-Linux/solr/build/solr-core/test/J2/temp/solr.security.BasicAuthIntegrationTest_DE61965EA597D88B-001/tempDir-001/node3/authCollection_shard3_replica1], dataDir=[/home/jenkins/workspace/Lucene-Solr-6.x-Linux/solr/build/solr-core/test/J2/temp/solr.security.BasicAuthIntegrationTest_DE61965EA597D88B-001/tempDir-001/node3/./authCollection_shard3_replica1/data/]
   [junit4]   2> 470066 INFO  (qtp3679195-3812) [    ] o.a.s.c.SolrCore JMX monitoring not detected for core: authCollection_shard1_replica1
   [junit4]   2> 470066 INFO  (qtp4757234-3811) [    ] o.a.s.c.SolrCore JMX monitoring not detected for core: authCollection_shard3_replica1
   [junit4]   2> 470066 INFO  (qtp3679195-3812) [    ] o.a.s.c.CachingDirectoryFactory return new directory for /home/jenkins/workspace/Lucene-Solr-6.x-Linux/solr/build/solr-core/test/J2/temp/solr.security.BasicAuthIntegrationTest_DE61965EA597D88B-001/tempDir-001/node2/./authCollection_shard1_replica1/data/snapshot_metadata
   [junit4]   2> 470066 INFO  (qtp3679195-3812) [    ] o.a.s.c.s.SolrSnapshotMetaDataManager Loading from snapshot metadata file...
   [junit4]   2> 470066 INFO  (qtp4757234-3811) [    ] o.a.s.c.CachingDirectoryFactory return new directory for /home/jenkins/workspace/Lucene-Solr-6.x-Linux/solr/build/solr-core/test/J2/temp/solr.security.BasicAuthIntegrationTest_DE61965EA597D88B-001/tempDir-001/node3/./authCollection_shard3_replica1/data/snapshot_metadata
   [junit4]   2> 470067 INFO  (qtp4757234-3811) [    ] o.a.s.c.s.SolrSnapshotMetaDataManager Loading from snapshot metadata file...
   [junit4]   2> 470067 INFO  (qtp3679195-3812) [    ] o.a.s.c.CachingDirectoryFactory return new directory for /home/jenkins/workspace/Lucene-Solr-6.x-Linux/solr/build/solr-core/test/J2/temp/solr.security.BasicAuthIntegrationTest_DE61965EA597D88B-001/tempDir-001/node2/./authCollection_shard1_replica1/data
   [junit4]   2> 470067 INFO  (qtp3679195-3812) [    ] o.a.s.c.SolrCore New index directory detected: old=null new=/home/jenkins/workspace/Lucene-Solr-6.x-Linux/solr/build/solr-core/test/J2/temp/solr.security.BasicAuthIntegrationTest_DE61965EA597D88B-001/tempDir-001/node2/./authCollection_shard1_replica1/data/index/
   [junit4]   2> 470067 WARN  (qtp3679195-3812) [    ] o.a.s.c.SolrCore [authCollection_shard1_replica1] Solr index directory '/home/jenkins/workspace/Lucene-Solr-6.x-Linux/solr/build/solr-core/test/J2/temp/solr.security.BasicAuthIntegrationTest_DE61965EA597D88B-001/tempDir-001/node2/./authCollection_shard1_replica1/data/index' doesn't exist. Creating new index...
   [junit4]   2> 470067 INFO  (qtp4757234-3811) [    ] o.a.s.c.CachingDirectoryFactory return new directory for /home/jenkins/workspace/Lucene-Solr-6.x-Linux/solr/build/solr-core/test/J2/temp/solr.security.BasicAuthIntegrationTest_DE61965EA597D88B-001/tempDir-001/node3/./authCollection_shard3_replica1/data
   [junit4]   2> 470068 INFO  (qtp4757234-3811) [    ] o.a.s.c.SolrCore New index directory detected: old=null new=/home/jenkins/workspace/Lucene-Solr-6.x-Linux/solr/build/solr-core/test/J2/temp/solr.security.BasicAuthIntegrationTest_DE61965EA597D88B-001/tempDir-001/node3/./authCollection_shard3_replica1/data/index/
   [junit4]   2> 470068 WARN  (qtp4757234-3811) [    ] o.a.s.c.SolrCore [authCollection_shard3_replica1] Solr index directory '/home/jenkins/workspace/Lucene-Solr-6.x-Linux/solr/build/solr-core/test/J2/temp/solr.security.BasicAuthIntegrationTest_DE61965EA597D88B-001/tempDir-001/node3/./authCollection_shard3_replica1/data/index' doesn't exist. Creating new index...
   [junit4]   2> 470068 INFO  (qtp3679195-3812) [    ] o.a.s.c.CachingDirectoryFactory return new directory for /home/jenkins/workspace/Lucene-Solr-6.x-Linux/solr/build/solr-core/test/J2/temp/solr.security.BasicAuthIntegrationTest_DE61965EA597D88B-001/tempDir-001/node2/./authCollection_shard1_replica1/data/index
   [junit4]   2> 470068 INFO  (qtp4757234-3811) [    ] o.a.s.c.CachingDirectoryFactory return new directory for /home/jenkins/workspace/Lucene-Solr-6.x-Linux/solr/build/solr-core/test/J2/temp/solr.security.BasicAuthIntegrationTest_DE61965EA597D88B-001/tempDir-001/node3/./authCollection_shard3_replica1/data/index
   [junit4]   2> 470068 INFO  (qtp3679195-3812) [    ] o.a.s.c.SolrDeletionPolicy SolrDeletionPolicy.onCommit: commits: num=1
   [junit4]   2> 	commit{dir=MockDirectoryWrapper(RAMDirectory@275a8b lockFactory=org.apache.lucene.store.SingleInstanceLockFactory@15b393d),segFN=segments_1,generation=1}
   [junit4]   2> 470068 INFO  (qtp3679195-3812) [    ] o.a.s.c.SolrDeletionPolicy newest commit generation = 1
   [junit4]   2> 470069 INFO  (qtp4757234-3811) [    ] o.a.s.c.SolrDeletionPolicy SolrDeletionPolicy.onCommit: commits: num=1
   [junit4]   2> 	commit{dir=MockDirectoryWrapper(RAMDirectory@1300c31 lockFactory=org.apache.lucene.store.SingleInstanceLockFactory@14a825e),segFN=segments_1,generation=1}
   [junit4]   2> 470069 INFO  (qtp4757234-3811) [    ] o.a.s.c.SolrDeletionPolicy newest commit generation = 1
   [junit4]   2> 470069 INFO  (OldIndexDirectoryCleanupThreadForCore-authCollection_shard1_replica1) [    ] o.a.s.c.SolrCore Looking for old index directories to cleanup for core authCollection_shard1_replica1 in /home/jenkins/workspace/Lucene-Solr-6.x-Linux/solr/build/solr-core/test/J2/temp/solr.security.BasicAuthIntegrationTest_DE61965EA597D88B-001/tempDir-001/node2/./authCollection_shard1_replica1/data/
   [junit4]   2> 470069 INFO  (OldIndexDirectoryCleanupThreadForCore-authCollection_shard3_replica1) [    ] o.a.s.c.SolrCore Looking for old index directories to cleanup for core authCollection_shard3_replica1 in /home/jenkins/workspace/Lucene-Solr-6.x-Linux/solr/build/solr-core/test/J2/temp/solr.security.BasicAuthIntegrationTest_DE61965EA597D88B-001/tempDir-001/node3/./authCollection_shard3_replica1/data/
   [junit4]   2> 470069 WARN  (OldIndexDirectoryCleanupThreadForCore-authCollection_shard1_replica1) [    ] o.a.s.c.DirectoryFactory /home/jenkins/workspace/Lucene-Solr-6.x-Linux/solr/build/solr-core/test/J2/temp/solr.security.BasicAuthIntegrationTest_DE61965EA597D88B-001/tempDir-001/node2/./authCollection_shard1_replica1/data/ does not point to a valid data directory; skipping clean-up of old index directories.
   [junit4]   2> 470069 WARN  (OldIndexDirectoryCleanupThreadForCore-authCollection_shard3_replica1) [    ] o.a.s.c.DirectoryFactory /home/jenkins/workspace/Lucene-Solr-6.x-Linux/solr/build/solr-core/test/J2/temp/solr.security.BasicAuthIntegrationTest_DE61965EA597D88B-001/tempDir-001/node3/./authCollection_shard3_replica1/data/ does not point to a valid data directory; skipping clean-up of old index directories.
   [junit4]   2> 470070 INFO  (qtp3679195-3812) [    ] o.a.s.c.SolrCore no updateRequestProcessorChain defined as default, creating implicit default
   [junit4]   2> 470070 INFO  (qtp4757234-3811) [    ] o.a.s.c.SolrCore no updateRequestProcessorChain defined as default, creating implicit default
   [junit4]   2> 470071 INFO  (qtp4757234-3811) [    ] o.a.s.h.l.XMLLoader xsltCacheLifetimeSeconds=60
   [junit4]   2> 470071 INFO  (qtp3679195-3812) [    ] o.a.s.h.l.XMLLoader xsltCacheLifetimeSeconds=60
   [junit4]   2> 470071 INFO  (qtp4757234-3811) [    ] o.a.s.h.l.XMLLoader xsltCacheLifetimeSeconds=60
   [junit4]   2> 470071 INFO  (qtp3679195-3812) [    ] o.a.s.h.l.XMLLoader xsltCacheLifetimeSeconds=60
   [junit4]   2> 470072 INFO  (qtp4757234-3811) [    ] o.a.s.h.l.XMLLoader xsltCacheLifetimeSeconds=60
   [junit4]   2> 470072 INFO  (qtp3679195-3812) [    ] o.a.s.h.l.XMLLoader xsltCacheLifetimeSeconds=60
   [junit4]   2> 470072 INFO  (qtp4757234-3811) [    ] o.a.s.h.l.XMLLoader xsltCacheLifetimeSeconds=60
   [junit4]   2> 470072 INFO  (qtp3679195-3812) [    ] o.a.s.h.l.XMLLoader xsltCacheLifetimeSeconds=60
   [junit4]   2> 470073 INFO  (qtp4757234-3811) [    ] o.a.s.c.RequestHandlers Registered paths: /admin/mbeans,/update/json/docs,/admin/luke,/export,/get,/admin/properties,/update/json,/admin/threads,/update/csv,/sql,/graph,/select,/admin/segments,/admin/system,/replication,/config,/stream,/schema,/admin/plugins,/admin/logging,/admin/ping,/update,/admin/file,/terms
   [junit4]   2> 470073 INFO  (qtp3679195-3812) [    ] o.a.s.c.RequestHandlers Registered paths: /admin/mbeans,/update/json/docs,/admin/luke,/export,/get,/admin/properties,/update/json,/admin/threads,/update/csv,/sql,/graph,/select,/admin/segments,/admin/system,/replication,/config,/stream,/schema,/admin/plugins,/admin/logging,/admin/ping,/update,/admin/file,/terms
   [junit4]   2> 470073 INFO  (qtp4757234-3811) [    ] o.a.s.c.SolrCore Using default statsCache cache: org.apache.solr.search.stats.LocalStatsCache
   [junit4]   2> 470073 INFO  (qtp3679195-3812) [    ] o.a.s.c.SolrCore Using default statsCache cache: org.apache.solr.search.stats.LocalStatsCache
   [junit4]   2> 470074 INFO  (qtp4757234-3811) [    ] o.a.s.u.UpdateHandler Using UpdateLog implementation: org.apache.solr.update.UpdateLog
   [junit4]   2> 470074 INFO  (qtp4757234-3811) [    ] o.a.s.u.UpdateLog Initializing UpdateLog: dataDir=null defaultSyncLevel=FLUSH numRecordsToKeep=100 maxNumLogsToKeep=10 numVersionBuckets=65536
   [junit4]   2> 470074 INFO  (qtp3679195-3812) [    ] o.a.s.u.UpdateHandler Using UpdateLog implementation: org.apache.solr.update.UpdateLog
   [junit4]   2> 470074 INFO  (qtp3679195-3812) [    ] o.a.s.u.UpdateLog Initializing UpdateLog: dataDir=null defaultSyncLevel=FLUSH numRecordsToKeep=100 maxNumLogsToKeep=10 numVersionBuckets=65536
   [junit4]   2> 470075 INFO  (qtp4757234-3811) [    ] o.a.s.u.CommitTracker Hard AutoCommit: disabled
   [junit4]   2> 470075 INFO  (qtp4757234-3811) [    ] o.a.s.u.CommitTrack

[...truncated too long message...]

ollection_shard1_replica1/data/snapshot_metadata;done=false>>]
   [junit4]   2> 472053 INFO  (coreCloseExecutor-1626-thread-1) [    ] o.a.s.c.CachingDirectoryFactory looking to close /home/jenkins/workspace/Lucene-Solr-6.x-Linux/solr/build/solr-core/test/J2/temp/solr.security.BasicAuthIntegrationTest_DE61965EA597D88B-001/tempDir-001/node1/./authCollection_shard2_replica1/data/snapshot_metadata [CachedDir<<refCount=0;path=/home/jenkins/workspace/Lucene-Solr-6.x-Linux/solr/build/solr-core/test/J2/temp/solr.security.BasicAuthIntegrationTest_DE61965EA597D88B-001/tempDir-001/node1/./authCollection_shard2_replica1/data/snapshot_metadata;done=false>>]
   [junit4]   2> 472053 INFO  (coreCloseExecutor-1624-thread-1) [    ] o.a.s.c.CachingDirectoryFactory Closing directory, CoreContainer#isShutdown=true
   [junit4]   2> 472053 INFO  (coreCloseExecutor-1626-thread-1) [    ] o.a.s.c.CachingDirectoryFactory Closing directory, CoreContainer#isShutdown=true
   [junit4]   2> 472053 INFO  (coreCloseExecutor-1624-thread-1) [    ] o.a.s.c.CachingDirectoryFactory Closing directory: /home/jenkins/workspace/Lucene-Solr-6.x-Linux/solr/build/solr-core/test/J2/temp/solr.security.BasicAuthIntegrationTest_DE61965EA597D88B-001/tempDir-001/node2/./authCollection_shard1_replica1/data/snapshot_metadata
   [junit4]   2> 472053 INFO  (coreCloseExecutor-1626-thread-1) [    ] o.a.s.c.CachingDirectoryFactory Closing directory: /home/jenkins/workspace/Lucene-Solr-6.x-Linux/solr/build/solr-core/test/J2/temp/solr.security.BasicAuthIntegrationTest_DE61965EA597D88B-001/tempDir-001/node1/./authCollection_shard2_replica1/data/snapshot_metadata
   [junit4]   2> 472056 INFO  (jetty-launcher-600-thread-2) [    ] o.a.s.c.Overseer Overseer (id=96558490264535049-127.0.0.1:41980_solr-n_0000000000) closing
   [junit4]   2> 472056 INFO  (OverseerStateUpdate-96558490264535049-127.0.0.1:41980_solr-n_0000000000) [    ] o.a.s.c.Overseer Overseer Loop exiting : 127.0.0.1:41980_solr
   [junit4]   2> 472056 INFO  (zkCallback-615-thread-2) [    ] o.a.s.c.c.ZkStateReader A live node change: [WatchedEvent state:SyncConnected type:NodeChildrenChanged path:/live_nodes], has occurred - updating... (live nodes size: [3])
   [junit4]   2> 472056 INFO  (zkCallback-628-thread-1) [    ] o.a.s.c.c.ZkStateReader A live node change: [WatchedEvent state:SyncConnected type:NodeChildrenChanged path:/live_nodes], has occurred - updating... (live nodes size: [3])
   [junit4]   2> 472056 WARN  (NIOServerCxn.Factory:0.0.0.0/0.0.0.0:0) [    ] o.a.z.s.NIOServerCnxn caught end of stream exception
   [junit4]   2> EndOfStreamException: Unable to read additional data from client sessionid 0x1570b6f70440008, likely client has closed socket
   [junit4]   2> 	at org.apache.zookeeper.server.NIOServerCnxn.doIO(NIOServerCnxn.java:228)
   [junit4]   2> 	at org.apache.zookeeper.server.NIOServerCnxnFactory.run(NIOServerCnxnFactory.java:208)
   [junit4]   2> 	at java.lang.Thread.run(java.base@9-ea/Thread.java:843)
   [junit4]   2> 472056 INFO  (zkCallback-616-thread-3) [    ] o.a.s.c.c.ZkStateReader A live node change: [WatchedEvent state:SyncConnected type:NodeChildrenChanged path:/live_nodes], has occurred - updating... (live nodes size: [3])
   [junit4]   2> 472056 INFO  (zkCallback-616-thread-3) [    ] o.a.s.c.c.ZkStateReader Updated live nodes from ZooKeeper... (3) -> (1)
   [junit4]   2> 472057 INFO  (zkCallback-616-thread-3) [    ] o.a.s.c.c.ZkStateReader A live node change: [WatchedEvent state:SyncConnected type:NodeChildrenChanged path:/live_nodes], has occurred - updating... (live nodes size: [1])
   [junit4]   2> 472057 WARN  (zkCallback-616-thread-3) [    ] o.a.s.c.c.ZkStateReader ZooKeeper watch triggered, but Solr cannot talk to ZK: [KeeperErrorCode = Session expired for /live_nodes]
   [junit4]   2> 472057 INFO  (jetty-launcher-600-thread-2) [    ] o.e.j.s.h.ContextHandler Stopped o.e.j.s.ServletContextHandler@5c7b39{/solr,null,UNAVAILABLE}
   [junit4]   2> 473556 WARN  (zkCallback-615-thread-2) [    ] o.a.s.c.c.ZkStateReader ZooKeeper watch triggered, but Solr cannot talk to ZK: [KeeperErrorCode = Session expired for /live_nodes]
   [junit4]   2> 473556 WARN  (zkCallback-628-thread-1) [    ] o.a.s.c.c.ZkStateReader ZooKeeper watch triggered, but Solr cannot talk to ZK: [KeeperErrorCode = Session expired for /live_nodes]
   [junit4]   2> 473556 INFO  (jetty-launcher-600-thread-1) [    ] o.e.j.s.h.ContextHandler Stopped o.e.j.s.ServletContextHandler@5c9140{/solr,null,UNAVAILABLE}
   [junit4]   2> 473556 WARN  (zkCallback-628-thread-2) [    ] o.a.s.c.LeaderElector 
   [junit4]   2> org.apache.zookeeper.KeeperException$SessionExpiredException: KeeperErrorCode = Session expired for /overseer_elect/election
   [junit4]   2> 	at org.apache.zookeeper.KeeperException.create(KeeperException.java:127)
   [junit4]   2> 	at org.apache.zookeeper.KeeperException.create(KeeperException.java:51)
   [junit4]   2> 	at org.apache.zookeeper.ZooKeeper.getChildren(ZooKeeper.java:1472)
   [junit4]   2> 	at org.apache.solr.common.cloud.SolrZkClient$6.execute(SolrZkClient.java:331)
   [junit4]   2> 	at org.apache.solr.common.cloud.SolrZkClient$6.execute(SolrZkClient.java:328)
   [junit4]   2> 	at org.apache.solr.common.cloud.ZkCmdExecutor.retryOperation(ZkCmdExecutor.java:60)
   [junit4]   2> 	at org.apache.solr.common.cloud.SolrZkClient.getChildren(SolrZkClient.java:328)
   [junit4]   2> 	at org.apache.solr.cloud.LeaderElector.checkIfIamLeader(LeaderElector.java:105)
   [junit4]   2> 	at org.apache.solr.cloud.LeaderElector.access$200(LeaderElector.java:56)
   [junit4]   2> 	at org.apache.solr.cloud.LeaderElector$ElectionWatcher.process(LeaderElector.java:348)
   [junit4]   2> 	at org.apache.solr.common.cloud.SolrZkClient$3.lambda$process$0(SolrZkClient.java:266)
   [junit4]   2> 	at java.util.concurrent.Executors$RunnableAdapter.call(java.base@9-ea/Executors.java:514)
   [junit4]   2> 	at java.util.concurrent.FutureTask.run(java.base@9-ea/FutureTask.java:264)
   [junit4]   2> 	at org.apache.solr.common.util.ExecutorUtil$MDCAwareThreadPoolExecutor.lambda$execute$0(ExecutorUtil.java:229)
   [junit4]   2> 	at java.util.concurrent.ThreadPoolExecutor.runWorker(java.base@9-ea/ThreadPoolExecutor.java:1158)
   [junit4]   2> 	at java.util.concurrent.ThreadPoolExecutor$Worker.run(java.base@9-ea/ThreadPoolExecutor.java:632)
   [junit4]   2> 	at java.lang.Thread.run(java.base@9-ea/Thread.java:843)
   [junit4]   2> 473557 INFO  (jetty-launcher-600-thread-3) [    ] o.e.j.s.h.ContextHandler Stopped o.e.j.s.ServletContextHandler@183cead{/solr,null,UNAVAILABLE}
   [junit4]   2> 473558 INFO  (SUITE-BasicAuthIntegrationTest-seed#[DE61965EA597D88B]-worker) [    ] o.a.s.c.ZkTestServer connecting to 127.0.0.1:38805 38805
   [junit4]   2> 473615 INFO  (Thread-947) [    ] o.a.s.c.ZkTestServer connecting to 127.0.0.1:38805 38805
   [junit4]   2> 473615 WARN  (Thread-947) [    ] o.a.s.c.ZkTestServer Watch limit violations: 
   [junit4]   2> Maximum concurrent create/delete watches above limit:
   [junit4]   2> 
   [junit4]   2> 	5	/solr/aliases.json
   [junit4]   2> 	4	/solr/security.json
   [junit4]   2> 	4	/solr/configs/conf
   [junit4]   2> 
   [junit4]   2> Maximum concurrent data watches above limit:
   [junit4]   2> 
   [junit4]   2> 	5	/solr/clusterstate.json
   [junit4]   2> 	5	/solr/clusterprops.json
   [junit4]   2> 	4	/solr/collections/authCollection/state.json
   [junit4]   2> 	2	/solr/overseer_elect/election/96558490264535048-127.0.0.1:45062_solr-n_0000000001
   [junit4]   2> 
   [junit4]   2> Maximum concurrent children watches above limit:
   [junit4]   2> 
   [junit4]   2> 	7	/solr/overseer/queue
   [junit4]   2> 	5	/solr/collections
   [junit4]   2> 	4	/solr/live_nodes
   [junit4]   2> 	3	/solr/overseer/collection-queue-work
   [junit4]   2> 	3	/solr/overseer/queue-work
   [junit4]   2> 
   [junit4]   2> 473615 INFO  (SUITE-BasicAuthIntegrationTest-seed#[DE61965EA597D88B]-worker) [    ] o.a.s.SolrTestCaseJ4 ###deleteCore
   [junit4]   2> NOTE: leaving temporary files on disk at: /home/jenkins/workspace/Lucene-Solr-6.x-Linux/solr/build/solr-core/test/J2/temp/solr.security.BasicAuthIntegrationTest_DE61965EA597D88B-001
   [junit4]   2> Sep 08, 2016 8:14:00 PM com.carrotsearch.randomizedtesting.ThreadLeakControl checkThreadLeaks
   [junit4]   2> WARNING: Will linger awaiting termination of 1 leaked thread(s).
   [junit4]   2> NOTE: test params are: codec=Asserting(Lucene62): {}, docValues:{}, maxPointsInLeafNode=1628, maxMBSortInHeap=7.550026148534226, sim=RandomSimilarity(queryNorm=true,coord=no): {}, locale=en-FI, timezone=Australia/Currie
   [junit4]   2> NOTE: Linux 4.4.0-36-generic i386/Oracle Corporation 9-ea (32-bit)/cpus=12,threads=1,free=43813448,total=303882240
   [junit4]   2> NOTE: All tests run in this JVM: [DistributedFacetPivotLongTailTest, TestExclusionRuleCollectionAccess, TermVectorComponentDistributedTest, SpellPossibilityIteratorTest, TestIndexSearcher, DistribJoinFromCollectionTest, PreAnalyzedUpdateProcessorTest, DebugComponentTest, TestExtendedDismaxParser, TestSolrQueryParser, TestGeoJSONResponseWriter, TestExpandComponent, SuggestComponentContextFilterQueryTest, TestConfigSetsAPI, DistributedSuggestComponentTest, TestChildDocTransformer, OverseerCollectionConfigSetProcessorTest, TestNumericTerms32, UpdateParamsTest, TestPhraseSuggestions, NoCacheHeaderTest, DeleteNodeTest, TestLeaderInitiatedRecoveryThread, FullSolrCloudDistribCmdsTest, CoreAdminHandlerTest, JSONWriterTest, TestAuthenticationFramework, BadCopyFieldTest, SimpleMLTQParserTest, TestImplicitCoreProperties, PrimitiveFieldTypeTest, BasicDistributedZk2Test, ResponseLogComponentTest, TestSchemaResource, ForceLeaderTest, TestReversedWildcardFilterFactory, HdfsTlogReplayBufferedWhileIndexingTest, SuggesterWFSTTest, StatelessScriptUpdateProcessorFactoryTest, BJQParserTest, DOMUtilTest, TestRawTransformer, BasicAuthIntegrationTest]
   [junit4] Completed [172/630 (1!)] on J2 in 6.61s, 1 test, 1 error <<< FAILURES!

[...truncated 51301 lines...]


Mime
View raw message