lucene-dev mailing list archives

Site index · List index
Message view « Date » · « Thread »
Top « Date » · « Thread »
From Apache Jenkins Server <jenk...@builds.apache.org>
Subject [JENKINS] Lucene-Solr-Tests-master - Build # 1388 - Still Unstable
Date Sun, 11 Sep 2016 02:22:39 GMT
Build: https://builds.apache.org/job/Lucene-Solr-Tests-master/1388/

1 tests failed.
FAILED:  org.apache.solr.cloud.ForceLeaderTest.testReplicasInLIRNoLeader

Error Message:
No live SolrServers available to handle this request:[http://127.0.0.1:39981/pi_ko/z/forceleader_test_collection_shard1_replica2]

Stack Trace:
org.apache.solr.client.solrj.impl.CloudSolrClient$RouteException: No live SolrServers available to handle this request:[http://127.0.0.1:39981/pi_ko/z/forceleader_test_collection_shard1_replica2]
	at __randomizedtesting.SeedInfo.seed([48722C3319D162D2:AEE518F320539BB3]:0)
	at org.apache.solr.client.solrj.impl.CloudSolrClient.directUpdate(CloudSolrClient.java:755)
	at org.apache.solr.client.solrj.impl.CloudSolrClient.sendRequest(CloudSolrClient.java:1161)
	at org.apache.solr.client.solrj.impl.CloudSolrClient.requestWithRetryOnStaleState(CloudSolrClient.java:1050)
	at org.apache.solr.client.solrj.impl.CloudSolrClient.request(CloudSolrClient.java:992)
	at org.apache.solr.cloud.AbstractFullDistribZkTestBase.sendDocsWithRetry(AbstractFullDistribZkTestBase.java:753)
	at org.apache.solr.cloud.AbstractFullDistribZkTestBase.sendDocsWithRetry(AbstractFullDistribZkTestBase.java:741)
	at org.apache.solr.cloud.ForceLeaderTest.sendDoc(ForceLeaderTest.java:424)
	at org.apache.solr.cloud.ForceLeaderTest.testReplicasInLIRNoLeader(ForceLeaderTest.java:131)
	at sun.reflect.NativeMethodAccessorImpl.invoke0(Native Method)
	at sun.reflect.NativeMethodAccessorImpl.invoke(NativeMethodAccessorImpl.java:62)
	at sun.reflect.DelegatingMethodAccessorImpl.invoke(DelegatingMethodAccessorImpl.java:43)
	at java.lang.reflect.Method.invoke(Method.java:498)
	at com.carrotsearch.randomizedtesting.RandomizedRunner.invoke(RandomizedRunner.java:1764)
	at com.carrotsearch.randomizedtesting.RandomizedRunner$8.evaluate(RandomizedRunner.java:871)
	at com.carrotsearch.randomizedtesting.RandomizedRunner$9.evaluate(RandomizedRunner.java:907)
	at com.carrotsearch.randomizedtesting.RandomizedRunner$10.evaluate(RandomizedRunner.java:921)
	at org.apache.solr.BaseDistributedSearchTestCase$ShardsRepeatRule$ShardsFixedStatement.callStatement(BaseDistributedSearchTestCase.java:985)
	at org.apache.solr.BaseDistributedSearchTestCase$ShardsRepeatRule$ShardsStatement.evaluate(BaseDistributedSearchTestCase.java:960)
	at com.carrotsearch.randomizedtesting.rules.SystemPropertiesRestoreRule$1.evaluate(SystemPropertiesRestoreRule.java:57)
	at org.apache.lucene.util.TestRuleSetupTeardownChained$1.evaluate(TestRuleSetupTeardownChained.java:49)
	at org.apache.lucene.util.AbstractBeforeAfterRule$1.evaluate(AbstractBeforeAfterRule.java:45)
	at org.apache.lucene.util.TestRuleThreadAndTestName$1.evaluate(TestRuleThreadAndTestName.java:48)
	at org.apache.lucene.util.TestRuleIgnoreAfterMaxFailures$1.evaluate(TestRuleIgnoreAfterMaxFailures.java:64)
	at org.apache.lucene.util.TestRuleMarkFailure$1.evaluate(TestRuleMarkFailure.java:47)
	at com.carrotsearch.randomizedtesting.rules.StatementAdapter.evaluate(StatementAdapter.java:36)
	at com.carrotsearch.randomizedtesting.ThreadLeakControl$StatementRunner.run(ThreadLeakControl.java:367)
	at com.carrotsearch.randomizedtesting.ThreadLeakControl.forkTimeoutingTask(ThreadLeakControl.java:809)
	at com.carrotsearch.randomizedtesting.ThreadLeakControl$3.evaluate(ThreadLeakControl.java:460)
	at com.carrotsearch.randomizedtesting.RandomizedRunner.runSingleTest(RandomizedRunner.java:880)
	at com.carrotsearch.randomizedtesting.RandomizedRunner$5.evaluate(RandomizedRunner.java:781)
	at com.carrotsearch.randomizedtesting.RandomizedRunner$6.evaluate(RandomizedRunner.java:816)
	at com.carrotsearch.randomizedtesting.RandomizedRunner$7.evaluate(RandomizedRunner.java:827)
	at com.carrotsearch.randomizedtesting.rules.StatementAdapter.evaluate(StatementAdapter.java:36)
	at com.carrotsearch.randomizedtesting.rules.SystemPropertiesRestoreRule$1.evaluate(SystemPropertiesRestoreRule.java:57)
	at org.apache.lucene.util.AbstractBeforeAfterRule$1.evaluate(AbstractBeforeAfterRule.java:45)
	at com.carrotsearch.randomizedtesting.rules.StatementAdapter.evaluate(StatementAdapter.java:36)
	at org.apache.lucene.util.TestRuleStoreClassName$1.evaluate(TestRuleStoreClassName.java:41)
	at com.carrotsearch.randomizedtesting.rules.NoShadowingOrOverridesOnMethodsRule$1.evaluate(NoShadowingOrOverridesOnMethodsRule.java:40)
	at com.carrotsearch.randomizedtesting.rules.NoShadowingOrOverridesOnMethodsRule$1.evaluate(NoShadowingOrOverridesOnMethodsRule.java:40)
	at com.carrotsearch.randomizedtesting.rules.StatementAdapter.evaluate(StatementAdapter.java:36)
	at com.carrotsearch.randomizedtesting.rules.StatementAdapter.evaluate(StatementAdapter.java:36)
	at com.carrotsearch.randomizedtesting.rules.StatementAdapter.evaluate(StatementAdapter.java:36)
	at org.apache.lucene.util.TestRuleAssertionsRequired$1.evaluate(TestRuleAssertionsRequired.java:53)
	at org.apache.lucene.util.TestRuleMarkFailure$1.evaluate(TestRuleMarkFailure.java:47)
	at org.apache.lucene.util.TestRuleIgnoreAfterMaxFailures$1.evaluate(TestRuleIgnoreAfterMaxFailures.java:64)
	at org.apache.lucene.util.TestRuleIgnoreTestSuites$1.evaluate(TestRuleIgnoreTestSuites.java:54)
	at com.carrotsearch.randomizedtesting.rules.StatementAdapter.evaluate(StatementAdapter.java:36)
	at com.carrotsearch.randomizedtesting.ThreadLeakControl$StatementRunner.run(ThreadLeakControl.java:367)
	at java.lang.Thread.run(Thread.java:745)
Caused by: org.apache.solr.client.solrj.SolrServerException: No live SolrServers available to handle this request:[http://127.0.0.1:39981/pi_ko/z/forceleader_test_collection_shard1_replica2]
	at org.apache.solr.client.solrj.impl.LBHttpSolrClient.request(LBHttpSolrClient.java:394)
	at org.apache.solr.client.solrj.impl.CloudSolrClient.lambda$directUpdate$0(CloudSolrClient.java:730)
	at java.util.concurrent.FutureTask.run(FutureTask.java:266)
	at org.apache.solr.common.util.ExecutorUtil$MDCAwareThreadPoolExecutor.lambda$execute$0(ExecutorUtil.java:229)
	at java.util.concurrent.ThreadPoolExecutor.runWorker(ThreadPoolExecutor.java:1142)
	at java.util.concurrent.ThreadPoolExecutor$Worker.run(ThreadPoolExecutor.java:617)
	... 1 more
Caused by: org.apache.solr.client.solrj.SolrServerException: Server refused connection at: http://127.0.0.1:39981/pi_ko/z/forceleader_test_collection_shard1_replica2
	at org.apache.solr.client.solrj.impl.HttpSolrClient.executeMethod(HttpSolrClient.java:615)
	at org.apache.solr.client.solrj.impl.HttpSolrClient.request(HttpSolrClient.java:261)
	at org.apache.solr.client.solrj.impl.HttpSolrClient.request(HttpSolrClient.java:250)
	at org.apache.solr.client.solrj.impl.LBHttpSolrClient.doRequest(LBHttpSolrClient.java:415)
	at org.apache.solr.client.solrj.impl.LBHttpSolrClient.request(LBHttpSolrClient.java:383)
	... 6 more
Caused by: org.apache.http.conn.HttpHostConnectException: Connect to 127.0.0.1:39981 [/127.0.0.1] failed: Connection refused
	at org.apache.http.impl.conn.DefaultHttpClientConnectionOperator.connect(DefaultHttpClientConnectionOperator.java:151)
	at org.apache.http.impl.conn.PoolingHttpClientConnectionManager.connect(PoolingHttpClientConnectionManager.java:353)
	at org.apache.http.impl.execchain.MainClientExec.establishRoute(MainClientExec.java:380)
	at org.apache.http.impl.execchain.MainClientExec.execute(MainClientExec.java:236)
	at org.apache.http.impl.execchain.ProtocolExec.execute(ProtocolExec.java:184)
	at org.apache.http.impl.execchain.RetryExec.execute(RetryExec.java:88)
	at org.apache.http.impl.execchain.RedirectExec.execute(RedirectExec.java:110)
	at org.apache.http.impl.client.InternalHttpClient.doExecute(InternalHttpClient.java:184)
	at org.apache.http.impl.client.CloseableHttpClient.execute(CloseableHttpClient.java:82)
	at org.apache.http.impl.client.CloseableHttpClient.execute(CloseableHttpClient.java:55)
	at org.apache.solr.client.solrj.impl.HttpSolrClient.executeMethod(HttpSolrClient.java:513)
	... 10 more
Caused by: java.net.ConnectException: Connection refused
	at java.net.PlainSocketImpl.socketConnect(Native Method)
	at java.net.AbstractPlainSocketImpl.doConnect(AbstractPlainSocketImpl.java:350)
	at java.net.AbstractPlainSocketImpl.connectToAddress(AbstractPlainSocketImpl.java:206)
	at java.net.AbstractPlainSocketImpl.connect(AbstractPlainSocketImpl.java:188)
	at java.net.SocksSocketImpl.connect(SocksSocketImpl.java:392)
	at java.net.Socket.connect(Socket.java:589)
	at org.apache.http.conn.socket.PlainConnectionSocketFactory.connectSocket(PlainConnectionSocketFactory.java:74)
	at org.apache.http.impl.conn.DefaultHttpClientConnectionOperator.connect(DefaultHttpClientConnectionOperator.java:134)
	... 20 more




Build Log:
[...truncated 12027 lines...]
   [junit4] Suite: org.apache.solr.cloud.ForceLeaderTest
   [junit4]   2> Creating dataDir: /x1/jenkins/jenkins-slave/workspace/Lucene-Solr-Tests-master/solr/build/solr-core/test/J0/temp/solr.cloud.ForceLeaderTest_48722C3319D162D2-001/init-core-data-001
   [junit4]   2> 2078203 INFO  (SUITE-ForceLeaderTest-seed#[48722C3319D162D2]-worker) [    ] o.a.s.SolrTestCaseJ4 Randomized ssl (false) and clientAuth (false) via: @org.apache.solr.SolrTestCaseJ4$SuppressSSL(bugUrl=https://issues.apache.org/jira/browse/SOLR-5776)
   [junit4]   2> 2078203 INFO  (SUITE-ForceLeaderTest-seed#[48722C3319D162D2]-worker) [    ] o.a.s.BaseDistributedSearchTestCase Setting hostContext system property: /pi_ko/z
   [junit4]   2> 2078205 INFO  (TEST-ForceLeaderTest.testLastPublishedStateIsActive-seed#[48722C3319D162D2]) [    ] o.a.s.c.ZkTestServer STARTING ZK TEST SERVER
   [junit4]   2> 2078205 INFO  (Thread-4521) [    ] o.a.s.c.ZkTestServer client port:0.0.0.0/0.0.0.0:0
   [junit4]   2> 2078205 INFO  (Thread-4521) [    ] o.a.s.c.ZkTestServer Starting server
   [junit4]   2> 2078305 INFO  (TEST-ForceLeaderTest.testLastPublishedStateIsActive-seed#[48722C3319D162D2]) [    ] o.a.s.c.ZkTestServer start zk server on port:47383
   [junit4]   2> 2078305 INFO  (TEST-ForceLeaderTest.testLastPublishedStateIsActive-seed#[48722C3319D162D2]) [    ] o.a.s.c.c.SolrZkClient Using default ZkCredentialsProvider
   [junit4]   2> 2078312 INFO  (TEST-ForceLeaderTest.testLastPublishedStateIsActive-seed#[48722C3319D162D2]) [    ] o.a.s.c.c.ConnectionManager Waiting for client to connect to ZooKeeper
   [junit4]   2> 2078313 INFO  (zkCallback-1500-thread-1) [    ] o.a.s.c.c.ConnectionManager Watcher org.apache.solr.common.cloud.ConnectionManager@db9d3fc name:ZooKeeperConnection Watcher:127.0.0.1:47383 got event WatchedEvent state:SyncConnected type:None path:null path:null type:None
   [junit4]   2> 2078313 INFO  (TEST-ForceLeaderTest.testLastPublishedStateIsActive-seed#[48722C3319D162D2]) [    ] o.a.s.c.c.ConnectionManager Client is connected to ZooKeeper
   [junit4]   2> 2078314 INFO  (TEST-ForceLeaderTest.testLastPublishedStateIsActive-seed#[48722C3319D162D2]) [    ] o.a.s.c.c.SolrZkClient Using default ZkACLProvider
   [junit4]   2> 2078314 INFO  (TEST-ForceLeaderTest.testLastPublishedStateIsActive-seed#[48722C3319D162D2]) [    ] o.a.s.c.c.SolrZkClient makePath: /solr
   [junit4]   2> 2078324 INFO  (TEST-ForceLeaderTest.testLastPublishedStateIsActive-seed#[48722C3319D162D2]) [    ] o.a.s.c.c.SolrZkClient Using default ZkCredentialsProvider
   [junit4]   2> 2078327 INFO  (TEST-ForceLeaderTest.testLastPublishedStateIsActive-seed#[48722C3319D162D2]) [    ] o.a.s.c.c.ConnectionManager Waiting for client to connect to ZooKeeper
   [junit4]   2> 2078327 INFO  (zkCallback-1501-thread-1) [    ] o.a.s.c.c.ConnectionManager Watcher org.apache.solr.common.cloud.ConnectionManager@3a4e876d name:ZooKeeperConnection Watcher:127.0.0.1:47383/solr got event WatchedEvent state:SyncConnected type:None path:null path:null type:None
   [junit4]   2> 2078327 INFO  (TEST-ForceLeaderTest.testLastPublishedStateIsActive-seed#[48722C3319D162D2]) [    ] o.a.s.c.c.ConnectionManager Client is connected to ZooKeeper
   [junit4]   2> 2078328 INFO  (TEST-ForceLeaderTest.testLastPublishedStateIsActive-seed#[48722C3319D162D2]) [    ] o.a.s.c.c.SolrZkClient Using default ZkACLProvider
   [junit4]   2> 2078328 INFO  (TEST-ForceLeaderTest.testLastPublishedStateIsActive-seed#[48722C3319D162D2]) [    ] o.a.s.c.c.SolrZkClient makePath: /collections/collection1
   [junit4]   2> 2078329 INFO  (TEST-ForceLeaderTest.testLastPublishedStateIsActive-seed#[48722C3319D162D2]) [    ] o.a.s.c.c.SolrZkClient makePath: /collections/collection1/shards
   [junit4]   2> 2078330 INFO  (TEST-ForceLeaderTest.testLastPublishedStateIsActive-seed#[48722C3319D162D2]) [    ] o.a.s.c.c.SolrZkClient makePath: /collections/control_collection
   [junit4]   2> 2078331 INFO  (TEST-ForceLeaderTest.testLastPublishedStateIsActive-seed#[48722C3319D162D2]) [    ] o.a.s.c.c.SolrZkClient makePath: /collections/control_collection/shards
   [junit4]   2> 2078332 INFO  (TEST-ForceLeaderTest.testLastPublishedStateIsActive-seed#[48722C3319D162D2]) [    ] o.a.s.c.AbstractZkTestCase put /x1/jenkins/jenkins-slave/workspace/Lucene-Solr-Tests-master/solr/core/src/test-files/solr/collection1/conf/solrconfig-tlog.xml to /configs/conf1/solrconfig.xml
   [junit4]   2> 2078332 INFO  (TEST-ForceLeaderTest.testLastPublishedStateIsActive-seed#[48722C3319D162D2]) [    ] o.a.s.c.c.SolrZkClient makePath: /configs/conf1/solrconfig.xml
   [junit4]   2> 2078336 INFO  (TEST-ForceLeaderTest.testLastPublishedStateIsActive-seed#[48722C3319D162D2]) [    ] o.a.s.c.AbstractZkTestCase put /x1/jenkins/jenkins-slave/workspace/Lucene-Solr-Tests-master/solr/core/src/test-files/solr/collection1/conf/schema.xml to /configs/conf1/schema.xml
   [junit4]   2> 2078336 INFO  (TEST-ForceLeaderTest.testLastPublishedStateIsActive-seed#[48722C3319D162D2]) [    ] o.a.s.c.c.SolrZkClient makePath: /configs/conf1/schema.xml
   [junit4]   2> 2078344 INFO  (TEST-ForceLeaderTest.testLastPublishedStateIsActive-seed#[48722C3319D162D2]) [    ] o.a.s.c.AbstractZkTestCase put /x1/jenkins/jenkins-slave/workspace/Lucene-Solr-Tests-master/solr/core/src/test-files/solr/collection1/conf/solrconfig.snippet.randomindexconfig.xml to /configs/conf1/solrconfig.snippet.randomindexconfig.xml
   [junit4]   2> 2078344 INFO  (TEST-ForceLeaderTest.testLastPublishedStateIsActive-seed#[48722C3319D162D2]) [    ] o.a.s.c.c.SolrZkClient makePath: /configs/conf1/solrconfig.snippet.randomindexconfig.xml
   [junit4]   2> 2078345 INFO  (TEST-ForceLeaderTest.testLastPublishedStateIsActive-seed#[48722C3319D162D2]) [    ] o.a.s.c.AbstractZkTestCase put /x1/jenkins/jenkins-slave/workspace/Lucene-Solr-Tests-master/solr/core/src/test-files/solr/collection1/conf/stopwords.txt to /configs/conf1/stopwords.txt
   [junit4]   2> 2078346 INFO  (TEST-ForceLeaderTest.testLastPublishedStateIsActive-seed#[48722C3319D162D2]) [    ] o.a.s.c.c.SolrZkClient makePath: /configs/conf1/stopwords.txt
   [junit4]   2> 2078347 INFO  (TEST-ForceLeaderTest.testLastPublishedStateIsActive-seed#[48722C3319D162D2]) [    ] o.a.s.c.AbstractZkTestCase put /x1/jenkins/jenkins-slave/workspace/Lucene-Solr-Tests-master/solr/core/src/test-files/solr/collection1/conf/protwords.txt to /configs/conf1/protwords.txt
   [junit4]   2> 2078347 INFO  (TEST-ForceLeaderTest.testLastPublishedStateIsActive-seed#[48722C3319D162D2]) [    ] o.a.s.c.c.SolrZkClient makePath: /configs/conf1/protwords.txt
   [junit4]   2> 2078348 INFO  (TEST-ForceLeaderTest.testLastPublishedStateIsActive-seed#[48722C3319D162D2]) [    ] o.a.s.c.AbstractZkTestCase put /x1/jenkins/jenkins-slave/workspace/Lucene-Solr-Tests-master/solr/core/src/test-files/solr/collection1/conf/currency.xml to /configs/conf1/currency.xml
   [junit4]   2> 2078348 INFO  (TEST-ForceLeaderTest.testLastPublishedStateIsActive-seed#[48722C3319D162D2]) [    ] o.a.s.c.c.SolrZkClient makePath: /configs/conf1/currency.xml
   [junit4]   2> 2078349 INFO  (TEST-ForceLeaderTest.testLastPublishedStateIsActive-seed#[48722C3319D162D2]) [    ] o.a.s.c.AbstractZkTestCase put /x1/jenkins/jenkins-slave/workspace/Lucene-Solr-Tests-master/solr/core/src/test-files/solr/collection1/conf/enumsConfig.xml to /configs/conf1/enumsConfig.xml
   [junit4]   2> 2078349 INFO  (TEST-ForceLeaderTest.testLastPublishedStateIsActive-seed#[48722C3319D162D2]) [    ] o.a.s.c.c.SolrZkClient makePath: /configs/conf1/enumsConfig.xml
   [junit4]   2> 2078350 INFO  (TEST-ForceLeaderTest.testLastPublishedStateIsActive-seed#[48722C3319D162D2]) [    ] o.a.s.c.AbstractZkTestCase put /x1/jenkins/jenkins-slave/workspace/Lucene-Solr-Tests-master/solr/core/src/test-files/solr/collection1/conf/open-exchange-rates.json to /configs/conf1/open-exchange-rates.json
   [junit4]   2> 2078351 INFO  (TEST-ForceLeaderTest.testLastPublishedStateIsActive-seed#[48722C3319D162D2]) [    ] o.a.s.c.c.SolrZkClient makePath: /configs/conf1/open-exchange-rates.json
   [junit4]   2> 2078356 INFO  (TEST-ForceLeaderTest.testLastPublishedStateIsActive-seed#[48722C3319D162D2]) [    ] o.a.s.c.AbstractZkTestCase put /x1/jenkins/jenkins-slave/workspace/Lucene-Solr-Tests-master/solr/core/src/test-files/solr/collection1/conf/mapping-ISOLatin1Accent.txt to /configs/conf1/mapping-ISOLatin1Accent.txt
   [junit4]   2> 2078356 INFO  (TEST-ForceLeaderTest.testLastPublishedStateIsActive-seed#[48722C3319D162D2]) [    ] o.a.s.c.c.SolrZkClient makePath: /configs/conf1/mapping-ISOLatin1Accent.txt
   [junit4]   2> 2078357 INFO  (TEST-ForceLeaderTest.testLastPublishedStateIsActive-seed#[48722C3319D162D2]) [    ] o.a.s.c.AbstractZkTestCase put /x1/jenkins/jenkins-slave/workspace/Lucene-Solr-Tests-master/solr/core/src/test-files/solr/collection1/conf/old_synonyms.txt to /configs/conf1/old_synonyms.txt
   [junit4]   2> 2078358 INFO  (TEST-ForceLeaderTest.testLastPublishedStateIsActive-seed#[48722C3319D162D2]) [    ] o.a.s.c.c.SolrZkClient makePath: /configs/conf1/old_synonyms.txt
   [junit4]   2> 2078359 INFO  (TEST-ForceLeaderTest.testLastPublishedStateIsActive-seed#[48722C3319D162D2]) [    ] o.a.s.c.AbstractZkTestCase put /x1/jenkins/jenkins-slave/workspace/Lucene-Solr-Tests-master/solr/core/src/test-files/solr/collection1/conf/synonyms.txt to /configs/conf1/synonyms.txt
   [junit4]   2> 2078359 INFO  (TEST-ForceLeaderTest.testLastPublishedStateIsActive-seed#[48722C3319D162D2]) [    ] o.a.s.c.c.SolrZkClient makePath: /configs/conf1/synonyms.txt
   [junit4]   2> 2078518 INFO  (TEST-ForceLeaderTest.testLastPublishedStateIsActive-seed#[48722C3319D162D2]) [    ] o.a.s.SolrTestCaseJ4 Writing core.properties file to /x1/jenkins/jenkins-slave/workspace/Lucene-Solr-Tests-master/solr/build/solr-core/test/J0/temp/solr.cloud.ForceLeaderTest_48722C3319D162D2-001/control-001/cores/collection1
   [junit4]   2> 2078523 INFO  (TEST-ForceLeaderTest.testLastPublishedStateIsActive-seed#[48722C3319D162D2]) [    ] o.e.j.s.Server jetty-9.3.8.v20160314
   [junit4]   2> 2078539 INFO  (TEST-ForceLeaderTest.testLastPublishedStateIsActive-seed#[48722C3319D162D2]) [    ] o.e.j.s.h.ContextHandler Started o.e.j.s.ServletContextHandler@53d8847{/pi_ko/z,null,AVAILABLE}
   [junit4]   2> 2078540 INFO  (TEST-ForceLeaderTest.testLastPublishedStateIsActive-seed#[48722C3319D162D2]) [    ] o.e.j.s.ServerConnector Started ServerConnector@3154b3fb{HTTP/1.1,[http/1.1]}{127.0.0.1:40985}
   [junit4]   2> 2078540 INFO  (TEST-ForceLeaderTest.testLastPublishedStateIsActive-seed#[48722C3319D162D2]) [    ] o.e.j.s.Server Started @2086141ms
   [junit4]   2> 2078540 INFO  (TEST-ForceLeaderTest.testLastPublishedStateIsActive-seed#[48722C3319D162D2]) [    ] o.a.s.c.s.e.JettySolrRunner Jetty properties: {solr.data.dir=/x1/jenkins/jenkins-slave/workspace/Lucene-Solr-Tests-master/solr/build/solr-core/test/J0/temp/solr.cloud.ForceLeaderTest_48722C3319D162D2-001/tempDir-001/control/data, hostContext=/pi_ko/z, hostPort=45084, coreRootDirectory=/x1/jenkins/jenkins-slave/workspace/Lucene-Solr-Tests-master/solr/build/solr-core/test/J0/temp/solr.cloud.ForceLeaderTest_48722C3319D162D2-001/control-001/cores}
   [junit4]   2> 2078540 INFO  (TEST-ForceLeaderTest.testLastPublishedStateIsActive-seed#[48722C3319D162D2]) [    ] o.a.s.s.SolrDispatchFilter SolrDispatchFilter.init(): sun.misc.Launcher$AppClassLoader@73d16e93
   [junit4]   2> 2078541 INFO  (TEST-ForceLeaderTest.testLastPublishedStateIsActive-seed#[48722C3319D162D2]) [    ] o.a.s.c.SolrResourceLoader new SolrResourceLoader for directory: '/x1/jenkins/jenkins-slave/workspace/Lucene-Solr-Tests-master/solr/build/solr-core/test/J0/temp/solr.cloud.ForceLeaderTest_48722C3319D162D2-001/control-001'
   [junit4]   2> 2078541 INFO  (TEST-ForceLeaderTest.testLastPublishedStateIsActive-seed#[48722C3319D162D2]) [    ] o.a.s.c.SolrResourceLoader JNDI not configured for solr (NoInitialContextEx)
   [junit4]   2> 2078541 INFO  (TEST-ForceLeaderTest.testLastPublishedStateIsActive-seed#[48722C3319D162D2]) [    ] o.a.s.c.SolrResourceLoader solr home defaulted to 'solr/' (could not find system property or JNDI)
   [junit4]   2> 2078541 INFO  (TEST-ForceLeaderTest.testLastPublishedStateIsActive-seed#[48722C3319D162D2]) [    ] o.a.s.c.c.SolrZkClient Using default ZkCredentialsProvider
   [junit4]   2> 2078548 INFO  (TEST-ForceLeaderTest.testLastPublishedStateIsActive-seed#[48722C3319D162D2]) [    ] o.a.s.c.c.ConnectionManager Waiting for client to connect to ZooKeeper
   [junit4]   2> 2078774 INFO  (zkCallback-1502-thread-1) [    ] o.a.s.c.c.ConnectionManager Watcher org.apache.solr.common.cloud.ConnectionManager@2949c6e7 name:ZooKeeperConnection Watcher:127.0.0.1:47383/solr got event WatchedEvent state:SyncConnected type:None path:null path:null type:None
   [junit4]   2> 2078775 INFO  (TEST-ForceLeaderTest.testLastPublishedStateIsActive-seed#[48722C3319D162D2]) [    ] o.a.s.c.c.ConnectionManager Client is connected to ZooKeeper
   [junit4]   2> 2078775 INFO  (TEST-ForceLeaderTest.testLastPublishedStateIsActive-seed#[48722C3319D162D2]) [    ] o.a.s.c.c.SolrZkClient Using default ZkACLProvider
   [junit4]   2> 2078781 INFO  (TEST-ForceLeaderTest.testLastPublishedStateIsActive-seed#[48722C3319D162D2]) [    ] o.a.s.s.SolrDispatchFilter Loading solr.xml from SolrHome (not found in ZooKeeper)
   [junit4]   2> 2078781 INFO  (TEST-ForceLeaderTest.testLastPublishedStateIsActive-seed#[48722C3319D162D2]) [    ] o.a.s.c.SolrXmlConfig Loading container configuration from /x1/jenkins/jenkins-slave/workspace/Lucene-Solr-Tests-master/solr/build/solr-core/test/J0/temp/solr.cloud.ForceLeaderTest_48722C3319D162D2-001/control-001/solr.xml
   [junit4]   2> 2078786 INFO  (TEST-ForceLeaderTest.testLastPublishedStateIsActive-seed#[48722C3319D162D2]) [    ] o.a.s.c.CorePropertiesLocator Config-defined core root directory: /x1/jenkins/jenkins-slave/workspace/Lucene-Solr-Tests-master/solr/build/solr-core/test/J0/temp/solr.cloud.ForceLeaderTest_48722C3319D162D2-001/control-001/cores
   [junit4]   2> 2078786 INFO  (TEST-ForceLeaderTest.testLastPublishedStateIsActive-seed#[48722C3319D162D2]) [    ] o.a.s.c.CoreContainer New CoreContainer 700701760
   [junit4]   2> 2078786 INFO  (TEST-ForceLeaderTest.testLastPublishedStateIsActive-seed#[48722C3319D162D2]) [    ] o.a.s.c.CoreContainer Loading cores into CoreContainer [instanceDir=/x1/jenkins/jenkins-slave/workspace/Lucene-Solr-Tests-master/solr/build/solr-core/test/J0/temp/solr.cloud.ForceLeaderTest_48722C3319D162D2-001/control-001]
   [junit4]   2> 2078786 WARN  (TEST-ForceLeaderTest.testLastPublishedStateIsActive-seed#[48722C3319D162D2]) [    ] o.a.s.c.CoreContainer Couldn't add files from /x1/jenkins/jenkins-slave/workspace/Lucene-Solr-Tests-master/solr/build/solr-core/test/J0/temp/solr.cloud.ForceLeaderTest_48722C3319D162D2-001/control-001/lib to classpath: /x1/jenkins/jenkins-slave/workspace/Lucene-Solr-Tests-master/solr/build/solr-core/test/J0/temp/solr.cloud.ForceLeaderTest_48722C3319D162D2-001/control-001/lib
   [junit4]   2> 2078787 INFO  (TEST-ForceLeaderTest.testLastPublishedStateIsActive-seed#[48722C3319D162D2]) [    ] o.a.s.h.c.HttpShardHandlerFactory created with socketTimeout : 90000,urlScheme : ,connTimeout : 15000,maxConnectionsPerHost : 20,maxConnections : 10000,corePoolSize : 0,maximumPoolSize : 2147483647,maxThreadIdleTime : 5,sizeOfQueue : -1,fairnessPolicy : false,
   [junit4]   2> 2078820 INFO  (TEST-ForceLeaderTest.testLastPublishedStateIsActive-seed#[48722C3319D162D2]) [    ] o.a.s.u.UpdateShardHandler Created UpdateShardHandler HTTP client with params: socketTimeout=340000&connTimeout=45000&maxConnections=100000&maxConnectionsPerHost=100000
   [junit4]   2> 2078820 INFO  (TEST-ForceLeaderTest.testLastPublishedStateIsActive-seed#[48722C3319D162D2]) [    ] o.a.s.l.LogWatcher SLF4J impl is org.slf4j.impl.Log4jLoggerFactory
   [junit4]   2> 2078820 INFO  (TEST-ForceLeaderTest.testLastPublishedStateIsActive-seed#[48722C3319D162D2]) [    ] o.a.s.l.LogWatcher Registering Log Listener [Log4j (org.slf4j.impl.Log4jLoggerFactory)]
   [junit4]   2> 2078820 INFO  (TEST-ForceLeaderTest.testLastPublishedStateIsActive-seed#[48722C3319D162D2]) [    ] o.a.s.c.ZkContainer Zookeeper client=127.0.0.1:47383/solr
   [junit4]   2> 2078820 INFO  (TEST-ForceLeaderTest.testLastPublishedStateIsActive-seed#[48722C3319D162D2]) [    ] o.a.s.c.ZkController zkHost includes chroot
   [junit4]   2> 2078820 INFO  (TEST-ForceLeaderTest.testLastPublishedStateIsActive-seed#[48722C3319D162D2]) [    ] o.a.s.c.c.SolrZkClient Using default ZkCredentialsProvider
   [junit4]   2> 2078822 INFO  (TEST-ForceLeaderTest.testLastPublishedStateIsActive-seed#[48722C3319D162D2]) [    ] o.a.s.c.c.ConnectionManager Waiting for client to connect to ZooKeeper
   [junit4]   2> 2078825 INFO  (zkCallback-1505-thread-1) [    ] o.a.s.c.c.ConnectionManager Watcher org.apache.solr.common.cloud.ConnectionManager@329a7451 name:ZooKeeperConnection Watcher:127.0.0.1:47383 got event WatchedEvent state:SyncConnected type:None path:null path:null type:None
   [junit4]   2> 2078825 INFO  (TEST-ForceLeaderTest.testLastPublishedStateIsActive-seed#[48722C3319D162D2]) [    ] o.a.s.c.c.ConnectionManager Client is connected to ZooKeeper
   [junit4]   2> 2078825 INFO  (TEST-ForceLeaderTest.testLastPublishedStateIsActive-seed#[48722C3319D162D2]) [    ] o.a.s.c.c.SolrZkClient Using default ZkACLProvider
   [junit4]   2> 2078852 INFO  (TEST-ForceLeaderTest.testLastPublishedStateIsActive-seed#[48722C3319D162D2]) [n:127.0.0.1:45084_pi_ko%2Fz    ] o.a.s.c.ZkController Added new OnReconnect listener org.apache.solr.cloud.ZkController$$Lambda$14/59653614@14b30a02
   [junit4]   2> 2078857 INFO  (TEST-ForceLeaderTest.testLastPublishedStateIsActive-seed#[48722C3319D162D2]) [n:127.0.0.1:45084_pi_ko%2Fz    ] o.a.s.c.c.ConnectionManager Waiting for client to connect to ZooKeeper
   [junit4]   2> 2078868 INFO  (zkCallback-1506-thread-1-processing-n:127.0.0.1:45084_pi_ko%2Fz) [n:127.0.0.1:45084_pi_ko%2Fz    ] o.a.s.c.c.ConnectionManager Watcher org.apache.solr.common.cloud.ConnectionManager@26213496 name:ZooKeeperConnection Watcher:127.0.0.1:47383/solr got event WatchedEvent state:SyncConnected type:None path:null path:null type:None
   [junit4]   2> 2078869 INFO  (TEST-ForceLeaderTest.testLastPublishedStateIsActive-seed#[48722C3319D162D2]) [n:127.0.0.1:45084_pi_ko%2Fz    ] o.a.s.c.c.ConnectionManager Client is connected to ZooKeeper
   [junit4]   2> 2078888 INFO  (TEST-ForceLeaderTest.testLastPublishedStateIsActive-seed#[48722C3319D162D2]) [n:127.0.0.1:45084_pi_ko%2Fz    ] o.a.s.c.c.SolrZkClient makePath: /overseer/queue
   [junit4]   2> 2078913 INFO  (TEST-ForceLeaderTest.testLastPublishedStateIsActive-seed#[48722C3319D162D2]) [n:127.0.0.1:45084_pi_ko%2Fz    ] o.a.s.c.c.SolrZkClient makePath: /overseer/collection-queue-work
   [junit4]   2> 2078921 INFO  (TEST-ForceLeaderTest.testLastPublishedStateIsActive-seed#[48722C3319D162D2]) [n:127.0.0.1:45084_pi_ko%2Fz    ] o.a.s.c.c.SolrZkClient makePath: /overseer/collection-map-running
   [junit4]   2> 2078922 INFO  (TEST-ForceLeaderTest.testLastPublishedStateIsActive-seed#[48722C3319D162D2]) [n:127.0.0.1:45084_pi_ko%2Fz    ] o.a.s.c.c.SolrZkClient makePath: /overseer/collection-map-completed
   [junit4]   2> 2078923 INFO  (TEST-ForceLeaderTest.testLastPublishedStateIsActive-seed#[48722C3319D162D2]) [n:127.0.0.1:45084_pi_ko%2Fz    ] o.a.s.c.c.SolrZkClient makePath: /overseer/collection-map-failure
   [junit4]   2> 2078929 INFO  (TEST-ForceLeaderTest.testLastPublishedStateIsActive-seed#[48722C3319D162D2]) [n:127.0.0.1:45084_pi_ko%2Fz    ] o.a.s.c.c.SolrZkClient makePath: /live_nodes
   [junit4]   2> 2078930 INFO  (TEST-ForceLeaderTest.testLastPublishedStateIsActive-seed#[48722C3319D162D2]) [n:127.0.0.1:45084_pi_ko%2Fz    ] o.a.s.c.c.SolrZkClient makePath: /aliases.json
   [junit4]   2> 2078931 INFO  (TEST-ForceLeaderTest.testLastPublishedStateIsActive-seed#[48722C3319D162D2]) [n:127.0.0.1:45084_pi_ko%2Fz    ] o.a.s.c.c.SolrZkClient makePath: /clusterstate.json
   [junit4]   2> 2078932 INFO  (TEST-ForceLeaderTest.testLastPublishedStateIsActive-seed#[48722C3319D162D2]) [n:127.0.0.1:45084_pi_ko%2Fz    ] o.a.s.c.c.SolrZkClient makePath: /security.json
   [junit4]   2> 2078932 INFO  (TEST-ForceLeaderTest.testLastPublishedStateIsActive-seed#[48722C3319D162D2]) [n:127.0.0.1:45084_pi_ko%2Fz    ] o.a.s.c.c.ZkStateReader Updating cluster state from ZooKeeper... 
   [junit4]   2> 2078938 INFO  (TEST-ForceLeaderTest.testLastPublishedStateIsActive-seed#[48722C3319D162D2]) [n:127.0.0.1:45084_pi_ko%2Fz    ] o.a.s.c.c.ZkStateReader Loaded empty cluster properties
   [junit4]   2> 2078939 INFO  (TEST-ForceLeaderTest.testLastPublishedStateIsActive-seed#[48722C3319D162D2]) [n:127.0.0.1:45084_pi_ko%2Fz    ] o.a.s.c.c.ZkStateReader Updated live nodes from ZooKeeper... (0) -> (0)
   [junit4]   2> 2078940 INFO  (TEST-ForceLeaderTest.testLastPublishedStateIsActive-seed#[48722C3319D162D2]) [n:127.0.0.1:45084_pi_ko%2Fz    ] o.a.s.c.c.SolrZkClient makePath: /overseer_elect
   [junit4]   2> 2078945 INFO  (TEST-ForceLeaderTest.testLastPublishedStateIsActive-seed#[48722C3319D162D2]) [n:127.0.0.1:45084_pi_ko%2Fz    ] o.a.s.c.c.SolrZkClient makePath: /overseer_elect/election
   [junit4]   2> 2078946 INFO  (TEST-ForceLeaderTest.testLastPublishedStateIsActive-seed#[48722C3319D162D2]) [n:127.0.0.1:45084_pi_ko%2Fz    ] o.a.s.c.Overseer Overseer (id=null) closing
   [junit4]   2> 2078946 INFO  (TEST-ForceLeaderTest.testLastPublishedStateIsActive-seed#[48722C3319D162D2]) [n:127.0.0.1:45084_pi_ko%2Fz    ] o.a.s.c.LeaderElector Joined leadership election with path: /overseer_elect/election/96571027711262724-127.0.0.1:45084_pi_ko%2Fz-n_0000000000
   [junit4]   2> 2078946 INFO  (TEST-ForceLeaderTest.testLastPublishedStateIsActive-seed#[48722C3319D162D2]) [n:127.0.0.1:45084_pi_ko%2Fz    ] o.a.s.c.OverseerElectionContext I am going to be the leader 127.0.0.1:45084_pi_ko%2Fz
   [junit4]   2> 2078946 INFO  (TEST-ForceLeaderTest.testLastPublishedStateIsActive-seed#[48722C3319D162D2]) [n:127.0.0.1:45084_pi_ko%2Fz    ] o.a.s.c.c.SolrZkClient makePath: /overseer_elect/leader
   [junit4]   2> 2078948 INFO  (TEST-ForceLeaderTest.testLastPublishedStateIsActive-seed#[48722C3319D162D2]) [n:127.0.0.1:45084_pi_ko%2Fz    ] o.a.s.c.Overseer Overseer (id=96571027711262724-127.0.0.1:45084_pi_ko%2Fz-n_0000000000) starting
   [junit4]   2> 2078953 INFO  (TEST-ForceLeaderTest.testLastPublishedStateIsActive-seed#[48722C3319D162D2]) [n:127.0.0.1:45084_pi_ko%2Fz    ] o.a.s.c.c.SolrZkClient makePath: /overseer/queue-work
   [junit4]   2> 2078962 INFO  (TEST-ForceLeaderTest.testLastPublishedStateIsActive-seed#[48722C3319D162D2]) [n:127.0.0.1:45084_pi_ko%2Fz    ] o.a.s.c.OverseerAutoReplicaFailoverThread Starting OverseerAutoReplicaFailoverThread autoReplicaFailoverWorkLoopDelay=10000 autoReplicaFailoverWaitAfterExpiration=10000 autoReplicaFailoverBadNodeExpiration=60000
   [junit4]   2> 2078963 INFO  (OverseerCollectionConfigSetProcessor-96571027711262724-127.0.0.1:45084_pi_ko%2Fz-n_0000000000) [n:127.0.0.1:45084_pi_ko%2Fz    ] o.a.s.c.OverseerTaskProcessor Process current queue of overseer operations
   [junit4]   2> 2078964 INFO  (OverseerStateUpdate-96571027711262724-127.0.0.1:45084_pi_ko%2Fz-n_0000000000) [n:127.0.0.1:45084_pi_ko%2Fz    ] o.a.s.c.Overseer Starting to work on the main queue
   [junit4]   2> 2078965 INFO  (TEST-ForceLeaderTest.testLastPublishedStateIsActive-seed#[48722C3319D162D2]) [n:127.0.0.1:45084_pi_ko%2Fz    ] o.a.s.c.ZkController Register node as live in ZooKeeper:/live_nodes/127.0.0.1:45084_pi_ko%2Fz
   [junit4]   2> 2078966 INFO  (TEST-ForceLeaderTest.testLastPublishedStateIsActive-seed#[48722C3319D162D2]) [n:127.0.0.1:45084_pi_ko%2Fz    ] o.a.s.c.c.SolrZkClient makePath: /live_nodes/127.0.0.1:45084_pi_ko%2Fz
   [junit4]   2> 2078969 INFO  (OverseerStateUpdate-96571027711262724-127.0.0.1:45084_pi_ko%2Fz-n_0000000000) [n:127.0.0.1:45084_pi_ko%2Fz    ] o.a.s.c.c.ZkStateReader Updated live nodes from ZooKeeper... (0) -> (0)
   [junit4]   2> 2078977 INFO  (zkCallback-1506-thread-1-processing-n:127.0.0.1:45084_pi_ko%2Fz) [n:127.0.0.1:45084_pi_ko%2Fz    ] o.a.s.c.c.ZkStateReader A live node change: [WatchedEvent state:SyncConnected type:NodeChildrenChanged path:/live_nodes], has occurred - updating... (live nodes size: [0])
   [junit4]   2> 2078977 INFO  (zkCallback-1506-thread-1-processing-n:127.0.0.1:45084_pi_ko%2Fz) [n:127.0.0.1:45084_pi_ko%2Fz    ] o.a.s.c.c.ZkStateReader Updated live nodes from ZooKeeper... (0) -> (1)
   [junit4]   2> 2079001 INFO  (TEST-ForceLeaderTest.testLastPublishedStateIsActive-seed#[48722C3319D162D2]) [n:127.0.0.1:45084_pi_ko%2Fz    ] o.a.s.c.CoreContainer Security conf doesn't exist. Skipping setup for authorization module.
   [junit4]   2> 2079001 INFO  (TEST-ForceLeaderTest.testLastPublishedStateIsActive-seed#[48722C3319D162D2]) [n:127.0.0.1:45084_pi_ko%2Fz    ] o.a.s.c.CoreContainer No authentication plugin used.
   [junit4]   2> 2079001 INFO  (TEST-ForceLeaderTest.testLastPublishedStateIsActive-seed#[48722C3319D162D2]) [n:127.0.0.1:45084_pi_ko%2Fz    ] o.a.s.c.CorePropertiesLocator Looking for core definitions underneath /x1/jenkins/jenkins-slave/workspace/Lucene-Solr-Tests-master/solr/build/solr-core/test/J0/temp/solr.cloud.ForceLeaderTest_48722C3319D162D2-001/control-001/cores
   [junit4]   2> 2079002 INFO  (TEST-ForceLeaderTest.testLastPublishedStateIsActive-seed#[48722C3319D162D2]) [n:127.0.0.1:45084_pi_ko%2Fz    ] o.a.s.c.CoreDescriptor Created CoreDescriptor: {name=collection1, config=solrconfig.xml, transient=false, schema=schema.xml, loadOnStartup=true, configSetProperties=configsetprops.json, collection=control_collection, coreNodeName=, dataDir=data/, shard=}
   [junit4]   2> 2079002 INFO  (TEST-ForceLeaderTest.testLastPublishedStateIsActive-seed#[48722C3319D162D2]) [n:127.0.0.1:45084_pi_ko%2Fz    ] o.a.s.c.CorePropertiesLocator Found core collection1 in /x1/jenkins/jenkins-slave/workspace/Lucene-Solr-Tests-master/solr/build/solr-core/test/J0/temp/solr.cloud.ForceLeaderTest_48722C3319D162D2-001/control-001/cores/collection1
   [junit4]   2> 2079003 INFO  (TEST-ForceLeaderTest.testLastPublishedStateIsActive-seed#[48722C3319D162D2]) [n:127.0.0.1:45084_pi_ko%2Fz    ] o.a.s.c.CorePropertiesLocator Found 1 core definitions
   [junit4]   2> 2079008 INFO  (coreLoadExecutor-4975-thread-1-processing-n:127.0.0.1:45084_pi_ko%2Fz) [n:127.0.0.1:45084_pi_ko%2Fz c:control_collection   x:collection1] o.a.s.c.ZkController publishing state=down
   [junit4]   2> 2079008 INFO  (coreLoadExecutor-4975-thread-1-processing-n:127.0.0.1:45084_pi_ko%2Fz) [n:127.0.0.1:45084_pi_ko%2Fz c:control_collection   x:collection1] o.a.s.c.ZkController numShards not found on descriptor - reading it from system property
   [junit4]   2> 2079011 INFO  (TEST-ForceLeaderTest.testLastPublishedStateIsActive-seed#[48722C3319D162D2]) [n:127.0.0.1:45084_pi_ko%2Fz    ] o.a.s.s.SolrDispatchFilter user.dir=/x1/jenkins/jenkins-slave/workspace/Lucene-Solr-Tests-master/solr/build/solr-core/test/J0
   [junit4]   2> 2079011 INFO  (TEST-ForceLeaderTest.testLastPublishedStateIsActive-seed#[48722C3319D162D2]) [n:127.0.0.1:45084_pi_ko%2Fz    ] o.a.s.s.SolrDispatchFilter SolrDispatchFilter.init() done
   [junit4]   2> 2079012 INFO  (coreLoadExecutor-4975-thread-1-processing-n:127.0.0.1:45084_pi_ko%2Fz) [n:127.0.0.1:45084_pi_ko%2Fz c:control_collection   x:collection1] o.a.s.c.ZkController Collection control_collection not visible yet, but flagging it so a watch is registered when it becomes visible
   [junit4]   2> 2079013 INFO  (OverseerStateUpdate-96571027711262724-127.0.0.1:45084_pi_ko%2Fz-n_0000000000) [n:127.0.0.1:45084_pi_ko%2Fz    ] o.a.s.c.Overseer processMessage: queueSize: 1, message = {
   [junit4]   2>   "core":"collection1",
   [junit4]   2>   "roles":null,
   [junit4]   2>   "base_url":"http://127.0.0.1:45084/pi_ko/z",
   [junit4]   2>   "node_name":"127.0.0.1:45084_pi_ko%2Fz",
   [junit4]   2>   "numShards":"1",
   [junit4]   2>   "state":"down",
   [junit4]   2>   "shard":null,
   [junit4]   2>   "collection":"control_collection",
   [junit4]   2>   "operation":"state"} current state version: 0
   [junit4]   2> 2079013 INFO  (OverseerStateUpdate-96571027711262724-127.0.0.1:45084_pi_ko%2Fz-n_0000000000) [n:127.0.0.1:45084_pi_ko%2Fz    ] o.a.s.c.o.ReplicaMutator Update state numShards=1 message={
   [junit4]   2>   "core":"collection1",
   [junit4]   2>   "roles":null,
   [junit4]   2>   "base_url":"http://127.0.0.1:45084/pi_ko/z",
   [junit4]   2>   "node_name":"127.0.0.1:45084_pi_ko%2Fz",
   [junit4]   2>   "numShards":"1",
   [junit4]   2>   "state":"down",
   [junit4]   2>   "shard":null,
   [junit4]   2>   "collection":"control_collection",
   [junit4]   2>   "operation":"state"}
   [junit4]   2> 2079013 INFO  (OverseerStateUpdate-96571027711262724-127.0.0.1:45084_pi_ko%2Fz-n_0000000000) [n:127.0.0.1:45084_pi_ko%2Fz    ] o.a.s.c.o.ClusterStateMutator building a new cName: control_collection
   [junit4]   2> 2079014 INFO  (coreLoadExecutor-4975-thread-1-processing-n:127.0.0.1:45084_pi_ko%2Fz) [n:127.0.0.1:45084_pi_ko%2Fz c:control_collection   x:collection1] o.a.s.c.c.ZkStateReader Deleting data for [control_collection]
   [junit4]   2> 2079014 INFO  (OverseerStateUpdate-96571027711262724-127.0.0.1:45084_pi_ko%2Fz-n_0000000000) [n:127.0.0.1:45084_pi_ko%2Fz    ] o.a.s.c.o.ReplicaMutator Assigning new node to shard shard=shard1
   [junit4]   2> 2079016 INFO  (zkCallback-1506-thread-1-processing-n:127.0.0.1:45084_pi_ko%2Fz) [n:127.0.0.1:45084_pi_ko%2Fz    ] o.a.s.c.c.ZkStateReader A cluster state change: [WatchedEvent state:SyncConnected type:NodeDataChanged path:/clusterstate.json], has occurred - updating... (live nodes size: [1])
   [junit4]   2> 2079017 INFO  (coreLoadExecutor-4975-thread-1-processing-n:127.0.0.1:45084_pi_ko%2Fz) [n:127.0.0.1:45084_pi_ko%2Fz c:control_collection   x:collection1] o.a.s.c.ZkController look for our core node name
   [junit4]   2> 2079017 INFO  (coreLoadExecutor-4975-thread-1-processing-n:127.0.0.1:45084_pi_ko%2Fz) [n:127.0.0.1:45084_pi_ko%2Fz c:control_collection   x:collection1] o.a.s.c.ZkController waiting to find shard id in clusterstate for collection1
   [junit4]   2> 2079017 INFO  (coreLoadExecutor-4975-thread-1-processing-n:127.0.0.1:45084_pi_ko%2Fz) [n:127.0.0.1:45084_pi_ko%2Fz c:control_collection   x:collection1] o.a.s.c.ZkController Check for collection zkNode:control_collection
   [junit4]   2> 2079018 INFO  (coreLoadExecutor-4975-thread-1-processing-n:127.0.0.1:45084_pi_ko%2Fz) [n:127.0.0.1:45084_pi_ko%2Fz c:control_collection   x:collection1] o.a.s.c.ZkController Collection zkNode exists
   [junit4]   2> 2079018 INFO  (coreLoadExecutor-4975-thread-1-processing-n:127.0.0.1:45084_pi_ko%2Fz) [n:127.0.0.1:45084_pi_ko%2Fz c:control_collection   x:collection1] o.a.s.c.c.ZkStateReader Load collection config from: [/collections/control_collection]
   [junit4]   2> 2079019 INFO  (coreLoadExecutor-4975-thread-1-processing-n:127.0.0.1:45084_pi_ko%2Fz) [n:127.0.0.1:45084_pi_ko%2Fz c:control_collection   x:collection1] o.a.s.c.c.ZkStateReader path=[/collections/control_collection] [configName]=[conf1] specified config exists in ZooKeeper
   [junit4]   2> 2079019 INFO  (coreLoadExecutor-4975-thread-1-processing-n:127.0.0.1:45084_pi_ko%2Fz) [n:127.0.0.1:45084_pi_ko%2Fz c:control_collection   x:collection1] o.a.s.c.SolrResourceLoader new SolrResourceLoader for directory: '/x1/jenkins/jenkins-slave/workspace/Lucene-Solr-Tests-master/solr/build/solr-core/test/J0/temp/solr.cloud.ForceLeaderTest_48722C3319D162D2-001/control-001/cores/collection1'
   [junit4]   2> 2079019 INFO  (coreLoadExecutor-4975-thread-1-processing-n:127.0.0.1:45084_pi_ko%2Fz) [n:127.0.0.1:45084_pi_ko%2Fz c:control_collection   x:collection1] o.a.s.c.SolrResourceLoader JNDI not configured for solr (NoInitialContextEx)
   [junit4]   2> 2079019 INFO  (coreLoadExecutor-4975-thread-1-processing-n:127.0.0.1:45084_pi_ko%2Fz) [n:127.0.0.1:45084_pi_ko%2Fz c:control_collection   x:collection1] o.a.s.c.SolrResourceLoader solr home defaulted to 'solr/' (could not find system property or JNDI)
   [junit4]   2> 2079022 INFO  (coreLoadExecutor-4975-thread-1-processing-n:127.0.0.1:45084_pi_ko%2Fz) [n:127.0.0.1:45084_pi_ko%2Fz c:control_collection   x:collection1] o.a.s.c.Config loaded config solrconfig.xml with version 0 
   [junit4]   2> 2079026 INFO  (coreLoadExecutor-4975-thread-1-processing-n:127.0.0.1:45084_pi_ko%2Fz) [n:127.0.0.1:45084_pi_ko%2Fz c:control_collection   x:collection1] o.a.s.c.SolrConfig current version of requestparams : -1
   [junit4]   2> 2079029 WARN  (coreLoadExecutor-4975-thread-1-processing-n:127.0.0.1:45084_pi_ko%2Fz) [n:127.0.0.1:45084_pi_ko%2Fz c:control_collection   x:collection1] o.a.s.c.Config Beginning with Solr 5.5, <mergePolicy> is deprecated, use <mergePolicyFactory> instead.
   [junit4]   2> 2079030 INFO  (coreLoadExecutor-4975-thread-1-processing-n:127.0.0.1:45084_pi_ko%2Fz) [n:127.0.0.1:45084_pi_ko%2Fz c:control_collection   x:collection1] o.a.s.c.SolrConfig Using Lucene MatchVersion: 7.0.0
   [junit4]   2> 2079039 INFO  (coreLoadExecutor-4975-thread-1-processing-n:127.0.0.1:45084_pi_ko%2Fz) [n:127.0.0.1:45084_pi_ko%2Fz c:control_collection   x:collection1] o.a.s.c.SolrConfig Loaded SolrConfig: solrconfig.xml
   [junit4]   2> 2079060 INFO  (coreLoadExecutor-4975-thread-1-processing-n:127.0.0.1:45084_pi_ko%2Fz) [n:127.0.0.1:45084_pi_ko%2Fz c:control_collection   x:collection1] o.a.s.s.IndexSchema [collection1] Schema name=test
   [junit4]   2> 2079407 INFO  (coreLoadExecutor-4975-thread-1-processing-n:127.0.0.1:45084_pi_ko%2Fz) [n:127.0.0.1:45084_pi_ko%2Fz c:control_collection   x:collection1] o.a.s.s.OpenExchangeRatesOrgProvider Initialized with rates=open-exchange-rates.json, refreshInterval=1440.
   [junit4]   2> 2079433 INFO  (coreLoadExecutor-4975-thread-1-processing-n:127.0.0.1:45084_pi_ko%2Fz) [n:127.0.0.1:45084_pi_ko%2Fz c:control_collection   x:collection1] o.a.s.s.IndexSchema default search field in schema is text
   [junit4]   2> 2079434 INFO  (coreLoadExecutor-4975-thread-1-processing-n:127.0.0.1:45084_pi_ko%2Fz) [n:127.0.0.1:45084_pi_ko%2Fz c:control_collection   x:collection1] o.a.s.s.IndexSchema unique key field: id
   [junit4]   2> 2079447 INFO  (coreLoadExecutor-4975-thread-1-processing-n:127.0.0.1:45084_pi_ko%2Fz) [n:127.0.0.1:45084_pi_ko%2Fz c:control_collection   x:collection1] o.a.s.s.FileExchangeRateProvider Reloading exchange rates from file currency.xml
   [junit4]   2> 2079457 INFO  (coreLoadExecutor-4975-thread-1-processing-n:127.0.0.1:45084_pi_ko%2Fz) [n:127.0.0.1:45084_pi_ko%2Fz c:control_collection   x:collection1] o.a.s.s.FileExchangeRateProvider Reloading exchange rates from file currency.xml
   [junit4]   2> 2079459 INFO  (coreLoadExecutor-4975-thread-1-processing-n:127.0.0.1:45084_pi_ko%2Fz) [n:127.0.0.1:45084_pi_ko%2Fz c:control_collection   x:collection1] o.a.s.s.OpenExchangeRatesOrgProvider Reloading exchange rates from open-exchange-rates.json
   [junit4]   2> 2079460 INFO  (coreLoadExecutor-4975-thread-1-processing-n:127.0.0.1:45084_pi_ko%2Fz) [n:127.0.0.1:45084_pi_ko%2Fz c:control_collection   x:collection1] o.a.s.s.OpenExchangeRatesOrgProvider Reloading exchange rates from open-exchange-rates.json
   [junit4]   2> 2079461 INFO  (coreLoadExecutor-4975-thread-1-processing-n:127.0.0.1:45084_pi_ko%2Fz) [n:127.0.0.1:45084_pi_ko%2Fz c:control_collection   x:collection1] o.a.s.c.ConfigSetProperties Did not find ConfigSet properties, assuming default properties: Can't find resource 'configsetprops.json' in classpath or '/configs/conf1', cwd=/x1/jenkins/jenkins-slave/workspace/Lucene-Solr-Tests-master/solr/build/solr-core/test/J0
   [junit4]   2> 2079461 INFO  (coreLoadExecutor-4975-thread-1-processing-n:127.0.0.1:45084_pi_ko%2Fz) [n:127.0.0.1:45084_pi_ko%2Fz c:control_collection   x:collection1] o.a.s.c.CoreContainer Creating SolrCore 'collection1' using configuration from collection control_collection
   [junit4]   2> 2079461 INFO  (coreLoadExecutor-4975-thread-1-processing-n:127.0.0.1:45084_pi_ko%2Fz) [n:127.0.0.1:45084_pi_ko%2Fz c:control_collection s:shard1 r:core_node1 x:collection1] o.a.s.c.SolrCore org.apache.solr.core.MockDirectoryFactory
   [junit4]   2> 2079462 INFO  (coreLoadExecutor-4975-thread-1-processing-n:127.0.0.1:45084_pi_ko%2Fz) [n:127.0.0.1:45084_pi_ko%2Fz c:control_collection s:shard1 r:core_node1 x:collection1] o.a.s.c.SolrCore [[collection1] ] Opening new SolrCore at [/x1/jenkins/jenkins-slave/workspace/Lucene-Solr-Tests-master/solr/build/solr-core/test/J0/temp/solr.cloud.ForceLeaderTest_48722C3319D162D2-001/control-001/cores/collection1], dataDir=[/x1/jenkins/jenkins-slave/workspace/Lucene-Solr-Tests-master/solr/build/solr-core/test/J0/temp/solr.cloud.ForceLeaderTest_48722C3319D162D2-001/control-001/cores/collection1/data/]
   [junit4]   2> 2079462 INFO  (coreLoadExecutor-4975-thread-1-processing-n:127.0.0.1:45084_pi_ko%2Fz) [n:127.0.0.1:45084_pi_ko%2Fz c:control_collection s:shard1 r:core_node1 x:collection1] o.a.s.c.JmxMonitoredMap JMX monitoring is enabled. Adding Solr mbeans to JMX Server: com.sun.jmx.mbeanserver.JmxMBeanServer@62ba2de4
   [junit4]   2> 2079463 INFO  (coreLoadExecutor-4975-thread-1-processing-n:127.0.0.1:45084_pi_ko%2Fz) [n:127.0.0.1:45084_pi_ko%2Fz c:control_collection s:shard1 r:core_node1 x:collection1] o.a.s.c.CachingDirectoryFactory return new directory for /x1/jenkins/jenkins-slave/workspace/Lucene-Solr-Tests-master/solr/build/solr-core/test/J0/temp/solr.cloud.ForceLeaderTest_48722C3319D162D2-001/control-001/cores/collection1/data/snapshot_metadata
   [junit4]   2> 2079463 INFO  (coreLoadExecutor-4975-thread-1-processing-n:127.0.0.1:45084_pi_ko%2Fz) [n:127.0.0.1:45084_pi_ko%2Fz c:control_collection s:shard1 r:core_node1 x:collection1] o.a.s.c.s.SolrSnapshotMetaDataManager Loading from snapshot metadata file...
   [junit4]   2> 2079472 INFO  (coreLoadExecutor-4975-thread-1-processing-n:127.0.0.1:45084_pi_ko%2Fz) [n:127.0.0.1:45084_pi_ko%2Fz c:control_collection s:shard1 r:core_node1 x:collection1] o.a.s.c.CachingDirectoryFactory return new directory for /x1/jenkins/jenkins-slave/workspace/Lucene-Solr-Tests-master/solr/build/solr-core/test/J0/temp/solr.cloud.ForceLeaderTest_48722C3319D162D2-001/control-001/cores/collection1/data
   [junit4]   2> 2079472 INFO  (coreLoadExecutor-4975-thread-1-processing-n:127.0.0.1:45084_pi_ko%2Fz) [n:127.0.0.1:45084_pi_ko%2Fz c:control_collection s:shard1 r:core_node1 x:collection1] o.a.s.c.SolrCore New index directory detected: old=null new=/x1/jenkins/jenkins-slave/workspace/Lucene-Solr-Tests-master/solr/build/solr-core/test/J0/temp/solr.cloud.ForceLeaderTest_48722C3319D162D2-001/control-001/cores/collection1/data/index/
   [junit4]   2> 2079473 WARN  (coreLoadExecutor-4975-thread-1-processing-n:127.0.0.1:45084_pi_ko%2Fz) [n:127.0.0.1:45084_pi_ko%2Fz c:control_collection s:shard1 r:core_node1 x:collection1] o.a.s.c.SolrCore [collection1] Solr index directory '/x1/jenkins/jenkins-slave/workspace/Lucene-Solr-Tests-master/solr/build/solr-core/test/J0/temp/solr.cloud.ForceLeaderTest_48722C3319D162D2-001/control-001/cores/collection1/data/index' doesn't exist. Creating new index...
   [junit4]   2> 2079473 INFO  (coreLoadExecutor-4975-thread-1-processing-n:127.0.0.1:45084_pi_ko%2Fz) [n:127.0.0.1:45084_pi_ko%2Fz c:control_collection s:shard1 r:core_node1 x:collection1] o.a.s.c.CachingDirectoryFactory return new directory for /x1/jenkins/jenkins-slave/workspace/Lucene-Solr-Tests-master/solr/build/solr-core/test/J0/temp/solr.cloud.ForceLeaderTest_48722C3319D162D2-001/control-001/cores/collection1/data/index
   [junit4]   2> 2079473 INFO  (coreLoadExecutor-4975-thread-1-processing-n:127.0.0.1:45084_pi_ko%2Fz) [n:127.0.0.1:45084_pi_ko%2Fz c:control_collection s:shard1 r:core_node1 x:collection1] o.a.s.u.RandomMergePolicy RandomMergePolicy wrapping class org.apache.lucene.index.LogByteSizeMergePolicy: [LogByteSizeMergePolicy: minMergeSize=1677721, mergeFactor=38, maxMergeSize=2147483648, maxMergeSizeForForcedMerge=9223372036854775807, calibrateSizeByDeletes=false, maxMergeDocs=2147483647, maxCFSSegmentSizeMB=8.796093022207999E12, noCFSRatio=1.0]
   [junit4]   2> 2079476 INFO  (coreLoadExecutor-4975-thread-1-processing-n:127.0.0.1:45084_pi_ko%2Fz) [n:127.0.0.1:45084_pi_ko%2Fz c:control_collection s:shard1 r:core_node1 x:collection1] o.a.s.c.SolrDeletionPolicy SolrDeletionPolicy.onCommit: commits: num=1
   [junit4]   2> 	commit{dir=MockDirectoryWrapper(RAMDirectory@3d522a85 lockFactory=org.apache.lucene.store.SingleInstanceLockFactory@7f9fa58),segFN=segments_1,generation=1}
   [junit4]   2> 2079476 INFO  (coreLoadExecutor-4975-thread-1-processing-n:127.0.0.1:45084_pi_ko%2Fz) [n:127.0.0.1:45084_pi_ko%2Fz c:control_collection s:shard1 r:core_node1 x:collection1] o.a.s.c.SolrDeletionPolicy newest commit generation = 1
   [junit4]   2> 2079483 INFO  (coreLoadExecutor-4975-thread-1-processing-n:127.0.0.1:45084_pi_ko%2Fz) [n:127.0.0.1:45084_pi_ko%2Fz c:control_collection s:shard1 r:core_node1 x:collection1] o.a.s.u.p.UpdateRequestProcessorChain creating updateRequestProcessorChain "nodistrib"
   [junit4]   2> 2079483 INFO  (coreLoadExecutor-4975-thread-1-processing-n:127.0.0.1:45084_pi_ko%2Fz) [n:127.0.0.1:45084_pi_ko%2Fz c:control_collection s:shard1 r:core_node1 x:collection1] o.a.s.u.p.UpdateRequestProcessorChain creating updateRequestProcessorChain "dedupe"
   [junit4]   2> 2079483 INFO  (coreLoadExecutor-4975-thread-1-processing-n:127.0.0.1:45084_pi_ko%2Fz) [n:127.0.0.1:45084_pi_ko%2Fz c:control_collection s:shard1 r:core_node1 x:collection1] o.a.s.u.p.UpdateRequestProcessorChain inserting DistributedUpdateProcessorFactory into updateRequestProcessorChain "dedupe"
   [junit4]   2> 2079483 INFO  (coreLoadExecutor-4975-thread-1-processing-n:127.0.0.1:45084_pi_ko%2Fz) [n:127.0.0.1:45084_pi_ko%2Fz c:control_collection s:shard1 r:core_node1 x:collection1] o.a.s.u.p.UpdateRequestProcessorChain creating updateRequestProcessorChain "stored_sig"
   [junit4]   2> 2079483 INFO  (coreLoadExecutor-4975-thread-1-processing-n:127.0.0.1:45084_pi_ko%2Fz) [n:127.0.0.1:45084_pi_ko%2Fz c:control_collection s:shard1 r:core_node1 x:collection1] o.a.s.u.p.UpdateRequestProcessorChain inserting DistributedUpdateProcessorFactory into updateRequestProcessorChain "stored_sig"
   [junit4]   2> 2079483 INFO  (coreLoadExecutor-4975-thread-1-processing-n:127.0.0.1:45084_pi_ko%2Fz) [n:127.0.0.1:45084_pi_ko%2Fz c:control_collection s:shard1 r:core_node1 x:collection1] o.a.s.u.p.UpdateRequestProcessorChain creating updateRequestProcessorChain "distrib-dup-test-chain-explicit"
   [junit4]   2> 2079484 INFO  (coreLoadExecutor-4975-thread-1-processing-n:127.0.0.1:45084_pi_ko%2Fz) [n:127.0.0.1:45084_pi_ko%2Fz c:control_collection s:shard1 r:core_node1 x:collection1] o.a.s.u.p.UpdateRequestProcessorChain creating updateRequestProcessorChain "distrib-dup-test-chain-implicit"
   [junit4]   2> 2079484 INFO  (coreLoadExecutor-4975-thread-1-processing-n:127.0.0.1:45084_pi_ko%2Fz) [n:127.0.0.1:45084_pi_ko%2Fz c:control_collection s:shard1 r:core_node1 x:collection1] o.a.s.u.p.UpdateRequestProcessorChain inserting DistributedUpdateProcessorFactory into updateRequestProcessorChain "distrib-dup-test-chain-implicit"
   [junit4]   2> 2079484 INFO  (coreLoadExecutor-4975-thread-1-processing-n:127.0.0.1:45084_pi_ko%2Fz) [n:127.0.0.1:45084_pi_ko%2Fz c:control_collection s:shard1 r:core_node1 x:collection1] o.a.s.c.SolrCore no updateRequestProcessorChain defined as default, creating implicit default
   [junit4]   2> 2079484 WARN  (coreLoadExecutor-4975-thread-1-processing-n:127.0.0.1:45084_pi_ko%2Fz) [n:127.0.0.1:45084_pi_ko%2Fz c:control_collection s:shard1 r:core_node1 x:collection1] o.a.s.c.RequestHandlers INVALID paramSet a in requestHandler {type = requestHandler,name = /dump,class = DumpRequestHandler,args = {defaults={a=A,b=B}}}
   [junit4]   2> 2079486 INFO  (coreLoadExecutor-4975-thread-1-processing-n:127.0.0.1:45084_pi_ko%2Fz) [n:127.0.0.1:45084_pi_ko%2Fz c:control_collection s:shard1 r:core_node1 x:collection1] o.a.s.h.l.XMLLoader xsltCacheLifetimeSeconds=60
   [junit4]   2> 2079486 INFO  (coreLoadExecutor-4975-thread-1-processing-n:127.0.0.1:45084_pi_ko%2Fz) [n:127.0.0.1:45084_pi_ko%2Fz c:control_collection s:shard1 r:core_node1 x:collection1] o.a.s.h.l.XMLLoader xsltCacheLifetimeSeconds=60
   [junit4]   2> 2079487 INFO  (coreLoadExecutor-4975-thread-1-processing-n:127.0.0.1:45084_pi_ko%2Fz) [n:127.0.0.1:45084_pi_ko%2Fz c:control_collection s:shard1 r:core_node1 x:collection1] o.a.s.h.l.XMLLoader xsltCacheLifetimeSeconds=60
   [junit4]   2> 2079492 INFO  (OldIndexDirectoryCleanupThreadForCore-collection1) [n:127.0.0.1:45084_pi_ko%2Fz c:control_collection s:shard1 r:core_node1 x:collection1] o.a.s.c.SolrCore Looking for old index directories to cleanup for core collection1 in /x1/jenkins/jenkins-slave/workspace/Lucene-Solr-Tests-master/solr/build/solr-core/test/J0/temp/solr.cloud.ForceLeaderTest_48722C3319D162D2-001/control-001/cores/collection1/data/
   [junit4]   2> 2079492 WARN  (OldIndexDirectoryCleanupThreadForCore-collection1) [n:127.0.0.1:45084_pi_ko%2Fz c:control_collection s:shard1 r:core_node1 x:collection1] o.a.s.c.DirectoryFactory /x1/jenkins/jenkins-slave/workspace/Lucene-Solr-Tests-master/solr/build/solr-core/test/J0/temp/solr.cloud.ForceLeaderTest_48722C3319D162D2-001/control-001/cores/collection1/data/ does not point to a valid data directory; skipping clean-up of old index directories.
   [junit4]   2> 2079493 INFO  (coreLoadExecutor-4975-thread-1-processing-n:127.0.0.1:45084_pi_ko%2Fz) [n:127.0.0.1:45084_pi_ko%2Fz c:control_collection s:shard1 r:core_node1 x:collection1] o.a.s.h.l.XMLLoader xsltCacheLifetimeSeconds=60
   [junit4]   2> 2079505 INFO  (coreLoadExecutor-4975-thread-1-processing-n:127.0.0.1:45084_pi_ko%2Fz) [n:127.0.0.1:45084_pi_ko%2Fz c:control_collection s:shard1 r:core_node1 x:collection1] o.a.s.c.RequestHandlers Registered paths: /admin/mbeans,standard,/update/json/docs,/admin/luke,/export,/get,/admin/properties,/update/json,/admin/threads,/dump,/update/csv,/sql,/graph,/admin/segments,/admin/system,/replication,/config,/stream,/schema,/admin/plugins,/admin/logging,/admin/ping,/update,/admin/file,/terms
   [junit4]   2> 2079505 INFO  (coreLoadExecutor-4975-thread-1-processing-n:127.0.0.1:45084_pi_ko%2Fz) [n:127.0.0.1:45084_pi_ko%2Fz c:control_collection s:shard1 r:core_node1 x:collection1] o.a.s.c.SolrCore Using default statsCache cache: org.apache.solr.search.stats.LocalStatsCache
   [junit4]   2> 2079509 INFO  (coreLoadExecutor-4975-thread-1-processing-n:127.0.0.1:45084_pi_ko%2Fz) [n:127.0.0.1:45084_pi_ko%2Fz c:control_collection s:shard1 r:core_node1 x:collection1] o.a.s.u.UpdateHandler Using UpdateLog implementation: org.apache.solr.update.UpdateLog
   [junit4]   2> 2079509 INFO  (coreLoadExecutor-4975-thread-1-processing-n:127.0.0.1:45084_pi_ko%2Fz) [n:127.0.0.1:45084_pi_ko%2Fz c:control_collection s:shard1 r:core_node1 x:collection1] o.a.s.u.UpdateLog Initializing UpdateLog: dataDir= defaultSyncLevel=FLUSH numRecordsToKeep=100 maxNumLogsToKeep=10 numVersionBuckets=65536
   [junit4]   2> 2079510 INFO  (coreLoadExecutor-4975-thread-1-processing-n:127.0.0.1:45084_pi_ko%2Fz) [n:127.0.0.1:45084_pi_ko%2Fz c:control_collection s:shard1 r:core_node1 x:collection1] o.a.s.u.CommitTracker Hard AutoCommit: disabled
   [junit4]   2> 2079510 INFO  (coreLoadExecutor-4975-thread-1-processing-n:127.0.0.1:45084_pi_ko%2Fz) [n:127.0.0.1:45084_pi_ko%2Fz c:control_collection s:shard1 r:core_node1 x:collection1] o.a.s.u.CommitTracker Soft AutoCommit: disabled
   [junit4]   2> 2079510 INFO  (coreLoadExecutor-4975-thread-1-processing-n:127.0.0.1:45084_pi_ko%2Fz) [n:127.0.0.1:45084_pi_ko%2Fz c:control_collection s:shard1 r:core_node1 x:collection1] o.a.s.u.RandomMergePolicy RandomMergePolicy wrapping class org.apache.lucene.index.TieredMergePolicy: [TieredMergePolicy: maxMergeAtOnce=20, maxMergeAtOnceExplicit=26, maxMergedSegmentMB=93.0634765625, floorSegmentMB=0.8466796875, forceMergeDeletesPctAllowed=24.42051250692553, segmentsPerTier=26.0, maxCFSSegmentSizeMB=8.796093022207999E12, noCFSRatio=1.0
   [junit4]   2> 2079532 INFO  (coreLoadExecutor-4975-thread-1-processing-n:127.0.0.1:45084_pi_ko%2Fz) [n:127.0.0.1:45084_pi_ko%2Fz c:control_collection s:shard1 r:core_node1 x:collection1] o.a.s.c.SolrDeletionPolicy SolrDeletionPolicy.onInit: commits: num=1
   [junit4]   2> 	commit{dir=MockDirectoryWrapper(RAMDirectory@3d522a85 lockFactory=org.apache.lucene.store.SingleInstanceLockFactory@7f9fa58),segFN=segments_1,generation=1}
   [junit4]   2> 2079532 INFO  (coreLoadExecutor-4975-thread-1-processing-n:127.0.0.1:45084_pi_ko%2Fz) [n:127.0.0.1:45084_pi_ko%2Fz c:control_collection s:shard1 r:core_node1 x:collection1] o.a.s.c.SolrDeletionPolicy newest commit generation = 1
   [junit4]   2> 2079532 INFO  (coreLoadExecutor-4975-thread-1-processing-n:127.0.0.1:45084_pi_ko%2Fz) [n:127.0.0.1:45084_pi_ko%2Fz c:control_collection s:shard1 r:core_node1 x:collection1] o.a.s.s.SolrIndexSearcher Opening [Searcher@4a8e07cf[collection1] main]
   [junit4]   2> 2079532 INFO  (coreLoadExecutor-4975-thread-1-processing-n:127.0.0.1:45084_pi_ko%2Fz) [n:127.0.0.1:45084_pi_ko%2Fz c:control_collection s:shard1 r:core_node1 x:collection1] o.a.s.c.c.ZkStateReader Load collection config from: [/collections/control_collection]
   [junit4]   2> 2079533 INFO  (coreLoadExecutor-4975-thread-1-processing-n:127.0.0.1:45084_pi_ko%2Fz) [n:127.0.0.1:45084_pi_ko%2Fz c:control_collection s:shard1 r:core_node1 x:collection1] o.a.s.c.c.ZkStateReader path=[/collections/control_collection] [configName]=[conf1] specified config exists in ZooKeeper
   [junit4]   2> 2079533 INFO  (coreLoadExecutor-4975-thread-1-processing-n:127.0.0.1:45084_pi_ko%2Fz) [n:127.0.0.1:45084_pi_ko%2Fz c:control_collection s:shard1 r:core_node1 x:collection1] o.a.s.r.ManagedResourceStorage Setting up ZooKeeper-based storage for the RestManager with znodeBase: /configs/conf1
   [junit4]   2> 2079534 INFO  (coreLoadExecutor-4975-thread-1-processing-n:127.0.0.1:45084_pi_ko%2Fz) [n:127.0.0.1:45084_pi_ko%2Fz c:control_collection s:shard1 r:core_node1 x:collection1] o.a.s.r.ManagedResourceStorage Configured ZooKeeperStorageIO with znodeBase: /configs/conf1
   [junit4]   2> 2079534 INFO  (coreLoadExecutor-4975-thread-1-processing-n:127.0.0.1:45084_pi_ko%2Fz) [n:127.0.0.1:45084_pi_ko%2Fz c:control_collection s:shard1 r:core_node1 x:collection1] o.a.s.r.RestManager Initializing RestManager with initArgs: {}
   [junit4]   2> 2079534 INFO  (coreLoadExecutor-4975-thread-1-processing-n:127.0.0.1:45084_pi_ko%2Fz) [n:127.0.0.1:45084_pi_ko%2Fz c:control_collection s:shard1 r:core_node1 x:collection1] o.a.s.r.ManagedResourceStorage Reading _rest_managed.json using ZooKeeperStorageIO:path=/configs/conf1
   [junit4]   2> 2079534 INFO  (coreLoadExecutor-4975-thread-1-processing-n:127.0.0.1:45084_pi_ko%2Fz) [n:127.0.0.1:45084_pi_ko%2Fz c:control_collection s:shard1 r:core_node1 x:collection1] o.a.s.r.ManagedResourceStorage No data found for znode /configs/conf1/_rest_managed.json
   [junit4]   2> 2079534 INFO  (coreLoadExecutor-4975-thread-1-processing-n:127.0.0.1:45084_pi_ko%2Fz) [n:127.0.0.1:45084_pi_ko%2Fz c:control_collection s:shard1 r:core_node1 x:collection1] o.a.s.r.ManagedResourceStorage Loaded null at path _rest_managed.json using ZooKeeperStorageIO:path=/configs/conf1
   [junit4]   2> 2079534 INFO  (coreLoadExecutor-4975-thread-1-processing-n:127.0.0.1:45084_pi_ko%2Fz) [n:127.0.0.1:45084_pi_ko%2Fz c:control_collection s:shard1 r:core_node1 x:collection1] o.a.s.r.RestManager Initializing 0 registered ManagedResources
   [junit4]   2> 2079534 INFO  (coreLoadExecutor-4975-thread-1-processing-n:127.0.0.1:45084_pi_ko%2Fz) [n:127.0.0.1:45084_pi_ko%2Fz c:control_collection s:shard1 r:core_node1 x:collection1] o.a.s.h.ReplicationHandler Commits will be reserved for  10000
   [junit4]   2> 2079535 INFO  (searcherExecutor-4976-thread-1-processing-n:127.0.0.1:45084_pi_ko%2Fz x:collection1 s:shard1 c:control_collection r:core_node1) [n:127.0.0.1:45084_pi_ko%2Fz c:control_collection s:shard1 r:core_node1 x:collection1] o.a.s.c.SolrCore [collection1] Registered new searcher Searcher@4a8e07cf[collection1] main{ExitableDirectoryReader(UninvertingDirectoryReader())}
   [junit4]   2> 2079536 INFO  (coreLoadExecutor-4975-thread-1-processing-n:127.0.0.1:45084_pi_ko%2Fz) [n:127.0.0.1:45084_pi_ko%2Fz c:control_collection s:shard1 r:core_node1 x:collection1] o.a.s.u.UpdateLog Looking up max value of version field to seed version buckets
   [junit4]   2> 2079536 INFO  (coreLoadExecutor-4975-thread-1-processing-n:127.0.0.1:45084_pi_ko%2Fz) [n:127.0.0.1:45084_pi_ko%2Fz c:control_collection s:shard1 r:core_node1 x:collection1] o.a.s.u.VersionInfo Refreshing highest value of _version_ for 65536 version buckets from index
   [junit4]   2> 2079536 INFO  (coreLoadExecutor-4975-thread-1-processing-n:127.0.0.1:45084_pi_ko%2Fz) [n:127.0.0.1:45084_pi_ko%2Fz c:control_collection s:shard1 r:core_node1 x:collection1] o.a.s.u.VersionInfo No terms found for _version_, cannot seed version bucket highest value from index
   [junit4]   2> 2079536 INFO  (coreLoadExecutor-4975-thread-1-processing-n:127.0.0.1:45084_pi_ko%2Fz) [n:127.0.0.1:45084_pi_ko%2Fz c:control_collection s:shard1 r:core_node1 x:collection1] o.a.s.u.UpdateLog Could not find max version in index or recent updates, using new clock 1545136444774809600
   [junit4]   2> 2079538 INFO  (coreLoadExecutor-4975-thread-1-processing-n:127.0.0.1:45084_pi_ko%2Fz) [n:127.0.0.1:45084_pi_ko%2Fz c:control_collection s:shard1 r:core_node1 x:collection1] o.a.s.u.UpdateLog Took 1.0ms to seed version buckets with highest version 1545136444774809600
   [junit4]   2> 2079538 INFO  (coreLoadExecutor-4975-thread-1-processing-n:127.0.0.1:45084_pi_ko%2Fz) [n:127.0.0.1:45084_pi_ko%2Fz c:control_collection s:shard1 r:core_node1 x:collection1] o.a.s.c.ZkController watch zkdir /configs/conf1
   [junit4]   2> 2079538 INFO  (coreLoadExecutor-4975-thread-1-processing-n:127.0.0.1:45084_pi_ko%2Fz) [n:127.0.0.1:45084_pi_ko%2Fz c:control_collection s:shard1 r:core_node1 x:collection1] o.a.s.c.CoreContainer registering core: collection1
   [junit4]   2> 2079539 INFO  (coreZkRegister-4968-thread-1-processing-n:127.0.0.1:45084_pi_ko%2Fz x:collection1 s:shard1 c:control_collection r:core_node1) [n:127.0.0.1:45084_pi_ko%2Fz c:control_collection s:shard1 r:core_node1 x:collection1] o.a.s.c.ZkController Register replica - core:collection1 address:http://127.0.0.1:45084/pi_ko/z collection:control_collection shard:shard1
   [junit4]   2> 2079540 INFO  (coreZkRegister-4968-thread-1-processing-n:127.0.0.1:45084_pi_ko%2Fz x:collection1 s:shard1 c:control_collection r:core_node1) [n:127.0.0.1:45084_pi_ko%2Fz c:control_collection s:shard1 r:core_node1 x:collection1] o.a.s.c.c.SolrZkClient makePath: /collections/control_collection/leader_elect/shard1/election
   [junit4]   2> 2079543 INFO  (coreZkRegister-4968-thread-1-processing-n:127.0.0.1:45084_pi_ko%2Fz x:collection1 s:shard1 c:control_collection r:core_node1) [n:127.0.0.1:45084_pi_ko%2Fz c:control_collection s:shard1 r:core_node1 x:collection1] o.a.s.c.LeaderElector Joined leadership election with path: /collections/control_collection/leader_elect/shard1/election/96571027711262724-core_node1-n_0000000000
   [junit4]   2> 2079544 INFO  (coreZkRegister-4968-thread-1-processing-n:127.0.0.1:45084_pi_ko%2Fz x:collection1 s:shard1 c:control_collection r:core_node1) [n:127.0.0.1:45084_pi_ko%2Fz c:control_collection s:shard1 r:core_node1 x:collection1] o.a.s.c.ShardLeaderElectionContext Running the leader process for shard=shard1 and weAreReplacement=false and leaderVoteWait=10000
   [junit4]   2> 2079545 INFO  (coreZkRegister-4968-thread-1-processing-n:127.0.0.1:45084_pi_ko%2Fz x:collection1 s:shard1 c:control_collection r:core_node1) [n:127.0.0.1:45084_pi_ko%2Fz c:control_collection s:shard1 r:core_node1 x:collection1] o.a.s.c.ShardLeaderElectionContext Enough replicas found to continue.
   [junit4]   2> 2079545 INFO  (coreZkRegister-4968-thread-1-processing-n:127.0.0.1:45084_pi_ko%2Fz x:collection1 s:shard1 c:control_collection r:core_node1) [n:127.0.0.1:45084_pi_ko%2Fz c:control_collection s:shard1 r:core_node1 x:collection1] o.a.s.c.ShardLeaderElectionContext I may be the new leader - try and sync
   [junit4]   2> 2079545 INFO  (coreZkRegister-4968-thread-1-processing-n:127.0.0.1:45084_pi_ko%2Fz x:collection1 s:shard1 c:control_collection r:core_node1) [n:127.0.0.1:45084_pi_ko%2Fz c:control_collection s:shard1 r:core_node1 x:collection1] o.a.s.c.SyncStrategy Sync replicas to http://127.0.0.1:45084/pi_ko/z/collection1/
   [junit4]   2> 2079545 INFO  (coreZkRegister-4968-thread-1-processing-n:127.0.0.1:45084_pi_ko%2Fz x:collection1 s:shard1 c:control_collection r:core_node1) [n:127.0.0.1:45084_pi_ko%2Fz c:control_collection s:shard1 r:core_node1 x:collection1] o.a.s.c.SyncStrategy Sync Success - now sync replicas to me
   [junit4]   2> 2079545 INFO  (coreZkRegister-4968-thread-1-processing-n:127.0.0.1:45084_pi_ko%2Fz x:collection1 s:shard1 c:control_collection r:core_node1) [n:127.0.0.1:45084_pi_ko%2Fz c:control_collection s:shard1 r:core_node1 x:collection1] o.a.s.c.SyncStrategy http://127.0.0.1:45084/pi_ko/z/collection1/ has no replicas
   [junit4]   2> 2079546 INFO  (coreZkRegister-4968-thread-1-processing-n:127.0.0.1:45084_pi_ko%2Fz x:collection1 s:shard1 c:control_collection r:core_node1) [n:127.0.0.1:45084_pi_ko%2Fz c:control_collection s:shard1 r:core_node1 x:collection1] o.a.s.c.c.SolrZkClient makePath: /collections/control_collection/leaders/shard1
   [junit4]   2> 2079548 INFO  (coreZkRegister-4968-thread-1-processing-n:127.0.0.1:45084_pi_ko%2Fz x:collection1 s:shard1 c:control_collection r:core_node1) [n:127.0.0.1:45084_pi_ko%2Fz c:control_collection s:shard1 r:core_node1 x:collection1] o.a.s.c.ShardLeaderElectionContextBase Creating leader registration node /collections/control_collection/leaders/shard1/leader after winning as /collections/control_collection/leader_elect/shard1/election/96571027711262724-core_node1-n_0000000000
   [junit4]   2> 2079662 INFO  (coreZkRegister-4968-thread-1-processing-n:127.0.0.1:45084_pi_ko%2Fz x:collection1 s:shard1 c:control_collection r:core_node1) [n:127.0.0.1:45084_pi_ko%2Fz c:control_collection s:shard1 r:core_node1 x:collection1] o.a.s.c.ShardLeaderElectionContext I am the new leader: http://127.0.0.1:45084/pi_ko/z/collection1/ shard1
   [junit4]   2> 2079669 INFO  (OverseerStateUpdate-96571027711262724-127.0.0.1:45084_pi_ko%2Fz-n_0000000000) [n:127.0.0.1:45084_pi_ko%2Fz    ] o.a.s.c.Overseer processMessage: queueSize: 2, message = {
   [junit4]   2>   "operation":"leader",
   [junit4]   2>   "shard":"shard1",
   [junit4]   2>   "collection":"control_collection"} current state version: 1
   [junit4]   2> 2079671 INFO  (OverseerStateUpdate-96571027711262724-127.0.0.1:45084_pi_ko%2Fz-n_0000000000) [n:127.0.0.1:45084_pi_ko%2Fz    ] o.a.s.c.Overseer processMessage: queueSize: 2, message = {
   [junit4]   2>   "operation":"leader",
   [junit4]   2>   "shard":"shard1",
   [junit4]   2>   "collection":"control_collection",
   [junit4]   2>   "base_url":"http://127.0.0.1:45084/pi_ko/z",
   [junit4]   2>   "core":"collection1",
   [junit4]   2>   "state":"active"} current state version: 1
   [junit4]   2> 2079778 INFO  (zkCallback-1506-thread-4-processing-n:127.0.0.1:45084_pi_ko%2Fz) [n:127.0.0.1:45084_pi_ko%2Fz    ] o.a.s.c.c.ZkStateReader A cluster state change: [WatchedEvent state:SyncConnected type:NodeDataChanged path:/clusterstate.json], has occurred - updating... (live nodes size: [1])
   [junit4]   2> 2079818 INFO  (coreZkRegister-4968-thread-1-processing-n:127.0.0.1:45084_pi_ko%2Fz x:collection1 s:shard1 c:control_collection r:core_node1) [n:127.0.0.1:45084_pi_ko%2Fz c:control_collection s:shard1 r:core_node1 x:collection1] o.a.s.c.ZkController We are http://127.0.0.1:45084/pi_ko/z/collection1/ and leader is http://127.0.0.1:45084/pi_ko/z/collection1/
   [junit4]   2> 2079818 INFO  (coreZkRegister-4968-thread-1-processing-n:127.0.0.1:45084_pi_ko%2Fz x:collection1 s:shard1 c:control_collection r:core_node1) [n:127.0.0.1:45084_pi_ko%2Fz c:control_collection s:shard1 r:core_node1 x:collection1] o.a.s.c.ZkController No LogReplay needed for core=collection1 baseURL=http://127.0.0.1:45084/pi_ko/z
   [junit4]   2> 2079818 INFO  (coreZkRegister-4968-thread-1-processing-n:127.0.0.1:45084_pi_ko%2Fz x:collection1 s:shard1 c:control_collection r:core_node1) [n:127.0.0.1:45084_pi_ko%2Fz c:control_collection s:shard1 r:core_node1 x:collection1] o.a.s.c.ZkController I am the leader, no recovery necessary
   [junit4]   2> 2079818 INFO  (coreZkRegister-4968-thread-1-processing-n:127.0.0.1:45084_pi_ko%2Fz x:collection1 s:shard1 c:control_collection r:core_node1) [n:127.0.0.1:45084_pi_ko%2Fz c:control_collection s:shard1 r:core_node1 x:collection1] o.a.s.c.ZkController publishing state=active
   [junit4]   2> 2079818 INFO  (coreZkRegister-4968-thread-1-processing-n:127.0.0.1:45084_pi_ko%2Fz x:collection1 s:shard1 c:control_collection r:core_node1) [n:127.0.0.1:45084_pi_ko%2Fz c:control_collection s:shard1 r:core_node1 x:collection1] o.a.s.c.ZkController numShards not found on descriptor - reading it from system property
   [junit4]   2> 2079819 INFO  (coreZkRegister-4968-thread-1-processing-n:127.0.0.1:45084_pi_ko%2Fz x:collection1 s:shard1 c:control_collection r:core_node1) [n:127.0.0.1:45084_pi_ko%2Fz c:control_collection s:shard1 r:core_node1 x:collection1] o.a.s.c.c.ZkStateReader Checking legacy cluster state for collection control_collection
   [junit4]   2> 2079832 INFO  (OverseerStateUpdate-96571027711262724-127.0.0.1:45084_pi_ko%2Fz-n_0000000000) [n:127.0.0.1:45084_pi_ko%2Fz    ] o.a.s.c.Overseer processMessage: queueSize: 1, message = {
   [junit4]   2>   "core":"collection1",
   [junit4]   2>   "core_node_name":"core_node1",
   [junit4]   2>   "roles":null,
   [junit4]   2>   "base_url":"http://127.0.0.1:45084/pi_ko/z",
   [junit4]   2>   "node_name":"127.0.0.1:45084_pi_ko%2Fz",
   [junit4]   2>   "numShards":"1",
   [junit4]   2>   "state":"active",
   [junit4]   2>   "shard":"shard1",
   [junit4]   2>   "collection":"control_collection",
   [junit4]   2>   "operation":"state"} current state version: 2
   [junit4]   2> 2079832 INFO  (OverseerStateUpdate-96571027711262724-127.0.0.1:45084_pi_ko%2Fz-n_0000000000) [n:127.0.0.1:45084_pi_ko%2Fz    ] o.a.s.c.o.ReplicaMutator Update state numShards=1 message={
   [junit4]   2>   "core":"collection1",
   [junit4]   2>   "core_node_name":"core_node1",
   [junit4]   2>   "roles":null,
   [junit4]   2>   "base_url":"http://127.0.0.1:45084/pi_ko/z",
   [junit4]   2>   "node_name":"127.0.0.1:45084_pi_ko%2Fz",
   [junit4]   2>   "numShards":"1",
   [junit4]   2>   "state":"active",
   [junit4]   2>   "shard":"shard1",
   [junit4]   2>   "collection":"control_collection",
   [junit4]   2>   "operation":"state"}
   [junit4]   2> 2079960 INFO  (zkCallback-1506-thread-4-processing-n:127.0.0.1:45084_pi_ko%2Fz) [n:127.0.0.1:45084_pi_ko%2Fz    ] o.a.s.c.c.ZkStateReader A cluster state change: [WatchedEvent state:SyncConnected type:NodeDataChanged path:/clusterstate.json], has occurred - updating... (live nodes size: [1])
   [junit4]   2> 2080022 INFO  (TEST-ForceLeaderTest.testLastPublishedStateIsActive-seed#[48722C3319D162D2]) [    ] o.a.s.c.c.SolrZkClient Using default ZkCredentialsProvider
   [junit4]   2> 2080023 INFO  (TEST-ForceLeaderTest.testLastPublishedStateIsActive-seed#[48722C3319D162D2]) [    ] o.a.s.c.c.ConnectionManager Waiting for client to connect to ZooKeeper
   [junit4]   2> 2080023 INFO  (zkCallback-1510-thread-1) [    ] o.a.s.c.c.ConnectionManager Watcher org.apache.solr.common.cloud.ConnectionManager@708406ae name:ZooKeeperConnection Watcher:127.0.0.1:47383/solr got event WatchedEvent state:SyncConnected type:None path:null path:null type:None
   [junit4]   2> 2080024 INFO  (TEST-ForceLeaderTest.testLastPublishedStateIsActive-seed#[48722C3319D162D2]) [    ] o.a.s.c.c.ConnectionManager Client is connected to ZooKeeper
   [junit4]   2> 2080024 INFO  (TEST-ForceLeaderTest.testLastPublishedStateIsActive-seed#[48722C3319D162D2]) [    ] o.a.s.c.c.SolrZkClient Using default ZkACLProvider
   [junit4]   2> 2080024 INFO  (TEST-ForceLeaderTest.testLastPublishedStateIsActive-seed#[48722C3319D162D2]) [    ] o.a.s.c.c.ZkStateReader Updating cluster state from ZooKeeper... 
   [junit4]   2> 2080024 INFO  (TEST-ForceLeaderTest.testLastPublishedStateIsActive-seed#[48722C3319D162D2]) [    ] o.a.s.c.c.ZkStateReader Loaded empty cluster properties
   [junit4]   2> 2080025 INFO  (TEST-ForceLeaderTest.testLastPublishedStateIsActive-seed#[48722C3319D162D2]) [    ] o.a.s.c.c.ZkStateReader Updated live nodes from ZooKeeper... (0) -> (1)
   [junit4]   2> 2080026 INFO  (TEST-ForceLeaderTest.testLastPublishedStateIsActive-seed#[48722C3319D162D2]) [    ] o.a.s.c.ChaosMonkey monkey: init - expire sessions:false cause connection loss:false
   [junit4]   2> 2080026 INFO  (TEST-ForceLeaderTest.testLastPublishedStateIsActive-seed#[48722C3319D162D2]) [    ] o.a.s.c.AbstractFullDistribZkTestBase Creating collection1 with stateFormat=2
   [junit4]   2> 2080026 INFO  (TEST-ForceLeaderTest.testLastPublishedStateIsActive-seed#[48722C3319D162D2]) [    ] o.a.s.c.c.SolrZkClient Using default ZkCredentialsProvider
   [junit4]   2> 2080027 INFO  (TEST-ForceLeaderTest.testLastPublishedStateIsActive-seed#[48722C3319D162D2]) [    ] o.a.s.c.c.ConnectionManager Waiting for client to connect to ZooKeeper
   [junit4]   2> 2080027 INFO  (zkCallback-1511-thread-1) [    ] o.a.s.c.c.ConnectionManager Watcher org.apache.solr.common.cloud.ConnectionManager@4613b0a3 name:ZooKeeperConnection Watcher:127.0.0.1:47383/solr got event WatchedEvent state:SyncConnected type:None path:null path:null type:None
   [junit4]   2> 2080027 INFO  (TEST-ForceLeaderTest.testLastPublishedStateIsActive-seed#[48722C3319D162D2]) [    ] o.a.s.c.c.ConnectionManager Client is connected to ZooKeeper
   [junit4]   2> 2080028 INFO  (TEST-ForceLeaderTest.testLastPublishedStateIsActive-seed#[48722C3319D162D2]) [    ] o.a.s.c.c.SolrZkClient Using default ZkACLProvider
   [junit4]   2> 2080029 INFO  (OverseerStateUpdate-96571027711262724-127.0.0.1:45084_pi_ko%2Fz-n_0000000000) [n:127.0.0.1:45084_pi_ko%2Fz    ] o.a.s.c.Overseer processMessage: queueSize: 1, message = {
   [junit4]   2>   "operation":"create",
   [junit4]   2>   "name":"collection1",
   [junit4]   2>   "numShards":"2",
   [junit4]   2>   "stateFormat":"2"} current state version: 3
   [junit4]   2> 2080029 INFO  (OverseerStateUpdate-96571027711262724-127.0.0.1:45084_pi_ko%2Fz-n_0000000000) [n:127.0.0.1:45084_pi_ko%2Fz    ] o.a.s.c.o.ClusterStateMutator building a new cName: collection1
   [junit4]   2> 2080132 INFO  (OverseerStateUpdate-96571027711262724-127.0.0.1:45084_pi_ko%2Fz-n_0000000000) [n:127.0.0.1:45084_pi_ko%2Fz    ] o.a.s.c.o.ZkStateWriter going to create_collection /collections/collection1/state.json
   [junit4]   2> 2080288 INFO  (TEST-ForceLeaderTest.testLastPublishedStateIsActive-seed#[48722C3319D162D2]) [    ] o.a.s.SolrTestCaseJ4 Writing core.properties file to /x1/jenkins/jenkins-slave/workspace/Lucene-Solr-Tests-master/solr/build/solr-core/test/J0/temp/solr.cloud.ForceLeaderTest_48722C3319D162D2-001/shard-1-001/cores/collection1
   [junit4]   2> 2080289 INFO  (TEST-ForceLeaderTest.testLastPublishedStateIsActive-seed#[48722C3319D162D2]) [    ] o.a.s.c.AbstractFullDistribZkTestBase create jetty 1 in directory /x1/jenkins/jenkins-slave/workspace/Lucene-Solr-Tests-master/solr/build/solr-core/test/J0/temp/solr.cloud.ForceLeaderTest_48722C3319D162D2-001/shard-1-001
   [junit4]   2> 2080290 INFO  (TEST-ForceLeaderTest.testLastPublishedStateIsActive-seed#[48722C3319D162D2]) [    ] o.e.j.s.Server jetty-9.3.8.v20160314
   [junit4]   2> 2080305 INFO  (TEST-ForceLeaderTest.testLastPublishedStateIsActive-seed#[48722C3319D162D2]) [    ] o.e.j.s.h.ContextHandler Started o.e.j.s.ServletContextHandler@37db5037{/pi_ko/z,null,AVAILABLE}
   [junit4]   2> 2080305 INFO  (TEST-ForceLeaderTest.testLastPublishedStateIsActive-seed#[48722C3319D162D2]) [    ] o.e.j.s.ServerConnector Started ServerConnector@1db1ef50{HTTP/1.1,[http/1.1]}{127.0.0.1:32791}
   [junit4]   2> 2080305 INFO  (TEST-ForceLeaderTest.testLastPublishedStateIsActive-seed#[48722C3319D162D2]) [    ] o.e.j.s.Server Started @2087907ms
   [junit4]   2> 2080306 INFO  (TEST-ForceLeaderTest.testLastPublishedStateIsActive-seed#[48722C3319D162D2]) [    ] o.a.s.c.s.e.JettySolrRunner Jetty properties: {solr.data.dir=/x1/jenkins/jenkins-slave/workspace/Lucene-Solr-Tests-master/solr/build/solr-core/test/J0/temp/solr.cloud.ForceLeaderTest_48722C3319D162D2-001/tempDir-001/jetty1, solrconfig=solrconfig.xml, hostContext=/pi_ko/z, hostPort=49444, coreRootDirectory=/x1/jenkins/jenkins-slave/workspace/Lucene-Solr-Tests-master/solr/build/solr-core/test/J0/temp/solr.cloud.ForceLeaderTest_48722C3319D162D2-001/shard-1-001/cores}
   [junit4]   2> 2080306 INFO  (TEST-ForceLeaderTest.testLastPublishedStateIsActive-seed#[48722C3319D162D2]) [    ] o.a.s.s.SolrDispatchFilter SolrDispatchFilter.init(): sun.misc.Launcher$AppClassLoader@73d16e93
   [junit4]   2> 2080306 INFO  (TEST-ForceLeaderTest.testLastPublishedStateIsActive-seed#[48722C3319D162D2]) [    ] o.a.s.c.SolrResourceLoader new SolrResourceLoader for directory: '/x1/jenkins/jenkins-slave/workspace/Lucene-Solr-Tests-master/solr/build/solr-core/test/J0/temp/solr.cloud.ForceLeaderTest_48722C3319D162D2-001/shard-1-001'
   [junit4]   2> 2080306 INFO  (TEST-ForceLeaderTest.testLastPublishedStateIsActive-seed#[48722C3319D162D2]) [    ] o.a.s.c.SolrResourceLoader JNDI not configured for solr (NoInitialContextEx)
   [junit4]   2> 2080306 INFO  (TEST-ForceLeaderTest.testLastPublishedStateIsActive-seed#[48722C3319D162D2]) [    ] o.a.s.c.SolrResourceLoader solr home defaulted to 'solr/' (could not find system property or JNDI)
   [junit4]   2> 2080306 INFO  (TEST-ForceLeaderTest.testLastPublishedStateIsActive-seed#[48722C3319D162D2]) [    ] o.a.s.c.c.SolrZkClient Using default ZkCredentialsProvider
   [junit4]   2> 2080308 INFO  (TEST-ForceLeaderTest.testLastPublishedStateIsActive-seed#[48722C3319D162D2]) [    ] o.a.s.c.c.ConnectionManager Waiting for client to connect to ZooKeeper
   [junit4]   2> 2080320 INFO  (zkCallback-1512-thread-1) [    ] o.a.s.c.c.ConnectionManager Watcher org.apache.solr.common.cloud.ConnectionManager@15883f6b name:ZooKeeperConnection Watcher:127.0.0.1:47383/solr got event WatchedEvent state:SyncConnected type:None path:null path:null type:None
   [junit4]   2> 2080321 INFO  (TEST-ForceLeaderTest.testLastPublishedStateIsActive-seed#[48722C3319D162D2]) [    ] o.a.s.c.c.ConnectionManager Client is connected to ZooKeeper
   [junit4]   2> 2080321 INFO  (TEST-ForceLeaderTest.testLastPublishedStateIsActive-seed#[48722C3319D162D2]) [    ] o.a.s.c.c.SolrZkClient Using default ZkACLProvider
   [junit4]   2> 2080322 INFO  (TEST-ForceLeaderTest.testLastPublishedStateIsActive-seed#[48722C3319D162D2]) [    ] o.a.s.s.SolrDispatchFilter Loading solr.xml from SolrHome (not found in ZooKeeper)
   [junit4]   2> 2080322 INFO  (TEST-ForceLeaderTest.testLastPublishedStateIsActive-seed#[48722C3319D162D2]) [    ] o.a.s.c.SolrXmlConfig Loading container configuration from /x1/jenkins/jenkins-slave/workspace/Lucene-Solr-Tests-master/solr/build/solr-core/test/J0/temp/solr.cloud.ForceLeaderTest_48722C3319D162D2-001/shard-1-001/solr.xml
   [junit4]   2> 2080327 INFO  (TEST-ForceLeaderTest.testLastPublishedStateIsActive-seed#[48722C3319D162D2]) [    ] o.a.s.c.CorePropertiesLocator Config-defined core root directory: /x1/jenkins/jenkins-slave/workspace/Lucene-Solr-Tests-master/solr/build/solr-core/test/J0/temp/solr.cloud.ForceLeaderTest_48722C3319D162D2-001/shard-1-001/cores
   [junit4]   2> 2080327 INFO  (TEST-ForceLeaderTest.testLastPublishedStateIsActive-seed#[48722C3319D162D2]) [    ] o.a.s.c.CoreContainer New CoreContainer 1939678881
   [junit4]   2> 2080327 INFO  (TEST-ForceLeaderTest.testLastPublishedStateIsActive-seed#[48722C3319D162D2]) [    ] o.a.s.c.CoreContainer Loading cores into CoreContainer [instanceDir=/x1/jenkins/jenkins-slave/workspace/Lucene-Solr-Tests-master/solr/build/solr-core/test/J0/temp/solr.cloud.ForceLeaderTest_48722C3319D162D2-001/shard-1-001]
   [junit4]   2> 2080327 WARN  (TEST-ForceLeaderTest.testLastPublishedStateIsActive-seed#[48722C3319D162D2]) [    ] o.a.s.c.CoreContainer Couldn't add files from /x1/jenkins/jenkins-slave/workspace/Lucene-Solr-Tests-master/solr/build/solr-core/test/J0/temp/solr.cloud.ForceLeaderTest_48722C3319D162D2-001/shard-1-001/lib to classpath: /x1/jenkins/jenkins-slave/workspace/Lucene-Solr-Tests-master/solr/build/solr-core/test/J0/temp/solr.cloud.ForceLeaderTest_48722C3319D162D2-001/shard-1-001/lib
   [junit4]   2> 2080328 INFO  (TEST-ForceLeaderTest.testLastPublishedStateIsActive-seed#[48722C3319D162D2]) [    ] o.a.s.h.c.HttpShardHandlerFactory created with socketTimeout : 90000,urlScheme : ,connTimeout : 15000,maxConnectionsPerHost : 20,maxConnections : 10000,corePoolSize : 0,maximumPoolSize : 2147483647,maxThreadIdleTime : 5,sizeOfQueue : -1,fairnessPolicy : false,
   [junit4]   2> 2080333 INFO  (TEST-ForceLeaderTest.testLastPublishedStateIsActive-seed#[48722C3319D162D2]) [    ] o.a.s.u.UpdateShardHandler Created UpdateShardHandler HTTP client with params: socketTimeout=340000&connTimeout=45000&maxConnections=100000&maxConnectionsPerHost=100000
   [junit4]   2> 2080333 INFO  (TEST-ForceLeaderTest.testLastPublishedStateIsActive-seed#[48722C3319D162D2]) [    ] o.a.s.l.LogWatcher SLF4J impl is org.slf4j.impl.Log4jLoggerFactory
   [junit4]   2> 2080333 INFO  (TEST-ForceLeaderTest.testLastPublishedStateIsActive-seed#[48722C3319D162D2]) [    ] o.a.s.l.LogWatcher Registering Log Listener [Log4j (org.slf4j.impl.Log4jLoggerFactory)]
   [junit4]   2> 2080333 INFO  (TEST-ForceLeaderTest.testLastPublishedStateIsActive-seed#[48722C3319D162D2]) [    ] o.a.s.c.ZkContainer Zookeeper client=127.0.0.1:47383/solr
   [junit4]   2> 2080333 INFO  (TEST-ForceLeaderTest.testLastPublishedStateIsActive-seed#[48722C3319D162D2]) [    ] o.a.s.c.ZkController zkHost includes chroot
   [junit4]   2> 2080333 INFO  (TEST-ForceLeaderTest.testLastPublishedStateIsActive-seed#[48722C3319D162D2]) [    ] o.a.s.c.c.SolrZkClient Using default ZkCredentialsProvider
   [junit4]   2> 2080335 INFO  (TEST-ForceLeaderTest.testLastPublishedStateIsActive-seed#[48722C3319D162D2]) [    ] o.a.s.c.c.ConnectionManager Waiting for client to connect to ZooKeeper
   [junit4]   2> 2080336 INFO  (zkCallback-1515-thread-1) [    ] o.a.s.c.c.ConnectionManager Watcher org.apache.solr.common.cloud.ConnectionManager@6dd7f730 name:ZooKeeperConnection Watcher:127.0.0.1:47383 got event WatchedEvent state:SyncConnected type:None path:null path:null type:None
   [junit4]   2> 2080336 INFO  (TEST-ForceLeaderTest.testLastPublishedStateIsActive-seed#[48722C3319D162D2]) [    ] o.a.s.c.c.ConnectionManager Client is connected to ZooKeeper
   [junit4]   2> 2080336 INFO  (TEST-ForceLeaderTest.testLastPublishedStateIsActive-seed#[48722C3319D162D2]) [    ] o.a.s.c.c.SolrZkClient Using default ZkACLProvider
   [junit4]   2> 2080338 INFO  (TEST-ForceLeaderTest.testLastPublishedStateIsActive-seed#[48722C3319D162D2]) [n:127.0.0.1:49444_pi_ko%2Fz    ] o.a.s.c.ZkController Added new OnReconnect listener org.apache.solr.cloud.ZkController$$Lambda$14/59653614@63972258
   [junit4]   2> 2080341 INFO  (TEST-ForceLeaderTest.testLastPublishedStateIsActive-seed#[48722C3319D162D2]) [n:127.0.0.1:49444_pi_ko%2Fz    ] o.a.s.c.c.ConnectionManager Waiting for client to connect to ZooKeeper
   [junit4]   2> 2080341 INFO  (zkCallback-1516-thread-1-processing-n:127.0.0.1:49444_pi_ko%2Fz) [n:127.0.0.1:49444_pi_ko%2Fz    ] o.a.s.c.c.ConnectionManager Watcher org.apache.solr.common.cloud.ConnectionManager@3856ec61 name:ZooKeeperConnection Watcher:127.0.0.1:47383/solr got event WatchedEvent state:SyncConnected type:None path:null path:null type:None
   [junit4]   2> 2080341 INFO  (TEST-ForceLeaderTest.testLastPublishedStateIsActive-seed#[48722C3319D162D2]) [n:127.0.0.1:49444_pi_ko%2Fz    ] o.a.s.c.c.ConnectionManager Client is connected to ZooKeeper
   [junit4]   2> 2080352 INFO  (TEST-ForceLeaderTest.testLastPublishedStateIsActive-seed#[48722C3319D162D2]) [n:127.0.0.1:49444_pi_ko%2Fz    ] o.a.s.c.c.ZkStateReader Updating cluster state from ZooKeeper... 
   [junit4]   2> 2080352 INFO  (TEST-ForceLeaderTest.testLastPublishedStateIsActive-seed#[48722C3319D162D2]) [n:127.0.0.1:49444_pi_ko%2Fz    ] o.a.s.c.c.ZkStateReader Loaded empty cluster properties
   [junit4]   2> 2080356 INFO  (TEST-ForceLeaderTest.testLastPublishedStateIsActive-seed#[48722C3319D162D2]) [n:127.0.0.1:49444_pi_ko%2Fz    ] o.a.s.c.c.ZkStateReader Updated live nodes from ZooKeeper... (0) -> (1)
   [junit4]   2> 2080369 INFO  (TEST-ForceLeaderTest.testLastPublishedStateIsActive-seed#[48722C3319D162D2]) [n:127.0.0.1:49444_pi_ko%2Fz    ] o.a.s.c.Overseer Overseer (id=null) closing
   [junit4]   2> 2080369 INFO  (TEST-ForceLeaderTest.testLastPublishedStateIsActive-seed#[48722C3319D162D2]) [n:127.0.0.1:49444_pi_ko%2Fz    ] o.a.s.c.LeaderElector Joined leadership election with path: /overseer_elect/election/96571027711262729-127.0.0.1:49444_pi_ko%2Fz-n_0000000001
   [junit4]   2> 2080370 INFO  (TEST-ForceLeaderTest.testLastPublishedStateIsActive-seed#[48722C3319D162D2]) [n:127.0.0.1:49444_pi_ko%2Fz    ] o.a.s.c.LeaderElector Watching path /overseer_elect/election/96571027711262724-127.0.0.1:45084_pi_ko%2Fz-n_0000000000 to know if I could be the leader
   [junit4]   2> 2080370 INFO  (TEST-ForceLeaderTest.testLastPublishedStateIsActive-seed#[48722C3319D162D2]) [n:127.0.0.1:49444_pi_ko%2Fz    ] o.a.s.c.ZkController Publish node=127.0.0.1:49444_pi_ko%2Fz as DOWN
   [junit4]   2> 2080371 INFO  (OverseerStateUpdate-96571027711262724-127.0.0.1:45084_pi_ko%2Fz-n_0000000000) [n:127.0.0.1:45084_pi_ko%2Fz    ] o.a.s.c.Overseer processMessage: queueSize: 1, message = {
   [junit4]   2>   "operation":"downnode",
   [junit4]   2>   "node_name":"127.0.0.1:49444_pi_ko%2Fz"} current state version: 3
   [junit4]   2> 2080371 INFO  (OverseerStateUpdate-96571027711262724-127.0.0.1:45084_pi_ko%2Fz-n_0000000000) [n:127.0.0.1:45084_pi_ko%2Fz    ] o.a.s.c.o.NodeMutator DownNode state invoked for node: 127.0.0.1:49444_pi_ko%2Fz
   [junit4]   2> 2080373 INFO  (zkCallback-1510-thread-1) [    ] o.a.s.c.c.ZkStateReader A cluster state change: [WatchedEvent state:SyncConnected type:NodeDataChanged path:/clusterstate.json], has occurred - updating... (live nodes size: [1])
   [junit4]   2> 2080373 INFO  (zkCallback-1506-thread-1-processing-n:127.0.0.1:45084_pi_ko%2Fz) [n:127.0.0.1:45084_pi_ko%2Fz    ] o.a.s.c.c.ZkStateReader A cluster state change: [WatchedEvent state:SyncConnected type:NodeDataChanged path:/clusterstate.json], has occurred - updating... (live nodes size: [1])
   [junit4]   2> 2080376 INFO  (TEST-ForceLeaderTest.testLastPublishedStateIsActive-seed#[48722C3319D162D2]) [n:127.0.0.1:49444_pi_ko%2Fz    ] o.a.s.c.ZkController Register node as live in ZooKeeper:/live_nodes/127.0.0.1:49444_pi_ko%2Fz
   [junit4]   2> 2080376 INFO  (TEST-ForceLeaderTest.testLastPublishedStateIsActive-seed#[48722C3319D162D2]) [n:127.0.0.1:49444_pi_ko%2Fz    ] o.a.s.c.c.SolrZkClient makePath: /live_nodes/127.0.0.1:49444_pi_ko%2Fz
   [junit4]   2> 2080377 INFO  (zkCallback-1516-thread-1-processing-n:127.0.0.1:49444_pi_ko%2Fz) [n:127.0.0.1:49444_pi_ko%2Fz    ] o.a.s.c.c.ZkStateReader A cluster state change: [WatchedEvent state:SyncConnected type:NodeDataChanged path:/clusterstate.json], has occurred - updating... (live nodes size: [1])
   [junit4]   2> 2080385 INFO  (zkCallback-1510-thread-1) [    ] o.a.s.c.c.ZkStateReader A live node change: [WatchedEvent state:SyncConnected type:NodeChildrenChanged path:/live_nodes], has occurred - updating... (live nodes size: [1])
   [junit4]   2> 2080385 INFO  (zkCallback-1506-thread-3-processing-n:127.0.0.1:45084_pi_ko%2Fz) [n:127.0.0.1:45084_pi_ko%2Fz    ] o.a.s.c.c.ZkStateReader A live node change: [WatchedEvent state:SyncConnected type:NodeChildrenChanged path:/live_nodes], has occurred - updating... (live nodes size: [1])
   [junit4]   2> 2080386 INFO  (zkCallback-1510-thread-1) [    ] o.a.s.c.c.ZkStateReader Updated live nodes from ZooKeeper... (1) -> (2)
   [junit4]   2> 2080386 INFO  (zkCallback-1506-thread-3-processing-n:127.0.0.1:45084_pi_ko%2Fz) [n:127.0.0.1:45084_pi_ko%2Fz    ] o.a.s.c.c.ZkStateReader Updated live nodes from ZooKeeper... (1) -> (2)
   [junit4]   2> 2080386 INFO  (zkCallback-1516-thread-1-processing-n:127.0.0.1:49444_pi_ko%2Fz) [n:127.0.0.1:49444_pi_ko%2Fz    ] o.a.s.c.c.ZkStateReader A live node change: [WatchedEvent state:SyncConnected type:NodeChildrenChanged path:/live_nodes], has occurred - updating... (live nodes size: [1])
   [junit4]   2> 2080386 INFO  (zkCallback-1516-thread-1-processing-n:127.0.0.1:49444_pi_ko%2Fz) [n:127.0.0.1:49444_pi_ko%2Fz    ] o.a.s.c.c.ZkStateReader Updated live nodes from ZooKeeper... (1) -> (2)
   [junit4]   2> 2080405 INFO  (TEST-ForceLeaderTest.testLastPublishedStateIsActive-seed#[48722C3319D162D2]) [n:127.0.0.1:49444_pi_ko%2Fz    ] o.a.s.c.CoreContainer Security conf doesn't exist. Sk

[...truncated too long message...]

org.apache.solr.client.solrj.impl.CloudSolrClient.sendRequest(CloudSolrClient.java:1161)
   [junit4]    > 	at org.apache.solr.client.solrj.impl.CloudSolrClient.requestWithRetryOnStaleState(CloudSolrClient.java:1050)
   [junit4]    > 	at org.apache.solr.client.solrj.impl.CloudSolrClient.request(CloudSolrClient.java:992)
   [junit4]    > 	at org.apache.solr.cloud.AbstractFullDistribZkTestBase.sendDocsWithRetry(AbstractFullDistribZkTestBase.java:753)
   [junit4]    > 	at org.apache.solr.cloud.AbstractFullDistribZkTestBase.sendDocsWithRetry(AbstractFullDistribZkTestBase.java:741)
   [junit4]    > 	at org.apache.solr.cloud.ForceLeaderTest.sendDoc(ForceLeaderTest.java:424)
   [junit4]    > 	at org.apache.solr.cloud.ForceLeaderTest.testReplicasInLIRNoLeader(ForceLeaderTest.java:131)
   [junit4]    > 	at org.apache.solr.BaseDistributedSearchTestCase$ShardsRepeatRule$ShardsFixedStatement.callStatement(BaseDistributedSearchTestCase.java:985)
   [junit4]    > 	at org.apache.solr.BaseDistributedSearchTestCase$ShardsRepeatRule$ShardsStatement.evaluate(BaseDistributedSearchTestCase.java:960)
   [junit4]    > 	at java.lang.Thread.run(Thread.java:745)
   [junit4]    > Caused by: org.apache.solr.client.solrj.SolrServerException: No live SolrServers available to handle this request:[http://127.0.0.1:39981/pi_ko/z/forceleader_test_collection_shard1_replica2]
   [junit4]    > 	at org.apache.solr.client.solrj.impl.LBHttpSolrClient.request(LBHttpSolrClient.java:394)
   [junit4]    > 	at org.apache.solr.client.solrj.impl.CloudSolrClient.lambda$directUpdate$0(CloudSolrClient.java:730)
   [junit4]    > 	at java.util.concurrent.FutureTask.run(FutureTask.java:266)
   [junit4]    > 	at org.apache.solr.common.util.ExecutorUtil$MDCAwareThreadPoolExecutor.lambda$execute$0(ExecutorUtil.java:229)
   [junit4]    > 	at java.util.concurrent.ThreadPoolExecutor.runWorker(ThreadPoolExecutor.java:1142)
   [junit4]    > 	at java.util.concurrent.ThreadPoolExecutor$Worker.run(ThreadPoolExecutor.java:617)
   [junit4]    > 	... 1 more
   [junit4]    > Caused by: org.apache.solr.client.solrj.SolrServerException: Server refused connection at: http://127.0.0.1:39981/pi_ko/z/forceleader_test_collection_shard1_replica2
   [junit4]    > 	at org.apache.solr.client.solrj.impl.HttpSolrClient.executeMethod(HttpSolrClient.java:615)
   [junit4]    > 	at org.apache.solr.client.solrj.impl.HttpSolrClient.request(HttpSolrClient.java:261)
   [junit4]    > 	at org.apache.solr.client.solrj.impl.HttpSolrClient.request(HttpSolrClient.java:250)
   [junit4]    > 	at org.apache.solr.client.solrj.impl.LBHttpSolrClient.doRequest(LBHttpSolrClient.java:415)
   [junit4]    > 	at org.apache.solr.client.solrj.impl.LBHttpSolrClient.request(LBHttpSolrClient.java:383)
   [junit4]    > 	... 6 more
   [junit4]    > Caused by: org.apache.http.conn.HttpHostConnectException: Connect to 127.0.0.1:39981 [/127.0.0.1] failed: Connection refused
   [junit4]    > 	at org.apache.http.impl.conn.DefaultHttpClientConnectionOperator.connect(DefaultHttpClientConnectionOperator.java:151)
   [junit4]    > 	at org.apache.http.impl.conn.PoolingHttpClientConnectionManager.connect(PoolingHttpClientConnectionManager.java:353)
   [junit4]    > 	at org.apache.http.impl.execchain.MainClientExec.establishRoute(MainClientExec.java:380)
   [junit4]    > 	at org.apache.http.impl.execchain.MainClientExec.execute(MainClientExec.java:236)
   [junit4]    > 	at org.apache.http.impl.execchain.ProtocolExec.execute(ProtocolExec.java:184)
   [junit4]    > 	at org.apache.http.impl.execchain.RetryExec.execute(RetryExec.java:88)
   [junit4]    > 	at org.apache.http.impl.execchain.RedirectExec.execute(RedirectExec.java:110)
   [junit4]    > 	at org.apache.http.impl.client.InternalHttpClient.doExecute(InternalHttpClient.java:184)
   [junit4]    > 	at org.apache.http.impl.client.CloseableHttpClient.execute(CloseableHttpClient.java:82)
   [junit4]    > 	at org.apache.http.impl.client.CloseableHttpClient.execute(CloseableHttpClient.java:55)
   [junit4]    > 	at org.apache.solr.client.solrj.impl.HttpSolrClient.executeMethod(HttpSolrClient.java:513)
   [junit4]    > 	... 10 more
   [junit4]    > Caused by: java.net.ConnectException: Connection refused
   [junit4]    > 	at java.net.PlainSocketImpl.socketConnect(Native Method)
   [junit4]    > 	at java.net.AbstractPlainSocketImpl.doConnect(AbstractPlainSocketImpl.java:350)
   [junit4]    > 	at java.net.AbstractPlainSocketImpl.connectToAddress(AbstractPlainSocketImpl.java:206)
   [junit4]    > 	at java.net.AbstractPlainSocketImpl.connect(AbstractPlainSocketImpl.java:188)
   [junit4]    > 	at java.net.SocksSocketImpl.connect(SocksSocketImpl.java:392)
   [junit4]    > 	at java.net.Socket.connect(Socket.java:589)
   [junit4]    > 	at org.apache.http.conn.socket.PlainConnectionSocketFactory.connectSocket(PlainConnectionSocketFactory.java:74)
   [junit4]    > 	at org.apache.http.impl.conn.DefaultHttpClientConnectionOperator.connect(DefaultHttpClientConnectionOperator.java:134)
   [junit4]    > 	... 20 more
   [junit4]   2> 2206632 INFO  (SUITE-ForceLeaderTest-seed#[48722C3319D162D2]-worker) [    ] o.a.s.SolrTestCaseJ4 ###deleteCore
   [junit4]   2> NOTE: leaving temporary files on disk at: /x1/jenkins/jenkins-slave/workspace/Lucene-Solr-Tests-master/solr/build/solr-core/test/J0/temp/solr.cloud.ForceLeaderTest_48722C3319D162D2-001
   [junit4]   2> Sep 11, 2016 1:24:29 AM com.carrotsearch.randomizedtesting.ThreadLeakControl checkThreadLeaks
   [junit4]   2> WARNING: Will linger awaiting termination of 1 leaked thread(s).
   [junit4]   2> NOTE: test params are: codec=Asserting(Lucene62): {range_facet_l_dv=TestBloomFilteredLucenePostings(BloomFilteringPostingsFormat(Lucene50(blocksize=128))), _version_=PostingsFormat(name=Direct), multiDefault=PostingsFormat(name=Memory doPackFST= true), a_t=PostingsFormat(name=Memory doPackFST= true), intDefault=PostingsFormat(name=Direct), id=TestBloomFilteredLucenePostings(BloomFilteringPostingsFormat(Lucene50(blocksize=128))), range_facet_i_dv=PostingsFormat(name=Memory doPackFST= true), text=PostingsFormat(name=LuceneVarGapFixedInterval), range_facet_l=PostingsFormat(name=Memory doPackFST= true), timestamp=PostingsFormat(name=Memory doPackFST= true)}, docValues:{range_facet_l_dv=DocValuesFormat(name=Asserting), range_facet_i_dv=DocValuesFormat(name=Direct), timestamp=DocValuesFormat(name=Direct)}, maxPointsInLeafNode=1097, maxMBSortInHeap=6.070812731495999, sim=ClassicSimilarity, locale=es-PR, timezone=America/Campo_Grande
   [junit4]   2> NOTE: Linux 3.13.0-85-generic amd64/Oracle Corporation 1.8.0_102 (64-bit)/cpus=4,threads=1,free=197026504,total=524812288
   [junit4]   2> NOTE: All tests run in this JVM: [SaslZkACLProviderTest, CdcrBootstrapTest, TestUseDocValuesAsStored, ConnectionManagerTest, TestBinaryResponseWriter, TestStressLucene, TestPseudoReturnFields, TestPerFieldSimilarity, DistributedExpandComponentTest, TestSolr4Spatial, TestReplicationHandler, TestExactSharedStatsCache, HLLUtilTest, TestReqParamsAPI, TestConfigSetProperties, ZkStateWriterTest, TestStressCloudBlindAtomicUpdates, DistributedSpellCheckComponentTest, TestRandomDVFaceting, TestBackupRepositoryFactory, TestFunctionQuery, NotRequiredUniqueKeyTest, TestFaceting, BufferStoreTest, ResponseHeaderTest, CollectionStateFormat2Test, SolrRequestParserTest, TestNRTOpen, OutputWriterTest, TestFieldTypeCollectionResource, ActionThrottleTest, TestTrieFacet, TestTolerantUpdateProcessorRandomCloud, XsltUpdateRequestHandlerTest, DocumentAnalysisRequestHandlerTest, DateFieldTest, TestDocSet, TestGraphTermsQParserPlugin, TestRangeQuery, HdfsChaosMonkeyNothingIsSafeTest, DistributedFacetPivotWhiteBoxTest, TestDocTermOrds, AddBlockUpdateTest, TestManagedSchema, TestCrossCoreJoin, SmileWriterTest, TestHighlightDedupGrouping, AsyncCallRequestStatusResponseTest, AtomicUpdatesTest, HdfsTlogReplayBufferedWhileIndexingTest, TestValueSourceCache, SyncSliceTest, SecurityConfHandlerTest, BasicDistributedZkTest, JavabinLoaderTest, WrapperMergePolicyFactoryTest, TestDistribDocBasedVersion, TestAtomicUpdateErrorCases, DataDrivenBlockJoinTest, TestUniqueKeyFieldResource, TestPKIAuthenticationPlugin, SolrCoreTest, TestRestManager, DistributedQueueTest, PeerSyncTest, TestExpandComponent, TestIBSimilarityFactory, CollectionsAPISolrJTest, AlternateDirectoryTest, AnalyticsQueryTest, TestCloudPseudoReturnFields, TestHighFrequencyDictionaryFactory, DistributedQueryElevationComponentTest, TestHdfsCloudBackupRestore, RemoteQueryErrorTest, SignatureUpdateProcessorFactoryTest, CloudMLTQParserTest, TestSchemaResource, HttpPartitionTest, TestScoreJoinQPNoScore, ExternalFileFieldSortTest, TestRandomFlRTGCloud, OverseerTaskQueueTest, TestRecoveryHdfs, TestQuerySenderNoQuery, TestRemoteStreaming, TestPHPSerializedResponseWriter, VMParamsZkACLAndCredentialsProvidersTest, CdcrRequestHandlerTest, ExitableDirectoryReaderTest, TestReplicaProperties, TestConfigReload, BigEndianAscendingWordDeserializerTest, TestOmitPositions, FastVectorHighlighterTest, CursorPagingTest, CurrencyFieldOpenExchangeTest, TestSerializedLuceneMatchVersion, TestSortByMinMaxFunction, ZkNodePropsTest, DirectUpdateHandlerTest, TestBadConfig, SimplePostToolTest, TestExtendedDismaxParser, SuggesterFSTTest, DocValuesTest, HighlighterConfigTest, CopyFieldTest, TestMergePolicyConfig, TestSearchPerf, MinimalSchemaTest, TestSolrCoreProperties, DirectSolrConnectionTest, TestLuceneMatchVersion, SynonymTokenizerTest, TestSweetSpotSimilarityFactory, TestDFRSimilarityFactory, TestLMJelinekMercerSimilarityFactory, TestFastWriter, ResourceLoaderTest, TestFastOutputStream, OpenExchangeRatesOrgProviderTest, TestFastLRUCache, ChaosMonkeyNothingIsSafeTest, ConnectionReuseTest, AssignTest, CdcrVersionReplicationTest, ConcurrentDeleteAndCreateCollectionTest, CreateCollectionCleanupTest, DeleteInactiveReplicaTest, DistribCursorPagingTest, ForceLeaderTest]
   [junit4] Completed [470/631 (1!)] on J0 in 128.75s, 3 tests, 1 error, 1 skipped <<< FAILURES!

[...truncated 60711 lines...]



Mime
View raw message