lucene-dev mailing list archives

Site index · List index
Message view « Date » · « Thread »
Top « Date » · « Thread »
From Policeman Jenkins Server <jenk...@thetaphi.de>
Subject [JENKINS] Lucene-Solr-master-Solaris (64bit/jdk1.8.0) - Build # 826 - Still Unstable!
Date Sat, 03 Sep 2016 12:12:30 GMT
Build: http://jenkins.thetaphi.de/job/Lucene-Solr-master-Solaris/826/
Java: 64bit/jdk1.8.0 -XX:-UseCompressedOops -XX:+UseG1GC

1 tests failed.
FAILED:  org.apache.solr.cloud.ForceLeaderTest.testReplicasInLIRNoLeader

Error Message:
org.apache.solr.client.solrj.SolrServerException: No live SolrServers available to handle this request:[http://127.0.0.1:39670/forceleader_test_collection_shard1_replica2]

Stack Trace:
org.apache.solr.client.solrj.SolrServerException: org.apache.solr.client.solrj.SolrServerException: No live SolrServers available to handle this request:[http://127.0.0.1:39670/forceleader_test_collection_shard1_replica2]
	at __randomizedtesting.SeedInfo.seed([3C142C6198BE1AB8:DA8318A1A13CE3D9]:0)
	at org.apache.solr.client.solrj.impl.CloudSolrClient.directUpdate(CloudSolrClient.java:769)
	at org.apache.solr.client.solrj.impl.CloudSolrClient.sendRequest(CloudSolrClient.java:1161)
	at org.apache.solr.client.solrj.impl.CloudSolrClient.requestWithRetryOnStaleState(CloudSolrClient.java:1050)
	at org.apache.solr.client.solrj.impl.CloudSolrClient.request(CloudSolrClient.java:992)
	at org.apache.solr.cloud.AbstractFullDistribZkTestBase.sendDocsWithRetry(AbstractFullDistribZkTestBase.java:753)
	at org.apache.solr.cloud.AbstractFullDistribZkTestBase.sendDocsWithRetry(AbstractFullDistribZkTestBase.java:741)
	at org.apache.solr.cloud.ForceLeaderTest.sendDoc(ForceLeaderTest.java:424)
	at org.apache.solr.cloud.ForceLeaderTest.assertSendDocFails(ForceLeaderTest.java:315)
	at org.apache.solr.cloud.ForceLeaderTest.testReplicasInLIRNoLeader(ForceLeaderTest.java:110)
	at sun.reflect.NativeMethodAccessorImpl.invoke0(Native Method)
	at sun.reflect.NativeMethodAccessorImpl.invoke(NativeMethodAccessorImpl.java:62)
	at sun.reflect.DelegatingMethodAccessorImpl.invoke(DelegatingMethodAccessorImpl.java:43)
	at java.lang.reflect.Method.invoke(Method.java:498)
	at com.carrotsearch.randomizedtesting.RandomizedRunner.invoke(RandomizedRunner.java:1764)
	at com.carrotsearch.randomizedtesting.RandomizedRunner$8.evaluate(RandomizedRunner.java:871)
	at com.carrotsearch.randomizedtesting.RandomizedRunner$9.evaluate(RandomizedRunner.java:907)
	at com.carrotsearch.randomizedtesting.RandomizedRunner$10.evaluate(RandomizedRunner.java:921)
	at org.apache.solr.BaseDistributedSearchTestCase$ShardsRepeatRule$ShardsFixedStatement.callStatement(BaseDistributedSearchTestCase.java:985)
	at org.apache.solr.BaseDistributedSearchTestCase$ShardsRepeatRule$ShardsStatement.evaluate(BaseDistributedSearchTestCase.java:960)
	at com.carrotsearch.randomizedtesting.rules.SystemPropertiesRestoreRule$1.evaluate(SystemPropertiesRestoreRule.java:57)
	at org.apache.lucene.util.TestRuleSetupTeardownChained$1.evaluate(TestRuleSetupTeardownChained.java:49)
	at org.apache.lucene.util.AbstractBeforeAfterRule$1.evaluate(AbstractBeforeAfterRule.java:45)
	at org.apache.lucene.util.TestRuleThreadAndTestName$1.evaluate(TestRuleThreadAndTestName.java:48)
	at org.apache.lucene.util.TestRuleIgnoreAfterMaxFailures$1.evaluate(TestRuleIgnoreAfterMaxFailures.java:64)
	at org.apache.lucene.util.TestRuleMarkFailure$1.evaluate(TestRuleMarkFailure.java:47)
	at com.carrotsearch.randomizedtesting.rules.StatementAdapter.evaluate(StatementAdapter.java:36)
	at com.carrotsearch.randomizedtesting.ThreadLeakControl$StatementRunner.run(ThreadLeakControl.java:367)
	at com.carrotsearch.randomizedtesting.ThreadLeakControl.forkTimeoutingTask(ThreadLeakControl.java:809)
	at com.carrotsearch.randomizedtesting.ThreadLeakControl$3.evaluate(ThreadLeakControl.java:460)
	at com.carrotsearch.randomizedtesting.RandomizedRunner.runSingleTest(RandomizedRunner.java:880)
	at com.carrotsearch.randomizedtesting.RandomizedRunner$5.evaluate(RandomizedRunner.java:781)
	at com.carrotsearch.randomizedtesting.RandomizedRunner$6.evaluate(RandomizedRunner.java:816)
	at com.carrotsearch.randomizedtesting.RandomizedRunner$7.evaluate(RandomizedRunner.java:827)
	at com.carrotsearch.randomizedtesting.rules.StatementAdapter.evaluate(StatementAdapter.java:36)
	at com.carrotsearch.randomizedtesting.rules.SystemPropertiesRestoreRule$1.evaluate(SystemPropertiesRestoreRule.java:57)
	at org.apache.lucene.util.AbstractBeforeAfterRule$1.evaluate(AbstractBeforeAfterRule.java:45)
	at com.carrotsearch.randomizedtesting.rules.StatementAdapter.evaluate(StatementAdapter.java:36)
	at org.apache.lucene.util.TestRuleStoreClassName$1.evaluate(TestRuleStoreClassName.java:41)
	at com.carrotsearch.randomizedtesting.rules.NoShadowingOrOverridesOnMethodsRule$1.evaluate(NoShadowingOrOverridesOnMethodsRule.java:40)
	at com.carrotsearch.randomizedtesting.rules.NoShadowingOrOverridesOnMethodsRule$1.evaluate(NoShadowingOrOverridesOnMethodsRule.java:40)
	at com.carrotsearch.randomizedtesting.rules.StatementAdapter.evaluate(StatementAdapter.java:36)
	at com.carrotsearch.randomizedtesting.rules.StatementAdapter.evaluate(StatementAdapter.java:36)
	at com.carrotsearch.randomizedtesting.rules.StatementAdapter.evaluate(StatementAdapter.java:36)
	at org.apache.lucene.util.TestRuleAssertionsRequired$1.evaluate(TestRuleAssertionsRequired.java:53)
	at org.apache.lucene.util.TestRuleMarkFailure$1.evaluate(TestRuleMarkFailure.java:47)
	at org.apache.lucene.util.TestRuleIgnoreAfterMaxFailures$1.evaluate(TestRuleIgnoreAfterMaxFailures.java:64)
	at org.apache.lucene.util.TestRuleIgnoreTestSuites$1.evaluate(TestRuleIgnoreTestSuites.java:54)
	at com.carrotsearch.randomizedtesting.rules.StatementAdapter.evaluate(StatementAdapter.java:36)
	at com.carrotsearch.randomizedtesting.ThreadLeakControl$StatementRunner.run(ThreadLeakControl.java:367)
	at java.lang.Thread.run(Thread.java:745)
Caused by: org.apache.solr.client.solrj.SolrServerException: No live SolrServers available to handle this request:[http://127.0.0.1:39670/forceleader_test_collection_shard1_replica2]
	at org.apache.solr.client.solrj.impl.LBHttpSolrClient.request(LBHttpSolrClient.java:394)
	at org.apache.solr.client.solrj.impl.CloudSolrClient.directUpdate(CloudSolrClient.java:763)
	... 49 more
Caused by: org.apache.solr.client.solrj.SolrServerException: Server refused connection at: http://127.0.0.1:39670/forceleader_test_collection_shard1_replica2
	at org.apache.solr.client.solrj.impl.HttpSolrClient.executeMethod(HttpSolrClient.java:615)
	at org.apache.solr.client.solrj.impl.HttpSolrClient.request(HttpSolrClient.java:261)
	at org.apache.solr.client.solrj.impl.HttpSolrClient.request(HttpSolrClient.java:250)
	at org.apache.solr.client.solrj.impl.LBHttpSolrClient.doRequest(LBHttpSolrClient.java:415)
	at org.apache.solr.client.solrj.impl.LBHttpSolrClient.request(LBHttpSolrClient.java:383)
	... 50 more
Caused by: org.apache.http.conn.HttpHostConnectException: Connect to 127.0.0.1:39670 [/127.0.0.1] failed: Connection refused
	at org.apache.http.impl.conn.DefaultHttpClientConnectionOperator.connect(DefaultHttpClientConnectionOperator.java:151)
	at org.apache.http.impl.conn.PoolingHttpClientConnectionManager.connect(PoolingHttpClientConnectionManager.java:353)
	at org.apache.http.impl.execchain.MainClientExec.establishRoute(MainClientExec.java:380)
	at org.apache.http.impl.execchain.MainClientExec.execute(MainClientExec.java:236)
	at org.apache.http.impl.execchain.ProtocolExec.execute(ProtocolExec.java:184)
	at org.apache.http.impl.execchain.RetryExec.execute(RetryExec.java:88)
	at org.apache.http.impl.execchain.RedirectExec.execute(RedirectExec.java:110)
	at org.apache.http.impl.client.InternalHttpClient.doExecute(InternalHttpClient.java:184)
	at org.apache.http.impl.client.CloseableHttpClient.execute(CloseableHttpClient.java:82)
	at org.apache.http.impl.client.CloseableHttpClient.execute(CloseableHttpClient.java:55)
	at org.apache.solr.client.solrj.impl.HttpSolrClient.executeMethod(HttpSolrClient.java:513)
	... 54 more
Caused by: java.net.ConnectException: Connection refused
	at java.net.PlainSocketImpl.socketConnect(Native Method)
	at java.net.AbstractPlainSocketImpl.doConnect(AbstractPlainSocketImpl.java:350)
	at java.net.AbstractPlainSocketImpl.connectToAddress(AbstractPlainSocketImpl.java:206)
	at java.net.AbstractPlainSocketImpl.connect(AbstractPlainSocketImpl.java:188)
	at java.net.SocksSocketImpl.connect(SocksSocketImpl.java:392)
	at java.net.Socket.connect(Socket.java:589)
	at org.apache.http.conn.socket.PlainConnectionSocketFactory.connectSocket(PlainConnectionSocketFactory.java:74)
	at org.apache.http.impl.conn.DefaultHttpClientConnectionOperator.connect(DefaultHttpClientConnectionOperator.java:134)
	... 64 more




Build Log:
[...truncated 11987 lines...]
   [junit4] Suite: org.apache.solr.cloud.ForceLeaderTest
   [junit4]   2> Creating dataDir: /export/home/jenkins/workspace/Lucene-Solr-master-Solaris/solr/build/solr-core/test/J0/temp/solr.cloud.ForceLeaderTest_3C142C6198BE1AB8-001/init-core-data-001
   [junit4]   2> 2709317 INFO  (SUITE-ForceLeaderTest-seed#[3C142C6198BE1AB8]-worker) [    ] o.a.s.SolrTestCaseJ4 Randomized ssl (false) and clientAuth (false) via: @org.apache.solr.SolrTestCaseJ4$SuppressSSL(bugUrl=https://issues.apache.org/jira/browse/SOLR-5776)
   [junit4]   2> 2709318 INFO  (SUITE-ForceLeaderTest-seed#[3C142C6198BE1AB8]-worker) [    ] o.a.s.BaseDistributedSearchTestCase Setting hostContext system property: /
   [junit4]   2> 2709329 INFO  (TEST-ForceLeaderTest.testLastPublishedStateIsActive-seed#[3C142C6198BE1AB8]) [    ] o.a.s.c.ZkTestServer STARTING ZK TEST SERVER
   [junit4]   2> 2709329 INFO  (Thread-8082) [    ] o.a.s.c.ZkTestServer client port:0.0.0.0/0.0.0.0:0
   [junit4]   2> 2709329 INFO  (Thread-8082) [    ] o.a.s.c.ZkTestServer Starting server
   [junit4]   2> 2709439 INFO  (TEST-ForceLeaderTest.testLastPublishedStateIsActive-seed#[3C142C6198BE1AB8]) [    ] o.a.s.c.ZkTestServer start zk server on port:56362
   [junit4]   2> 2709439 INFO  (TEST-ForceLeaderTest.testLastPublishedStateIsActive-seed#[3C142C6198BE1AB8]) [    ] o.a.s.c.c.SolrZkClient Using default ZkCredentialsProvider
   [junit4]   2> 2709440 INFO  (TEST-ForceLeaderTest.testLastPublishedStateIsActive-seed#[3C142C6198BE1AB8]) [    ] o.a.s.c.c.ConnectionManager Waiting for client to connect to ZooKeeper
   [junit4]   2> 2709448 INFO  (zkCallback-2886-thread-1) [    ] o.a.s.c.c.ConnectionManager Watcher org.apache.solr.common.cloud.ConnectionManager@4d24661f name:ZooKeeperConnection Watcher:127.0.0.1:56362 got event WatchedEvent state:SyncConnected type:None path:null path:null type:None
   [junit4]   2> 2709448 INFO  (TEST-ForceLeaderTest.testLastPublishedStateIsActive-seed#[3C142C6198BE1AB8]) [    ] o.a.s.c.c.ConnectionManager Client is connected to ZooKeeper
   [junit4]   2> 2709449 INFO  (TEST-ForceLeaderTest.testLastPublishedStateIsActive-seed#[3C142C6198BE1AB8]) [    ] o.a.s.c.c.SolrZkClient Using default ZkACLProvider
   [junit4]   2> 2709449 INFO  (TEST-ForceLeaderTest.testLastPublishedStateIsActive-seed#[3C142C6198BE1AB8]) [    ] o.a.s.c.c.SolrZkClient makePath: /solr
   [junit4]   2> 2709456 INFO  (TEST-ForceLeaderTest.testLastPublishedStateIsActive-seed#[3C142C6198BE1AB8]) [    ] o.a.s.c.c.SolrZkClient Using default ZkCredentialsProvider
   [junit4]   2> 2709457 INFO  (TEST-ForceLeaderTest.testLastPublishedStateIsActive-seed#[3C142C6198BE1AB8]) [    ] o.a.s.c.c.ConnectionManager Waiting for client to connect to ZooKeeper
   [junit4]   2> 2709460 INFO  (zkCallback-2887-thread-1) [    ] o.a.s.c.c.ConnectionManager Watcher org.apache.solr.common.cloud.ConnectionManager@6e34b0db name:ZooKeeperConnection Watcher:127.0.0.1:56362/solr got event WatchedEvent state:SyncConnected type:None path:null path:null type:None
   [junit4]   2> 2709460 INFO  (TEST-ForceLeaderTest.testLastPublishedStateIsActive-seed#[3C142C6198BE1AB8]) [    ] o.a.s.c.c.ConnectionManager Client is connected to ZooKeeper
   [junit4]   2> 2709460 INFO  (TEST-ForceLeaderTest.testLastPublishedStateIsActive-seed#[3C142C6198BE1AB8]) [    ] o.a.s.c.c.SolrZkClient Using default ZkACLProvider
   [junit4]   2> 2709460 INFO  (TEST-ForceLeaderTest.testLastPublishedStateIsActive-seed#[3C142C6198BE1AB8]) [    ] o.a.s.c.c.SolrZkClient makePath: /collections/collection1
   [junit4]   2> 2709465 INFO  (TEST-ForceLeaderTest.testLastPublishedStateIsActive-seed#[3C142C6198BE1AB8]) [    ] o.a.s.c.c.SolrZkClient makePath: /collections/collection1/shards
   [junit4]   2> 2709468 INFO  (TEST-ForceLeaderTest.testLastPublishedStateIsActive-seed#[3C142C6198BE1AB8]) [    ] o.a.s.c.c.SolrZkClient makePath: /collections/control_collection
   [junit4]   2> 2709470 INFO  (TEST-ForceLeaderTest.testLastPublishedStateIsActive-seed#[3C142C6198BE1AB8]) [    ] o.a.s.c.c.SolrZkClient makePath: /collections/control_collection/shards
   [junit4]   2> 2709480 INFO  (TEST-ForceLeaderTest.testLastPublishedStateIsActive-seed#[3C142C6198BE1AB8]) [    ] o.a.s.c.AbstractZkTestCase put /export/home/jenkins/workspace/Lucene-Solr-master-Solaris/solr/core/src/test-files/solr/collection1/conf/solrconfig-tlog.xml to /configs/conf1/solrconfig.xml
   [junit4]   2> 2709481 INFO  (TEST-ForceLeaderTest.testLastPublishedStateIsActive-seed#[3C142C6198BE1AB8]) [    ] o.a.s.c.c.SolrZkClient makePath: /configs/conf1/solrconfig.xml
   [junit4]   2> 2709487 INFO  (TEST-ForceLeaderTest.testLastPublishedStateIsActive-seed#[3C142C6198BE1AB8]) [    ] o.a.s.c.AbstractZkTestCase put /export/home/jenkins/workspace/Lucene-Solr-master-Solaris/solr/core/src/test-files/solr/collection1/conf/schema.xml to /configs/conf1/schema.xml
   [junit4]   2> 2709487 INFO  (TEST-ForceLeaderTest.testLastPublishedStateIsActive-seed#[3C142C6198BE1AB8]) [    ] o.a.s.c.c.SolrZkClient makePath: /configs/conf1/schema.xml
   [junit4]   2> 2709491 INFO  (TEST-ForceLeaderTest.testLastPublishedStateIsActive-seed#[3C142C6198BE1AB8]) [    ] o.a.s.c.AbstractZkTestCase put /export/home/jenkins/workspace/Lucene-Solr-master-Solaris/solr/core/src/test-files/solr/collection1/conf/solrconfig.snippet.randomindexconfig.xml to /configs/conf1/solrconfig.snippet.randomindexconfig.xml
   [junit4]   2> 2709492 INFO  (TEST-ForceLeaderTest.testLastPublishedStateIsActive-seed#[3C142C6198BE1AB8]) [    ] o.a.s.c.c.SolrZkClient makePath: /configs/conf1/solrconfig.snippet.randomindexconfig.xml
   [junit4]   2> 2709496 INFO  (TEST-ForceLeaderTest.testLastPublishedStateIsActive-seed#[3C142C6198BE1AB8]) [    ] o.a.s.c.AbstractZkTestCase put /export/home/jenkins/workspace/Lucene-Solr-master-Solaris/solr/core/src/test-files/solr/collection1/conf/stopwords.txt to /configs/conf1/stopwords.txt
   [junit4]   2> 2709497 INFO  (TEST-ForceLeaderTest.testLastPublishedStateIsActive-seed#[3C142C6198BE1AB8]) [    ] o.a.s.c.c.SolrZkClient makePath: /configs/conf1/stopwords.txt
   [junit4]   2> 2709500 INFO  (TEST-ForceLeaderTest.testLastPublishedStateIsActive-seed#[3C142C6198BE1AB8]) [    ] o.a.s.c.AbstractZkTestCase put /export/home/jenkins/workspace/Lucene-Solr-master-Solaris/solr/core/src/test-files/solr/collection1/conf/protwords.txt to /configs/conf1/protwords.txt
   [junit4]   2> 2709501 INFO  (TEST-ForceLeaderTest.testLastPublishedStateIsActive-seed#[3C142C6198BE1AB8]) [    ] o.a.s.c.c.SolrZkClient makePath: /configs/conf1/protwords.txt
   [junit4]   2> 2709512 INFO  (TEST-ForceLeaderTest.testLastPublishedStateIsActive-seed#[3C142C6198BE1AB8]) [    ] o.a.s.c.AbstractZkTestCase put /export/home/jenkins/workspace/Lucene-Solr-master-Solaris/solr/core/src/test-files/solr/collection1/conf/currency.xml to /configs/conf1/currency.xml
   [junit4]   2> 2709513 INFO  (TEST-ForceLeaderTest.testLastPublishedStateIsActive-seed#[3C142C6198BE1AB8]) [    ] o.a.s.c.c.SolrZkClient makePath: /configs/conf1/currency.xml
   [junit4]   2> 2709516 INFO  (TEST-ForceLeaderTest.testLastPublishedStateIsActive-seed#[3C142C6198BE1AB8]) [    ] o.a.s.c.AbstractZkTestCase put /export/home/jenkins/workspace/Lucene-Solr-master-Solaris/solr/core/src/test-files/solr/collection1/conf/enumsConfig.xml to /configs/conf1/enumsConfig.xml
   [junit4]   2> 2709516 INFO  (TEST-ForceLeaderTest.testLastPublishedStateIsActive-seed#[3C142C6198BE1AB8]) [    ] o.a.s.c.c.SolrZkClient makePath: /configs/conf1/enumsConfig.xml
   [junit4]   2> 2709524 INFO  (TEST-ForceLeaderTest.testLastPublishedStateIsActive-seed#[3C142C6198BE1AB8]) [    ] o.a.s.c.AbstractZkTestCase put /export/home/jenkins/workspace/Lucene-Solr-master-Solaris/solr/core/src/test-files/solr/collection1/conf/open-exchange-rates.json to /configs/conf1/open-exchange-rates.json
   [junit4]   2> 2709525 INFO  (TEST-ForceLeaderTest.testLastPublishedStateIsActive-seed#[3C142C6198BE1AB8]) [    ] o.a.s.c.c.SolrZkClient makePath: /configs/conf1/open-exchange-rates.json
   [junit4]   2> 2709529 INFO  (TEST-ForceLeaderTest.testLastPublishedStateIsActive-seed#[3C142C6198BE1AB8]) [    ] o.a.s.c.AbstractZkTestCase put /export/home/jenkins/workspace/Lucene-Solr-master-Solaris/solr/core/src/test-files/solr/collection1/conf/mapping-ISOLatin1Accent.txt to /configs/conf1/mapping-ISOLatin1Accent.txt
   [junit4]   2> 2709530 INFO  (TEST-ForceLeaderTest.testLastPublishedStateIsActive-seed#[3C142C6198BE1AB8]) [    ] o.a.s.c.c.SolrZkClient makePath: /configs/conf1/mapping-ISOLatin1Accent.txt
   [junit4]   2> 2709534 INFO  (TEST-ForceLeaderTest.testLastPublishedStateIsActive-seed#[3C142C6198BE1AB8]) [    ] o.a.s.c.AbstractZkTestCase put /export/home/jenkins/workspace/Lucene-Solr-master-Solaris/solr/core/src/test-files/solr/collection1/conf/old_synonyms.txt to /configs/conf1/old_synonyms.txt
   [junit4]   2> 2709534 INFO  (TEST-ForceLeaderTest.testLastPublishedStateIsActive-seed#[3C142C6198BE1AB8]) [    ] o.a.s.c.c.SolrZkClient makePath: /configs/conf1/old_synonyms.txt
   [junit4]   2> 2709538 INFO  (TEST-ForceLeaderTest.testLastPublishedStateIsActive-seed#[3C142C6198BE1AB8]) [    ] o.a.s.c.AbstractZkTestCase put /export/home/jenkins/workspace/Lucene-Solr-master-Solaris/solr/core/src/test-files/solr/collection1/conf/synonyms.txt to /configs/conf1/synonyms.txt
   [junit4]   2> 2709538 INFO  (TEST-ForceLeaderTest.testLastPublishedStateIsActive-seed#[3C142C6198BE1AB8]) [    ] o.a.s.c.c.SolrZkClient makePath: /configs/conf1/synonyms.txt
   [junit4]   2> 2709784 INFO  (TEST-ForceLeaderTest.testLastPublishedStateIsActive-seed#[3C142C6198BE1AB8]) [    ] o.a.s.SolrTestCaseJ4 Writing core.properties file to /export/home/jenkins/workspace/Lucene-Solr-master-Solaris/solr/build/solr-core/test/J0/temp/solr.cloud.ForceLeaderTest_3C142C6198BE1AB8-001/control-001/cores/collection1
   [junit4]   2> 2709786 INFO  (TEST-ForceLeaderTest.testLastPublishedStateIsActive-seed#[3C142C6198BE1AB8]) [    ] o.e.j.s.Server jetty-9.3.8.v20160314
   [junit4]   2> 2709797 INFO  (TEST-ForceLeaderTest.testLastPublishedStateIsActive-seed#[3C142C6198BE1AB8]) [    ] o.e.j.s.h.ContextHandler Started o.e.j.s.ServletContextHandler@3801ea74{/,null,AVAILABLE}
   [junit4]   2> 2709797 INFO  (TEST-ForceLeaderTest.testLastPublishedStateIsActive-seed#[3C142C6198BE1AB8]) [    ] o.e.j.s.ServerConnector Started ServerConnector@5eb151a7{HTTP/1.1,[http/1.1]}{127.0.0.1:48818}
   [junit4]   2> 2709798 INFO  (TEST-ForceLeaderTest.testLastPublishedStateIsActive-seed#[3C142C6198BE1AB8]) [    ] o.e.j.s.Server Started @2712800ms
   [junit4]   2> 2709798 INFO  (TEST-ForceLeaderTest.testLastPublishedStateIsActive-seed#[3C142C6198BE1AB8]) [    ] o.a.s.c.s.e.JettySolrRunner Jetty properties: {solr.data.dir=/export/home/jenkins/workspace/Lucene-Solr-master-Solaris/solr/build/solr-core/test/J0/temp/solr.cloud.ForceLeaderTest_3C142C6198BE1AB8-001/tempDir-001/control/data, hostContext=/, hostPort=61792, coreRootDirectory=/export/home/jenkins/workspace/Lucene-Solr-master-Solaris/solr/build/solr-core/test/J0/temp/solr.cloud.ForceLeaderTest_3C142C6198BE1AB8-001/control-001/cores}
   [junit4]   2> 2709798 INFO  (TEST-ForceLeaderTest.testLastPublishedStateIsActive-seed#[3C142C6198BE1AB8]) [    ] o.a.s.s.SolrDispatchFilter SolrDispatchFilter.init(): sun.misc.Launcher$AppClassLoader@6d06d69c
   [junit4]   2> 2709798 INFO  (TEST-ForceLeaderTest.testLastPublishedStateIsActive-seed#[3C142C6198BE1AB8]) [    ] o.a.s.c.SolrResourceLoader new SolrResourceLoader for directory: '/export/home/jenkins/workspace/Lucene-Solr-master-Solaris/solr/build/solr-core/test/J0/temp/solr.cloud.ForceLeaderTest_3C142C6198BE1AB8-001/control-001'
   [junit4]   2> 2709798 INFO  (TEST-ForceLeaderTest.testLastPublishedStateIsActive-seed#[3C142C6198BE1AB8]) [    ] o.a.s.c.SolrResourceLoader JNDI not configured for solr (NoInitialContextEx)
   [junit4]   2> 2709798 INFO  (TEST-ForceLeaderTest.testLastPublishedStateIsActive-seed#[3C142C6198BE1AB8]) [    ] o.a.s.c.SolrResourceLoader solr home defaulted to 'solr/' (could not find system property or JNDI)
   [junit4]   2> 2709799 INFO  (TEST-ForceLeaderTest.testLastPublishedStateIsActive-seed#[3C142C6198BE1AB8]) [    ] o.a.s.c.c.SolrZkClient Using default ZkCredentialsProvider
   [junit4]   2> 2709799 INFO  (TEST-ForceLeaderTest.testLastPublishedStateIsActive-seed#[3C142C6198BE1AB8]) [    ] o.a.s.c.c.ConnectionManager Waiting for client to connect to ZooKeeper
   [junit4]   2> 2709827 INFO  (zkCallback-2888-thread-1) [    ] o.a.s.c.c.ConnectionManager Watcher org.apache.solr.common.cloud.ConnectionManager@2d2fcd0f name:ZooKeeperConnection Watcher:127.0.0.1:56362/solr got event WatchedEvent state:SyncConnected type:None path:null path:null type:None
   [junit4]   2> 2709828 INFO  (TEST-ForceLeaderTest.testLastPublishedStateIsActive-seed#[3C142C6198BE1AB8]) [    ] o.a.s.c.c.ConnectionManager Client is connected to ZooKeeper
   [junit4]   2> 2709894 INFO  (TEST-ForceLeaderTest.testLastPublishedStateIsActive-seed#[3C142C6198BE1AB8]) [    ] o.a.s.c.c.SolrZkClient Using default ZkACLProvider
   [junit4]   2> 2709901 INFO  (TEST-ForceLeaderTest.testLastPublishedStateIsActive-seed#[3C142C6198BE1AB8]) [    ] o.a.s.s.SolrDispatchFilter Loading solr.xml from SolrHome (not found in ZooKeeper)
   [junit4]   2> 2709901 INFO  (TEST-ForceLeaderTest.testLastPublishedStateIsActive-seed#[3C142C6198BE1AB8]) [    ] o.a.s.c.SolrXmlConfig Loading container configuration from /export/home/jenkins/workspace/Lucene-Solr-master-Solaris/solr/build/solr-core/test/J0/temp/solr.cloud.ForceLeaderTest_3C142C6198BE1AB8-001/control-001/solr.xml
   [junit4]   2> 2709913 INFO  (TEST-ForceLeaderTest.testLastPublishedStateIsActive-seed#[3C142C6198BE1AB8]) [    ] o.a.s.c.CorePropertiesLocator Config-defined core root directory: /export/home/jenkins/workspace/Lucene-Solr-master-Solaris/solr/build/solr-core/test/J0/temp/solr.cloud.ForceLeaderTest_3C142C6198BE1AB8-001/control-001/cores
   [junit4]   2> 2709913 INFO  (TEST-ForceLeaderTest.testLastPublishedStateIsActive-seed#[3C142C6198BE1AB8]) [    ] o.a.s.c.CoreContainer New CoreContainer 826756048
   [junit4]   2> 2709913 INFO  (TEST-ForceLeaderTest.testLastPublishedStateIsActive-seed#[3C142C6198BE1AB8]) [    ] o.a.s.c.CoreContainer Loading cores into CoreContainer [instanceDir=/export/home/jenkins/workspace/Lucene-Solr-master-Solaris/solr/build/solr-core/test/J0/temp/solr.cloud.ForceLeaderTest_3C142C6198BE1AB8-001/control-001]
   [junit4]   2> 2709913 WARN  (TEST-ForceLeaderTest.testLastPublishedStateIsActive-seed#[3C142C6198BE1AB8]) [    ] o.a.s.c.CoreContainer Couldn't add files from /export/home/jenkins/workspace/Lucene-Solr-master-Solaris/solr/build/solr-core/test/J0/temp/solr.cloud.ForceLeaderTest_3C142C6198BE1AB8-001/control-001/lib to classpath: /export/home/jenkins/workspace/Lucene-Solr-master-Solaris/solr/build/solr-core/test/J0/temp/solr.cloud.ForceLeaderTest_3C142C6198BE1AB8-001/control-001/lib
   [junit4]   2> 2709913 INFO  (TEST-ForceLeaderTest.testLastPublishedStateIsActive-seed#[3C142C6198BE1AB8]) [    ] o.a.s.h.c.HttpShardHandlerFactory created with socketTimeout : 90000,urlScheme : ,connTimeout : 15000,maxConnectionsPerHost : 20,maxConnections : 10000,corePoolSize : 0,maximumPoolSize : 2147483647,maxThreadIdleTime : 5,sizeOfQueue : -1,fairnessPolicy : false,
   [junit4]   2> 2709917 INFO  (TEST-ForceLeaderTest.testLastPublishedStateIsActive-seed#[3C142C6198BE1AB8]) [    ] o.a.s.u.UpdateShardHandler Created UpdateShardHandler HTTP client with params: socketTimeout=340000&connTimeout=45000&maxConnections=100000&maxConnectionsPerHost=100000
   [junit4]   2> 2709917 INFO  (TEST-ForceLeaderTest.testLastPublishedStateIsActive-seed#[3C142C6198BE1AB8]) [    ] o.a.s.l.LogWatcher SLF4J impl is org.slf4j.impl.Log4jLoggerFactory
   [junit4]   2> 2709917 INFO  (TEST-ForceLeaderTest.testLastPublishedStateIsActive-seed#[3C142C6198BE1AB8]) [    ] o.a.s.l.LogWatcher Registering Log Listener [Log4j (org.slf4j.impl.Log4jLoggerFactory)]
   [junit4]   2> 2709917 INFO  (TEST-ForceLeaderTest.testLastPublishedStateIsActive-seed#[3C142C6198BE1AB8]) [    ] o.a.s.c.ZkContainer Zookeeper client=127.0.0.1:56362/solr
   [junit4]   2> 2709917 INFO  (TEST-ForceLeaderTest.testLastPublishedStateIsActive-seed#[3C142C6198BE1AB8]) [    ] o.a.s.c.ZkController zkHost includes chroot
   [junit4]   2> 2709917 INFO  (TEST-ForceLeaderTest.testLastPublishedStateIsActive-seed#[3C142C6198BE1AB8]) [    ] o.a.s.c.c.SolrZkClient Using default ZkCredentialsProvider
   [junit4]   2> 2709919 INFO  (TEST-ForceLeaderTest.testLastPublishedStateIsActive-seed#[3C142C6198BE1AB8]) [    ] o.a.s.c.c.ConnectionManager Waiting for client to connect to ZooKeeper
   [junit4]   2> 2709923 INFO  (zkCallback-2891-thread-1) [    ] o.a.s.c.c.ConnectionManager Watcher org.apache.solr.common.cloud.ConnectionManager@14eda4c6 name:ZooKeeperConnection Watcher:127.0.0.1:56362 got event WatchedEvent state:SyncConnected type:None path:null path:null type:None
   [junit4]   2> 2709924 INFO  (TEST-ForceLeaderTest.testLastPublishedStateIsActive-seed#[3C142C6198BE1AB8]) [    ] o.a.s.c.c.ConnectionManager Client is connected to ZooKeeper
   [junit4]   2> 2709924 INFO  (TEST-ForceLeaderTest.testLastPublishedStateIsActive-seed#[3C142C6198BE1AB8]) [    ] o.a.s.c.c.SolrZkClient Using default ZkACLProvider
   [junit4]   2> 2709926 INFO  (TEST-ForceLeaderTest.testLastPublishedStateIsActive-seed#[3C142C6198BE1AB8]) [n:127.0.0.1:61792_    ] o.a.s.c.ZkController Added new OnReconnect listener org.apache.solr.cloud.ZkController$$Lambda$67/271644614@42421af4
   [junit4]   2> 2709926 INFO  (TEST-ForceLeaderTest.testLastPublishedStateIsActive-seed#[3C142C6198BE1AB8]) [n:127.0.0.1:61792_    ] o.a.s.c.c.ConnectionManager Waiting for client to connect to ZooKeeper
   [junit4]   2> 2709929 INFO  (zkCallback-2892-thread-1-processing-n:127.0.0.1:61792_) [n:127.0.0.1:61792_    ] o.a.s.c.c.ConnectionManager Watcher org.apache.solr.common.cloud.ConnectionManager@4aec9e95 name:ZooKeeperConnection Watcher:127.0.0.1:56362/solr got event WatchedEvent state:SyncConnected type:None path:null path:null type:None
   [junit4]   2> 2709929 INFO  (TEST-ForceLeaderTest.testLastPublishedStateIsActive-seed#[3C142C6198BE1AB8]) [n:127.0.0.1:61792_    ] o.a.s.c.c.ConnectionManager Client is connected to ZooKeeper
   [junit4]   2> 2709931 INFO  (TEST-ForceLeaderTest.testLastPublishedStateIsActive-seed#[3C142C6198BE1AB8]) [n:127.0.0.1:61792_    ] o.a.s.c.c.SolrZkClient makePath: /overseer/queue
   [junit4]   2> 2709945 INFO  (TEST-ForceLeaderTest.testLastPublishedStateIsActive-seed#[3C142C6198BE1AB8]) [n:127.0.0.1:61792_    ] o.a.s.c.c.SolrZkClient makePath: /overseer/collection-queue-work
   [junit4]   2> 2709952 INFO  (TEST-ForceLeaderTest.testLastPublishedStateIsActive-seed#[3C142C6198BE1AB8]) [n:127.0.0.1:61792_    ] o.a.s.c.c.SolrZkClient makePath: /overseer/collection-map-running
   [junit4]   2> 2709956 INFO  (TEST-ForceLeaderTest.testLastPublishedStateIsActive-seed#[3C142C6198BE1AB8]) [n:127.0.0.1:61792_    ] o.a.s.c.c.SolrZkClient makePath: /overseer/collection-map-completed
   [junit4]   2> 2709960 INFO  (TEST-ForceLeaderTest.testLastPublishedStateIsActive-seed#[3C142C6198BE1AB8]) [n:127.0.0.1:61792_    ] o.a.s.c.c.SolrZkClient makePath: /overseer/collection-map-failure
   [junit4]   2> 2709964 INFO  (TEST-ForceLeaderTest.testLastPublishedStateIsActive-seed#[3C142C6198BE1AB8]) [n:127.0.0.1:61792_    ] o.a.s.c.c.SolrZkClient makePath: /live_nodes
   [junit4]   2> 2709967 INFO  (TEST-ForceLeaderTest.testLastPublishedStateIsActive-seed#[3C142C6198BE1AB8]) [n:127.0.0.1:61792_    ] o.a.s.c.c.SolrZkClient makePath: /aliases.json
   [junit4]   2> 2709970 INFO  (TEST-ForceLeaderTest.testLastPublishedStateIsActive-seed#[3C142C6198BE1AB8]) [n:127.0.0.1:61792_    ] o.a.s.c.c.SolrZkClient makePath: /clusterstate.json
   [junit4]   2> 2709973 INFO  (TEST-ForceLeaderTest.testLastPublishedStateIsActive-seed#[3C142C6198BE1AB8]) [n:127.0.0.1:61792_    ] o.a.s.c.c.SolrZkClient makePath: /security.json
   [junit4]   2> 2709975 INFO  (TEST-ForceLeaderTest.testLastPublishedStateIsActive-seed#[3C142C6198BE1AB8]) [n:127.0.0.1:61792_    ] o.a.s.c.c.ZkStateReader Updating cluster state from ZooKeeper... 
   [junit4]   2> 2709976 INFO  (TEST-ForceLeaderTest.testLastPublishedStateIsActive-seed#[3C142C6198BE1AB8]) [n:127.0.0.1:61792_    ] o.a.s.c.c.ZkStateReader Loaded empty cluster properties
   [junit4]   2> 2709978 INFO  (TEST-ForceLeaderTest.testLastPublishedStateIsActive-seed#[3C142C6198BE1AB8]) [n:127.0.0.1:61792_    ] o.a.s.c.c.ZkStateReader Updated live nodes from ZooKeeper... (0) -> (0)
   [junit4]   2> 2709983 INFO  (TEST-ForceLeaderTest.testLastPublishedStateIsActive-seed#[3C142C6198BE1AB8]) [n:127.0.0.1:61792_    ] o.a.s.c.c.SolrZkClient makePath: /overseer_elect
   [junit4]   2> 2709985 INFO  (TEST-ForceLeaderTest.testLastPublishedStateIsActive-seed#[3C142C6198BE1AB8]) [n:127.0.0.1:61792_    ] o.a.s.c.c.SolrZkClient makePath: /overseer_elect/election
   [junit4]   2> 2709987 INFO  (TEST-ForceLeaderTest.testLastPublishedStateIsActive-seed#[3C142C6198BE1AB8]) [n:127.0.0.1:61792_    ] o.a.s.c.Overseer Overseer (id=null) closing
   [junit4]   2> 2709988 INFO  (TEST-ForceLeaderTest.testLastPublishedStateIsActive-seed#[3C142C6198BE1AB8]) [n:127.0.0.1:61792_    ] o.a.s.c.LeaderElector Joined leadership election with path: /overseer_elect/election/96528159769559044-127.0.0.1:61792_-n_0000000000
   [junit4]   2> 2709989 INFO  (TEST-ForceLeaderTest.testLastPublishedStateIsActive-seed#[3C142C6198BE1AB8]) [n:127.0.0.1:61792_    ] o.a.s.c.OverseerElectionContext I am going to be the leader 127.0.0.1:61792_
   [junit4]   2> 2709989 INFO  (TEST-ForceLeaderTest.testLastPublishedStateIsActive-seed#[3C142C6198BE1AB8]) [n:127.0.0.1:61792_    ] o.a.s.c.c.SolrZkClient makePath: /overseer_elect/leader
   [junit4]   2> 2709991 INFO  (TEST-ForceLeaderTest.testLastPublishedStateIsActive-seed#[3C142C6198BE1AB8]) [n:127.0.0.1:61792_    ] o.a.s.c.Overseer Overseer (id=96528159769559044-127.0.0.1:61792_-n_0000000000) starting
   [junit4]   2> 2709999 INFO  (TEST-ForceLeaderTest.testLastPublishedStateIsActive-seed#[3C142C6198BE1AB8]) [n:127.0.0.1:61792_    ] o.a.s.c.c.SolrZkClient makePath: /overseer/queue-work
   [junit4]   2> 2710024 INFO  (TEST-ForceLeaderTest.testLastPublishedStateIsActive-seed#[3C142C6198BE1AB8]) [n:127.0.0.1:61792_    ] o.a.s.c.OverseerAutoReplicaFailoverThread Starting OverseerAutoReplicaFailoverThread autoReplicaFailoverWorkLoopDelay=10000 autoReplicaFailoverWaitAfterExpiration=10000 autoReplicaFailoverBadNodeExpiration=60000
   [junit4]   2> 2710025 INFO  (TEST-ForceLeaderTest.testLastPublishedStateIsActive-seed#[3C142C6198BE1AB8]) [n:127.0.0.1:61792_    ] o.a.s.c.ZkController Register node as live in ZooKeeper:/live_nodes/127.0.0.1:61792_
   [junit4]   2> 2710026 INFO  (TEST-ForceLeaderTest.testLastPublishedStateIsActive-seed#[3C142C6198BE1AB8]) [n:127.0.0.1:61792_    ] o.a.s.c.c.SolrZkClient makePath: /live_nodes/127.0.0.1:61792_
   [junit4]   2> 2710033 INFO  (OverseerCollectionConfigSetProcessor-96528159769559044-127.0.0.1:61792_-n_0000000000) [n:127.0.0.1:61792_    ] o.a.s.c.OverseerTaskProcessor Process current queue of overseer operations
   [junit4]   2> 2710047 INFO  (OverseerStateUpdate-96528159769559044-127.0.0.1:61792_-n_0000000000) [n:127.0.0.1:61792_    ] o.a.s.c.Overseer Starting to work on the main queue
   [junit4]   2> 2710048 INFO  (zkCallback-2892-thread-1-processing-n:127.0.0.1:61792_) [n:127.0.0.1:61792_    ] o.a.s.c.c.ZkStateReader A live node change: [WatchedEvent state:SyncConnected type:NodeChildrenChanged path:/live_nodes], has occurred - updating... (live nodes size: [0])
   [junit4]   2> 2710048 INFO  (zkCallback-2892-thread-1-processing-n:127.0.0.1:61792_) [n:127.0.0.1:61792_    ] o.a.s.c.c.ZkStateReader Updated live nodes from ZooKeeper... (0) -> (1)
   [junit4]   2> 2710050 INFO  (OverseerStateUpdate-96528159769559044-127.0.0.1:61792_-n_0000000000) [n:127.0.0.1:61792_    ] o.a.s.c.c.ZkStateReader Updated live nodes from ZooKeeper... (1) -> (1)
   [junit4]   2> 2710118 INFO  (TEST-ForceLeaderTest.testLastPublishedStateIsActive-seed#[3C142C6198BE1AB8]) [n:127.0.0.1:61792_    ] o.a.s.c.CoreContainer Security conf doesn't exist. Skipping setup for authorization module.
   [junit4]   2> 2710119 INFO  (TEST-ForceLeaderTest.testLastPublishedStateIsActive-seed#[3C142C6198BE1AB8]) [n:127.0.0.1:61792_    ] o.a.s.c.CoreContainer No authentication plugin used.
   [junit4]   2> 2710120 INFO  (TEST-ForceLeaderTest.testLastPublishedStateIsActive-seed#[3C142C6198BE1AB8]) [n:127.0.0.1:61792_    ] o.a.s.c.CorePropertiesLocator Looking for core definitions underneath /export/home/jenkins/workspace/Lucene-Solr-master-Solaris/solr/build/solr-core/test/J0/temp/solr.cloud.ForceLeaderTest_3C142C6198BE1AB8-001/control-001/cores
   [junit4]   2> 2710121 INFO  (TEST-ForceLeaderTest.testLastPublishedStateIsActive-seed#[3C142C6198BE1AB8]) [n:127.0.0.1:61792_    ] o.a.s.c.CoreDescriptor Created CoreDescriptor: {name=collection1, config=solrconfig.xml, transient=false, schema=schema.xml, loadOnStartup=true, configSetProperties=configsetprops.json, collection=control_collection, coreNodeName=, dataDir=data/, shard=}
   [junit4]   2> 2710121 INFO  (TEST-ForceLeaderTest.testLastPublishedStateIsActive-seed#[3C142C6198BE1AB8]) [n:127.0.0.1:61792_    ] o.a.s.c.CorePropertiesLocator Found core collection1 in /export/home/jenkins/workspace/Lucene-Solr-master-Solaris/solr/build/solr-core/test/J0/temp/solr.cloud.ForceLeaderTest_3C142C6198BE1AB8-001/control-001/cores/collection1
   [junit4]   2> 2710122 INFO  (TEST-ForceLeaderTest.testLastPublishedStateIsActive-seed#[3C142C6198BE1AB8]) [n:127.0.0.1:61792_    ] o.a.s.c.CorePropertiesLocator Found 1 core definitions
   [junit4]   2> 2710123 INFO  (TEST-ForceLeaderTest.testLastPublishedStateIsActive-seed#[3C142C6198BE1AB8]) [n:127.0.0.1:61792_    ] o.a.s.s.SolrDispatchFilter user.dir=/export/home/jenkins/workspace/Lucene-Solr-master-Solaris/solr/build/solr-core/test/J0
   [junit4]   2> 2710124 INFO  (TEST-ForceLeaderTest.testLastPublishedStateIsActive-seed#[3C142C6198BE1AB8]) [n:127.0.0.1:61792_    ] o.a.s.s.SolrDispatchFilter SolrDispatchFilter.init() done
   [junit4]   2> 2710124 INFO  (coreLoadExecutor-8343-thread-1-processing-n:127.0.0.1:61792_) [n:127.0.0.1:61792_ c:control_collection   x:collection1] o.a.s.c.ZkController publishing state=down
   [junit4]   2> 2710124 INFO  (coreLoadExecutor-8343-thread-1-processing-n:127.0.0.1:61792_) [n:127.0.0.1:61792_ c:control_collection   x:collection1] o.a.s.c.ZkController numShards not found on descriptor - reading it from system property
   [junit4]   2> 2710126 INFO  (OverseerStateUpdate-96528159769559044-127.0.0.1:61792_-n_0000000000) [n:127.0.0.1:61792_    ] o.a.s.c.Overseer processMessage: queueSize: 1, message = {
   [junit4]   2>   "core":"collection1",
   [junit4]   2>   "roles":null,
   [junit4]   2>   "base_url":"http://127.0.0.1:61792",
   [junit4]   2>   "node_name":"127.0.0.1:61792_",
   [junit4]   2>   "numShards":"1",
   [junit4]   2>   "state":"down",
   [junit4]   2>   "shard":null,
   [junit4]   2>   "collection":"control_collection",
   [junit4]   2>   "operation":"state"} current state version: 0
   [junit4]   2> 2710126 INFO  (OverseerStateUpdate-96528159769559044-127.0.0.1:61792_-n_0000000000) [n:127.0.0.1:61792_    ] o.a.s.c.o.ReplicaMutator Update state numShards=1 message={
   [junit4]   2>   "core":"collection1",
   [junit4]   2>   "roles":null,
   [junit4]   2>   "base_url":"http://127.0.0.1:61792",
   [junit4]   2>   "node_name":"127.0.0.1:61792_",
   [junit4]   2>   "numShards":"1",
   [junit4]   2>   "state":"down",
   [junit4]   2>   "shard":null,
   [junit4]   2>   "collection":"control_collection",
   [junit4]   2>   "operation":"state"}
   [junit4]   2> 2710127 INFO  (OverseerStateUpdate-96528159769559044-127.0.0.1:61792_-n_0000000000) [n:127.0.0.1:61792_    ] o.a.s.c.o.ClusterStateMutator building a new cName: control_collection
   [junit4]   2> 2710127 INFO  (OverseerStateUpdate-96528159769559044-127.0.0.1:61792_-n_0000000000) [n:127.0.0.1:61792_    ] o.a.s.c.o.ReplicaMutator Assigning new node to shard shard=shard1
   [junit4]   2> 2710131 INFO  (zkCallback-2892-thread-2-processing-n:127.0.0.1:61792_) [n:127.0.0.1:61792_    ] o.a.s.c.c.ZkStateReader A cluster state change: [WatchedEvent state:SyncConnected type:NodeDataChanged path:/clusterstate.json], has occurred - updating... (live nodes size: [1])
   [junit4]   2> 2710132 INFO  (coreLoadExecutor-8343-thread-1-processing-n:127.0.0.1:61792_) [n:127.0.0.1:61792_ c:control_collection   x:collection1] o.a.s.c.ZkController Collection control_collection not visible yet, but flagging it so a watch is registered when it becomes visible
   [junit4]   2> 2710133 INFO  (coreLoadExecutor-8343-thread-1-processing-n:127.0.0.1:61792_) [n:127.0.0.1:61792_ c:control_collection   x:collection1] o.a.s.c.c.ZkStateReader Deleting data for [control_collection]
   [junit4]   2> 2710134 INFO  (coreLoadExecutor-8343-thread-1-processing-n:127.0.0.1:61792_) [n:127.0.0.1:61792_ c:control_collection   x:collection1] o.a.s.c.ZkController look for our core node name
   [junit4]   2> 2710134 INFO  (coreLoadExecutor-8343-thread-1-processing-n:127.0.0.1:61792_) [n:127.0.0.1:61792_ c:control_collection   x:collection1] o.a.s.c.ZkController waiting to find shard id in clusterstate for collection1
   [junit4]   2> 2710134 INFO  (coreLoadExecutor-8343-thread-1-processing-n:127.0.0.1:61792_) [n:127.0.0.1:61792_ c:control_collection   x:collection1] o.a.s.c.ZkController Check for collection zkNode:control_collection
   [junit4]   2> 2710135 INFO  (coreLoadExecutor-8343-thread-1-processing-n:127.0.0.1:61792_) [n:127.0.0.1:61792_ c:control_collection   x:collection1] o.a.s.c.ZkController Collection zkNode exists
   [junit4]   2> 2710135 INFO  (coreLoadExecutor-8343-thread-1-processing-n:127.0.0.1:61792_) [n:127.0.0.1:61792_ c:control_collection   x:collection1] o.a.s.c.c.ZkStateReader Load collection config from: [/collections/control_collection]
   [junit4]   2> 2710136 INFO  (coreLoadExecutor-8343-thread-1-processing-n:127.0.0.1:61792_) [n:127.0.0.1:61792_ c:control_collection   x:collection1] o.a.s.c.c.ZkStateReader path=[/collections/control_collection] [configName]=[conf1] specified config exists in ZooKeeper
   [junit4]   2> 2710136 INFO  (coreLoadExecutor-8343-thread-1-processing-n:127.0.0.1:61792_) [n:127.0.0.1:61792_ c:control_collection   x:collection1] o.a.s.c.SolrResourceLoader new SolrResourceLoader for directory: '/export/home/jenkins/workspace/Lucene-Solr-master-Solaris/solr/build/solr-core/test/J0/temp/solr.cloud.ForceLeaderTest_3C142C6198BE1AB8-001/control-001/cores/collection1'
   [junit4]   2> 2710136 INFO  (coreLoadExecutor-8343-thread-1-processing-n:127.0.0.1:61792_) [n:127.0.0.1:61792_ c:control_collection   x:collection1] o.a.s.c.SolrResourceLoader JNDI not configured for solr (NoInitialContextEx)
   [junit4]   2> 2710136 INFO  (coreLoadExecutor-8343-thread-1-processing-n:127.0.0.1:61792_) [n:127.0.0.1:61792_ c:control_collection   x:collection1] o.a.s.c.SolrResourceLoader solr home defaulted to 'solr/' (could not find system property or JNDI)
   [junit4]   2> 2710138 INFO  (coreLoadExecutor-8343-thread-1-processing-n:127.0.0.1:61792_) [n:127.0.0.1:61792_ c:control_collection   x:collection1] o.a.s.c.Config loaded config solrconfig.xml with version 0 
   [junit4]   2> 2710150 INFO  (coreLoadExecutor-8343-thread-1-processing-n:127.0.0.1:61792_) [n:127.0.0.1:61792_ c:control_collection   x:collection1] o.a.s.c.SolrConfig current version of requestparams : -1
   [junit4]   2> 2710156 INFO  (coreLoadExecutor-8343-thread-1-processing-n:127.0.0.1:61792_) [n:127.0.0.1:61792_ c:control_collection   x:collection1] o.a.s.c.SolrConfig Using Lucene MatchVersion: 7.0.0
   [junit4]   2> 2710169 INFO  (coreLoadExecutor-8343-thread-1-processing-n:127.0.0.1:61792_) [n:127.0.0.1:61792_ c:control_collection   x:collection1] o.a.s.c.SolrConfig Loaded SolrConfig: solrconfig.xml
   [junit4]   2> 2710180 INFO  (coreLoadExecutor-8343-thread-1-processing-n:127.0.0.1:61792_) [n:127.0.0.1:61792_ c:control_collection   x:collection1] o.a.s.s.IndexSchema [collection1] Schema name=test
   [junit4]   2> 2710405 INFO  (coreLoadExecutor-8343-thread-1-processing-n:127.0.0.1:61792_) [n:127.0.0.1:61792_ c:control_collection   x:collection1] o.a.s.s.OpenExchangeRatesOrgProvider Initialized with rates=open-exchange-rates.json, refreshInterval=1440.
   [junit4]   2> 2710413 INFO  (coreLoadExecutor-8343-thread-1-processing-n:127.0.0.1:61792_) [n:127.0.0.1:61792_ c:control_collection   x:collection1] o.a.s.s.IndexSchema default search field in schema is text
   [junit4]   2> 2710415 INFO  (coreLoadExecutor-8343-thread-1-processing-n:127.0.0.1:61792_) [n:127.0.0.1:61792_ c:control_collection   x:collection1] o.a.s.s.IndexSchema unique key field: id
   [junit4]   2> 2710465 INFO  (coreLoadExecutor-8343-thread-1-processing-n:127.0.0.1:61792_) [n:127.0.0.1:61792_ c:control_collection   x:collection1] o.a.s.s.FileExchangeRateProvider Reloading exchange rates from file currency.xml
   [junit4]   2> 2710473 INFO  (coreLoadExecutor-8343-thread-1-processing-n:127.0.0.1:61792_) [n:127.0.0.1:61792_ c:control_collection   x:collection1] o.a.s.s.FileExchangeRateProvider Reloading exchange rates from file currency.xml
   [junit4]   2> 2710477 INFO  (coreLoadExecutor-8343-thread-1-processing-n:127.0.0.1:61792_) [n:127.0.0.1:61792_ c:control_collection   x:collection1] o.a.s.s.OpenExchangeRatesOrgProvider Reloading exchange rates from open-exchange-rates.json
   [junit4]   2> 2710495 INFO  (coreLoadExecutor-8343-thread-1-processing-n:127.0.0.1:61792_) [n:127.0.0.1:61792_ c:control_collection   x:collection1] o.a.s.s.OpenExchangeRatesOrgProvider Reloading exchange rates from open-exchange-rates.json
   [junit4]   2> 2710511 INFO  (coreLoadExecutor-8343-thread-1-processing-n:127.0.0.1:61792_) [n:127.0.0.1:61792_ c:control_collection   x:collection1] o.a.s.c.ConfigSetProperties Did not find ConfigSet properties, assuming default properties: Can't find resource 'configsetprops.json' in classpath or '/configs/conf1', cwd=/export/home/jenkins/workspace/Lucene-Solr-master-Solaris/solr/build/solr-core/test/J0
   [junit4]   2> 2710511 INFO  (coreLoadExecutor-8343-thread-1-processing-n:127.0.0.1:61792_) [n:127.0.0.1:61792_ c:control_collection   x:collection1] o.a.s.c.CoreContainer Creating SolrCore 'collection1' using configuration from collection control_collection
   [junit4]   2> 2710511 INFO  (coreLoadExecutor-8343-thread-1-processing-n:127.0.0.1:61792_) [n:127.0.0.1:61792_ c:control_collection s:shard1 r:core_node1 x:collection1] o.a.s.c.SolrCore org.apache.solr.core.MockDirectoryFactory
   [junit4]   2> 2710512 INFO  (coreLoadExecutor-8343-thread-1-processing-n:127.0.0.1:61792_) [n:127.0.0.1:61792_ c:control_collection s:shard1 r:core_node1 x:collection1] o.a.s.c.SolrCore [[collection1] ] Opening new SolrCore at [/export/home/jenkins/workspace/Lucene-Solr-master-Solaris/solr/build/solr-core/test/J0/temp/solr.cloud.ForceLeaderTest_3C142C6198BE1AB8-001/control-001/cores/collection1], dataDir=[/export/home/jenkins/workspace/Lucene-Solr-master-Solaris/solr/build/solr-core/test/J0/temp/solr.cloud.ForceLeaderTest_3C142C6198BE1AB8-001/control-001/cores/collection1/data/]
   [junit4]   2> 2710512 INFO  (coreLoadExecutor-8343-thread-1-processing-n:127.0.0.1:61792_) [n:127.0.0.1:61792_ c:control_collection s:shard1 r:core_node1 x:collection1] o.a.s.c.JmxMonitoredMap JMX monitoring is enabled. Adding Solr mbeans to JMX Server: com.sun.jmx.mbeanserver.JmxMBeanServer@ba9d458
   [junit4]   2> 2710512 INFO  (coreLoadExecutor-8343-thread-1-processing-n:127.0.0.1:61792_) [n:127.0.0.1:61792_ c:control_collection s:shard1 r:core_node1 x:collection1] o.a.s.c.CachingDirectoryFactory return new directory for /export/home/jenkins/workspace/Lucene-Solr-master-Solaris/solr/build/solr-core/test/J0/temp/solr.cloud.ForceLeaderTest_3C142C6198BE1AB8-001/control-001/cores/collection1/data/snapshot_metadata
   [junit4]   2> 2710512 INFO  (coreLoadExecutor-8343-thread-1-processing-n:127.0.0.1:61792_) [n:127.0.0.1:61792_ c:control_collection s:shard1 r:core_node1 x:collection1] o.a.s.c.s.SolrSnapshotMetaDataManager Loading from snapshot metadata file...
   [junit4]   2> 2710513 INFO  (coreLoadExecutor-8343-thread-1-processing-n:127.0.0.1:61792_) [n:127.0.0.1:61792_ c:control_collection s:shard1 r:core_node1 x:collection1] o.a.s.c.CachingDirectoryFactory return new directory for /export/home/jenkins/workspace/Lucene-Solr-master-Solaris/solr/build/solr-core/test/J0/temp/solr.cloud.ForceLeaderTest_3C142C6198BE1AB8-001/control-001/cores/collection1/data
   [junit4]   2> 2710513 INFO  (coreLoadExecutor-8343-thread-1-processing-n:127.0.0.1:61792_) [n:127.0.0.1:61792_ c:control_collection s:shard1 r:core_node1 x:collection1] o.a.s.c.SolrCore New index directory detected: old=null new=/export/home/jenkins/workspace/Lucene-Solr-master-Solaris/solr/build/solr-core/test/J0/temp/solr.cloud.ForceLeaderTest_3C142C6198BE1AB8-001/control-001/cores/collection1/data/index/
   [junit4]   2> 2710513 WARN  (coreLoadExecutor-8343-thread-1-processing-n:127.0.0.1:61792_) [n:127.0.0.1:61792_ c:control_collection s:shard1 r:core_node1 x:collection1] o.a.s.c.SolrCore [collection1] Solr index directory '/export/home/jenkins/workspace/Lucene-Solr-master-Solaris/solr/build/solr-core/test/J0/temp/solr.cloud.ForceLeaderTest_3C142C6198BE1AB8-001/control-001/cores/collection1/data/index' doesn't exist. Creating new index...
   [junit4]   2> 2710513 INFO  (coreLoadExecutor-8343-thread-1-processing-n:127.0.0.1:61792_) [n:127.0.0.1:61792_ c:control_collection s:shard1 r:core_node1 x:collection1] o.a.s.c.CachingDirectoryFactory return new directory for /export/home/jenkins/workspace/Lucene-Solr-master-Solaris/solr/build/solr-core/test/J0/temp/solr.cloud.ForceLeaderTest_3C142C6198BE1AB8-001/control-001/cores/collection1/data/index
   [junit4]   2> 2710513 INFO  (coreLoadExecutor-8343-thread-1-processing-n:127.0.0.1:61792_) [n:127.0.0.1:61792_ c:control_collection s:shard1 r:core_node1 x:collection1] o.a.s.u.RandomMergePolicy RandomMergePolicy wrapping class org.apache.lucene.index.LogByteSizeMergePolicy: [LogByteSizeMergePolicy: minMergeSize=1677721, mergeFactor=12, maxMergeSize=2147483648, maxMergeSizeForForcedMerge=9223372036854775807, calibrateSizeByDeletes=false, maxMergeDocs=2147483647, maxCFSSegmentSizeMB=8.796093022207999E12, noCFSRatio=0.5241996422493073]
   [junit4]   2> 2710514 INFO  (coreLoadExecutor-8343-thread-1-processing-n:127.0.0.1:61792_) [n:127.0.0.1:61792_ c:control_collection s:shard1 r:core_node1 x:collection1] o.a.s.c.SolrDeletionPolicy SolrDeletionPolicy.onCommit: commits: num=1
   [junit4]   2> 	commit{dir=MockDirectoryWrapper(RAMDirectory@60fdb60d lockFactory=org.apache.lucene.store.SingleInstanceLockFactory@5ae4abb8),segFN=segments_1,generation=1}
   [junit4]   2> 2710514 INFO  (coreLoadExecutor-8343-thread-1-processing-n:127.0.0.1:61792_) [n:127.0.0.1:61792_ c:control_collection s:shard1 r:core_node1 x:collection1] o.a.s.c.SolrDeletionPolicy newest commit generation = 1
   [junit4]   2> 2710514 INFO  (OldIndexDirectoryCleanupThreadForCore-collection1) [n:127.0.0.1:61792_ c:control_collection s:shard1 r:core_node1 x:collection1] o.a.s.c.SolrCore Looking for old index directories to cleanup for core collection1 in /export/home/jenkins/workspace/Lucene-Solr-master-Solaris/solr/build/solr-core/test/J0/temp/solr.cloud.ForceLeaderTest_3C142C6198BE1AB8-001/control-001/cores/collection1/data/
   [junit4]   2> 2710515 WARN  (OldIndexDirectoryCleanupThreadForCore-collection1) [n:127.0.0.1:61792_ c:control_collection s:shard1 r:core_node1 x:collection1] o.a.s.c.DirectoryFactory /export/home/jenkins/workspace/Lucene-Solr-master-Solaris/solr/build/solr-core/test/J0/temp/solr.cloud.ForceLeaderTest_3C142C6198BE1AB8-001/control-001/cores/collection1/data/ does not point to a valid data directory; skipping clean-up of old index directories.
   [junit4]   2> 2710518 INFO  (coreLoadExecutor-8343-thread-1-processing-n:127.0.0.1:61792_) [n:127.0.0.1:61792_ c:control_collection s:shard1 r:core_node1 x:collection1] o.a.s.u.p.UpdateRequestProcessorChain creating updateRequestProcessorChain "nodistrib"
   [junit4]   2> 2710518 INFO  (coreLoadExecutor-8343-thread-1-processing-n:127.0.0.1:61792_) [n:127.0.0.1:61792_ c:control_collection s:shard1 r:core_node1 x:collection1] o.a.s.u.p.UpdateRequestProcessorChain creating updateRequestProcessorChain "dedupe"
   [junit4]   2> 2710518 INFO  (coreLoadExecutor-8343-thread-1-processing-n:127.0.0.1:61792_) [n:127.0.0.1:61792_ c:control_collection s:shard1 r:core_node1 x:collection1] o.a.s.u.p.UpdateRequestProcessorChain inserting DistributedUpdateProcessorFactory into updateRequestProcessorChain "dedupe"
   [junit4]   2> 2710518 INFO  (coreLoadExecutor-8343-thread-1-processing-n:127.0.0.1:61792_) [n:127.0.0.1:61792_ c:control_collection s:shard1 r:core_node1 x:collection1] o.a.s.u.p.UpdateRequestProcessorChain creating updateRequestProcessorChain "stored_sig"
   [junit4]   2> 2710518 INFO  (coreLoadExecutor-8343-thread-1-processing-n:127.0.0.1:61792_) [n:127.0.0.1:61792_ c:control_collection s:shard1 r:core_node1 x:collection1] o.a.s.u.p.UpdateRequestProcessorChain inserting DistributedUpdateProcessorFactory into updateRequestProcessorChain "stored_sig"
   [junit4]   2> 2710518 INFO  (coreLoadExecutor-8343-thread-1-processing-n:127.0.0.1:61792_) [n:127.0.0.1:61792_ c:control_collection s:shard1 r:core_node1 x:collection1] o.a.s.u.p.UpdateRequestProcessorChain creating updateRequestProcessorChain "distrib-dup-test-chain-explicit"
   [junit4]   2> 2710519 INFO  (coreLoadExecutor-8343-thread-1-processing-n:127.0.0.1:61792_) [n:127.0.0.1:61792_ c:control_collection s:shard1 r:core_node1 x:collection1] o.a.s.u.p.UpdateRequestProcessorChain creating updateRequestProcessorChain "distrib-dup-test-chain-implicit"
   [junit4]   2> 2710519 INFO  (coreLoadExecutor-8343-thread-1-processing-n:127.0.0.1:61792_) [n:127.0.0.1:61792_ c:control_collection s:shard1 r:core_node1 x:collection1] o.a.s.u.p.UpdateRequestProcessorChain inserting DistributedUpdateProcessorFactory into updateRequestProcessorChain "distrib-dup-test-chain-implicit"
   [junit4]   2> 2710519 INFO  (coreLoadExecutor-8343-thread-1-processing-n:127.0.0.1:61792_) [n:127.0.0.1:61792_ c:control_collection s:shard1 r:core_node1 x:collection1] o.a.s.c.SolrCore no updateRequestProcessorChain defined as default, creating implicit default
   [junit4]   2> 2710519 WARN  (coreLoadExecutor-8343-thread-1-processing-n:127.0.0.1:61792_) [n:127.0.0.1:61792_ c:control_collection s:shard1 r:core_node1 x:collection1] o.a.s.c.RequestHandlers INVALID paramSet a in requestHandler {type = requestHandler,name = /dump,class = DumpRequestHandler,args = {defaults={a=A,b=B}}}
   [junit4]   2> 2710521 INFO  (coreLoadExecutor-8343-thread-1-processing-n:127.0.0.1:61792_) [n:127.0.0.1:61792_ c:control_collection s:shard1 r:core_node1 x:collection1] o.a.s.h.l.XMLLoader xsltCacheLifetimeSeconds=60
   [junit4]   2> 2710527 INFO  (coreLoadExecutor-8343-thread-1-processing-n:127.0.0.1:61792_) [n:127.0.0.1:61792_ c:control_collection s:shard1 r:core_node1 x:collection1] o.a.s.h.l.XMLLoader xsltCacheLifetimeSeconds=60
   [junit4]   2> 2710529 INFO  (coreLoadExecutor-8343-thread-1-processing-n:127.0.0.1:61792_) [n:127.0.0.1:61792_ c:control_collection s:shard1 r:core_node1 x:collection1] o.a.s.h.l.XMLLoader xsltCacheLifetimeSeconds=60
   [junit4]   2> 2710530 INFO  (coreLoadExecutor-8343-thread-1-processing-n:127.0.0.1:61792_) [n:127.0.0.1:61792_ c:control_collection s:shard1 r:core_node1 x:collection1] o.a.s.h.l.XMLLoader xsltCacheLifetimeSeconds=60
   [junit4]   2> 2710536 INFO  (coreLoadExecutor-8343-thread-1-processing-n:127.0.0.1:61792_) [n:127.0.0.1:61792_ c:control_collection s:shard1 r:core_node1 x:collection1] o.a.s.c.RequestHandlers Registered paths: /admin/mbeans,standard,/update/json/docs,/admin/luke,/export,/get,/admin/properties,/update/json,/admin/threads,/dump,/update/csv,/sql,/graph,/admin/segments,/admin/system,/replication,/config,/stream,/schema,/admin/plugins,/admin/logging,/admin/ping,/update,/admin/file,/terms
   [junit4]   2> 2710536 INFO  (coreLoadExecutor-8343-thread-1-processing-n:127.0.0.1:61792_) [n:127.0.0.1:61792_ c:control_collection s:shard1 r:core_node1 x:collection1] o.a.s.c.SolrCore Using default statsCache cache: org.apache.solr.search.stats.LocalStatsCache
   [junit4]   2> 2710536 INFO  (coreLoadExecutor-8343-thread-1-processing-n:127.0.0.1:61792_) [n:127.0.0.1:61792_ c:control_collection s:shard1 r:core_node1 x:collection1] o.a.s.u.UpdateHandler Using UpdateLog implementation: org.apache.solr.update.UpdateLog
   [junit4]   2> 2710536 INFO  (coreLoadExecutor-8343-thread-1-processing-n:127.0.0.1:61792_) [n:127.0.0.1:61792_ c:control_collection s:shard1 r:core_node1 x:collection1] o.a.s.u.UpdateLog Initializing UpdateLog: dataDir= defaultSyncLevel=FLUSH numRecordsToKeep=100 maxNumLogsToKeep=10 numVersionBuckets=65536
   [junit4]   2> 2710657 INFO  (coreLoadExecutor-8343-thread-1-processing-n:127.0.0.1:61792_) [n:127.0.0.1:61792_ c:control_collection s:shard1 r:core_node1 x:collection1] o.a.s.u.CommitTracker Hard AutoCommit: disabled
   [junit4]   2> 2710658 INFO  (coreLoadExecutor-8343-thread-1-processing-n:127.0.0.1:61792_) [n:127.0.0.1:61792_ c:control_collection s:shard1 r:core_node1 x:collection1] o.a.s.u.CommitTracker Soft AutoCommit: disabled
   [junit4]   2> 2710658 INFO  (coreLoadExecutor-8343-thread-1-processing-n:127.0.0.1:61792_) [n:127.0.0.1:61792_ c:control_collection s:shard1 r:core_node1 x:collection1] o.a.s.u.RandomMergePolicy RandomMergePolicy wrapping class org.apache.lucene.index.TieredMergePolicy: [TieredMergePolicy: maxMergeAtOnce=41, maxMergeAtOnceExplicit=39, maxMergedSegmentMB=59.619140625, floorSegmentMB=1.9072265625, forceMergeDeletesPctAllowed=3.8622820499934516, segmentsPerTier=49.0, maxCFSSegmentSizeMB=8.796093022207999E12, noCFSRatio=0.8277761999730633
   [junit4]   2> 2710658 INFO  (coreLoadExecutor-8343-thread-1-processing-n:127.0.0.1:61792_) [n:127.0.0.1:61792_ c:control_collection s:shard1 r:core_node1 x:collection1] o.a.s.c.SolrDeletionPolicy SolrDeletionPolicy.onInit: commits: num=1
   [junit4]   2> 	commit{dir=MockDirectoryWrapper(RAMDirectory@60fdb60d lockFactory=org.apache.lucene.store.SingleInstanceLockFactory@5ae4abb8),segFN=segments_1,generation=1}
   [junit4]   2> 2710658 INFO  (coreLoadExecutor-8343-thread-1-processing-n:127.0.0.1:61792_) [n:127.0.0.1:61792_ c:control_collection s:shard1 r:core_node1 x:collection1] o.a.s.c.SolrDeletionPolicy newest commit generation = 1
   [junit4]   2> 2710658 INFO  (coreLoadExecutor-8343-thread-1-processing-n:127.0.0.1:61792_) [n:127.0.0.1:61792_ c:control_collection s:shard1 r:core_node1 x:collection1] o.a.s.s.SolrIndexSearcher Opening [Searcher@76105f45[collection1] main]
   [junit4]   2> 2710659 INFO  (coreLoadExecutor-8343-thread-1-processing-n:127.0.0.1:61792_) [n:127.0.0.1:61792_ c:control_collection s:shard1 r:core_node1 x:collection1] o.a.s.c.c.ZkStateReader Load collection config from: [/collections/control_collection]
   [junit4]   2> 2710660 INFO  (coreLoadExecutor-8343-thread-1-processing-n:127.0.0.1:61792_) [n:127.0.0.1:61792_ c:control_collection s:shard1 r:core_node1 x:collection1] o.a.s.c.c.ZkStateReader path=[/collections/control_collection] [configName]=[conf1] specified config exists in ZooKeeper
   [junit4]   2> 2710660 INFO  (coreLoadExecutor-8343-thread-1-processing-n:127.0.0.1:61792_) [n:127.0.0.1:61792_ c:control_collection s:shard1 r:core_node1 x:collection1] o.a.s.r.ManagedResourceStorage Setting up ZooKeeper-based storage for the RestManager with znodeBase: /configs/conf1
   [junit4]   2> 2710661 INFO  (coreLoadExecutor-8343-thread-1-processing-n:127.0.0.1:61792_) [n:127.0.0.1:61792_ c:control_collection s:shard1 r:core_node1 x:collection1] o.a.s.r.ManagedResourceStorage Configured ZooKeeperStorageIO with znodeBase: /configs/conf1
   [junit4]   2> 2710661 INFO  (coreLoadExecutor-8343-thread-1-processing-n:127.0.0.1:61792_) [n:127.0.0.1:61792_ c:control_collection s:shard1 r:core_node1 x:collection1] o.a.s.r.RestManager Initializing RestManager with initArgs: {}
   [junit4]   2> 2710661 INFO  (coreLoadExecutor-8343-thread-1-processing-n:127.0.0.1:61792_) [n:127.0.0.1:61792_ c:control_collection s:shard1 r:core_node1 x:collection1] o.a.s.r.ManagedResourceStorage Reading _rest_managed.json using ZooKeeperStorageIO:path=/configs/conf1
   [junit4]   2> 2710661 INFO  (coreLoadExecutor-8343-thread-1-processing-n:127.0.0.1:61792_) [n:127.0.0.1:61792_ c:control_collection s:shard1 r:core_node1 x:collection1] o.a.s.r.ManagedResourceStorage No data found for znode /configs/conf1/_rest_managed.json
   [junit4]   2> 2710662 INFO  (coreLoadExecutor-8343-thread-1-processing-n:127.0.0.1:61792_) [n:127.0.0.1:61792_ c:control_collection s:shard1 r:core_node1 x:collection1] o.a.s.r.ManagedResourceStorage Loaded null at path _rest_managed.json using ZooKeeperStorageIO:path=/configs/conf1
   [junit4]   2> 2710662 INFO  (coreLoadExecutor-8343-thread-1-processing-n:127.0.0.1:61792_) [n:127.0.0.1:61792_ c:control_collection s:shard1 r:core_node1 x:collection1] o.a.s.r.RestManager Initializing 0 registered ManagedResources
   [junit4]   2> 2710662 INFO  (coreLoadExecutor-8343-thread-1-processing-n:127.0.0.1:61792_) [n:127.0.0.1:61792_ c:control_collection s:shard1 r:core_node1 x:collection1] o.a.s.h.ReplicationHandler Commits will be reserved for  10000
   [junit4]   2> 2710662 INFO  (coreLoadExecutor-8343-thread-1-processing-n:127.0.0.1:61792_) [n:127.0.0.1:61792_ c:control_collection s:shard1 r:core_node1 x:collection1] o.a.s.u.UpdateLog Looking up max value of version field to seed version buckets
   [junit4]   2> 2710662 INFO  (coreLoadExecutor-8343-thread-1-processing-n:127.0.0.1:61792_) [n:127.0.0.1:61792_ c:control_collection s:shard1 r:core_node1 x:collection1] o.a.s.u.VersionInfo Refreshing highest value of _version_ for 65536 version buckets from index
   [junit4]   2> 2710662 INFO  (coreLoadExecutor-8343-thread-1-processing-n:127.0.0.1:61792_) [n:127.0.0.1:61792_ c:control_collection s:shard1 r:core_node1 x:collection1] o.a.s.u.VersionInfo No terms found for _version_, cannot seed version bucket highest value from index
   [junit4]   2> 2710663 INFO  (coreLoadExecutor-8343-thread-1-processing-n:127.0.0.1:61792_) [n:127.0.0.1:61792_ c:control_collection s:shard1 r:core_node1 x:collection1] o.a.s.u.UpdateLog Could not find max version in index or recent updates, using new clock 1544450557708599296
   [junit4]   2> 2710665 INFO  (coreLoadExecutor-8343-thread-1-processing-n:127.0.0.1:61792_) [n:127.0.0.1:61792_ c:control_collection s:shard1 r:core_node1 x:collection1] o.a.s.u.UpdateLog Took 2.0ms to seed version buckets with highest version 1544450557708599296
   [junit4]   2> 2710666 INFO  (coreLoadExecutor-8343-thread-1-processing-n:127.0.0.1:61792_) [n:127.0.0.1:61792_ c:control_collection s:shard1 r:core_node1 x:collection1] o.a.s.c.ZkController watch zkdir /configs/conf1
   [junit4]   2> 2710667 INFO  (searcherExecutor-8344-thread-1-processing-n:127.0.0.1:61792_ x:collection1 s:shard1 c:control_collection r:core_node1) [n:127.0.0.1:61792_ c:control_collection s:shard1 r:core_node1 x:collection1] o.a.s.c.SolrCore [collection1] Registered new searcher Searcher@76105f45[collection1] main{ExitableDirectoryReader(UninvertingDirectoryReader())}
   [junit4]   2> 2710667 INFO  (coreLoadExecutor-8343-thread-1-processing-n:127.0.0.1:61792_) [n:127.0.0.1:61792_ c:control_collection s:shard1 r:core_node1 x:collection1] o.a.s.c.CoreContainer registering core: collection1
   [junit4]   2> 2710668 INFO  (coreZkRegister-8336-thread-1-processing-n:127.0.0.1:61792_ x:collection1 s:shard1 c:control_collection r:core_node1) [n:127.0.0.1:61792_ c:control_collection s:shard1 r:core_node1 x:collection1] o.a.s.c.ZkController Register replica - core:collection1 address:http://127.0.0.1:61792 collection:control_collection shard:shard1
   [junit4]   2> 2710669 INFO  (coreZkRegister-8336-thread-1-processing-n:127.0.0.1:61792_ x:collection1 s:shard1 c:control_collection r:core_node1) [n:127.0.0.1:61792_ c:control_collection s:shard1 r:core_node1 x:collection1] o.a.s.c.c.SolrZkClient makePath: /collections/control_collection/leader_elect/shard1/election
   [junit4]   2> 2710685 INFO  (coreZkRegister-8336-thread-1-processing-n:127.0.0.1:61792_ x:collection1 s:shard1 c:control_collection r:core_node1) [n:127.0.0.1:61792_ c:control_collection s:shard1 r:core_node1 x:collection1] o.a.s.c.LeaderElector Joined leadership election with path: /collections/control_collection/leader_elect/shard1/election/96528159769559044-core_node1-n_0000000000
   [junit4]   2> 2710686 INFO  (coreZkRegister-8336-thread-1-processing-n:127.0.0.1:61792_ x:collection1 s:shard1 c:control_collection r:core_node1) [n:127.0.0.1:61792_ c:control_collection s:shard1 r:core_node1 x:collection1] o.a.s.c.ShardLeaderElectionContext Running the leader process for shard=shard1 and weAreReplacement=false and leaderVoteWait=10000
   [junit4]   2> 2710689 INFO  (coreZkRegister-8336-thread-1-processing-n:127.0.0.1:61792_ x:collection1 s:shard1 c:control_collection r:core_node1) [n:127.0.0.1:61792_ c:control_collection s:shard1 r:core_node1 x:collection1] o.a.s.c.ShardLeaderElectionContext Enough replicas found to continue.
   [junit4]   2> 2710690 INFO  (OverseerStateUpdate-96528159769559044-127.0.0.1:61792_-n_0000000000) [n:127.0.0.1:61792_    ] o.a.s.c.Overseer processMessage: queueSize: 1, message = {
   [junit4]   2>   "operation":"leader",
   [junit4]   2>   "shard":"shard1",
   [junit4]   2>   "collection":"control_collection"} current state version: 1
   [junit4]   2> 2710690 INFO  (coreZkRegister-8336-thread-1-processing-n:127.0.0.1:61792_ x:collection1 s:shard1 c:control_collection r:core_node1) [n:127.0.0.1:61792_ c:control_collection s:shard1 r:core_node1 x:collection1] o.a.s.c.ShardLeaderElectionContext I may be the new leader - try and sync
   [junit4]   2> 2710690 INFO  (coreZkRegister-8336-thread-1-processing-n:127.0.0.1:61792_ x:collection1 s:shard1 c:control_collection r:core_node1) [n:127.0.0.1:61792_ c:control_collection s:shard1 r:core_node1 x:collection1] o.a.s.c.SyncStrategy Sync replicas to http://127.0.0.1:61792/collection1/
   [junit4]   2> 2710690 INFO  (coreZkRegister-8336-thread-1-processing-n:127.0.0.1:61792_ x:collection1 s:shard1 c:control_collection r:core_node1) [n:127.0.0.1:61792_ c:control_collection s:shard1 r:core_node1 x:collection1] o.a.s.c.SyncStrategy Sync Success - now sync replicas to me
   [junit4]   2> 2710691 INFO  (coreZkRegister-8336-thread-1-processing-n:127.0.0.1:61792_ x:collection1 s:shard1 c:control_collection r:core_node1) [n:127.0.0.1:61792_ c:control_collection s:shard1 r:core_node1 x:collection1] o.a.s.c.SyncStrategy http://127.0.0.1:61792/collection1/ has no replicas
   [junit4]   2> 2710707 INFO  (coreZkRegister-8336-thread-1-processing-n:127.0.0.1:61792_ x:collection1 s:shard1 c:control_collection r:core_node1) [n:127.0.0.1:61792_ c:control_collection s:shard1 r:core_node1 x:collection1] o.a.s.c.c.SolrZkClient makePath: /collections/control_collection/leaders/shard1
   [junit4]   2> 2710768 INFO  (coreZkRegister-8336-thread-1-processing-n:127.0.0.1:61792_ x:collection1 s:shard1 c:control_collection r:core_node1) [n:127.0.0.1:61792_ c:control_collection s:shard1 r:core_node1 x:collection1] o.a.s.c.ShardLeaderElectionContextBase Creating leader registration node /collections/control_collection/leaders/shard1/leader after winning as /collections/control_collection/leader_elect/shard1/election/96528159769559044-core_node1-n_0000000000
   [junit4]   2> 2710798 INFO  (coreZkRegister-8336-thread-1-processing-n:127.0.0.1:61792_ x:collection1 s:shard1 c:control_collection r:core_node1) [n:127.0.0.1:61792_ c:control_collection s:shard1 r:core_node1 x:collection1] o.a.s.c.ShardLeaderElectionContext I am the new leader: http://127.0.0.1:61792/collection1/ shard1
   [junit4]   2> 2710836 INFO  (OverseerStateUpdate-96528159769559044-127.0.0.1:61792_-n_0000000000) [n:127.0.0.1:61792_    ] o.a.s.c.Overseer processMessage: queueSize: 1, message = {
   [junit4]   2>   "operation":"leader",
   [junit4]   2>   "shard":"shard1",
   [junit4]   2>   "collection":"control_collection",
   [junit4]   2>   "base_url":"http://127.0.0.1:61792",
   [junit4]   2>   "core":"collection1",
   [junit4]   2>   "state":"active"} current state version: 1
   [junit4]   2> 2711050 INFO  (zkCallback-2892-thread-3-processing-n:127.0.0.1:61792_) [n:127.0.0.1:61792_    ] o.a.s.c.c.ZkStateReader A cluster state change: [WatchedEvent state:SyncConnected type:NodeDataChanged path:/clusterstate.json], has occurred - updating... (live nodes size: [1])
   [junit4]   2> 2711099 INFO  (coreZkRegister-8336-thread-1-processing-n:127.0.0.1:61792_ x:collection1 s:shard1 c:control_collection r:core_node1) [n:127.0.0.1:61792_ c:control_collection s:shard1 r:core_node1 x:collection1] o.a.s.c.ZkController We are http://127.0.0.1:61792/collection1/ and leader is http://127.0.0.1:61792/collection1/
   [junit4]   2> 2711099 INFO  (coreZkRegister-8336-thread-1-processing-n:127.0.0.1:61792_ x:collection1 s:shard1 c:control_collection r:core_node1) [n:127.0.0.1:61792_ c:control_collection s:shard1 r:core_node1 x:collection1] o.a.s.c.ZkController No LogReplay needed for core=collection1 baseURL=http://127.0.0.1:61792
   [junit4]   2> 2711099 INFO  (coreZkRegister-8336-thread-1-processing-n:127.0.0.1:61792_ x:collection1 s:shard1 c:control_collection r:core_node1) [n:127.0.0.1:61792_ c:control_collection s:shard1 r:core_node1 x:collection1] o.a.s.c.ZkController I am the leader, no recovery necessary
   [junit4]   2> 2711099 INFO  (coreZkRegister-8336-thread-1-processing-n:127.0.0.1:61792_ x:collection1 s:shard1 c:control_collection r:core_node1) [n:127.0.0.1:61792_ c:control_collection s:shard1 r:core_node1 x:collection1] o.a.s.c.ZkController publishing state=active
   [junit4]   2> 2711100 INFO  (coreZkRegister-8336-thread-1-processing-n:127.0.0.1:61792_ x:collection1 s:shard1 c:control_collection r:core_node1) [n:127.0.0.1:61792_ c:control_collection s:shard1 r:core_node1 x:collection1] o.a.s.c.ZkController numShards not found on descriptor - reading it from system property
   [junit4]   2> 2711104 INFO  (coreZkRegister-8336-thread-1-processing-n:127.0.0.1:61792_ x:collection1 s:shard1 c:control_collection r:core_node1) [n:127.0.0.1:61792_ c:control_collection s:shard1 r:core_node1 x:collection1] o.a.s.c.c.ZkStateReader Checking legacy cluster state for collection control_collection
   [junit4]   2> 2711106 INFO  (OverseerStateUpdate-96528159769559044-127.0.0.1:61792_-n_0000000000) [n:127.0.0.1:61792_    ] o.a.s.c.Overseer processMessage: queueSize: 1, message = {
   [junit4]   2>   "core":"collection1",
   [junit4]   2>   "core_node_name":"core_node1",
   [junit4]   2>   "roles":null,
   [junit4]   2>   "base_url":"http://127.0.0.1:61792",
   [junit4]   2>   "node_name":"127.0.0.1:61792_",
   [junit4]   2>   "numShards":"1",
   [junit4]   2>   "state":"active",
   [junit4]   2>   "shard":"shard1",
   [junit4]   2>   "collection":"control_collection",
   [junit4]   2>   "operation":"state"} current state version: 2
   [junit4]   2> 2711106 INFO  (OverseerStateUpdate-96528159769559044-127.0.0.1:61792_-n_0000000000) [n:127.0.0.1:61792_    ] o.a.s.c.o.ReplicaMutator Update state numShards=1 message={
   [junit4]   2>   "core":"collection1",
   [junit4]   2>   "core_node_name":"core_node1",
   [junit4]   2>   "roles":null,
   [junit4]   2>   "base_url":"http://127.0.0.1:61792",
   [junit4]   2>   "node_name":"127.0.0.1:61792_",
   [junit4]   2>   "numShards":"1",
   [junit4]   2>   "state":"active",
   [junit4]   2>   "shard":"shard1",
   [junit4]   2>   "collection":"control_collection",
   [junit4]   2>   "operation":"state"}
   [junit4]   2> 2711163 INFO  (TEST-ForceLeaderTest.testLastPublishedStateIsActive-seed#[3C142C6198BE1AB8]) [    ] o.a.s.c.c.SolrZkClient Using default ZkCredentialsProvider
   [junit4]   2> 2711164 INFO  (TEST-ForceLeaderTest.testLastPublishedStateIsActive-seed#[3C142C6198BE1AB8]) [    ] o.a.s.c.c.ConnectionManager Waiting for client to connect to ZooKeeper
   [junit4]   2> 2711167 INFO  (zkCallback-2896-thread-1) [    ] o.a.s.c.c.ConnectionManager Watcher org.apache.solr.common.cloud.ConnectionManager@3ec2bfca name:ZooKeeperConnection Watcher:127.0.0.1:56362/solr got event WatchedEvent state:SyncConnected type:None path:null path:null type:None
   [junit4]   2> 2711167 INFO  (TEST-ForceLeaderTest.testLastPublishedStateIsActive-seed#[3C142C6198BE1AB8]) [    ] o.a.s.c.c.ConnectionManager Client is connected to ZooKeeper
   [junit4]   2> 2711167 INFO  (TEST-ForceLeaderTest.testLastPublishedStateIsActive-seed#[3C142C6198BE1AB8]) [    ] o.a.s.c.c.SolrZkClient Using default ZkACLProvider
   [junit4]   2> 2711167 INFO  (TEST-ForceLeaderTest.testLastPublishedStateIsActive-seed#[3C142C6198BE1AB8]) [    ] o.a.s.c.c.ZkStateReader Updating cluster state from ZooKeeper... 
   [junit4]   2> 2711169 INFO  (TEST-ForceLeaderTest.testLastPublishedStateIsActive-seed#[3C142C6198BE1AB8]) [    ] o.a.s.c.c.ZkStateReader Loaded empty cluster properties
   [junit4]   2> 2711171 INFO  (TEST-ForceLeaderTest.testLastPublishedStateIsActive-seed#[3C142C6198BE1AB8]) [    ] o.a.s.c.c.ZkStateReader Updated live nodes from ZooKeeper... (0) -> (1)
   [junit4]   2> 2711175 INFO  (TEST-ForceLeaderTest.testLastPublishedStateIsActive-seed#[3C142C6198BE1AB8]) [    ] o.a.s.c.ChaosMonkey monkey: init - expire sessions:false cause connection loss:false
   [junit4]   2> 2711175 INFO  (TEST-ForceLeaderTest.testLastPublishedStateIsActive-seed#[3C142C6198BE1AB8]) [    ] o.a.s.c.AbstractFullDistribZkTestBase Creating collection1 with stateFormat=2
   [junit4]   2> 2711175 INFO  (TEST-ForceLeaderTest.testLastPublishedStateIsActive-seed#[3C142C6198BE1AB8]) [    ] o.a.s.c.c.SolrZkClient Using default ZkCredentialsProvider
   [junit4]   2> 2711176 INFO  (TEST-ForceLeaderTest.testLastPublishedStateIsActive-seed#[3C142C6198BE1AB8]) [    ] o.a.s.c.c.ConnectionManager Waiting for client to connect to ZooKeeper
   [junit4]   2> 2711178 INFO  (zkCallback-2897-thread-1) [    ] o.a.s.c.c.ConnectionManager Watcher org.apache.solr.common.cloud.ConnectionManager@38d36f2b name:ZooKeeperConnection Watcher:127.0.0.1:56362/solr got event WatchedEvent state:SyncConnected type:None path:null path:null type:None
   [junit4]   2> 2711178 INFO  (TEST-ForceLeaderTest.testLastPublishedStateIsActive-seed#[3C142C6198BE1AB8]) [    ] o.a.s.c.c.ConnectionManager Client is connected to ZooKeeper
   [junit4]   2> 2711178 INFO  (TEST-ForceLeaderTest.testLastPublishedStateIsActive-seed#[3C142C6198BE1AB8]) [    ] o.a.s.c.c.SolrZkClient Using default ZkACLProvider
   [junit4]   2> 2711183 INFO  (OverseerStateUpdate-96528159769559044-127.0.0.1:61792_-n_0000000000) [n:127.0.0.1:61792_    ] o.a.s.c.Overseer processMessage: queueSize: 1, message = {
   [junit4]   2>   "operation":"create",
   [junit4]   2>   "name":"collection1",
   [junit4]   2>   "numShards":"2",
   [junit4]   2>   "stateFormat":"2"} current state version: 2
   [junit4]   2> 2711183 INFO  (OverseerStateUpdate-96528159769559044-127.0.0.1:61792_-n_0000000000) [n:127.0.0.1:61792_    ] o.a.s.c.o.ClusterStateMutator building a new cName: collection1
   [junit4]   2> 2711184 INFO  (zkCallback-2896-thread-1) [    ] o.a.s.c.c.ZkStateReader A cluster state change: [WatchedEvent state:SyncConnected type:NodeDataChanged path:/clusterstate.json], has occurred - updating... (live nodes size: [1])
   [junit4]   2> 2711187 INFO  (zkCallback-2892-thread-2-processing-n:127.0.0.1:61792_) [n:127.0.0.1:61792_    ] o.a.s.c.c.ZkStateReader A cluster state change: [WatchedEvent state:SyncConnected type:NodeDataChanged path:/clusterstate.json], has occurred - updating... (live nodes size: [1])
   [junit4]   2> 2711299 INFO  (OverseerStateUpdate-96528159769559044-127.0.0.1:61792_-n_0000000000) [n:127.0.0.1:61792_    ] o.a.s.c.o.ZkStateWriter going to create_collection /collections/collection1/state.json
   [junit4]   2> 2711333 INFO  (TEST-ForceLeaderTest.testLastPublishedStateIsActive-seed#[3C142C6198BE1AB8]) [    ] o.a.s.SolrTestCaseJ4 Writing core.properties file to /export/home/jenkins/workspace/Lucene-Solr-master-Solaris/solr/build/solr-core/test/J0/temp/solr.cloud.ForceLeaderTest_3C142C6198BE1AB8-001/shard-1-001/cores/collection1
   [junit4]   2> 2711334 INFO  (TEST-ForceLeaderTest.testLastPublishedStateIsActive-seed#[3C142C6198BE1AB8]) [    ] o.a.s.c.AbstractFullDistribZkTestBase create jetty 1 in directory /export/home/jenkins/workspace/Lucene-Solr-master-Solaris/solr/build/solr-core/test/J0/temp/solr.cloud.ForceLeaderTest_3C142C6198BE1AB8-001/shard-1-001
   [junit4]   2> 2711335 INFO  (TEST-ForceLeaderTest.testLastPublishedStateIsActive-seed#[3C142C6198BE1AB8]) [    ] o.e.j.s.Server jetty-9.3.8.v20160314
   [junit4]   2> 2711337 INFO  (TEST-ForceLeaderTest.testLastPublishedStateIsActive-seed#[3C142C6198BE1AB8]) [    ] o.e.j.s.h.ContextHandler Started o.e.j.s.ServletContextHandler@497c94d2{/,null,AVAILABLE}
   [junit4]   2> 2711338 INFO  (TEST-ForceLeaderTest.testLastPublishedStateIsActive-seed#[3C142C6198BE1AB8]) [    ] o.e.j.s.ServerConnector Started ServerConnector@503606a7{HTTP/1.1,[http/1.1]}{127.0.0.1:51516}
   [junit4]   2> 2711338 INFO  (TEST-ForceLeaderTest.testLastPublishedStateIsActive-seed#[3C142C6198BE1AB8]) [    ] o.e.j.s.Server Started @2714340ms
   [junit4]   2> 2711338 INFO  (TEST-ForceLeaderTest.testLastPublishedStateIsActive-seed#[3C142C6198BE1AB8]) [    ] o.a.s.c.s.e.JettySolrRunner Jetty properties: {solr.data.dir=/export/home/jenkins/workspace/Lucene-Solr-master-Solaris/solr/build/solr-core/test/J0/temp/solr.cloud.ForceLeaderTest_3C142C6198BE1AB8-001/tempDir-001/jetty1, solrconfig=solrconfig.xml, hostContext=/, hostPort=52698, coreRootDirectory=/export/home/jenkins/workspace/Lucene-Solr-master-Solaris/solr/build/solr-core/test/J0/temp/solr.cloud.ForceLeaderTest_3C142C6198BE1AB8-001/shard-1-001/cores}
   [junit4]   2> 2711338 INFO  (TEST-ForceLeaderTest.testLastPublishedStateIsActive-seed#[3C142C6198BE1AB8]) [    ] o.a.s.s.SolrDispatchFilter SolrDispatchFilter.init(): sun.misc.Launcher$AppClassLoader@6d06d69c
   [junit4]   2> 2711339 INFO  (TEST-ForceLeaderTest.testLastPublishedStateIsActive-seed#[3C142C6198BE1AB8]) [    ] o.a.s.c.SolrResourceLoader new SolrResourceLoader for directory: '/export/home/jenkins/workspace/Lucene-Solr-master-Solaris/solr/build/solr-core/test/J0/temp/solr.cloud.ForceLeaderTest_3C142C6198BE1AB8-001/shard-1-001'
   [junit4]   2> 2711339 INFO  (TEST-ForceLeaderTest.testLastPublishedStateIsActive-seed#[3C142C6198BE1AB8]) [    ] o.a.s.c.SolrResourceLoader JNDI not configured for solr (NoInitialContextEx)
   [junit4]   2> 2711339 INFO  (TEST-ForceLeaderTest.testLastPublishedStateIsActive-seed#[3C142C6198BE1AB8]) [    ] o.a.s.c.SolrResourceLoader solr home defaulted to 'solr/' (could not find system property or JNDI)
   [junit4]   2> 2711339 INFO  (TEST-ForceLeaderTest.testLastPublishedStateIsActive-seed#[3C142C6198BE1AB8]) [    ] o.a.s.c.c.SolrZkClient Using default ZkCredentialsProvider
   [junit4]   2> 2711340 INFO  (TEST-ForceLeaderTest.testLastPublishedStateIsActive-seed#[3C142C6198BE1AB8]) [    ] o.a.s.c.c.ConnectionManager Waiting for client to connect to ZooKeeper
   [junit4]   2> 2711342 INFO  (zkCallback-2898-thread-1) [    ] o.a.s.c.c.ConnectionManager Watcher org.apache.solr.common.cloud.ConnectionManager@66034df2 name:ZooKeeperConnection Watcher:127.0.0.1:56362/solr got event WatchedEvent state:SyncConnected type:None path:null path:null type:None
   [junit4]   2> 2711342 INFO  (TEST-ForceLeaderTest.testLastPublishedStateIsActive-seed#[3C142C6198BE1AB8]) [    ] o.a.s.c.c.ConnectionManager Client is connected to ZooKeeper
   [junit4]   2> 2711342 INFO  (TEST-ForceLeaderTest.testLastPublishedStateIsActive-seed#[3C142C6198BE1AB8]) [    ] o.a.s.c.c.SolrZkClient Using default ZkACLProvider
   [junit4]   2> 2711345 INFO  (TEST-ForceLeaderTest.testLastPublishedStateIsActive-seed#[3C142C6198BE1AB8]) [    ] o.a.s.s.SolrDispatchFilter Loading solr.xml from SolrHome (not found in ZooKeeper)
   [junit4]   2> 2711345 INFO  (TEST-ForceLeaderTest.testLastPublishedStateIsActive-seed#[3C142C6198BE1AB8]) [    ] o.a.s.c.SolrXmlConfig Loading container configuration from /export/home/jenkins/workspace/Lucene-Solr-master-Solaris/solr/build/solr-core/test/J0/temp/solr.cloud.ForceLeaderTest_3C142C6198BE1AB8-001/shard-1-001/solr.xml
   [junit4]   2> 2711350 INFO  (TEST-ForceLeaderTest.testLastPublishedStateIsActive-seed#[3C142C6198BE1AB8]) [    ] o.a.s.c.CorePropertiesLocator Config-defined core root directory: /export/home/jenkins/workspace/Lucene-Solr-master-Solaris/solr/build/solr-core/test/J0/temp/solr.cloud.ForceLeaderTest_3C142C6198BE1AB8-001/shard-1-001/cores
   [junit4]   2> 2711350 INFO  (TEST-ForceLeaderTest.testLastPublishedStateIsActive-seed#[3C142C6198BE1AB8]) [    ] o.a.s.c.CoreContainer New CoreContainer 1409439868
   [junit4]   2> 2711350 INFO  (TEST-ForceLeaderTest.testLastPublishedStateIsActive-seed#[3C142C6198BE1AB8]) [    ] o.a.s.c.CoreContainer Loading cores into CoreContainer [instanceDir=/export/home/jenkins/workspace/Lucene-Solr-master-Solaris/solr/build/solr-core/test/J0/temp/solr.cloud.ForceLeaderTest_3C142C6198BE1AB8-001/shard-1-001]
   [junit4]   2> 2711350 WARN  (TEST-ForceLeaderTest.testLastPublishedStateIsActive-seed#[3C142C6198BE1AB8]) [    ] o.a.s.c.CoreContainer Couldn't add files from /export/home/jenkins/workspace/Lucene-Solr-master-Solaris/solr/build/solr-core/test/J0/temp/solr.cloud.ForceLeaderTest_3C142C6198BE1AB8-001/shard-1-001/lib to classpath: /export/home/jenkins/workspace/Lucene-Solr-master-Solaris/solr/build/solr-core/test/J0/temp/solr.cloud.ForceLeaderTest_3C142C6198BE1AB8-001/shard-1-001/lib
   [junit4]   2> 2711350 INFO  (TEST-ForceLeaderTest.testLastPublishedStateIsActive-seed#[3C142C6198BE1AB8]) [    ] o.a.s.h.c.HttpShardHandlerFactory created with socketTimeout : 90000,urlScheme : ,connTimeout : 15000,maxConnectionsPerHost : 20,maxConnections : 10000,corePoolSize : 0,maximumPoolSize : 2147483647,maxThreadIdleTime : 5,sizeOfQueue : -1,fairnessPolicy : false,
   [junit4]   2> 2711353 INFO  (TEST-ForceLeaderTest.testLastPublishedStateIsActive-seed#[3C142C6198BE1AB8]) [    ] o.a.s.u.UpdateShardHandler Created UpdateShardHandler HTTP client with params: socketTimeout=340000&connTimeout=45000&maxConnections=100000&maxConnectionsPerHost=100000
   [junit4]   2> 2711353 INFO  (TEST-ForceLeaderTest.testLastPublishedStateIsActive-seed#[3C142C6198BE1AB8]) [    ] o.a.s.l.LogWatcher SLF4J impl is org.slf4j.impl.Log4jLoggerFactory
   [junit4]   2> 2711353 INFO  (TEST-ForceLeaderTest.testLastPublishedStateIsActive-seed#[3C142C6198BE1AB8]) [    ] o.a.s.l.LogWatcher Registering Log Listener [Log4j (org.slf4j.impl.Log4jLoggerFactory)]
   [junit4]   2> 2711353 INFO  (TEST-ForceLeaderTest.testLastPublishedStateIsActive-seed#[3C142C6198BE1AB8]) [    ] o.a.s.c.ZkContainer Zookeeper client=127.0.0.1:56362/solr
   [junit4]   2> 2711353 INFO  (TEST-ForceLeaderTest.testLastPublishedStateIsActive-seed#[3C142C6198BE1AB8]) [    ] o.a.s.c.ZkController zkHost includes chroot
   [junit4]   2> 2711353 INFO  (TEST-ForceLeaderTest.testLastPublishedStateIsActive-seed#[3C142C6198BE1AB8]) [    ] o.a.s.c.c.SolrZkClient Using default ZkCredentialsProvider
   [junit4]   2> 2711354 INFO  (TEST-ForceLeaderTest.testLastPublishedStateIsActive-seed#[3C142C6198BE1AB8]) [    ] o.a.s.c.c.ConnectionManager Waiting for client to connect to ZooKeeper
   [junit4]   2> 2711356 INFO  (zkCallback-2901-thread-1) [    ] o.a.s.c.c.ConnectionManager Watcher org.apache.solr.common.cloud.ConnectionManager@4377fbc5 name:ZooKeeperConnection Watcher:127.0.0.1:56362 got event WatchedEvent state:SyncConnected type:None path:null path:null type:None
   [junit4]   2> 2711356 INFO  (TEST-ForceLeaderTest.testLastPublishedStateIsActive-seed#[3C142C6198BE1AB8]) [    ] o.a.s.c.c.ConnectionManager Client is connected to ZooKeeper
   [junit4]   2> 2711357 INFO  (TEST-ForceLeaderTest.testLastPublishedStateIsActive-seed#[3C142C6198BE1AB8]) [    ] o.a.s.c.c.SolrZkClient Using default ZkACLProvider
   [junit4]   2> 2711358 INFO  (TEST-ForceLeaderTest.testLastPublishedStateIsActive-seed#[3C142C6198BE1AB8]) [n:127.0.0.1:52698_    ] o.a.s.c.ZkController Added new OnReconnect listener org.apache.solr.cloud.ZkController$$Lambda$67/271644614@331297e5
   [junit4]   2> 2711359 INFO  (TEST-ForceLeaderTest.testLastPublishedStateIsActive-seed#[3C142C6198BE1AB8]) [n:127.0.0.1:52698_    ] o.a.s.c.c.ConnectionManager Waiting for client to connect to ZooKeeper
   [junit4]   2> 2711366 INFO  (zkCallback-2902-thread-1-processing-n:127.0.0.1:52698_) [n:127.0.0.1:52698_    ] o.a.s.c.c.ConnectionManager Watcher org.apache.solr.common.cloud.ConnectionManager@616e9f76 name:ZooKeeperConnection Watcher:127.0.0.1:56362/solr got event WatchedEvent state:SyncConnected type:None path:null path:null type:None
   [junit4]   2> 2711366 INFO  (TEST-ForceLeaderTest.testLastPublishedStateIsActive-seed#[3C142C6198BE1AB8]) [n:127.0.0.1:52698_    ] o.a.s.c.c.ConnectionManager Client is connected to ZooKeeper
   [junit4]   2> 2711380 INFO  (TEST-ForceLeaderTest.testLastPublishedStateIsActive-seed#[3C142C6198BE1AB8]) [n:127.0.0.1:52698_    ] o.a.s.c.c.ZkStateReader Updating cluster state from ZooKeeper... 
   [junit4]   2> 2711381 INFO  (TEST-ForceLeaderTest.testLastPublishedStateIsActive-seed#[3C142C6198BE1AB8]) [n:127.0.0.1:52698_    ] o.a.s.c.c.ZkStateReader Loaded empty cluster properties
   [junit4]   2> 2711382 INFO  (TEST-ForceLeaderTest.testLastPublishedStateIsActive-seed#[3C142C6198BE1AB8]) [n:127.0.0.1:52698_    ] o.a.s.c.c.ZkStateReader Updated live nodes from ZooKeeper... (0) -> (1)
   [junit4]   2> 2711388 INFO  (TEST-ForceLeaderTest.testLastPublishedStateIsActive-seed#[3C142C6198BE1AB8]) [n:127.0.0.1:52698_    ] o.a.s.c.Overseer Overseer (id=null) closing
   [junit4]   2> 2711389 INFO  (TEST-ForceLeaderTest.testLastPublishedStateIsActive-seed#[3C142C6198BE1AB8]) [n:127.0.0.1:52698_    ] o.a.s.c.LeaderElector Joined leadership election with path: /overseer_elect/election/96528159769559049-127.0.0.1:52698_-n_0000000001
   [junit4]   2> 2711390 INFO  (TEST-ForceLeaderTest.testLastPublishedStateIsActive-seed#[3C142C6198BE1AB8]) [n:127.0.0.1:52698_    ] o.a.s.c.LeaderElector Watching path /overseer_elect/election/96528159769559044-127.0.0.1:61792_-n_0000000000 to know if I could be the leader
   [junit4]   2> 2711391 INFO  (TEST-ForceLeaderTest.testLastPublishedStateIsActive-seed#[3C142C6198BE1AB8]) [n:127.0.0.1:52698_    ] o.a.s.c.ZkController Publish node=127.0.0.1:52698_ as DOWN
   [junit4]   2> 2711393 INFO  (TEST-ForceLeaderTest.testLastPublishedStateIsActive-seed#[3C142C6198BE1AB8]) [n:127.0.0.1:52698_    ] o.a.s.c.ZkController Register node as live in ZooKeeper:/live_nodes/127.0.0.1:52698_
   [junit4]   2> 2711393 INFO  (TEST-ForceLeaderTest.testLastPublishedStateIsActive-seed#[3C142C6198BE1AB8]) [n:127.0.0.1:52698_    ] o.a.s.c.c.SolrZkClient makePath: /live_nodes/127.0.0.1:52698_
   [junit4]   2> 2711395 INFO  (OverseerStateUpdate-96528159769559044-127.0.0.1:61792_-n_0000000000) [n:127.0.0.1:61792_    ] o.a.s.c.Overseer processMessage: queueSize: 1, message = {
   [junit4]   2>   "operation":"downnode",
   [junit4]   2>   "node_name":"127.0.0.1:52698_"} current state version: 3
   [junit4]   2> 2711395 INFO  (OverseerStateUpdate-96528159769559044-127.0.0.1:61792_-n_0000000000) [n:127.0.0.1:61792_    ] o.a.s.c.o.NodeMutator DownNode state invoked for node: 127.0.0.1:52698_
   [junit4]   2> 2711396 INFO  (zkCallback-2896-thread-1) [    ] o.a.s.c.c.ZkStateReader A live node change: [WatchedEvent state:SyncConnected type:NodeChildrenChanged path:/live_nodes], has occurred - updating... (live nodes size: [1])
   [junit4]   2> 2711396 INFO  (zkCallback-2902-thread-1-processing-n:127.0.0.1:52698_) [n:127.0.0.1:52698_    ] o.a.s.c.c.ZkStateReader A live node change: [WatchedEvent state:SyncConnected type:NodeChildrenChanged path:/live_nodes], has occurred - updating... (live nodes size: [1])
   [junit4]   2> 2711396 INFO  (zkCallback-2896-thread-1) [    ] o.a.s.c.c.ZkStateReader Updated live nodes from ZooKeeper... (1) -> (2)
   [junit4]   2> 2711397 INFO  (zkCallback-2902-thread-1-processing-n:127.0.0.1:52698_) [n:127.0.0.1:52698_    ] o.a.s.c.c.ZkStateReader Updated live nodes from ZooKeeper... (1) -> (2)
   [junit4]   2> 2711400 INFO  (zkCallback-2892-thread-3-processing-n:127.0.0.1:61792_) [n:127.0.0.1:61792_    ] o.a.s.c.c.ZkStateReader A live node change: [WatchedEvent state:SyncConnected type:NodeChildrenChanged path:/live_nodes], has occurred - updating... (live nodes size: [1])
   [junit4]   2> 2711401 INFO  (zkCallback-2892-thread-3-processing-n:127.0.0.1:61792_) [n:127.0.0.1:61792_    ] o.a.s.c.c.ZkStateReader Updated live nodes from ZooKeeper... (1) -> (2)
   [junit4]   2> 2711402 INFO  (zkCallback-2896-thread-1) [    ] o.a.s.c.c.ZkStateReader A cluster state change: [WatchedEvent state:SyncConnected type:NodeDataChanged path:/clusterstate.json], has occurred - updating... (live nodes size: [2])
   [junit4]   2> 2711403 INFO  (zkCallback-2892-thread-3-processing-n:127.0.0.1:61792_) [n:127.0.0.1:61792_    ] o.a.s.c.c.ZkStateReader A cluster state change: [WatchedEvent state:SyncConnected type:NodeDataChanged path:/clusterstate.json], has occurred - updating... (live nodes size: [2])
   [junit4]   2> 2711404 INFO  (zkCallback-2902-thread-1-processing-n:127.0.0.1:52698_) [n:127.0.0.1:52698_    ] o.a.s.c.c.ZkStateReader A cluster state change: [WatchedEvent state:SyncConnected type:NodeDataChanged path:/clusterstate.json], has occurred - updating... (live nodes size: [2])
   [junit4]   2> 2711449 INFO  (TEST-ForceLeaderTest.testLastPublishedStateIsActive-seed#[3C142C6198BE1AB8]) [n:127.0.0.1:52698_    ] o.a.s.c.CoreContainer Security conf doesn't exist. Skipping setup for authorization module.
   [junit4]   2> 2711449 INFO  (TEST-ForceLeaderTest.testLastPublishedStateIsActive-seed#[3C142C6198BE1AB8]) [n:127.0.0.1:52698_    ] o.a.s.c.CoreContainer No authentication plugin used.
   [junit4]   2> 2711450 INFO  (TEST-ForceLeaderTest.testLastPublishedStateIsActive-seed#[3C142C6198BE1AB8]) [n:127.0.0.1:52698_    ] o.a.s.c.CorePropertiesLocator Looking for core definitions underneath /export/home/jenkins/workspace/Lucene-Solr-master-Solaris/solr/build/solr-core/test/J0/temp/solr.cloud.ForceLeaderTest_3C142C6198BE1AB8-001/shard-1-001/cores
   [junit4]   2> 2711450 INFO  (TEST-ForceLeaderTest.testLastPublishedStateIsActive-seed#[3C142C6198BE1AB8]) [n:127.0.0.1:52698_    ] o.a.s.c.CoreDescriptor Created CoreDescriptor: {name=collection1, config=solrconfig.xml, transient=false, schema=schema.xml, loadOnStartup=true, configSetProperties=configsetprops.json, collection=collection1, coreNodeName=, dataDir=data/, shard=}
   [junit4]   2> 2711450 INFO  (TEST-ForceLeaderTest.testLastPublishedStateIsActive-seed#[3C142C6198BE1AB8]) [n:127.0.0.1:52698_    ] o.a.s.c.CorePropertiesLocator Found core collection1 in /export/home/jenkins/workspace/Lucene-Solr-master-Solaris/solr/build/solr-core/test/J0/temp/solr.cloud.ForceLeaderTest_3C142C6198BE1AB8-001/shard-1-001/cores/collection1
   [junit4]   2> 2711450 INFO  (TEST-ForceLeaderTest.testLastPublishedStateIsActive-seed#[3C142C6198BE1AB8]) [n:127.0.0.1:52698_    ] o.a.s.c.CorePropertiesLocator Found 1 core definitions
   [junit4]   2> 2711452 INFO  (TEST-ForceLeaderTest.testLastPublishedStateIsActive-seed#[3C142C6198BE1AB8]) [n:127.0.0.1:52698_    ] o.a.s.s.SolrDispatchFilter user.dir=/export/home/jenkins/workspace/Lucene-Solr-master-Solaris/solr/build/solr-core/test/J0
   [junit4]   2> 2711453 INFO  (TEST-ForceLeaderTest.testLastPublishedStateIsActive-seed#[3C142C6198BE1AB8]) [n:127.0.0.1:52698_    ] o.a.s.s.SolrDispatchFilter SolrDispatchFilter.init() done
   [junit4]   2> 2711453 INFO  (coreLoadExecutor-8354-thread-1-processing-n:127.0.0.1:52698_) [n:127.0.0.1:52698_ c:collection1   x:collection1] o.a.s.c.ZkController publishing state=down
   [junit4]   2> 2711453 INFO  (coreLoadExecutor-8354-thread-1-processing-n:127.0.0.1:52698_) [n:127.0.0.1:52698_ c:collection1   x:collection1] o.a.s.c.ZkController numShards not found on descriptor - reading it from system property
   [junit4]   2> 2711461 INFO  (OverseerStateUpdate-96528159769559044-127.0.0.1:61792_-n_0000000000) [n:127.0.0.1:61792_    ] o.a.s.c.Overseer processMessage: queueSize: 1, message = {
   [junit4]   2>   "core":"collection1",
   [junit4]   2>   "roles":null,
   [junit4]   2>   "base_url":"http://127.0.0.1:52698",
   [junit4]   2>   "node_name":"127.0.0.1:52698_",
   [junit4]   2>   "numShards":"2",
   [junit4]   2>   "state":"down",
   [junit4]   2>   "shard":null,
   [junit4]   2>   "collection":"collection1",
   [junit4]   2>   "operation":"state"} current state version: 4
   [junit4]   2> 2711462 INFO  (OverseerStateUpdate-96528159769559044-127.0.0.1:61792_-n_0000000000) [n:127.0.0.1:61792_    ] o.a.s.c.o.ReplicaMutator Update state numShards=2 message={
   [junit4]   2>   "core":"collection1",
   [junit4]   2>   "roles":null,
   [junit4]   2>   "base_url":"http://127.0.0.1:52698",
   [j

[...truncated too long message...]

eader_test_collection_shard1_replica2
   [junit4]    > 	at org.apache.solr.client.solrj.impl.HttpSolrClient.executeMethod(HttpSolrClient.java:615)
   [junit4]    > 	at org.apache.solr.client.solrj.impl.HttpSolrClient.request(HttpSolrClient.java:261)
   [junit4]    > 	at org.apache.solr.client.solrj.impl.HttpSolrClient.request(HttpSolrClient.java:250)
   [junit4]    > 	at org.apache.solr.client.solrj.impl.LBHttpSolrClient.doRequest(LBHttpSolrClient.java:415)
   [junit4]    > 	at org.apache.solr.client.solrj.impl.LBHttpSolrClient.request(LBHttpSolrClient.java:383)
   [junit4]    > 	... 50 more
   [junit4]    > Caused by: org.apache.http.conn.HttpHostConnectException: Connect to 127.0.0.1:39670 [/127.0.0.1] failed: Connection refused
   [junit4]    > 	at org.apache.http.impl.conn.DefaultHttpClientConnectionOperator.connect(DefaultHttpClientConnectionOperator.java:151)
   [junit4]    > 	at org.apache.http.impl.conn.PoolingHttpClientConnectionManager.connect(PoolingHttpClientConnectionManager.java:353)
   [junit4]    > 	at org.apache.http.impl.execchain.MainClientExec.establishRoute(MainClientExec.java:380)
   [junit4]    > 	at org.apache.http.impl.execchain.MainClientExec.execute(MainClientExec.java:236)
   [junit4]    > 	at org.apache.http.impl.execchain.ProtocolExec.execute(ProtocolExec.java:184)
   [junit4]    > 	at org.apache.http.impl.execchain.RetryExec.execute(RetryExec.java:88)
   [junit4]    > 	at org.apache.http.impl.execchain.RedirectExec.execute(RedirectExec.java:110)
   [junit4]    > 	at org.apache.http.impl.client.InternalHttpClient.doExecute(InternalHttpClient.java:184)
   [junit4]    > 	at org.apache.http.impl.client.CloseableHttpClient.execute(CloseableHttpClient.java:82)
   [junit4]    > 	at org.apache.http.impl.client.CloseableHttpClient.execute(CloseableHttpClient.java:55)
   [junit4]    > 	at org.apache.solr.client.solrj.impl.HttpSolrClient.executeMethod(HttpSolrClient.java:513)
   [junit4]    > 	... 54 more
   [junit4]    > Caused by: java.net.ConnectException: Connection refused
   [junit4]    > 	at java.net.PlainSocketImpl.socketConnect(Native Method)
   [junit4]    > 	at java.net.AbstractPlainSocketImpl.doConnect(AbstractPlainSocketImpl.java:350)
   [junit4]    > 	at java.net.AbstractPlainSocketImpl.connectToAddress(AbstractPlainSocketImpl.java:206)
   [junit4]    > 	at java.net.AbstractPlainSocketImpl.connect(AbstractPlainSocketImpl.java:188)
   [junit4]    > 	at java.net.SocksSocketImpl.connect(SocksSocketImpl.java:392)
   [junit4]    > 	at java.net.Socket.connect(Socket.java:589)
   [junit4]    > 	at org.apache.http.conn.socket.PlainConnectionSocketFactory.connectSocket(PlainConnectionSocketFactory.java:74)
   [junit4]    > 	at org.apache.http.impl.conn.DefaultHttpClientConnectionOperator.connect(DefaultHttpClientConnectionOperator.java:134)
   [junit4]    > 	... 64 more
   [junit4]   2> 2812341 INFO  (SUITE-ForceLeaderTest-seed#[3C142C6198BE1AB8]-worker) [    ] o.a.s.SolrTestCaseJ4 ###deleteCore
   [junit4]   2> NOTE: leaving temporary files on disk at: /export/home/jenkins/workspace/Lucene-Solr-master-Solaris/solr/build/solr-core/test/J0/temp/solr.cloud.ForceLeaderTest_3C142C6198BE1AB8-001
   [junit4]   2> Sep 03, 2016 11:42:11 AM com.carrotsearch.randomizedtesting.ThreadLeakControl checkThreadLeaks
   [junit4]   2> WARNING: Will linger awaiting termination of 1 leaked thread(s).
   [junit4]   2> NOTE: test params are: codec=Asserting(Lucene62): {range_facet_l_dv=PostingsFormat(name=Asserting), _version_=BlockTreeOrds(blocksize=128), multiDefault=TestBloomFilteredLucenePostings(BloomFilteringPostingsFormat(Lucene50(blocksize=128))), a_t=TestBloomFilteredLucenePostings(BloomFilteringPostingsFormat(Lucene50(blocksize=128))), intDefault=BlockTreeOrds(blocksize=128), id=PostingsFormat(name=Asserting), range_facet_i_dv=TestBloomFilteredLucenePostings(BloomFilteringPostingsFormat(Lucene50(blocksize=128))), text=FST50, range_facet_l=TestBloomFilteredLucenePostings(BloomFilteringPostingsFormat(Lucene50(blocksize=128))), timestamp=TestBloomFilteredLucenePostings(BloomFilteringPostingsFormat(Lucene50(blocksize=128)))}, docValues:{range_facet_l_dv=DocValuesFormat(name=Memory), range_facet_i_dv=DocValuesFormat(name=Lucene54), timestamp=DocValuesFormat(name=Lucene54)}, maxPointsInLeafNode=1715, maxMBSortInHeap=5.9732150718761945, sim=RandomSimilarity(queryNorm=true): {}, locale=it, timezone=America/Barbados
   [junit4]   2> NOTE: SunOS 5.11 amd64/Oracle Corporation 1.8.0_102 (64-bit)/cpus=3,threads=1,free=262600848,total=536870912
   [junit4]   2> NOTE: All tests run in this JVM: [TestDFRSimilarityFactory, BadComponentTest, DistributedQueryComponentCustomSortTest, TestCloudManagedSchema, TestWordDelimiterFilterFactory, TestTolerantSearch, BlobRepositoryCloudTest, TestEmbeddedSolrServerConstructors, CollectionsAPISolrJTest, StandardRequestHandlerTest, TestDistributedSearch, BasicAuthIntegrationTest, AsyncMigrateRouteKeyTest, SolrCLIZkUtilsTest, VMParamsZkACLAndCredentialsProvidersTest, TestStressVersions, TestReloadAndDeleteDocs, OutOfBoxZkACLAndCredentialsProvidersTest, CircularListTest, GraphQueryTest, TestDownShardTolerantSearch, ParsingFieldUpdateProcessorsTest, CloudMLTQParserTest, TestDistribIDF, TestMacroExpander, SSLMigrationTest, ShardRoutingTest, RestartWhileUpdatingTest, TestLMDirichletSimilarityFactory, TermsComponentTest, ClusterStateUpdateTest, TestSortingResponseWriter, RequiredFieldsTest, TestSearchPerf, TestExactStatsCache, TestInitQParser, TestStressReorder, HdfsTlogReplayBufferedWhileIndexingTest, CollectionTooManyReplicasTest, TestUpdate, DistributedSpellCheckComponentTest, PolyFieldTest, TestFastLRUCache, BitVectorTest, TestFieldSortValues, TestConfig, TestSolrQueryParserResource, TestGraphTermsQParserPlugin, AssignTest, ConfigSetsAPITest, TestCoreContainer, ShardSplitTest, SpatialHeatmapFacetsTest, TestSSLRandomization, CleanupOldIndexTest, PreAnalyzedFieldTest, TestCloudPivotFacet, TestFunctionQuery, SampleTest, AddSchemaFieldsUpdateProcessorFactoryTest, TestInitParams, TestSort, TestStressCloudBlindAtomicUpdates, TestHdfsCloudBackupRestore, ScriptEngineTest, ReturnFieldsTest, SharedFSAutoReplicaFailoverUtilsTest, ActionThrottleTest, TestJsonFacets, TestManagedResourceStorage, DistribCursorPagingTest, TestRandomFlRTGCloud, TestSolrFieldCacheMBean, TestDocBasedVersionConstraints, TestHdfsUpdateLog, TestSizeLimitedDistributedMap, CursorPagingTest, AnalyticsQueryTest, DistributedFacetExistsSmallTest, DistributedQueryElevationComponentTest, HLLUtilTest, TestSubQueryTransformerDistrib, FullHLLTest, TestClusterStateMutator, TestDocSet, TestPartialUpdateDeduplication, TestManagedSchema, TestSolrXml, HdfsWriteToMultipleCollectionsTest, BJQParserTest, TestFieldCollectionResource, TlogReplayBufferedWhileIndexingTest, SolrIndexConfigTest, OverseerTest, UUIDFieldTest, UUIDUpdateProcessorFallbackTest, DistributedFacetPivotSmallTest, TestLockTree, TestConfigSets, SolrRequestParserTest, TestConfigSetsAPIExclusivity, TestBackupRepositoryFactory, TestStressUserVersions, TestQuerySenderNoQuery, RegexBoostProcessorTest, TestPhraseSuggestions, MBeansHandlerTest, RuleEngineTest, PrimitiveFieldTypeTest, TestSweetSpotSimilarityFactory, TestNonDefinedSimilarityFactory, TestSerializedLuceneMatchVersion, SecurityConfHandlerTest, DocExpirationUpdateProcessorFactoryTest, TestSolrCLIRunExample, SortSpecParsingTest, StatelessScriptUpdateProcessorFactoryTest, TestBulkSchemaAPI, TestRequestForwarding, TestXmlQParser, SyncSliceTest, ZkStateWriterTest, SOLR749Test, TestOrdValues, DeleteNodeTest, MoreLikeThisHandlerTest, TestLegacyFieldCache, SpatialRPTFieldTypeTest, SchemaVersionSpecificBehaviorTest, ClassificationUpdateProcessorFactoryTest, OverseerTaskQueueTest, TestRecoveryHdfs, HdfsDirectoryTest, WrapperMergePolicyFactoryTest, TestSurroundQueryParser, LeaderElectionTest, SolrTestCaseJ4Test, TestMaxScoreQueryParser, DirectoryFactoryTest, HttpPartitionTest, DocValuesTest, UpdateParamsTest, TestCursorMarkWithoutUniqueKey, DistributedVersionInfoTest, TestSchemaNameResource, TestComponentsName, DistributedSuggestComponentTest, TestMergePolicyConfig, TimeZoneUtilsTest, PeerSyncTest, CollectionsAPIDistributedZkTest, TestRandomFaceting, ZkCLITest, TestHashPartitioner, TestJoin, HardAutoCommitTest, SimpleFacetsTest, SolrCoreTest, TestGroupingSearch, QueryElevationComponentTest, TestFiltering, BasicFunctionalityTest, TestLazyCores, TestBadConfig, ShowFileRequestHandlerTest, CurrencyFieldOpenExchangeTest, CurrencyFieldXmlFileTest, SimplePostToolTest, AnalysisAfterCoreReloadTest, SignatureUpdateProcessorFactoryTest, TestExtendedDismaxParser, SpellCheckCollatorTest, SuggesterFSTTest, TestStressLucene, SpatialFilterTest, TestCSVLoader, FieldMutatingUpdateProcessorTest, QueryEqualityTest, DocValuesMultiTest, TestSolrDeletionPolicy1, XsltUpdateRequestHandlerTest, IndexBasedSpellCheckerTest, TestReversedWildcardFilterFactory, TestQueryTypes, FileBasedSpellCheckerTest, DocumentBuilderTest, PathHierarchyTokenizerFactoryTest, TestArbitraryIndexDir, IndexSchemaRuntimeFieldTest, SolrPluginUtilsTest, TestJmxIntegration, JSONWriterTest, JsonLoaderTest, TestPHPSerializedResponseWriter, CSVRequestHandlerTest, SearchHandlerTest, HighlighterConfigTest, AlternateDirectoryTest, TestStressRecovery, TestSolrDeletionPolicy2, MultiTermTest, TestBinaryField, NumericFieldsTest, TestElisionMultitermQuery, ExternalFileFieldSortTest, TestSolrCoreProperties, TestLuceneMatchVersion, TestCodecSupport, ResourceLoaderTest, OpenExchangeRatesOrgProviderTest, PluginInfoTest, DateMathParserTest, ChaosMonkeyNothingIsSafeTest, CdcrReplicationDistributedZkTest, CdcrReplicationHandlerTest, CdcrVersionReplicationTest, CloudExitableDirectoryReaderTest, CollectionStateFormat2Test, ConnectionManagerTest, CreateCollectionCleanupTest, DeleteInactiveReplicaTest, DeleteShardTest, DistribDocExpirationUpdateProcessorTest, ForceLeaderTest]
   [junit4] Completed [478/633 (1!)] on J0 in 103.56s, 3 tests, 1 error, 1 skipped <<< FAILURES!

[...truncated 60640 lines...]


Mime
View raw message