lucene-dev mailing list archives

Site index · List index
Message view « Date » · « Thread »
Top « Date » · « Thread »
From Apache Jenkins Server <jenk...@builds.apache.org>
Subject [JENKINS] Lucene-Solr-Tests-master - Build # 1392 - Still Unstable
Date Wed, 14 Sep 2016 11:05:52 GMT
Build: https://builds.apache.org/job/Lucene-Solr-Tests-master/1392/

1 tests failed.
FAILED:  org.apache.solr.cloud.ForceLeaderTest.testReplicasInLIRNoLeader

Error Message:
No live SolrServers available to handle this request:[http://127.0.0.1:46512/forceleader_test_collection_shard1_replica3]

Stack Trace:
org.apache.solr.client.solrj.impl.CloudSolrClient$RouteException: No live SolrServers available to handle this request:[http://127.0.0.1:46512/forceleader_test_collection_shard1_replica3]
	at __randomizedtesting.SeedInfo.seed([6985005880625E85:8F123498B9E0A7E4]:0)
	at org.apache.solr.client.solrj.impl.CloudSolrClient.directUpdate(CloudSolrClient.java:755)
	at org.apache.solr.client.solrj.impl.CloudSolrClient.sendRequest(CloudSolrClient.java:1161)
	at org.apache.solr.client.solrj.impl.CloudSolrClient.requestWithRetryOnStaleState(CloudSolrClient.java:1050)
	at org.apache.solr.client.solrj.impl.CloudSolrClient.request(CloudSolrClient.java:992)
	at org.apache.solr.cloud.AbstractFullDistribZkTestBase.sendDocsWithRetry(AbstractFullDistribZkTestBase.java:753)
	at org.apache.solr.cloud.AbstractFullDistribZkTestBase.sendDocsWithRetry(AbstractFullDistribZkTestBase.java:741)
	at org.apache.solr.cloud.ForceLeaderTest.sendDoc(ForceLeaderTest.java:424)
	at org.apache.solr.cloud.ForceLeaderTest.testReplicasInLIRNoLeader(ForceLeaderTest.java:131)
	at sun.reflect.NativeMethodAccessorImpl.invoke0(Native Method)
	at sun.reflect.NativeMethodAccessorImpl.invoke(NativeMethodAccessorImpl.java:62)
	at sun.reflect.DelegatingMethodAccessorImpl.invoke(DelegatingMethodAccessorImpl.java:43)
	at java.lang.reflect.Method.invoke(Method.java:498)
	at com.carrotsearch.randomizedtesting.RandomizedRunner.invoke(RandomizedRunner.java:1764)
	at com.carrotsearch.randomizedtesting.RandomizedRunner$8.evaluate(RandomizedRunner.java:871)
	at com.carrotsearch.randomizedtesting.RandomizedRunner$9.evaluate(RandomizedRunner.java:907)
	at com.carrotsearch.randomizedtesting.RandomizedRunner$10.evaluate(RandomizedRunner.java:921)
	at org.apache.solr.BaseDistributedSearchTestCase$ShardsRepeatRule$ShardsFixedStatement.callStatement(BaseDistributedSearchTestCase.java:985)
	at org.apache.solr.BaseDistributedSearchTestCase$ShardsRepeatRule$ShardsStatement.evaluate(BaseDistributedSearchTestCase.java:960)
	at com.carrotsearch.randomizedtesting.rules.SystemPropertiesRestoreRule$1.evaluate(SystemPropertiesRestoreRule.java:57)
	at org.apache.lucene.util.TestRuleSetupTeardownChained$1.evaluate(TestRuleSetupTeardownChained.java:49)
	at org.apache.lucene.util.AbstractBeforeAfterRule$1.evaluate(AbstractBeforeAfterRule.java:45)
	at org.apache.lucene.util.TestRuleThreadAndTestName$1.evaluate(TestRuleThreadAndTestName.java:48)
	at org.apache.lucene.util.TestRuleIgnoreAfterMaxFailures$1.evaluate(TestRuleIgnoreAfterMaxFailures.java:64)
	at org.apache.lucene.util.TestRuleMarkFailure$1.evaluate(TestRuleMarkFailure.java:47)
	at com.carrotsearch.randomizedtesting.rules.StatementAdapter.evaluate(StatementAdapter.java:36)
	at com.carrotsearch.randomizedtesting.ThreadLeakControl$StatementRunner.run(ThreadLeakControl.java:367)
	at com.carrotsearch.randomizedtesting.ThreadLeakControl.forkTimeoutingTask(ThreadLeakControl.java:809)
	at com.carrotsearch.randomizedtesting.ThreadLeakControl$3.evaluate(ThreadLeakControl.java:460)
	at com.carrotsearch.randomizedtesting.RandomizedRunner.runSingleTest(RandomizedRunner.java:880)
	at com.carrotsearch.randomizedtesting.RandomizedRunner$5.evaluate(RandomizedRunner.java:781)
	at com.carrotsearch.randomizedtesting.RandomizedRunner$6.evaluate(RandomizedRunner.java:816)
	at com.carrotsearch.randomizedtesting.RandomizedRunner$7.evaluate(RandomizedRunner.java:827)
	at com.carrotsearch.randomizedtesting.rules.StatementAdapter.evaluate(StatementAdapter.java:36)
	at com.carrotsearch.randomizedtesting.rules.SystemPropertiesRestoreRule$1.evaluate(SystemPropertiesRestoreRule.java:57)
	at org.apache.lucene.util.AbstractBeforeAfterRule$1.evaluate(AbstractBeforeAfterRule.java:45)
	at com.carrotsearch.randomizedtesting.rules.StatementAdapter.evaluate(StatementAdapter.java:36)
	at org.apache.lucene.util.TestRuleStoreClassName$1.evaluate(TestRuleStoreClassName.java:41)
	at com.carrotsearch.randomizedtesting.rules.NoShadowingOrOverridesOnMethodsRule$1.evaluate(NoShadowingOrOverridesOnMethodsRule.java:40)
	at com.carrotsearch.randomizedtesting.rules.NoShadowingOrOverridesOnMethodsRule$1.evaluate(NoShadowingOrOverridesOnMethodsRule.java:40)
	at com.carrotsearch.randomizedtesting.rules.StatementAdapter.evaluate(StatementAdapter.java:36)
	at com.carrotsearch.randomizedtesting.rules.StatementAdapter.evaluate(StatementAdapter.java:36)
	at com.carrotsearch.randomizedtesting.rules.StatementAdapter.evaluate(StatementAdapter.java:36)
	at org.apache.lucene.util.TestRuleAssertionsRequired$1.evaluate(TestRuleAssertionsRequired.java:53)
	at org.apache.lucene.util.TestRuleMarkFailure$1.evaluate(TestRuleMarkFailure.java:47)
	at org.apache.lucene.util.TestRuleIgnoreAfterMaxFailures$1.evaluate(TestRuleIgnoreAfterMaxFailures.java:64)
	at org.apache.lucene.util.TestRuleIgnoreTestSuites$1.evaluate(TestRuleIgnoreTestSuites.java:54)
	at com.carrotsearch.randomizedtesting.rules.StatementAdapter.evaluate(StatementAdapter.java:36)
	at com.carrotsearch.randomizedtesting.ThreadLeakControl$StatementRunner.run(ThreadLeakControl.java:367)
	at java.lang.Thread.run(Thread.java:745)
Caused by: org.apache.solr.client.solrj.SolrServerException: No live SolrServers available to handle this request:[http://127.0.0.1:46512/forceleader_test_collection_shard1_replica3]
	at org.apache.solr.client.solrj.impl.LBHttpSolrClient.request(LBHttpSolrClient.java:394)
	at org.apache.solr.client.solrj.impl.CloudSolrClient.lambda$directUpdate$0(CloudSolrClient.java:730)
	at java.util.concurrent.FutureTask.run(FutureTask.java:266)
	at org.apache.solr.common.util.ExecutorUtil$MDCAwareThreadPoolExecutor.lambda$execute$0(ExecutorUtil.java:229)
	at java.util.concurrent.ThreadPoolExecutor.runWorker(ThreadPoolExecutor.java:1142)
	at java.util.concurrent.ThreadPoolExecutor$Worker.run(ThreadPoolExecutor.java:617)
	... 1 more
Caused by: org.apache.solr.client.solrj.SolrServerException: Server refused connection at: http://127.0.0.1:46512/forceleader_test_collection_shard1_replica3
	at org.apache.solr.client.solrj.impl.HttpSolrClient.executeMethod(HttpSolrClient.java:615)
	at org.apache.solr.client.solrj.impl.HttpSolrClient.request(HttpSolrClient.java:261)
	at org.apache.solr.client.solrj.impl.HttpSolrClient.request(HttpSolrClient.java:250)
	at org.apache.solr.client.solrj.impl.LBHttpSolrClient.doRequest(LBHttpSolrClient.java:415)
	at org.apache.solr.client.solrj.impl.LBHttpSolrClient.request(LBHttpSolrClient.java:383)
	... 6 more
Caused by: org.apache.http.conn.HttpHostConnectException: Connect to 127.0.0.1:46512 [/127.0.0.1] failed: Connection refused
	at org.apache.http.impl.conn.DefaultHttpClientConnectionOperator.connect(DefaultHttpClientConnectionOperator.java:151)
	at org.apache.http.impl.conn.PoolingHttpClientConnectionManager.connect(PoolingHttpClientConnectionManager.java:353)
	at org.apache.http.impl.execchain.MainClientExec.establishRoute(MainClientExec.java:380)
	at org.apache.http.impl.execchain.MainClientExec.execute(MainClientExec.java:236)
	at org.apache.http.impl.execchain.ProtocolExec.execute(ProtocolExec.java:184)
	at org.apache.http.impl.execchain.RetryExec.execute(RetryExec.java:88)
	at org.apache.http.impl.execchain.RedirectExec.execute(RedirectExec.java:110)
	at org.apache.http.impl.client.InternalHttpClient.doExecute(InternalHttpClient.java:184)
	at org.apache.http.impl.client.CloseableHttpClient.execute(CloseableHttpClient.java:82)
	at org.apache.http.impl.client.CloseableHttpClient.execute(CloseableHttpClient.java:55)
	at org.apache.solr.client.solrj.impl.HttpSolrClient.executeMethod(HttpSolrClient.java:513)
	... 10 more
Caused by: java.net.ConnectException: Connection refused
	at java.net.PlainSocketImpl.socketConnect(Native Method)
	at java.net.AbstractPlainSocketImpl.doConnect(AbstractPlainSocketImpl.java:350)
	at java.net.AbstractPlainSocketImpl.connectToAddress(AbstractPlainSocketImpl.java:206)
	at java.net.AbstractPlainSocketImpl.connect(AbstractPlainSocketImpl.java:188)
	at java.net.SocksSocketImpl.connect(SocksSocketImpl.java:392)
	at java.net.Socket.connect(Socket.java:589)
	at org.apache.http.conn.socket.PlainConnectionSocketFactory.connectSocket(PlainConnectionSocketFactory.java:74)
	at org.apache.http.impl.conn.DefaultHttpClientConnectionOperator.connect(DefaultHttpClientConnectionOperator.java:134)
	... 20 more




Build Log:
[...truncated 12031 lines...]
   [junit4] Suite: org.apache.solr.cloud.ForceLeaderTest
   [junit4]   2> Creating dataDir: /x1/jenkins/jenkins-slave/workspace/Lucene-Solr-Tests-master/solr/build/solr-core/test/J2/temp/solr.cloud.ForceLeaderTest_6985005880625E85-001/init-core-data-001
   [junit4]   2> 2582528 INFO  (SUITE-ForceLeaderTest-seed#[6985005880625E85]-worker) [    ] o.a.s.SolrTestCaseJ4 Randomized ssl (false) and clientAuth (false) via: @org.apache.solr.SolrTestCaseJ4$SuppressSSL(bugUrl=https://issues.apache.org/jira/browse/SOLR-5776)
   [junit4]   2> 2582528 INFO  (SUITE-ForceLeaderTest-seed#[6985005880625E85]-worker) [    ] o.a.s.BaseDistributedSearchTestCase Setting hostContext system property: /
   [junit4]   2> 2582530 INFO  (TEST-ForceLeaderTest.testReplicasInLIRNoLeader-seed#[6985005880625E85]) [    ] o.a.s.c.ZkTestServer STARTING ZK TEST SERVER
   [junit4]   2> 2582530 INFO  (Thread-3370) [    ] o.a.s.c.ZkTestServer client port:0.0.0.0/0.0.0.0:0
   [junit4]   2> 2582530 INFO  (Thread-3370) [    ] o.a.s.c.ZkTestServer Starting server
   [junit4]   2> 2582738 INFO  (TEST-ForceLeaderTest.testReplicasInLIRNoLeader-seed#[6985005880625E85]) [    ] o.a.s.c.ZkTestServer start zk server on port:58816
   [junit4]   2> 2582738 INFO  (TEST-ForceLeaderTest.testReplicasInLIRNoLeader-seed#[6985005880625E85]) [    ] o.a.s.c.c.SolrZkClient Using default ZkCredentialsProvider
   [junit4]   2> 2582740 INFO  (TEST-ForceLeaderTest.testReplicasInLIRNoLeader-seed#[6985005880625E85]) [    ] o.a.s.c.c.ConnectionManager Waiting for client to connect to ZooKeeper
   [junit4]   2> 2582743 INFO  (zkCallback-2928-thread-1) [    ] o.a.s.c.c.ConnectionManager Watcher org.apache.solr.common.cloud.ConnectionManager@2f52d192 name:ZooKeeperConnection Watcher:127.0.0.1:58816 got event WatchedEvent state:SyncConnected type:None path:null path:null type:None
   [junit4]   2> 2582743 INFO  (TEST-ForceLeaderTest.testReplicasInLIRNoLeader-seed#[6985005880625E85]) [    ] o.a.s.c.c.ConnectionManager Client is connected to ZooKeeper
   [junit4]   2> 2582743 INFO  (TEST-ForceLeaderTest.testReplicasInLIRNoLeader-seed#[6985005880625E85]) [    ] o.a.s.c.c.SolrZkClient Using default ZkACLProvider
   [junit4]   2> 2582743 INFO  (TEST-ForceLeaderTest.testReplicasInLIRNoLeader-seed#[6985005880625E85]) [    ] o.a.s.c.c.SolrZkClient makePath: /solr
   [junit4]   2> 2582749 WARN  (NIOServerCxn.Factory:0.0.0.0/0.0.0.0:0) [    ] o.a.z.s.NIOServerCnxn caught end of stream exception
   [junit4]   2> EndOfStreamException: Unable to read additional data from client sessionid 0x157283393ea0000, likely client has closed socket
   [junit4]   2> 	at org.apache.zookeeper.server.NIOServerCnxn.doIO(NIOServerCnxn.java:228)
   [junit4]   2> 	at org.apache.zookeeper.server.NIOServerCnxnFactory.run(NIOServerCnxnFactory.java:208)
   [junit4]   2> 	at java.lang.Thread.run(Thread.java:745)
   [junit4]   2> 2582755 INFO  (TEST-ForceLeaderTest.testReplicasInLIRNoLeader-seed#[6985005880625E85]) [    ] o.a.s.c.c.SolrZkClient Using default ZkCredentialsProvider
   [junit4]   2> 2582759 INFO  (TEST-ForceLeaderTest.testReplicasInLIRNoLeader-seed#[6985005880625E85]) [    ] o.a.s.c.c.ConnectionManager Waiting for client to connect to ZooKeeper
   [junit4]   2> 2582762 INFO  (zkCallback-2929-thread-1) [    ] o.a.s.c.c.ConnectionManager Watcher org.apache.solr.common.cloud.ConnectionManager@723a6f3b name:ZooKeeperConnection Watcher:127.0.0.1:58816/solr got event WatchedEvent state:SyncConnected type:None path:null path:null type:None
   [junit4]   2> 2582762 INFO  (TEST-ForceLeaderTest.testReplicasInLIRNoLeader-seed#[6985005880625E85]) [    ] o.a.s.c.c.ConnectionManager Client is connected to ZooKeeper
   [junit4]   2> 2582762 INFO  (TEST-ForceLeaderTest.testReplicasInLIRNoLeader-seed#[6985005880625E85]) [    ] o.a.s.c.c.SolrZkClient Using default ZkACLProvider
   [junit4]   2> 2582762 INFO  (TEST-ForceLeaderTest.testReplicasInLIRNoLeader-seed#[6985005880625E85]) [    ] o.a.s.c.c.SolrZkClient makePath: /collections/collection1
   [junit4]   2> 2582764 INFO  (TEST-ForceLeaderTest.testReplicasInLIRNoLeader-seed#[6985005880625E85]) [    ] o.a.s.c.c.SolrZkClient makePath: /collections/collection1/shards
   [junit4]   2> 2582765 INFO  (TEST-ForceLeaderTest.testReplicasInLIRNoLeader-seed#[6985005880625E85]) [    ] o.a.s.c.c.SolrZkClient makePath: /collections/control_collection
   [junit4]   2> 2582766 INFO  (TEST-ForceLeaderTest.testReplicasInLIRNoLeader-seed#[6985005880625E85]) [    ] o.a.s.c.c.SolrZkClient makePath: /collections/control_collection/shards
   [junit4]   2> 2582767 INFO  (TEST-ForceLeaderTest.testReplicasInLIRNoLeader-seed#[6985005880625E85]) [    ] o.a.s.c.AbstractZkTestCase put /x1/jenkins/jenkins-slave/workspace/Lucene-Solr-Tests-master/solr/core/src/test-files/solr/collection1/conf/solrconfig-tlog.xml to /configs/conf1/solrconfig.xml
   [junit4]   2> 2582770 INFO  (TEST-ForceLeaderTest.testReplicasInLIRNoLeader-seed#[6985005880625E85]) [    ] o.a.s.c.c.SolrZkClient makePath: /configs/conf1/solrconfig.xml
   [junit4]   2> 2582772 INFO  (TEST-ForceLeaderTest.testReplicasInLIRNoLeader-seed#[6985005880625E85]) [    ] o.a.s.c.AbstractZkTestCase put /x1/jenkins/jenkins-slave/workspace/Lucene-Solr-Tests-master/solr/core/src/test-files/solr/collection1/conf/schema.xml to /configs/conf1/schema.xml
   [junit4]   2> 2582772 INFO  (TEST-ForceLeaderTest.testReplicasInLIRNoLeader-seed#[6985005880625E85]) [    ] o.a.s.c.c.SolrZkClient makePath: /configs/conf1/schema.xml
   [junit4]   2> 2582774 INFO  (TEST-ForceLeaderTest.testReplicasInLIRNoLeader-seed#[6985005880625E85]) [    ] o.a.s.c.AbstractZkTestCase put /x1/jenkins/jenkins-slave/workspace/Lucene-Solr-Tests-master/solr/core/src/test-files/solr/collection1/conf/solrconfig.snippet.randomindexconfig.xml to /configs/conf1/solrconfig.snippet.randomindexconfig.xml
   [junit4]   2> 2582774 INFO  (TEST-ForceLeaderTest.testReplicasInLIRNoLeader-seed#[6985005880625E85]) [    ] o.a.s.c.c.SolrZkClient makePath: /configs/conf1/solrconfig.snippet.randomindexconfig.xml
   [junit4]   2> 2582779 INFO  (TEST-ForceLeaderTest.testReplicasInLIRNoLeader-seed#[6985005880625E85]) [    ] o.a.s.c.AbstractZkTestCase put /x1/jenkins/jenkins-slave/workspace/Lucene-Solr-Tests-master/solr/core/src/test-files/solr/collection1/conf/stopwords.txt to /configs/conf1/stopwords.txt
   [junit4]   2> 2582779 INFO  (TEST-ForceLeaderTest.testReplicasInLIRNoLeader-seed#[6985005880625E85]) [    ] o.a.s.c.c.SolrZkClient makePath: /configs/conf1/stopwords.txt
   [junit4]   2> 2582780 INFO  (TEST-ForceLeaderTest.testReplicasInLIRNoLeader-seed#[6985005880625E85]) [    ] o.a.s.c.AbstractZkTestCase put /x1/jenkins/jenkins-slave/workspace/Lucene-Solr-Tests-master/solr/core/src/test-files/solr/collection1/conf/protwords.txt to /configs/conf1/protwords.txt
   [junit4]   2> 2582781 INFO  (TEST-ForceLeaderTest.testReplicasInLIRNoLeader-seed#[6985005880625E85]) [    ] o.a.s.c.c.SolrZkClient makePath: /configs/conf1/protwords.txt
   [junit4]   2> 2582788 INFO  (TEST-ForceLeaderTest.testReplicasInLIRNoLeader-seed#[6985005880625E85]) [    ] o.a.s.c.AbstractZkTestCase put /x1/jenkins/jenkins-slave/workspace/Lucene-Solr-Tests-master/solr/core/src/test-files/solr/collection1/conf/currency.xml to /configs/conf1/currency.xml
   [junit4]   2> 2582788 INFO  (TEST-ForceLeaderTest.testReplicasInLIRNoLeader-seed#[6985005880625E85]) [    ] o.a.s.c.c.SolrZkClient makePath: /configs/conf1/currency.xml
   [junit4]   2> 2582822 INFO  (TEST-ForceLeaderTest.testReplicasInLIRNoLeader-seed#[6985005880625E85]) [    ] o.a.s.c.AbstractZkTestCase put /x1/jenkins/jenkins-slave/workspace/Lucene-Solr-Tests-master/solr/core/src/test-files/solr/collection1/conf/enumsConfig.xml to /configs/conf1/enumsConfig.xml
   [junit4]   2> 2582822 INFO  (TEST-ForceLeaderTest.testReplicasInLIRNoLeader-seed#[6985005880625E85]) [    ] o.a.s.c.c.SolrZkClient makePath: /configs/conf1/enumsConfig.xml
   [junit4]   2> 2582823 INFO  (TEST-ForceLeaderTest.testReplicasInLIRNoLeader-seed#[6985005880625E85]) [    ] o.a.s.c.AbstractZkTestCase put /x1/jenkins/jenkins-slave/workspace/Lucene-Solr-Tests-master/solr/core/src/test-files/solr/collection1/conf/open-exchange-rates.json to /configs/conf1/open-exchange-rates.json
   [junit4]   2> 2582823 INFO  (TEST-ForceLeaderTest.testReplicasInLIRNoLeader-seed#[6985005880625E85]) [    ] o.a.s.c.c.SolrZkClient makePath: /configs/conf1/open-exchange-rates.json
   [junit4]   2> 2582824 INFO  (TEST-ForceLeaderTest.testReplicasInLIRNoLeader-seed#[6985005880625E85]) [    ] o.a.s.c.AbstractZkTestCase put /x1/jenkins/jenkins-slave/workspace/Lucene-Solr-Tests-master/solr/core/src/test-files/solr/collection1/conf/mapping-ISOLatin1Accent.txt to /configs/conf1/mapping-ISOLatin1Accent.txt
   [junit4]   2> 2582825 INFO  (TEST-ForceLeaderTest.testReplicasInLIRNoLeader-seed#[6985005880625E85]) [    ] o.a.s.c.c.SolrZkClient makePath: /configs/conf1/mapping-ISOLatin1Accent.txt
   [junit4]   2> 2582826 INFO  (TEST-ForceLeaderTest.testReplicasInLIRNoLeader-seed#[6985005880625E85]) [    ] o.a.s.c.AbstractZkTestCase put /x1/jenkins/jenkins-slave/workspace/Lucene-Solr-Tests-master/solr/core/src/test-files/solr/collection1/conf/old_synonyms.txt to /configs/conf1/old_synonyms.txt
   [junit4]   2> 2582826 INFO  (TEST-ForceLeaderTest.testReplicasInLIRNoLeader-seed#[6985005880625E85]) [    ] o.a.s.c.c.SolrZkClient makePath: /configs/conf1/old_synonyms.txt
   [junit4]   2> 2582827 INFO  (TEST-ForceLeaderTest.testReplicasInLIRNoLeader-seed#[6985005880625E85]) [    ] o.a.s.c.AbstractZkTestCase put /x1/jenkins/jenkins-slave/workspace/Lucene-Solr-Tests-master/solr/core/src/test-files/solr/collection1/conf/synonyms.txt to /configs/conf1/synonyms.txt
   [junit4]   2> 2582827 INFO  (TEST-ForceLeaderTest.testReplicasInLIRNoLeader-seed#[6985005880625E85]) [    ] o.a.s.c.c.SolrZkClient makePath: /configs/conf1/synonyms.txt
   [junit4]   2> 2582921 INFO  (TEST-ForceLeaderTest.testReplicasInLIRNoLeader-seed#[6985005880625E85]) [    ] o.a.s.SolrTestCaseJ4 Writing core.properties file to /x1/jenkins/jenkins-slave/workspace/Lucene-Solr-Tests-master/solr/build/solr-core/test/J2/temp/solr.cloud.ForceLeaderTest_6985005880625E85-001/control-001/cores/collection1
   [junit4]   2> 2582923 INFO  (TEST-ForceLeaderTest.testReplicasInLIRNoLeader-seed#[6985005880625E85]) [    ] o.e.j.s.Server jetty-9.3.8.v20160314
   [junit4]   2> 2582927 INFO  (TEST-ForceLeaderTest.testReplicasInLIRNoLeader-seed#[6985005880625E85]) [    ] o.e.j.s.h.ContextHandler Started o.e.j.s.ServletContextHandler@2519271e{/,null,AVAILABLE}
   [junit4]   2> 2582928 INFO  (TEST-ForceLeaderTest.testReplicasInLIRNoLeader-seed#[6985005880625E85]) [    ] o.e.j.s.ServerConnector Started ServerConnector@2b9d4a1c{HTTP/1.1,[http/1.1]}{127.0.0.1:38217}
   [junit4]   2> 2582928 INFO  (TEST-ForceLeaderTest.testReplicasInLIRNoLeader-seed#[6985005880625E85]) [    ] o.e.j.s.Server Started @2590614ms
   [junit4]   2> 2582928 INFO  (TEST-ForceLeaderTest.testReplicasInLIRNoLeader-seed#[6985005880625E85]) [    ] o.a.s.c.s.e.JettySolrRunner Jetty properties: {solr.data.dir=/x1/jenkins/jenkins-slave/workspace/Lucene-Solr-Tests-master/solr/build/solr-core/test/J2/temp/solr.cloud.ForceLeaderTest_6985005880625E85-001/tempDir-001/control/data, hostContext=/, hostPort=46512, coreRootDirectory=/x1/jenkins/jenkins-slave/workspace/Lucene-Solr-Tests-master/solr/build/solr-core/test/J2/temp/solr.cloud.ForceLeaderTest_6985005880625E85-001/control-001/cores}
   [junit4]   2> 2582929 INFO  (TEST-ForceLeaderTest.testReplicasInLIRNoLeader-seed#[6985005880625E85]) [    ] o.a.s.s.SolrDispatchFilter SolrDispatchFilter.init(): sun.misc.Launcher$AppClassLoader@73d16e93
   [junit4]   2> 2582929 INFO  (TEST-ForceLeaderTest.testReplicasInLIRNoLeader-seed#[6985005880625E85]) [    ] o.a.s.c.SolrResourceLoader new SolrResourceLoader for directory: '/x1/jenkins/jenkins-slave/workspace/Lucene-Solr-Tests-master/solr/build/solr-core/test/J2/temp/solr.cloud.ForceLeaderTest_6985005880625E85-001/control-001'
   [junit4]   2> 2582929 INFO  (TEST-ForceLeaderTest.testReplicasInLIRNoLeader-seed#[6985005880625E85]) [    ] o.a.s.c.SolrResourceLoader JNDI not configured for solr (NoInitialContextEx)
   [junit4]   2> 2582929 INFO  (TEST-ForceLeaderTest.testReplicasInLIRNoLeader-seed#[6985005880625E85]) [    ] o.a.s.c.SolrResourceLoader solr home defaulted to 'solr/' (could not find system property or JNDI)
   [junit4]   2> 2582929 INFO  (TEST-ForceLeaderTest.testReplicasInLIRNoLeader-seed#[6985005880625E85]) [    ] o.a.s.c.c.SolrZkClient Using default ZkCredentialsProvider
   [junit4]   2> 2582930 INFO  (TEST-ForceLeaderTest.testReplicasInLIRNoLeader-seed#[6985005880625E85]) [    ] o.a.s.c.c.ConnectionManager Waiting for client to connect to ZooKeeper
   [junit4]   2> 2582934 INFO  (zkCallback-2930-thread-1) [    ] o.a.s.c.c.ConnectionManager Watcher org.apache.solr.common.cloud.ConnectionManager@60a74bd6 name:ZooKeeperConnection Watcher:127.0.0.1:58816/solr got event WatchedEvent state:SyncConnected type:None path:null path:null type:None
   [junit4]   2> 2582934 INFO  (TEST-ForceLeaderTest.testReplicasInLIRNoLeader-seed#[6985005880625E85]) [    ] o.a.s.c.c.ConnectionManager Client is connected to ZooKeeper
   [junit4]   2> 2582934 INFO  (TEST-ForceLeaderTest.testReplicasInLIRNoLeader-seed#[6985005880625E85]) [    ] o.a.s.c.c.SolrZkClient Using default ZkACLProvider
   [junit4]   2> 2582939 INFO  (TEST-ForceLeaderTest.testReplicasInLIRNoLeader-seed#[6985005880625E85]) [    ] o.a.s.s.SolrDispatchFilter Loading solr.xml from SolrHome (not found in ZooKeeper)
   [junit4]   2> 2582939 INFO  (TEST-ForceLeaderTest.testReplicasInLIRNoLeader-seed#[6985005880625E85]) [    ] o.a.s.c.SolrXmlConfig Loading container configuration from /x1/jenkins/jenkins-slave/workspace/Lucene-Solr-Tests-master/solr/build/solr-core/test/J2/temp/solr.cloud.ForceLeaderTest_6985005880625E85-001/control-001/solr.xml
   [junit4]   2> 2582952 INFO  (TEST-ForceLeaderTest.testReplicasInLIRNoLeader-seed#[6985005880625E85]) [    ] o.a.s.c.CorePropertiesLocator Config-defined core root directory: /x1/jenkins/jenkins-slave/workspace/Lucene-Solr-Tests-master/solr/build/solr-core/test/J2/temp/solr.cloud.ForceLeaderTest_6985005880625E85-001/control-001/cores
   [junit4]   2> 2582952 INFO  (TEST-ForceLeaderTest.testReplicasInLIRNoLeader-seed#[6985005880625E85]) [    ] o.a.s.c.CoreContainer New CoreContainer 1538514330
   [junit4]   2> 2582952 INFO  (TEST-ForceLeaderTest.testReplicasInLIRNoLeader-seed#[6985005880625E85]) [    ] o.a.s.c.CoreContainer Loading cores into CoreContainer [instanceDir=/x1/jenkins/jenkins-slave/workspace/Lucene-Solr-Tests-master/solr/build/solr-core/test/J2/temp/solr.cloud.ForceLeaderTest_6985005880625E85-001/control-001]
   [junit4]   2> 2582953 WARN  (TEST-ForceLeaderTest.testReplicasInLIRNoLeader-seed#[6985005880625E85]) [    ] o.a.s.c.CoreContainer Couldn't add files from /x1/jenkins/jenkins-slave/workspace/Lucene-Solr-Tests-master/solr/build/solr-core/test/J2/temp/solr.cloud.ForceLeaderTest_6985005880625E85-001/control-001/lib to classpath: /x1/jenkins/jenkins-slave/workspace/Lucene-Solr-Tests-master/solr/build/solr-core/test/J2/temp/solr.cloud.ForceLeaderTest_6985005880625E85-001/control-001/lib
   [junit4]   2> 2582953 INFO  (TEST-ForceLeaderTest.testReplicasInLIRNoLeader-seed#[6985005880625E85]) [    ] o.a.s.h.c.HttpShardHandlerFactory created with socketTimeout : 90000,urlScheme : ,connTimeout : 15000,maxConnectionsPerHost : 20,maxConnections : 10000,corePoolSize : 0,maximumPoolSize : 2147483647,maxThreadIdleTime : 5,sizeOfQueue : -1,fairnessPolicy : false,
   [junit4]   2> 2582967 INFO  (TEST-ForceLeaderTest.testReplicasInLIRNoLeader-seed#[6985005880625E85]) [    ] o.a.s.u.UpdateShardHandler Created UpdateShardHandler HTTP client with params: socketTimeout=340000&connTimeout=45000&maxConnections=100000&maxConnectionsPerHost=100000
   [junit4]   2> 2582967 INFO  (TEST-ForceLeaderTest.testReplicasInLIRNoLeader-seed#[6985005880625E85]) [    ] o.a.s.l.LogWatcher SLF4J impl is org.slf4j.impl.Log4jLoggerFactory
   [junit4]   2> 2582967 INFO  (TEST-ForceLeaderTest.testReplicasInLIRNoLeader-seed#[6985005880625E85]) [    ] o.a.s.l.LogWatcher Registering Log Listener [Log4j (org.slf4j.impl.Log4jLoggerFactory)]
   [junit4]   2> 2582967 INFO  (TEST-ForceLeaderTest.testReplicasInLIRNoLeader-seed#[6985005880625E85]) [    ] o.a.s.c.ZkContainer Zookeeper client=127.0.0.1:58816/solr
   [junit4]   2> 2582967 INFO  (TEST-ForceLeaderTest.testReplicasInLIRNoLeader-seed#[6985005880625E85]) [    ] o.a.s.c.ZkController zkHost includes chroot
   [junit4]   2> 2582967 INFO  (TEST-ForceLeaderTest.testReplicasInLIRNoLeader-seed#[6985005880625E85]) [    ] o.a.s.c.c.SolrZkClient Using default ZkCredentialsProvider
   [junit4]   2> 2582968 INFO  (TEST-ForceLeaderTest.testReplicasInLIRNoLeader-seed#[6985005880625E85]) [    ] o.a.s.c.c.ConnectionManager Waiting for client to connect to ZooKeeper
   [junit4]   2> 2582974 INFO  (zkCallback-2933-thread-1) [    ] o.a.s.c.c.ConnectionManager Watcher org.apache.solr.common.cloud.ConnectionManager@4b59ca67 name:ZooKeeperConnection Watcher:127.0.0.1:58816 got event WatchedEvent state:SyncConnected type:None path:null path:null type:None
   [junit4]   2> 2582982 INFO  (TEST-ForceLeaderTest.testReplicasInLIRNoLeader-seed#[6985005880625E85]) [    ] o.a.s.c.c.ConnectionManager Client is connected to ZooKeeper
   [junit4]   2> 2582982 INFO  (TEST-ForceLeaderTest.testReplicasInLIRNoLeader-seed#[6985005880625E85]) [    ] o.a.s.c.c.SolrZkClient Using default ZkACLProvider
   [junit4]   2> 2582995 INFO  (TEST-ForceLeaderTest.testReplicasInLIRNoLeader-seed#[6985005880625E85]) [n:127.0.0.1:46512_    ] o.a.s.c.ZkController Added new OnReconnect listener org.apache.solr.cloud.ZkController$$Lambda$85/95314422@6b154229
   [junit4]   2> 2582996 INFO  (TEST-ForceLeaderTest.testReplicasInLIRNoLeader-seed#[6985005880625E85]) [n:127.0.0.1:46512_    ] o.a.s.c.c.ConnectionManager Waiting for client to connect to ZooKeeper
   [junit4]   2> 2583001 INFO  (zkCallback-2934-thread-1-processing-n:127.0.0.1:46512_) [n:127.0.0.1:46512_    ] o.a.s.c.c.ConnectionManager Watcher org.apache.solr.common.cloud.ConnectionManager@47848a2a name:ZooKeeperConnection Watcher:127.0.0.1:58816/solr got event WatchedEvent state:SyncConnected type:None path:null path:null type:None
   [junit4]   2> 2583001 INFO  (TEST-ForceLeaderTest.testReplicasInLIRNoLeader-seed#[6985005880625E85]) [n:127.0.0.1:46512_    ] o.a.s.c.c.ConnectionManager Client is connected to ZooKeeper
   [junit4]   2> 2583002 INFO  (TEST-ForceLeaderTest.testReplicasInLIRNoLeader-seed#[6985005880625E85]) [n:127.0.0.1:46512_    ] o.a.s.c.c.SolrZkClient makePath: /overseer/queue
   [junit4]   2> 2583003 INFO  (TEST-ForceLeaderTest.testReplicasInLIRNoLeader-seed#[6985005880625E85]) [n:127.0.0.1:46512_    ] o.a.s.c.c.SolrZkClient makePath: /overseer/collection-queue-work
   [junit4]   2> 2583010 INFO  (TEST-ForceLeaderTest.testReplicasInLIRNoLeader-seed#[6985005880625E85]) [n:127.0.0.1:46512_    ] o.a.s.c.c.SolrZkClient makePath: /overseer/collection-map-running
   [junit4]   2> 2583012 INFO  (TEST-ForceLeaderTest.testReplicasInLIRNoLeader-seed#[6985005880625E85]) [n:127.0.0.1:46512_    ] o.a.s.c.c.SolrZkClient makePath: /overseer/collection-map-completed
   [junit4]   2> 2583018 INFO  (TEST-ForceLeaderTest.testReplicasInLIRNoLeader-seed#[6985005880625E85]) [n:127.0.0.1:46512_    ] o.a.s.c.c.SolrZkClient makePath: /overseer/collection-map-failure
   [junit4]   2> 2583019 INFO  (TEST-ForceLeaderTest.testReplicasInLIRNoLeader-seed#[6985005880625E85]) [n:127.0.0.1:46512_    ] o.a.s.c.c.SolrZkClient makePath: /live_nodes
   [junit4]   2> 2583020 INFO  (TEST-ForceLeaderTest.testReplicasInLIRNoLeader-seed#[6985005880625E85]) [n:127.0.0.1:46512_    ] o.a.s.c.c.SolrZkClient makePath: /aliases.json
   [junit4]   2> 2583021 INFO  (TEST-ForceLeaderTest.testReplicasInLIRNoLeader-seed#[6985005880625E85]) [n:127.0.0.1:46512_    ] o.a.s.c.c.SolrZkClient makePath: /clusterstate.json
   [junit4]   2> 2583022 INFO  (TEST-ForceLeaderTest.testReplicasInLIRNoLeader-seed#[6985005880625E85]) [n:127.0.0.1:46512_    ] o.a.s.c.c.SolrZkClient makePath: /security.json
   [junit4]   2> 2583022 INFO  (TEST-ForceLeaderTest.testReplicasInLIRNoLeader-seed#[6985005880625E85]) [n:127.0.0.1:46512_    ] o.a.s.c.c.ZkStateReader Updating cluster state from ZooKeeper... 
   [junit4]   2> 2583023 INFO  (TEST-ForceLeaderTest.testReplicasInLIRNoLeader-seed#[6985005880625E85]) [n:127.0.0.1:46512_    ] o.a.s.c.c.ZkStateReader Loaded empty cluster properties
   [junit4]   2> 2583026 INFO  (TEST-ForceLeaderTest.testReplicasInLIRNoLeader-seed#[6985005880625E85]) [n:127.0.0.1:46512_    ] o.a.s.c.c.ZkStateReader Updated live nodes from ZooKeeper... (0) -> (0)
   [junit4]   2> 2583028 INFO  (TEST-ForceLeaderTest.testReplicasInLIRNoLeader-seed#[6985005880625E85]) [n:127.0.0.1:46512_    ] o.a.s.c.c.SolrZkClient makePath: /overseer_elect
   [junit4]   2> 2583035 INFO  (TEST-ForceLeaderTest.testReplicasInLIRNoLeader-seed#[6985005880625E85]) [n:127.0.0.1:46512_    ] o.a.s.c.c.SolrZkClient makePath: /overseer_elect/election
   [junit4]   2> 2583035 INFO  (TEST-ForceLeaderTest.testReplicasInLIRNoLeader-seed#[6985005880625E85]) [n:127.0.0.1:46512_    ] o.a.s.c.Overseer Overseer (id=null) closing
   [junit4]   2> 2583036 INFO  (TEST-ForceLeaderTest.testReplicasInLIRNoLeader-seed#[6985005880625E85]) [n:127.0.0.1:46512_    ] o.a.s.c.LeaderElector Joined leadership election with path: /overseer_elect/election/96590119001784324-127.0.0.1:46512_-n_0000000000
   [junit4]   2> 2583036 INFO  (TEST-ForceLeaderTest.testReplicasInLIRNoLeader-seed#[6985005880625E85]) [n:127.0.0.1:46512_    ] o.a.s.c.OverseerElectionContext I am going to be the leader 127.0.0.1:46512_
   [junit4]   2> 2583036 INFO  (TEST-ForceLeaderTest.testReplicasInLIRNoLeader-seed#[6985005880625E85]) [n:127.0.0.1:46512_    ] o.a.s.c.c.SolrZkClient makePath: /overseer_elect/leader
   [junit4]   2> 2583037 INFO  (TEST-ForceLeaderTest.testReplicasInLIRNoLeader-seed#[6985005880625E85]) [n:127.0.0.1:46512_    ] o.a.s.c.Overseer Overseer (id=96590119001784324-127.0.0.1:46512_-n_0000000000) starting
   [junit4]   2> 2583042 INFO  (TEST-ForceLeaderTest.testReplicasInLIRNoLeader-seed#[6985005880625E85]) [n:127.0.0.1:46512_    ] o.a.s.c.c.SolrZkClient makePath: /overseer/queue-work
   [junit4]   2> 2583051 INFO  (TEST-ForceLeaderTest.testReplicasInLIRNoLeader-seed#[6985005880625E85]) [n:127.0.0.1:46512_    ] o.a.s.c.OverseerAutoReplicaFailoverThread Starting OverseerAutoReplicaFailoverThread autoReplicaFailoverWorkLoopDelay=10000 autoReplicaFailoverWaitAfterExpiration=10000 autoReplicaFailoverBadNodeExpiration=60000
   [junit4]   2> 2583058 INFO  (OverseerCollectionConfigSetProcessor-96590119001784324-127.0.0.1:46512_-n_0000000000) [n:127.0.0.1:46512_    ] o.a.s.c.OverseerTaskProcessor Process current queue of overseer operations
   [junit4]   2> 2583062 INFO  (OverseerStateUpdate-96590119001784324-127.0.0.1:46512_-n_0000000000) [n:127.0.0.1:46512_    ] o.a.s.c.Overseer Starting to work on the main queue
   [junit4]   2> 2583070 INFO  (TEST-ForceLeaderTest.testReplicasInLIRNoLeader-seed#[6985005880625E85]) [n:127.0.0.1:46512_    ] o.a.s.c.ZkController Register node as live in ZooKeeper:/live_nodes/127.0.0.1:46512_
   [junit4]   2> 2583070 INFO  (TEST-ForceLeaderTest.testReplicasInLIRNoLeader-seed#[6985005880625E85]) [n:127.0.0.1:46512_    ] o.a.s.c.c.SolrZkClient makePath: /live_nodes/127.0.0.1:46512_
   [junit4]   2> 2583082 INFO  (OverseerStateUpdate-96590119001784324-127.0.0.1:46512_-n_0000000000) [n:127.0.0.1:46512_    ] o.a.s.c.c.ZkStateReader Updated live nodes from ZooKeeper... (0) -> (0)
   [junit4]   2> 2583089 INFO  (zkCallback-2934-thread-1-processing-n:127.0.0.1:46512_) [n:127.0.0.1:46512_    ] o.a.s.c.c.ZkStateReader A live node change: [WatchedEvent state:SyncConnected type:NodeChildrenChanged path:/live_nodes], has occurred - updating... (live nodes size: [0])
   [junit4]   2> 2583100 INFO  (zkCallback-2934-thread-1-processing-n:127.0.0.1:46512_) [n:127.0.0.1:46512_    ] o.a.s.c.c.ZkStateReader Updated live nodes from ZooKeeper... (0) -> (1)
   [junit4]   2> 2583105 INFO  (TEST-ForceLeaderTest.testReplicasInLIRNoLeader-seed#[6985005880625E85]) [n:127.0.0.1:46512_    ] o.a.s.c.CoreContainer Security conf doesn't exist. Skipping setup for authorization module.
   [junit4]   2> 2583105 INFO  (TEST-ForceLeaderTest.testReplicasInLIRNoLeader-seed#[6985005880625E85]) [n:127.0.0.1:46512_    ] o.a.s.c.CoreContainer No authentication plugin used.
   [junit4]   2> 2583106 INFO  (TEST-ForceLeaderTest.testReplicasInLIRNoLeader-seed#[6985005880625E85]) [n:127.0.0.1:46512_    ] o.a.s.c.CorePropertiesLocator Looking for core definitions underneath /x1/jenkins/jenkins-slave/workspace/Lucene-Solr-Tests-master/solr/build/solr-core/test/J2/temp/solr.cloud.ForceLeaderTest_6985005880625E85-001/control-001/cores
   [junit4]   2> 2583106 INFO  (TEST-ForceLeaderTest.testReplicasInLIRNoLeader-seed#[6985005880625E85]) [n:127.0.0.1:46512_    ] o.a.s.c.CoreDescriptor Created CoreDescriptor: {name=collection1, config=solrconfig.xml, transient=false, schema=schema.xml, loadOnStartup=true, configSetProperties=configsetprops.json, collection=control_collection, coreNodeName=, dataDir=data/, shard=}
   [junit4]   2> 2583107 INFO  (TEST-ForceLeaderTest.testReplicasInLIRNoLeader-seed#[6985005880625E85]) [n:127.0.0.1:46512_    ] o.a.s.c.CorePropertiesLocator Found core collection1 in /x1/jenkins/jenkins-slave/workspace/Lucene-Solr-Tests-master/solr/build/solr-core/test/J2/temp/solr.cloud.ForceLeaderTest_6985005880625E85-001/control-001/cores/collection1
   [junit4]   2> 2583107 INFO  (TEST-ForceLeaderTest.testReplicasInLIRNoLeader-seed#[6985005880625E85]) [n:127.0.0.1:46512_    ] o.a.s.c.CorePropertiesLocator Found 1 core definitions
   [junit4]   2> 2583114 INFO  (coreLoadExecutor-7370-thread-1-processing-n:127.0.0.1:46512_) [n:127.0.0.1:46512_ c:control_collection   x:collection1] o.a.s.c.ZkController publishing state=down
   [junit4]   2> 2583114 INFO  (coreLoadExecutor-7370-thread-1-processing-n:127.0.0.1:46512_) [n:127.0.0.1:46512_ c:control_collection   x:collection1] o.a.s.c.ZkController numShards not found on descriptor - reading it from system property
   [junit4]   2> 2583118 INFO  (coreLoadExecutor-7370-thread-1-processing-n:127.0.0.1:46512_) [n:127.0.0.1:46512_ c:control_collection   x:collection1] o.a.s.c.ZkController Collection control_collection not visible yet, but flagging it so a watch is registered when it becomes visible
   [junit4]   2> 2583126 INFO  (TEST-ForceLeaderTest.testReplicasInLIRNoLeader-seed#[6985005880625E85]) [n:127.0.0.1:46512_    ] o.a.s.s.SolrDispatchFilter user.dir=/x1/jenkins/jenkins-slave/workspace/Lucene-Solr-Tests-master/solr/build/solr-core/test/J2
   [junit4]   2> 2583126 INFO  (TEST-ForceLeaderTest.testReplicasInLIRNoLeader-seed#[6985005880625E85]) [n:127.0.0.1:46512_    ] o.a.s.s.SolrDispatchFilter SolrDispatchFilter.init() done
   [junit4]   2> 2583130 INFO  (coreLoadExecutor-7370-thread-1-processing-n:127.0.0.1:46512_) [n:127.0.0.1:46512_ c:control_collection   x:collection1] o.a.s.c.c.ZkStateReader Deleting data for [control_collection]
   [junit4]   2> 2583134 INFO  (OverseerStateUpdate-96590119001784324-127.0.0.1:46512_-n_0000000000) [n:127.0.0.1:46512_    ] o.a.s.c.Overseer processMessage: queueSize: 1, message = {
   [junit4]   2>   "core":"collection1",
   [junit4]   2>   "roles":null,
   [junit4]   2>   "base_url":"http://127.0.0.1:46512",
   [junit4]   2>   "node_name":"127.0.0.1:46512_",
   [junit4]   2>   "numShards":"1",
   [junit4]   2>   "state":"down",
   [junit4]   2>   "shard":null,
   [junit4]   2>   "collection":"control_collection",
   [junit4]   2>   "operation":"state"} current state version: 0
   [junit4]   2> 2583134 INFO  (OverseerStateUpdate-96590119001784324-127.0.0.1:46512_-n_0000000000) [n:127.0.0.1:46512_    ] o.a.s.c.o.ReplicaMutator Update state numShards=1 message={
   [junit4]   2>   "core":"collection1",
   [junit4]   2>   "roles":null,
   [junit4]   2>   "base_url":"http://127.0.0.1:46512",
   [junit4]   2>   "node_name":"127.0.0.1:46512_",
   [junit4]   2>   "numShards":"1",
   [junit4]   2>   "state":"down",
   [junit4]   2>   "shard":null,
   [junit4]   2>   "collection":"control_collection",
   [junit4]   2>   "operation":"state"}
   [junit4]   2> 2583142 INFO  (OverseerStateUpdate-96590119001784324-127.0.0.1:46512_-n_0000000000) [n:127.0.0.1:46512_    ] o.a.s.c.o.ClusterStateMutator building a new cName: control_collection
   [junit4]   2> 2583150 INFO  (OverseerStateUpdate-96590119001784324-127.0.0.1:46512_-n_0000000000) [n:127.0.0.1:46512_    ] o.a.s.c.o.ReplicaMutator Assigning new node to shard shard=shard1
   [junit4]   2> 2583170 INFO  (zkCallback-2934-thread-1-processing-n:127.0.0.1:46512_) [n:127.0.0.1:46512_    ] o.a.s.c.c.ZkStateReader A cluster state change: [WatchedEvent state:SyncConnected type:NodeDataChanged path:/clusterstate.json], has occurred - updating... (live nodes size: [1])
   [junit4]   2> 2583174 INFO  (coreLoadExecutor-7370-thread-1-processing-n:127.0.0.1:46512_) [n:127.0.0.1:46512_ c:control_collection   x:collection1] o.a.s.c.ZkController look for our core node name
   [junit4]   2> 2583174 INFO  (coreLoadExecutor-7370-thread-1-processing-n:127.0.0.1:46512_) [n:127.0.0.1:46512_ c:control_collection   x:collection1] o.a.s.c.ZkController waiting to find shard id in clusterstate for collection1
   [junit4]   2> 2583174 INFO  (coreLoadExecutor-7370-thread-1-processing-n:127.0.0.1:46512_) [n:127.0.0.1:46512_ c:control_collection   x:collection1] o.a.s.c.ZkController Check for collection zkNode:control_collection
   [junit4]   2> 2583186 INFO  (coreLoadExecutor-7370-thread-1-processing-n:127.0.0.1:46512_) [n:127.0.0.1:46512_ c:control_collection   x:collection1] o.a.s.c.ZkController Collection zkNode exists
   [junit4]   2> 2583186 INFO  (coreLoadExecutor-7370-thread-1-processing-n:127.0.0.1:46512_) [n:127.0.0.1:46512_ c:control_collection   x:collection1] o.a.s.c.c.ZkStateReader Load collection config from: [/collections/control_collection]
   [junit4]   2> 2583206 INFO  (coreLoadExecutor-7370-thread-1-processing-n:127.0.0.1:46512_) [n:127.0.0.1:46512_ c:control_collection   x:collection1] o.a.s.c.c.ZkStateReader path=[/collections/control_collection] [configName]=[conf1] specified config exists in ZooKeeper
   [junit4]   2> 2583206 INFO  (coreLoadExecutor-7370-thread-1-processing-n:127.0.0.1:46512_) [n:127.0.0.1:46512_ c:control_collection   x:collection1] o.a.s.c.SolrResourceLoader new SolrResourceLoader for directory: '/x1/jenkins/jenkins-slave/workspace/Lucene-Solr-Tests-master/solr/build/solr-core/test/J2/temp/solr.cloud.ForceLeaderTest_6985005880625E85-001/control-001/cores/collection1'
   [junit4]   2> 2583206 INFO  (coreLoadExecutor-7370-thread-1-processing-n:127.0.0.1:46512_) [n:127.0.0.1:46512_ c:control_collection   x:collection1] o.a.s.c.SolrResourceLoader JNDI not configured for solr (NoInitialContextEx)
   [junit4]   2> 2583206 INFO  (coreLoadExecutor-7370-thread-1-processing-n:127.0.0.1:46512_) [n:127.0.0.1:46512_ c:control_collection   x:collection1] o.a.s.c.SolrResourceLoader solr home defaulted to 'solr/' (could not find system property or JNDI)
   [junit4]   2> 2583218 INFO  (coreLoadExecutor-7370-thread-1-processing-n:127.0.0.1:46512_) [n:127.0.0.1:46512_ c:control_collection   x:collection1] o.a.s.c.Config loaded config solrconfig.xml with version 0 
   [junit4]   2> 2583230 INFO  (coreLoadExecutor-7370-thread-1-processing-n:127.0.0.1:46512_) [n:127.0.0.1:46512_ c:control_collection   x:collection1] o.a.s.c.SolrConfig current version of requestparams : -1
   [junit4]   2> 2583233 WARN  (coreLoadExecutor-7370-thread-1-processing-n:127.0.0.1:46512_) [n:127.0.0.1:46512_ c:control_collection   x:collection1] o.a.s.c.Config Beginning with Solr 5.5, <mergePolicy> is deprecated, use <mergePolicyFactory> instead.
   [junit4]   2> 2583234 INFO  (coreLoadExecutor-7370-thread-1-processing-n:127.0.0.1:46512_) [n:127.0.0.1:46512_ c:control_collection   x:collection1] o.a.s.c.SolrConfig Using Lucene MatchVersion: 7.0.0
   [junit4]   2> 2583243 INFO  (coreLoadExecutor-7370-thread-1-processing-n:127.0.0.1:46512_) [n:127.0.0.1:46512_ c:control_collection   x:collection1] o.a.s.c.SolrConfig Loaded SolrConfig: solrconfig.xml
   [junit4]   2> 2583249 INFO  (coreLoadExecutor-7370-thread-1-processing-n:127.0.0.1:46512_) [n:127.0.0.1:46512_ c:control_collection   x:collection1] o.a.s.s.IndexSchema [collection1] Schema name=test
   [junit4]   2> 2583353 INFO  (coreLoadExecutor-7370-thread-1-processing-n:127.0.0.1:46512_) [n:127.0.0.1:46512_ c:control_collection   x:collection1] o.a.s.s.OpenExchangeRatesOrgProvider Initialized with rates=open-exchange-rates.json, refreshInterval=1440.
   [junit4]   2> 2583359 INFO  (coreLoadExecutor-7370-thread-1-processing-n:127.0.0.1:46512_) [n:127.0.0.1:46512_ c:control_collection   x:collection1] o.a.s.s.IndexSchema default search field in schema is text
   [junit4]   2> 2583360 INFO  (coreLoadExecutor-7370-thread-1-processing-n:127.0.0.1:46512_) [n:127.0.0.1:46512_ c:control_collection   x:collection1] o.a.s.s.IndexSchema unique key field: id
   [junit4]   2> 2583368 INFO  (coreLoadExecutor-7370-thread-1-processing-n:127.0.0.1:46512_) [n:127.0.0.1:46512_ c:control_collection   x:collection1] o.a.s.s.FileExchangeRateProvider Reloading exchange rates from file currency.xml
   [junit4]   2> 2583370 INFO  (coreLoadExecutor-7370-thread-1-processing-n:127.0.0.1:46512_) [n:127.0.0.1:46512_ c:control_collection   x:collection1] o.a.s.s.FileExchangeRateProvider Reloading exchange rates from file currency.xml
   [junit4]   2> 2583377 INFO  (coreLoadExecutor-7370-thread-1-processing-n:127.0.0.1:46512_) [n:127.0.0.1:46512_ c:control_collection   x:collection1] o.a.s.s.OpenExchangeRatesOrgProvider Reloading exchange rates from open-exchange-rates.json
   [junit4]   2> 2583378 INFO  (coreLoadExecutor-7370-thread-1-processing-n:127.0.0.1:46512_) [n:127.0.0.1:46512_ c:control_collection   x:collection1] o.a.s.s.OpenExchangeRatesOrgProvider Reloading exchange rates from open-exchange-rates.json
   [junit4]   2> 2583379 INFO  (coreLoadExecutor-7370-thread-1-processing-n:127.0.0.1:46512_) [n:127.0.0.1:46512_ c:control_collection   x:collection1] o.a.s.c.ConfigSetProperties Did not find ConfigSet properties, assuming default properties: Can't find resource 'configsetprops.json' in classpath or '/configs/conf1', cwd=/x1/jenkins/jenkins-slave/workspace/Lucene-Solr-Tests-master/solr/build/solr-core/test/J2
   [junit4]   2> 2583379 INFO  (coreLoadExecutor-7370-thread-1-processing-n:127.0.0.1:46512_) [n:127.0.0.1:46512_ c:control_collection   x:collection1] o.a.s.c.CoreContainer Creating SolrCore 'collection1' using configuration from collection control_collection
   [junit4]   2> 2583379 INFO  (coreLoadExecutor-7370-thread-1-processing-n:127.0.0.1:46512_) [n:127.0.0.1:46512_ c:control_collection s:shard1 r:core_node1 x:collection1] o.a.s.c.SolrCore org.apache.solr.core.MockDirectoryFactory
   [junit4]   2> 2583380 INFO  (coreLoadExecutor-7370-thread-1-processing-n:127.0.0.1:46512_) [n:127.0.0.1:46512_ c:control_collection s:shard1 r:core_node1 x:collection1] o.a.s.c.SolrCore [[collection1] ] Opening new SolrCore at [/x1/jenkins/jenkins-slave/workspace/Lucene-Solr-Tests-master/solr/build/solr-core/test/J2/temp/solr.cloud.ForceLeaderTest_6985005880625E85-001/control-001/cores/collection1], dataDir=[/x1/jenkins/jenkins-slave/workspace/Lucene-Solr-Tests-master/solr/build/solr-core/test/J2/temp/solr.cloud.ForceLeaderTest_6985005880625E85-001/control-001/cores/collection1/data/]
   [junit4]   2> 2583380 INFO  (coreLoadExecutor-7370-thread-1-processing-n:127.0.0.1:46512_) [n:127.0.0.1:46512_ c:control_collection s:shard1 r:core_node1 x:collection1] o.a.s.c.JmxMonitoredMap JMX monitoring is enabled. Adding Solr mbeans to JMX Server: com.sun.jmx.mbeanserver.JmxMBeanServer@b749069
   [junit4]   2> 2583380 INFO  (coreLoadExecutor-7370-thread-1-processing-n:127.0.0.1:46512_) [n:127.0.0.1:46512_ c:control_collection s:shard1 r:core_node1 x:collection1] o.a.s.c.CachingDirectoryFactory return new directory for /x1/jenkins/jenkins-slave/workspace/Lucene-Solr-Tests-master/solr/build/solr-core/test/J2/temp/solr.cloud.ForceLeaderTest_6985005880625E85-001/control-001/cores/collection1/data/snapshot_metadata
   [junit4]   2> 2583380 INFO  (coreLoadExecutor-7370-thread-1-processing-n:127.0.0.1:46512_) [n:127.0.0.1:46512_ c:control_collection s:shard1 r:core_node1 x:collection1] o.a.s.c.s.SolrSnapshotMetaDataManager Loading from snapshot metadata file...
   [junit4]   2> 2583380 INFO  (coreLoadExecutor-7370-thread-1-processing-n:127.0.0.1:46512_) [n:127.0.0.1:46512_ c:control_collection s:shard1 r:core_node1 x:collection1] o.a.s.c.CachingDirectoryFactory return new directory for /x1/jenkins/jenkins-slave/workspace/Lucene-Solr-Tests-master/solr/build/solr-core/test/J2/temp/solr.cloud.ForceLeaderTest_6985005880625E85-001/control-001/cores/collection1/data
   [junit4]   2> 2583381 INFO  (coreLoadExecutor-7370-thread-1-processing-n:127.0.0.1:46512_) [n:127.0.0.1:46512_ c:control_collection s:shard1 r:core_node1 x:collection1] o.a.s.c.SolrCore New index directory detected: old=null new=/x1/jenkins/jenkins-slave/workspace/Lucene-Solr-Tests-master/solr/build/solr-core/test/J2/temp/solr.cloud.ForceLeaderTest_6985005880625E85-001/control-001/cores/collection1/data/index/
   [junit4]   2> 2583381 WARN  (coreLoadExecutor-7370-thread-1-processing-n:127.0.0.1:46512_) [n:127.0.0.1:46512_ c:control_collection s:shard1 r:core_node1 x:collection1] o.a.s.c.SolrCore [collection1] Solr index directory '/x1/jenkins/jenkins-slave/workspace/Lucene-Solr-Tests-master/solr/build/solr-core/test/J2/temp/solr.cloud.ForceLeaderTest_6985005880625E85-001/control-001/cores/collection1/data/index' doesn't exist. Creating new index...
   [junit4]   2> 2583381 INFO  (coreLoadExecutor-7370-thread-1-processing-n:127.0.0.1:46512_) [n:127.0.0.1:46512_ c:control_collection s:shard1 r:core_node1 x:collection1] o.a.s.c.CachingDirectoryFactory return new directory for /x1/jenkins/jenkins-slave/workspace/Lucene-Solr-Tests-master/solr/build/solr-core/test/J2/temp/solr.cloud.ForceLeaderTest_6985005880625E85-001/control-001/cores/collection1/data/index
   [junit4]   2> 2583381 INFO  (coreLoadExecutor-7370-thread-1-processing-n:127.0.0.1:46512_) [n:127.0.0.1:46512_ c:control_collection s:shard1 r:core_node1 x:collection1] o.a.s.u.RandomMergePolicy RandomMergePolicy wrapping class org.apache.lucene.index.LogByteSizeMergePolicy: [LogByteSizeMergePolicy: minMergeSize=1677721, mergeFactor=17, maxMergeSize=2147483648, maxMergeSizeForForcedMerge=9223372036854775807, calibrateSizeByDeletes=true, maxMergeDocs=2147483647, maxCFSSegmentSizeMB=8.796093022207999E12, noCFSRatio=0.8151364831405896]
   [junit4]   2> 2583381 INFO  (coreLoadExecutor-7370-thread-1-processing-n:127.0.0.1:46512_) [n:127.0.0.1:46512_ c:control_collection s:shard1 r:core_node1 x:collection1] o.a.s.c.SolrDeletionPolicy SolrDeletionPolicy.onCommit: commits: num=1
   [junit4]   2> 	commit{dir=MockDirectoryWrapper(RAMDirectory@723752a3 lockFactory=org.apache.lucene.store.SingleInstanceLockFactory@526108cc),segFN=segments_1,generation=1}
   [junit4]   2> 2583382 INFO  (coreLoadExecutor-7370-thread-1-processing-n:127.0.0.1:46512_) [n:127.0.0.1:46512_ c:control_collection s:shard1 r:core_node1 x:collection1] o.a.s.c.SolrDeletionPolicy newest commit generation = 1
   [junit4]   2> 2583384 INFO  (coreLoadExecutor-7370-thread-1-processing-n:127.0.0.1:46512_) [n:127.0.0.1:46512_ c:control_collection s:shard1 r:core_node1 x:collection1] o.a.s.u.p.UpdateRequestProcessorChain creating updateRequestProcessorChain "nodistrib"
   [junit4]   2> 2583385 INFO  (coreLoadExecutor-7370-thread-1-processing-n:127.0.0.1:46512_) [n:127.0.0.1:46512_ c:control_collection s:shard1 r:core_node1 x:collection1] o.a.s.u.p.UpdateRequestProcessorChain creating updateRequestProcessorChain "dedupe"
   [junit4]   2> 2583385 INFO  (coreLoadExecutor-7370-thread-1-processing-n:127.0.0.1:46512_) [n:127.0.0.1:46512_ c:control_collection s:shard1 r:core_node1 x:collection1] o.a.s.u.p.UpdateRequestProcessorChain inserting DistributedUpdateProcessorFactory into updateRequestProcessorChain "dedupe"
   [junit4]   2> 2583385 INFO  (coreLoadExecutor-7370-thread-1-processing-n:127.0.0.1:46512_) [n:127.0.0.1:46512_ c:control_collection s:shard1 r:core_node1 x:collection1] o.a.s.u.p.UpdateRequestProcessorChain creating updateRequestProcessorChain "stored_sig"
   [junit4]   2> 2583385 INFO  (coreLoadExecutor-7370-thread-1-processing-n:127.0.0.1:46512_) [n:127.0.0.1:46512_ c:control_collection s:shard1 r:core_node1 x:collection1] o.a.s.u.p.UpdateRequestProcessorChain inserting DistributedUpdateProcessorFactory into updateRequestProcessorChain "stored_sig"
   [junit4]   2> 2583385 INFO  (coreLoadExecutor-7370-thread-1-processing-n:127.0.0.1:46512_) [n:127.0.0.1:46512_ c:control_collection s:shard1 r:core_node1 x:collection1] o.a.s.u.p.UpdateRequestProcessorChain creating updateRequestProcessorChain "distrib-dup-test-chain-explicit"
   [junit4]   2> 2583385 INFO  (coreLoadExecutor-7370-thread-1-processing-n:127.0.0.1:46512_) [n:127.0.0.1:46512_ c:control_collection s:shard1 r:core_node1 x:collection1] o.a.s.u.p.UpdateRequestProcessorChain creating updateRequestProcessorChain "distrib-dup-test-chain-implicit"
   [junit4]   2> 2583385 INFO  (coreLoadExecutor-7370-thread-1-processing-n:127.0.0.1:46512_) [n:127.0.0.1:46512_ c:control_collection s:shard1 r:core_node1 x:collection1] o.a.s.u.p.UpdateRequestProcessorChain inserting DistributedUpdateProcessorFactory into updateRequestProcessorChain "distrib-dup-test-chain-implicit"
   [junit4]   2> 2583385 INFO  (coreLoadExecutor-7370-thread-1-processing-n:127.0.0.1:46512_) [n:127.0.0.1:46512_ c:control_collection s:shard1 r:core_node1 x:collection1] o.a.s.c.SolrCore no updateRequestProcessorChain defined as default, creating implicit default
   [junit4]   2> 2583385 WARN  (coreLoadExecutor-7370-thread-1-processing-n:127.0.0.1:46512_) [n:127.0.0.1:46512_ c:control_collection s:shard1 r:core_node1 x:collection1] o.a.s.c.RequestHandlers INVALID paramSet a in requestHandler {type = requestHandler,name = /dump,class = DumpRequestHandler,args = {defaults={a=A,b=B}}}
   [junit4]   2> 2583387 INFO  (coreLoadExecutor-7370-thread-1-processing-n:127.0.0.1:46512_) [n:127.0.0.1:46512_ c:control_collection s:shard1 r:core_node1 x:collection1] o.a.s.h.l.XMLLoader xsltCacheLifetimeSeconds=60
   [junit4]   2> 2583388 INFO  (coreLoadExecutor-7370-thread-1-processing-n:127.0.0.1:46512_) [n:127.0.0.1:46512_ c:control_collection s:shard1 r:core_node1 x:collection1] o.a.s.h.l.XMLLoader xsltCacheLifetimeSeconds=60
   [junit4]   2> 2583388 INFO  (coreLoadExecutor-7370-thread-1-processing-n:127.0.0.1:46512_) [n:127.0.0.1:46512_ c:control_collection s:shard1 r:core_node1 x:collection1] o.a.s.h.l.XMLLoader xsltCacheLifetimeSeconds=60
   [junit4]   2> 2583389 INFO  (coreLoadExecutor-7370-thread-1-processing-n:127.0.0.1:46512_) [n:127.0.0.1:46512_ c:control_collection s:shard1 r:core_node1 x:collection1] o.a.s.h.l.XMLLoader xsltCacheLifetimeSeconds=60
   [junit4]   2> 2583390 INFO  (OldIndexDirectoryCleanupThreadForCore-collection1) [n:127.0.0.1:46512_ c:control_collection s:shard1 r:core_node1 x:collection1] o.a.s.c.SolrCore Looking for old index directories to cleanup for core collection1 in /x1/jenkins/jenkins-slave/workspace/Lucene-Solr-Tests-master/solr/build/solr-core/test/J2/temp/solr.cloud.ForceLeaderTest_6985005880625E85-001/control-001/cores/collection1/data/
   [junit4]   2> 2583391 WARN  (OldIndexDirectoryCleanupThreadForCore-collection1) [n:127.0.0.1:46512_ c:control_collection s:shard1 r:core_node1 x:collection1] o.a.s.c.DirectoryFactory /x1/jenkins/jenkins-slave/workspace/Lucene-Solr-Tests-master/solr/build/solr-core/test/J2/temp/solr.cloud.ForceLeaderTest_6985005880625E85-001/control-001/cores/collection1/data/ does not point to a valid data directory; skipping clean-up of old index directories.
   [junit4]   2> 2583423 INFO  (coreLoadExecutor-7370-thread-1-processing-n:127.0.0.1:46512_) [n:127.0.0.1:46512_ c:control_collection s:shard1 r:core_node1 x:collection1] o.a.s.c.RequestHandlers Registered paths: /admin/mbeans,standard,/update/json/docs,/admin/luke,/export,/get,/admin/properties,/update/json,/admin/threads,/dump,/update/csv,/sql,/graph,/admin/segments,/admin/system,/replication,/config,/stream,/schema,/admin/plugins,/admin/logging,/admin/ping,/update,/admin/file,/terms
   [junit4]   2> 2583423 INFO  (coreLoadExecutor-7370-thread-1-processing-n:127.0.0.1:46512_) [n:127.0.0.1:46512_ c:control_collection s:shard1 r:core_node1 x:collection1] o.a.s.c.SolrCore Using default statsCache cache: org.apache.solr.search.stats.LocalStatsCache
   [junit4]   2> 2583426 INFO  (coreLoadExecutor-7370-thread-1-processing-n:127.0.0.1:46512_) [n:127.0.0.1:46512_ c:control_collection s:shard1 r:core_node1 x:collection1] o.a.s.u.UpdateHandler Using UpdateLog implementation: org.apache.solr.update.UpdateLog
   [junit4]   2> 2583426 INFO  (coreLoadExecutor-7370-thread-1-processing-n:127.0.0.1:46512_) [n:127.0.0.1:46512_ c:control_collection s:shard1 r:core_node1 x:collection1] o.a.s.u.UpdateLog Initializing UpdateLog: dataDir= defaultSyncLevel=FLUSH numRecordsToKeep=100 maxNumLogsToKeep=10 numVersionBuckets=65536
   [junit4]   2> 2583427 INFO  (coreLoadExecutor-7370-thread-1-processing-n:127.0.0.1:46512_) [n:127.0.0.1:46512_ c:control_collection s:shard1 r:core_node1 x:collection1] o.a.s.u.CommitTracker Hard AutoCommit: disabled
   [junit4]   2> 2583427 INFO  (coreLoadExecutor-7370-thread-1-processing-n:127.0.0.1:46512_) [n:127.0.0.1:46512_ c:control_collection s:shard1 r:core_node1 x:collection1] o.a.s.u.CommitTracker Soft AutoCommit: disabled
   [junit4]   2> 2583427 INFO  (coreLoadExecutor-7370-thread-1-processing-n:127.0.0.1:46512_) [n:127.0.0.1:46512_ c:control_collection s:shard1 r:core_node1 x:collection1] o.a.s.u.RandomMergePolicy RandomMergePolicy wrapping class org.apache.lucene.index.LogByteSizeMergePolicy: [LogByteSizeMergePolicy: minMergeSize=1677721, mergeFactor=47, maxMergeSize=2147483648, maxMergeSizeForForcedMerge=9223372036854775807, calibrateSizeByDeletes=true, maxMergeDocs=2147483647, maxCFSSegmentSizeMB=8.796093022207999E12, noCFSRatio=1.0]
   [junit4]   2> 2583427 INFO  (coreLoadExecutor-7370-thread-1-processing-n:127.0.0.1:46512_) [n:127.0.0.1:46512_ c:control_collection s:shard1 r:core_node1 x:collection1] o.a.s.c.SolrDeletionPolicy SolrDeletionPolicy.onInit: commits: num=1
   [junit4]   2> 	commit{dir=MockDirectoryWrapper(RAMDirectory@723752a3 lockFactory=org.apache.lucene.store.SingleInstanceLockFactory@526108cc),segFN=segments_1,generation=1}
   [junit4]   2> 2583428 INFO  (coreLoadExecutor-7370-thread-1-processing-n:127.0.0.1:46512_) [n:127.0.0.1:46512_ c:control_collection s:shard1 r:core_node1 x:collection1] o.a.s.c.SolrDeletionPolicy newest commit generation = 1
   [junit4]   2> 2583428 INFO  (coreLoadExecutor-7370-thread-1-processing-n:127.0.0.1:46512_) [n:127.0.0.1:46512_ c:control_collection s:shard1 r:core_node1 x:collection1] o.a.s.s.SolrIndexSearcher Opening [Searcher@5dd552d[collection1] main]
   [junit4]   2> 2583428 INFO  (coreLoadExecutor-7370-thread-1-processing-n:127.0.0.1:46512_) [n:127.0.0.1:46512_ c:control_collection s:shard1 r:core_node1 x:collection1] o.a.s.c.c.ZkStateReader Load collection config from: [/collections/control_collection]
   [junit4]   2> 2583429 INFO  (coreLoadExecutor-7370-thread-1-processing-n:127.0.0.1:46512_) [n:127.0.0.1:46512_ c:control_collection s:shard1 r:core_node1 x:collection1] o.a.s.c.c.ZkStateReader path=[/collections/control_collection] [configName]=[conf1] specified config exists in ZooKeeper
   [junit4]   2> 2583429 INFO  (coreLoadExecutor-7370-thread-1-processing-n:127.0.0.1:46512_) [n:127.0.0.1:46512_ c:control_collection s:shard1 r:core_node1 x:collection1] o.a.s.r.ManagedResourceStorage Setting up ZooKeeper-based storage for the RestManager with znodeBase: /configs/conf1
   [junit4]   2> 2583430 INFO  (coreLoadExecutor-7370-thread-1-processing-n:127.0.0.1:46512_) [n:127.0.0.1:46512_ c:control_collection s:shard1 r:core_node1 x:collection1] o.a.s.r.ManagedResourceStorage Configured ZooKeeperStorageIO with znodeBase: /configs/conf1
   [junit4]   2> 2583430 INFO  (coreLoadExecutor-7370-thread-1-processing-n:127.0.0.1:46512_) [n:127.0.0.1:46512_ c:control_collection s:shard1 r:core_node1 x:collection1] o.a.s.r.RestManager Initializing RestManager with initArgs: {}
   [junit4]   2> 2583430 INFO  (coreLoadExecutor-7370-thread-1-processing-n:127.0.0.1:46512_) [n:127.0.0.1:46512_ c:control_collection s:shard1 r:core_node1 x:collection1] o.a.s.r.ManagedResourceStorage Reading _rest_managed.json using ZooKeeperStorageIO:path=/configs/conf1
   [junit4]   2> 2583430 INFO  (coreLoadExecutor-7370-thread-1-processing-n:127.0.0.1:46512_) [n:127.0.0.1:46512_ c:control_collection s:shard1 r:core_node1 x:collection1] o.a.s.r.ManagedResourceStorage No data found for znode /configs/conf1/_rest_managed.json
   [junit4]   2> 2583430 INFO  (coreLoadExecutor-7370-thread-1-processing-n:127.0.0.1:46512_) [n:127.0.0.1:46512_ c:control_collection s:shard1 r:core_node1 x:collection1] o.a.s.r.ManagedResourceStorage Loaded null at path _rest_managed.json using ZooKeeperStorageIO:path=/configs/conf1
   [junit4]   2> 2583430 INFO  (coreLoadExecutor-7370-thread-1-processing-n:127.0.0.1:46512_) [n:127.0.0.1:46512_ c:control_collection s:shard1 r:core_node1 x:collection1] o.a.s.r.RestManager Initializing 0 registered ManagedResources
   [junit4]   2> 2583430 INFO  (coreLoadExecutor-7370-thread-1-processing-n:127.0.0.1:46512_) [n:127.0.0.1:46512_ c:control_collection s:shard1 r:core_node1 x:collection1] o.a.s.h.ReplicationHandler Commits will be reserved for  10000
   [junit4]   2> 2583431 INFO  (coreLoadExecutor-7370-thread-1-processing-n:127.0.0.1:46512_) [n:127.0.0.1:46512_ c:control_collection s:shard1 r:core_node1 x:collection1] o.a.s.u.UpdateLog Looking up max value of version field to seed version buckets
   [junit4]   2> 2583431 INFO  (coreLoadExecutor-7370-thread-1-processing-n:127.0.0.1:46512_) [n:127.0.0.1:46512_ c:control_collection s:shard1 r:core_node1 x:collection1] o.a.s.u.VersionInfo Refreshing highest value of _version_ for 65536 version buckets from index
   [junit4]   2> 2583431 INFO  (coreLoadExecutor-7370-thread-1-processing-n:127.0.0.1:46512_) [n:127.0.0.1:46512_ c:control_collection s:shard1 r:core_node1 x:collection1] o.a.s.u.VersionInfo No terms found for _version_, cannot seed version bucket highest value from index
   [junit4]   2> 2583431 INFO  (coreLoadExecutor-7370-thread-1-processing-n:127.0.0.1:46512_) [n:127.0.0.1:46512_ c:control_collection s:shard1 r:core_node1 x:collection1] o.a.s.u.UpdateLog Could not find max version in index or recent updates, using new clock 1545441904972267520
   [junit4]   2> 2583433 INFO  (coreLoadExecutor-7370-thread-1-processing-n:127.0.0.1:46512_) [n:127.0.0.1:46512_ c:control_collection s:shard1 r:core_node1 x:collection1] o.a.s.u.UpdateLog Took 1.0ms to seed version buckets with highest version 1545441904972267520
   [junit4]   2> 2583433 INFO  (coreLoadExecutor-7370-thread-1-processing-n:127.0.0.1:46512_) [n:127.0.0.1:46512_ c:control_collection s:shard1 r:core_node1 x:collection1] o.a.s.c.ZkController watch zkdir /configs/conf1
   [junit4]   2> 2583434 INFO  (coreLoadExecutor-7370-thread-1-processing-n:127.0.0.1:46512_) [n:127.0.0.1:46512_ c:control_collection s:shard1 r:core_node1 x:collection1] o.a.s.c.CoreContainer registering core: collection1
   [junit4]   2> 2583434 INFO  (coreZkRegister-7363-thread-1-processing-n:127.0.0.1:46512_ x:collection1 s:shard1 c:control_collection r:core_node1) [n:127.0.0.1:46512_ c:control_collection s:shard1 r:core_node1 x:collection1] o.a.s.c.ZkController Register replica - core:collection1 address:http://127.0.0.1:46512 collection:control_collection shard:shard1
   [junit4]   2> 2583434 INFO  (searcherExecutor-7371-thread-1-processing-n:127.0.0.1:46512_ x:collection1 s:shard1 c:control_collection r:core_node1) [n:127.0.0.1:46512_ c:control_collection s:shard1 r:core_node1 x:collection1] o.a.s.c.SolrCore [collection1] Registered new searcher Searcher@5dd552d[collection1] main{ExitableDirectoryReader(UninvertingDirectoryReader())}
   [junit4]   2> 2583435 INFO  (coreZkRegister-7363-thread-1-processing-n:127.0.0.1:46512_ x:collection1 s:shard1 c:control_collection r:core_node1) [n:127.0.0.1:46512_ c:control_collection s:shard1 r:core_node1 x:collection1] o.a.s.c.c.SolrZkClient makePath: /collections/control_collection/leader_elect/shard1/election
   [junit4]   2> 2583438 INFO  (coreZkRegister-7363-thread-1-processing-n:127.0.0.1:46512_ x:collection1 s:shard1 c:control_collection r:core_node1) [n:127.0.0.1:46512_ c:control_collection s:shard1 r:core_node1 x:collection1] o.a.s.c.LeaderElector Joined leadership election with path: /collections/control_collection/leader_elect/shard1/election/96590119001784324-core_node1-n_0000000000
   [junit4]   2> 2583438 INFO  (coreZkRegister-7363-thread-1-processing-n:127.0.0.1:46512_ x:collection1 s:shard1 c:control_collection r:core_node1) [n:127.0.0.1:46512_ c:control_collection s:shard1 r:core_node1 x:collection1] o.a.s.c.ShardLeaderElectionContext Running the leader process for shard=shard1 and weAreReplacement=false and leaderVoteWait=10000
   [junit4]   2> 2583439 INFO  (coreZkRegister-7363-thread-1-processing-n:127.0.0.1:46512_ x:collection1 s:shard1 c:control_collection r:core_node1) [n:127.0.0.1:46512_ c:control_collection s:shard1 r:core_node1 x:collection1] o.a.s.c.ShardLeaderElectionContext Enough replicas found to continue.
   [junit4]   2> 2583439 INFO  (coreZkRegister-7363-thread-1-processing-n:127.0.0.1:46512_ x:collection1 s:shard1 c:control_collection r:core_node1) [n:127.0.0.1:46512_ c:control_collection s:shard1 r:core_node1 x:collection1] o.a.s.c.ShardLeaderElectionContext I may be the new leader - try and sync
   [junit4]   2> 2583439 INFO  (coreZkRegister-7363-thread-1-processing-n:127.0.0.1:46512_ x:collection1 s:shard1 c:control_collection r:core_node1) [n:127.0.0.1:46512_ c:control_collection s:shard1 r:core_node1 x:collection1] o.a.s.c.SyncStrategy Sync replicas to http://127.0.0.1:46512/collection1/
   [junit4]   2> 2583440 INFO  (coreZkRegister-7363-thread-1-processing-n:127.0.0.1:46512_ x:collection1 s:shard1 c:control_collection r:core_node1) [n:127.0.0.1:46512_ c:control_collection s:shard1 r:core_node1 x:collection1] o.a.s.c.SyncStrategy Sync Success - now sync replicas to me
   [junit4]   2> 2583440 INFO  (coreZkRegister-7363-thread-1-processing-n:127.0.0.1:46512_ x:collection1 s:shard1 c:control_collection r:core_node1) [n:127.0.0.1:46512_ c:control_collection s:shard1 r:core_node1 x:collection1] o.a.s.c.SyncStrategy http://127.0.0.1:46512/collection1/ has no replicas
   [junit4]   2> 2583440 INFO  (coreZkRegister-7363-thread-1-processing-n:127.0.0.1:46512_ x:collection1 s:shard1 c:control_collection r:core_node1) [n:127.0.0.1:46512_ c:control_collection s:shard1 r:core_node1 x:collection1] o.a.s.c.c.SolrZkClient makePath: /collections/control_collection/leaders/shard1
   [junit4]   2> 2583442 INFO  (coreZkRegister-7363-thread-1-processing-n:127.0.0.1:46512_ x:collection1 s:shard1 c:control_collection r:core_node1) [n:127.0.0.1:46512_ c:control_collection s:shard1 r:core_node1 x:collection1] o.a.s.c.ShardLeaderElectionContextBase Creating leader registration node /collections/control_collection/leaders/shard1/leader after winning as /collections/control_collection/leader_elect/shard1/election/96590119001784324-core_node1-n_0000000000
   [junit4]   2> 2583444 INFO  (coreZkRegister-7363-thread-1-processing-n:127.0.0.1:46512_ x:collection1 s:shard1 c:control_collection r:core_node1) [n:127.0.0.1:46512_ c:control_collection s:shard1 r:core_node1 x:collection1] o.a.s.c.ShardLeaderElectionContext I am the new leader: http://127.0.0.1:46512/collection1/ shard1
   [junit4]   2> 2583446 INFO  (OverseerStateUpdate-96590119001784324-127.0.0.1:46512_-n_0000000000) [n:127.0.0.1:46512_    ] o.a.s.c.Overseer processMessage: queueSize: 1, message = {
   [junit4]   2>   "operation":"leader",
   [junit4]   2>   "shard":"shard1",
   [junit4]   2>   "collection":"control_collection"} current state version: 1
   [junit4]   2> 2583474 INFO  (OverseerStateUpdate-96590119001784324-127.0.0.1:46512_-n_0000000000) [n:127.0.0.1:46512_    ] o.a.s.c.Overseer processMessage: queueSize: 2, message = {
   [junit4]   2>   "operation":"leader",
   [junit4]   2>   "shard":"shard1",
   [junit4]   2>   "collection":"control_collection",
   [junit4]   2>   "base_url":"http://127.0.0.1:46512",
   [junit4]   2>   "core":"collection1",
   [junit4]   2>   "state":"active"} current state version: 1
   [junit4]   2> 2583691 INFO  (TEST-ForceLeaderTest.testReplicasInLIRNoLeader-seed#[6985005880625E85]) [    ] o.a.s.c.c.SolrZkClient Using default ZkCredentialsProvider
   [junit4]   2> 2583692 INFO  (zkCallback-2934-thread-2-processing-n:127.0.0.1:46512_) [n:127.0.0.1:46512_    ] o.a.s.c.c.ZkStateReader A cluster state change: [WatchedEvent state:SyncConnected type:NodeDataChanged path:/clusterstate.json], has occurred - updating... (live nodes size: [1])
   [junit4]   2> 2583692 INFO  (TEST-ForceLeaderTest.testReplicasInLIRNoLeader-seed#[6985005880625E85]) [    ] o.a.s.c.c.ConnectionManager Waiting for client to connect to ZooKeeper
   [junit4]   2> 2583702 INFO  (zkCallback-2938-thread-1) [    ] o.a.s.c.c.ConnectionManager Watcher org.apache.solr.common.cloud.ConnectionManager@2f3314c4 name:ZooKeeperConnection Watcher:127.0.0.1:58816/solr got event WatchedEvent state:SyncConnected type:None path:null path:null type:None
   [junit4]   2> 2583702 INFO  (TEST-ForceLeaderTest.testReplicasInLIRNoLeader-seed#[6985005880625E85]) [    ] o.a.s.c.c.ConnectionManager Client is connected to ZooKeeper
   [junit4]   2> 2583702 INFO  (TEST-ForceLeaderTest.testReplicasInLIRNoLeader-seed#[6985005880625E85]) [    ] o.a.s.c.c.SolrZkClient Using default ZkACLProvider
   [junit4]   2> 2583702 INFO  (TEST-ForceLeaderTest.testReplicasInLIRNoLeader-seed#[6985005880625E85]) [    ] o.a.s.c.c.ZkStateReader Updating cluster state from ZooKeeper... 
   [junit4]   2> 2583703 INFO  (TEST-ForceLeaderTest.testReplicasInLIRNoLeader-seed#[6985005880625E85]) [    ] o.a.s.c.c.ZkStateReader Loaded empty cluster properties
   [junit4]   2> 2583703 INFO  (TEST-ForceLeaderTest.testReplicasInLIRNoLeader-seed#[6985005880625E85]) [    ] o.a.s.c.c.ZkStateReader Updated live nodes from ZooKeeper... (0) -> (1)
   [junit4]   2> 2583704 INFO  (TEST-ForceLeaderTest.testReplicasInLIRNoLeader-seed#[6985005880625E85]) [    ] o.a.s.c.ChaosMonkey monkey: init - expire sessions:false cause connection loss:false
   [junit4]   2> 2583704 INFO  (TEST-ForceLeaderTest.testReplicasInLIRNoLeader-seed#[6985005880625E85]) [    ] o.a.s.c.AbstractFullDistribZkTestBase Creating collection1 with stateFormat=2
   [junit4]   2> 2583704 INFO  (TEST-ForceLeaderTest.testReplicasInLIRNoLeader-seed#[6985005880625E85]) [    ] o.a.s.c.c.SolrZkClient Using default ZkCredentialsProvider
   [junit4]   2> 2583705 INFO  (TEST-ForceLeaderTest.testReplicasInLIRNoLeader-seed#[6985005880625E85]) [    ] o.a.s.c.c.ConnectionManager Waiting for client to connect to ZooKeeper
   [junit4]   2> 2583706 INFO  (zkCallback-2939-thread-1) [    ] o.a.s.c.c.ConnectionManager Watcher org.apache.solr.common.cloud.ConnectionManager@7b858405 name:ZooKeeperConnection Watcher:127.0.0.1:58816/solr got event WatchedEvent state:SyncConnected type:None path:null path:null type:None
   [junit4]   2> 2583706 INFO  (TEST-ForceLeaderTest.testReplicasInLIRNoLeader-seed#[6985005880625E85]) [    ] o.a.s.c.c.ConnectionManager Client is connected to ZooKeeper
   [junit4]   2> 2583706 INFO  (TEST-ForceLeaderTest.testReplicasInLIRNoLeader-seed#[6985005880625E85]) [    ] o.a.s.c.c.SolrZkClient Using default ZkACLProvider
   [junit4]   2> 2583708 INFO  (OverseerStateUpdate-96590119001784324-127.0.0.1:46512_-n_0000000000) [n:127.0.0.1:46512_    ] o.a.s.c.Overseer processMessage: queueSize: 1, message = {
   [junit4]   2>   "operation":"create",
   [junit4]   2>   "name":"collection1",
   [junit4]   2>   "numShards":"2",
   [junit4]   2>   "stateFormat":"2"} current state version: 2
   [junit4]   2> 2583708 INFO  (OverseerStateUpdate-96590119001784324-127.0.0.1:46512_-n_0000000000) [n:127.0.0.1:46512_    ] o.a.s.c.o.ClusterStateMutator building a new cName: collection1
   [junit4]   2> 2583742 INFO  (coreZkRegister-7363-thread-1-processing-n:127.0.0.1:46512_ x:collection1 s:shard1 c:control_collection r:core_node1) [n:127.0.0.1:46512_ c:control_collection s:shard1 r:core_node1 x:collection1] o.a.s.c.ZkController We are http://127.0.0.1:46512/collection1/ and leader is http://127.0.0.1:46512/collection1/
   [junit4]   2> 2583742 INFO  (coreZkRegister-7363-thread-1-processing-n:127.0.0.1:46512_ x:collection1 s:shard1 c:control_collection r:core_node1) [n:127.0.0.1:46512_ c:control_collection s:shard1 r:core_node1 x:collection1] o.a.s.c.ZkController No LogReplay needed for core=collection1 baseURL=http://127.0.0.1:46512
   [junit4]   2> 2583742 INFO  (coreZkRegister-7363-thread-1-processing-n:127.0.0.1:46512_ x:collection1 s:shard1 c:control_collection r:core_node1) [n:127.0.0.1:46512_ c:control_collection s:shard1 r:core_node1 x:collection1] o.a.s.c.ZkController I am the leader, no recovery necessary
   [junit4]   2> 2583742 INFO  (coreZkRegister-7363-thread-1-processing-n:127.0.0.1:46512_ x:collection1 s:shard1 c:control_collection r:core_node1) [n:127.0.0.1:46512_ c:control_collection s:shard1 r:core_node1 x:collection1] o.a.s.c.ZkController publishing state=active
   [junit4]   2> 2583742 INFO  (coreZkRegister-7363-thread-1-processing-n:127.0.0.1:46512_ x:collection1 s:shard1 c:control_collection r:core_node1) [n:127.0.0.1:46512_ c:control_collection s:shard1 r:core_node1 x:collection1] o.a.s.c.ZkController numShards not found on descriptor - reading it from system property
   [junit4]   2> 2583758 INFO  (coreZkRegister-7363-thread-1-processing-n:127.0.0.1:46512_ x:collection1 s:shard1 c:control_collection r:core_node1) [n:127.0.0.1:46512_ c:control_collection s:shard1 r:core_node1 x:collection1] o.a.s.c.c.ZkStateReader Checking legacy cluster state for collection control_collection
   [junit4]   2> 2583778 INFO  (OverseerStateUpdate-96590119001784324-127.0.0.1:46512_-n_0000000000) [n:127.0.0.1:46512_    ] o.a.s.c.Overseer processMessage: queueSize: 1, message = {
   [junit4]   2>   "core":"collection1",
   [junit4]   2>   "core_node_name":"core_node1",
   [junit4]   2>   "roles":null,
   [junit4]   2>   "base_url":"http://127.0.0.1:46512",
   [junit4]   2>   "node_name":"127.0.0.1:46512_",
   [junit4]   2>   "numShards":"2",
   [junit4]   2>   "state":"active",
   [junit4]   2>   "shard":"shard1",
   [junit4]   2>   "collection":"control_collection",
   [junit4]   2>   "operation":"state"} current state version: 2
   [junit4]   2> 2583778 INFO  (OverseerStateUpdate-96590119001784324-127.0.0.1:46512_-n_0000000000) [n:127.0.0.1:46512_    ] o.a.s.c.o.ReplicaMutator Update state numShards=2 message={
   [junit4]   2>   "core":"collection1",
   [junit4]   2>   "core_node_name":"core_node1",
   [junit4]   2>   "roles":null,
   [junit4]   2>   "base_url":"http://127.0.0.1:46512",
   [junit4]   2>   "node_name":"127.0.0.1:46512_",
   [junit4]   2>   "numShards":"2",
   [junit4]   2>   "state":"active",
   [junit4]   2>   "shard":"shard1",
   [junit4]   2>   "collection":"control_collection",
   [junit4]   2>   "operation":"state"}
   [junit4]   2> 2583788 INFO  (OverseerStateUpdate-96590119001784324-127.0.0.1:46512_-n_0000000000) [n:127.0.0.1:46512_    ] o.a.s.c.o.ZkStateWriter going to create_collection /collections/collection1/state.json
   [junit4]   2> 2583919 INFO  (TEST-ForceLeaderTest.testReplicasInLIRNoLeader-seed#[6985005880625E85]) [    ] o.a.s.SolrTestCaseJ4 Writing core.properties file to /x1/jenkins/jenkins-slave/workspace/Lucene-Solr-Tests-master/solr/build/solr-core/test/J2/temp/solr.cloud.ForceLeaderTest_6985005880625E85-001/shard-1-001/cores/collection1
   [junit4]   2> 2583919 INFO  (TEST-ForceLeaderTest.testReplicasInLIRNoLeader-seed#[6985005880625E85]) [    ] o.a.s.c.AbstractFullDistribZkTestBase create jetty 1 in directory /x1/jenkins/jenkins-slave/workspace/Lucene-Solr-Tests-master/solr/build/solr-core/test/J2/temp/solr.cloud.ForceLeaderTest_6985005880625E85-001/shard-1-001
   [junit4]   2> 2583920 INFO  (TEST-ForceLeaderTest.testReplicasInLIRNoLeader-seed#[6985005880625E85]) [    ] o.e.j.s.Server jetty-9.3.8.v20160314
   [junit4]   2> 2583923 INFO  (TEST-ForceLeaderTest.testReplicasInLIRNoLeader-seed#[6985005880625E85]) [    ] o.e.j.s.h.ContextHandler Started o.e.j.s.ServletContextHandler@78530d76{/,null,AVAILABLE}
   [junit4]   2> 2583923 INFO  (TEST-ForceLeaderTest.testReplicasInLIRNoLeader-seed#[6985005880625E85]) [    ] o.e.j.s.ServerConnector Started ServerConnector@188eaff8{HTTP/1.1,[http/1.1]}{127.0.0.1:48307}
   [junit4]   2> 2583923 INFO  (TEST-ForceLeaderTest.testReplicasInLIRNoLeader-seed#[6985005880625E85]) [    ] o.e.j.s.Server Started @2591609ms
   [junit4]   2> 2583923 INFO  (TEST-ForceLeaderTest.testReplicasInLIRNoLeader-seed#[6985005880625E85]) [    ] o.a.s.c.s.e.JettySolrRunner Jetty properties: {solr.data.dir=/x1/jenkins/jenkins-slave/workspace/Lucene-Solr-Tests-master/solr/build/solr-core/test/J2/temp/solr.cloud.ForceLeaderTest_6985005880625E85-001/tempDir-001/jetty1, solrconfig=solrconfig.xml, hostContext=/, hostPort=33069, coreRootDirectory=/x1/jenkins/jenkins-slave/workspace/Lucene-Solr-Tests-master/solr/build/solr-core/test/J2/temp/solr.cloud.ForceLeaderTest_6985005880625E85-001/shard-1-001/cores}
   [junit4]   2> 2583924 INFO  (TEST-ForceLeaderTest.testReplicasInLIRNoLeader-seed#[6985005880625E85]) [    ] o.a.s.s.SolrDispatchFilter SolrDispatchFilter.init(): sun.misc.Launcher$AppClassLoader@73d16e93
   [junit4]   2> 2583924 INFO  (TEST-ForceLeaderTest.testReplicasInLIRNoLeader-seed#[6985005880625E85]) [    ] o.a.s.c.SolrResourceLoader new SolrResourceLoader for directory: '/x1/jenkins/jenkins-slave/workspace/Lucene-Solr-Tests-master/solr/build/solr-core/test/J2/temp/solr.cloud.ForceLeaderTest_6985005880625E85-001/shard-1-001'
   [junit4]   2> 2583924 INFO  (TEST-ForceLeaderTest.testReplicasInLIRNoLeader-seed#[6985005880625E85]) [    ] o.a.s.c.SolrResourceLoader JNDI not configured for solr (NoInitialContextEx)
   [junit4]   2> 2583924 INFO  (TEST-ForceLeaderTest.testReplicasInLIRNoLeader-seed#[6985005880625E85]) [    ] o.a.s.c.SolrResourceLoader solr home defaulted to 'solr/' (could not find system property or JNDI)
   [junit4]   2> 2583924 INFO  (TEST-ForceLeaderTest.testReplicasInLIRNoLeader-seed#[6985005880625E85]) [    ] o.a.s.c.c.SolrZkClient Using default ZkCredentialsProvider
   [junit4]   2> 2583925 INFO  (TEST-ForceLeaderTest.testReplicasInLIRNoLeader-seed#[6985005880625E85]) [    ] o.a.s.c.c.ConnectionManager Waiting for client to connect to ZooKeeper
   [junit4]   2> 2583954 INFO  (zkCallback-2938-thread-1) [    ] o.a.s.c.c.ZkStateReader A cluster state change: [WatchedEvent state:SyncConnected type:NodeDataChanged path:/clusterstate.json], has occurred - updating... (live nodes size: [1])
   [junit4]   2> 2583958 INFO  (zkCallback-2940-thread-1) [    ] o.a.s.c.c.ConnectionManager Watcher org.apache.solr.common.cloud.ConnectionManager@7af2d77d name:ZooKeeperConnection Watcher:127.0.0.1:58816/solr got event WatchedEvent state:SyncConnected type:None path:null path:null type:None
   [junit4]   2> 2583958 INFO  (TEST-ForceLeaderTest.testReplicasInLIRNoLeader-seed#[6985005880625E85]) [    ] o.a.s.c.c.ConnectionManager Client is connected to ZooKeeper
   [junit4]   2> 2583959 INFO  (TEST-ForceLeaderTest.testReplicasInLIRNoLeader-seed#[6985005880625E85]) [    ] o.a.s.c.c.SolrZkClient Using default ZkACLProvider
   [junit4]   2> 2583966 INFO  (zkCallback-2934-thread-3-processing-n:127.0.0.1:46512_) [n:127.0.0.1:46512_    ] o.a.s.c.c.ZkStateReader A cluster state change: [WatchedEvent state:SyncConnected type:NodeDataChanged path:/clusterstate.json], has occurred - updating... (live nodes size: [1])
   [junit4]   2> 2583974 INFO  (TEST-ForceLeaderTest.testReplicasInLIRNoLeader-seed#[6985005880625E85]) [    ] o.a.s.s.SolrDispatchFilter Loading solr.xml from SolrHome (not found in ZooKeeper)
   [junit4]   2> 2583975 INFO  (TEST-ForceLeaderTest.testReplicasInLIRNoLeader-seed#[6985005880625E85]) [    ] o.a.s.c.SolrXmlConfig Loading container configuration from /x1/jenkins/jenkins-slave/workspace/Lucene-Solr-Tests-master/solr/build/solr-core/test/J2/temp/solr.cloud.ForceLeaderTest_6985005880625E85-001/shard-1-001/solr.xml
   [junit4]   2> 2583979 INFO  (TEST-ForceLeaderTest.testReplicasInLIRNoLeader-seed#[6985005880625E85]) [    ] o.a.s.c.CorePropertiesLocator Config-defined core root directory: /x1/jenkins/jenkins-slave/workspace/Lucene-Solr-Tests-master/solr/build/solr-core/test/J2/temp/solr.cloud.ForceLeaderTest_6985005880625E85-001/shard-1-001/cores
   [junit4]   2> 2583980 INFO  (TEST-ForceLeaderTest.testReplicasInLIRNoLeader-seed#[6985005880625E85]) [    ] o.a.s.c.CoreContainer New CoreContainer 2142073646
   [junit4]   2> 2583980 INFO  (TEST-ForceLeaderTest.testReplicasInLIRNoLeader-seed#[6985005880625E85]) [    ] o.a.s.c.CoreContainer Loading cores into CoreContainer [instanceDir=/x1/jenkins/jenkins-slave/workspace/Lucene-Solr-Tests-master/solr/build/solr-core/test/J2/temp/solr.cloud.ForceLeaderTest_6985005880625E85-001/shard-1-001]
   [junit4]   2> 2583980 WARN  (TEST-ForceLeaderTest.testReplicasInLIRNoLeader-seed#[6985005880625E85]) [    ] o.a.s.c.CoreContainer Couldn't add files from /x1/jenkins/jenkins-slave/workspace/Lucene-Solr-Tests-master/solr/build/solr-core/test/J2/temp/solr.cloud.ForceLeaderTest_6985005880625E85-001/shard-1-001/lib to classpath: /x1/jenkins/jenkins-slave/workspace/Lucene-Solr-Tests-master/solr/build/solr-core/test/J2/temp/solr.cloud.ForceLeaderTest_6985005880625E85-001/shard-1-001/lib
   [junit4]   2> 2583980 INFO  (TEST-ForceLeaderTest.testReplicasInLIRNoLeader-seed#[6985005880625E85]) [    ] o.a.s.h.c.HttpShardHandlerFactory created with socketTimeout : 90000,urlScheme : ,connTimeout : 15000,maxConnectionsPerHost : 20,maxConnections : 10000,corePoolSize : 0,maximumPoolSize : 2147483647,maxThreadIdleTime : 5,sizeOfQueue : -1,fairnessPolicy : false,
   [junit4]   2> 2583982 INFO  (TEST-ForceLeaderTest.testReplicasInLIRNoLeader-seed#[6985005880625E85]) [    ] o.a.s.u.UpdateShardHandler Created UpdateShardHandler HTTP client with params: socketTimeout=340000&connTimeout=45000&maxConnections=100000&maxConnectionsPerHost=100000
   [junit4]   2> 2583982 INFO  (TEST-ForceLeaderTest.testReplicasInLIRNoLeader-seed#[6985005880625E85]) [    ] o.a.s.l.LogWatcher SLF4J impl is org.slf4j.impl.Log4jLoggerFactory
   [junit4]   2> 2583982 INFO  (TEST-ForceLeaderTest.testReplicasInLIRNoLeader-seed#[6985005880625E85]) [    ] o.a.s.l.LogWatcher Registering Log Listener [Log4j (org.slf4j.impl.Log4jLoggerFactory)]
   [junit4]   2> 2583982 INFO  (TEST-ForceLeaderTest.testReplicasInLIRNoLeader-seed#[6985005880625E85]) [    ] o.a.s.c.ZkContainer Zookeeper client=127.0.0.1:58816/solr
   [junit4]   2> 2583983 INFO  (TEST-ForceLeaderTest.testReplicasInLIRNoLeader-seed#[6985005880625E85]) [    ] o.a.s.c.ZkController zkHost includes chroot
   [junit4]   2> 2583983 INFO  (TEST-ForceLeaderTest.testReplicasInLIRNoLeader-seed#[6985005880625E85]) [    ] o.a.s.c.c.SolrZkClient Using default ZkCredentialsProvider
   [junit4]   2> 2583983 INFO  (TEST-ForceLeaderTest.testReplicasInLIRNoLeader-seed#[6985005880625E85]) [    ] o.a.s.c.c.ConnectionManager Waiting for client to connect to ZooKeeper
   [junit4]   2> 2583998 INFO  (zkCallback-2943-thread-1) [    ] o.a.s.c.c.ConnectionManager Watcher org.apache.solr.common.cloud.ConnectionManager@7eb8b73 name:ZooKeeperConnection Watcher:127.0.0.1:58816 got event WatchedEvent state:SyncConnected type:None path:null path:null type:None
   [junit4]   2> 2584010 INFO  (TEST-ForceLeaderTest.testReplicasInLIRNoLeader-seed#[6985005880625E85]) [    ] o.a.s.c.c.ConnectionManager Client is connected to ZooKeeper
   [junit4]   2> 2584010 INFO  (TEST-ForceLeaderTest.testReplicasInLIRNoLeader-seed#[6985005880625E85]) [    ] o.a.s.c.c.SolrZkClient Using default ZkACLProvider
   [junit4]   2> 2584030 INFO  (TEST-ForceLeaderTest.testReplicasInLIRNoLeader-seed#[6985005880625E85]) [n:127.0.0.1:33069_    ] o.a.s.c.ZkController Added new OnReconnect listener org.apache.solr.cloud.ZkController$$Lambda$85/95314422@6cb52053
   [junit4]   2> 2584031 INFO  (TEST-ForceLeaderTest.testReplicasInLIRNoLeader-seed#[6985005880625E85]) [n:127.0.0.1:33069_    ] o.a.s.c.c.ConnectionManager Waiting for client to connect to ZooKeeper
   [junit4]   2> 2584046 INFO  (zkCallback-2944-thread-1-processing-n:127.0.0.1:33069_) [n:127.0.0.1:33069_    ] o.a.s.c.c.ConnectionManager Watcher org.apache.solr.common.cloud.ConnectionManager@e6f12bc name:ZooKeeperConnection Watcher:127.0.0.1:58816/solr got event WatchedEvent state:SyncConnected type:None path:null path:null type:None
   [junit4]   2> 2584046 INFO  (TEST-ForceLeaderTest.testReplicasInLIRNoLeader-seed#[6985005880625E85]) [n:127.0.0.1:33069_    ] o.a.s.c.c.ConnectionManager Client is connected to ZooKeeper
   [junit4]   2> 2584186 INFO  (TEST-ForceLeaderTest.testReplicasInLIRNoLeader-seed#[6985005880625E85]) [n:127.0.0.1:33069_    ] o.a.s.c.c.ZkStateReader Updating cluster state from ZooKeeper... 
   [junit4]   2> 2584186 INFO  (TEST-ForceLeaderTest.testReplicasInLIRNoLeader-seed#[6985005880625E85]) [n:127.0.0.1:33069_    ] o.a.s.c.c.ZkStateReader Loaded empty cluster properties
   [junit4]   2> 2584187 INFO  (TEST-ForceLeaderTest.testReplicasInLIRNoLeader-seed#[6985005880625E85]) [n:127.0.0.1:33069_    ] o.a.s.c.c.ZkStateReader Updated live nodes from ZooKeeper... (0) -> (1)
   [junit4]   2> 2584190 INFO  (TEST-ForceLeaderTest.testReplicasInLIRNoLeader-seed#[6985005880625E85]) [n:127.0.0.1:33069_    ] o.a.s.c.Overseer Overseer (id=null) closing
   [junit4]   2> 2584190 INFO  (TEST-ForceLeaderTest.testReplicasInLIRNoLeader-seed#[6985005880625E85]) [n:127.0.0.1:33069_    ] o.a.s.c.LeaderElector Joined leadership election with path: /overseer_elect/election/96590119001784329-127.0.0.1:33069_-n_0000000001
   [junit4]   2> 2584190 INFO  (TEST-ForceLeaderTest.testReplicasInLIRNoLeader-seed#[6985005880625E85]) [n:127.0.0.1:33069_    ] o.a.s.c.LeaderElector Watching path /overseer_elect/election/96590119001784324-127.0.0.1:46512_-n_0000000000 to know if I could be the leader
   [junit4]   2> 2584191 INFO  (TEST-ForceLeaderTest.testReplicasInLIRNoLeader-seed#[6985005880625E85]) [n:127.0.0.1:33069_    ] o.a.s.c.ZkController Publish node=127.0.0.1:33069_ as DOWN
   [junit4]   2> 2584194 INFO  (TEST-ForceLeaderTest.testReplicasInLIRNoLeader-seed#[6985005880625E85]) [n:127.0.0.1:33069_    ] o.a.s.c.ZkController Register node as live in ZooKeeper:/live_nodes/127.0.0.1:33069_
   [junit4]   2> 2584194 INFO  (TEST-ForceLeaderTest.testReplicasInLIRNoLeader-seed#[6985005880625E85]) [n:127.0.0.1:33069_    ] o.a.s.c.c.SolrZkClient makePath: /live_nodes/127.0.0.1:33069_
   [junit4]   2> 2584208 INFO  (zkCallback-2938-thread-1) [    ] o.a.s.c.c.ZkStateReader A live node change: [WatchedEvent state:SyncConnected type:NodeChildrenChanged path:/live_nodes], has occurred - updating... (live nodes size: [1])
   [junit4]   2> 2584208 INFO  (OverseerStateUpdate-96590119001784324-127.0.0.1:46512_-n_0000000000) [n:127.0.0.1:46512_    ] o.a.s.c.Overseer processMessage: queueSize: 1, message = {
   [junit4]   2>   "operation":"downnode",
   [junit4]   2>   "node_name":"127.0.0.1:33069_"} current state version: 3
   [junit4]   2> 2584208 INFO  (OverseerStateUpdate-96590119001784324-127.0.0.1:46512_-n_0000000000) [n:127.0.0.1:46512_    ] o.a.s.c.o.NodeMutator DownNode state invoked for node: 127.0.0.1:33069_
   [junit4]   2> 2584208 INFO  (zkCallback-2934-thread-1-processing-n:127.0.0.1:46512_) [n:127.0.0.1:46512_    ] o.a.s.c.c.ZkStateReader A live node change: [WatchedEvent state:SyncConnected type:NodeChildrenChanged path:/live_nodes], has occurred - updating... (live nodes size: [1])
   [junit4]   2> 2584208 INFO  (zkCallback-2944-thread-1-processing-n:127.0.0.1:33069_) [n:127.0.0.1:33069_    ] o.a.s.c.c.ZkStateReader A live node change: [WatchedEvent state:SyncConnected type:NodeChildrenChanged path:/live_nodes], has occurred - updating... (live nodes size: [1])
   [junit4]   2> 2584215 INFO  (zkCallback-2934-thread-1-processing-n:127.0.0.1:46512_) [n:127.0.0.1:46512_    ] o.a.s.c.c.ZkStateReader Updated live nodes from ZooKeeper... (1) -> (2)
   [junit4]   2> 2584215 INFO  (zkCallback-2938-thread-1) [    ] o.a.s.c.c.ZkStateReader Updated live nodes from ZooKeeper... (1) -> (2)
   [junit4]   2> 2584218 INFO  (zkCallback-2944-thread-1-processing-n:127.0.0.1:33069_) [n:127.0.0.1:33069_    ] o.a.s.c.c.ZkStateReader Updated live nodes from ZooKeeper... (1) -> (2)
   [junit4]   2> 2584218 INFO  (zkCallback-2934-thread-1-processing-n:127.0.0.1:46512_) [n:127.0.0.1:46512_    ] o.a.s.c.c.ZkStateReader A cluster state change: [WatchedEvent state:SyncConnected type:NodeDataChanged path:/clusterstate.json], has occurred - updating... (live nodes size: [2])
   [junit4]   2> 2584218 INFO  (zkCallback-2938-thread-1) [    ] o.a.s.c.c.ZkStateReader A cluster state change: [WatchedEvent state:SyncConnected type:NodeDataChanged path:/clusterstate.json], has occurred - updating... (live nodes size: [2])
   [junit4]   2> 2584228 INFO  (zkCallback-2944-thread-1-processing-n:127.0.0.1:33069_) [n:127.0.0.1:33069_    ] o.a.s.c.c.ZkStateReader A cluster state change: [WatchedEvent state:SyncConnected type:NodeDataChanged path:/clusterstate.json], has occurred - updating... (live nodes size: [2])
   [junit4]   2> 2584248 INFO  (TEST-ForceLeaderTest.testReplicasInLIRNoLeader-seed#[6985005880625E85]) [n:127.0.0.1:33069_    ] o.a.s.c.CoreContainer Security conf doesn't exist. Skipping setup for authorization module.
   [junit4]   2> 2584249 INFO  (TEST-ForceLeaderTest.testReplicasInLIRNoLeader-seed#[6985005880625E85]) [n:127.0.0.1:33069_    ] o.a.s.c.CoreContainer No authentication plugin used.
   [junit4]   2> 2584249 INFO  (TEST-ForceLeaderTest.testReplicasInLIRNoLeader-seed#[6985005880625E85]) [n:127.0.0.1:33069_    ] o.a.s.c.CorePropertiesLocator Looking for core definitions underneath /x1/jenkins/jenkins-slave/workspace/Lucene-Solr-Tests-master/solr/build/solr-core/test/J2/temp/solr.cloud.ForceLeaderTest_6985005880625E85-001/shard-1-001/cores
   [junit4]   2> 2584250 INFO  (TEST-ForceLeaderTest.testReplicasInLIRNoLeader-seed#[6985005880625E85]) [n:127.0.0.1:33069_    ] o.a.s.c.CoreDescriptor Created CoreDescriptor: {name=collection1, config=solrconfig.xml, transient=false, schema=schema.xml, loadOnStartup=true, configSetProperties=configsetprops.json, collection=collection1, coreNodeName=, dataDir=data/, shard=}
   [junit4]   2> 2584250 INFO  (TEST-ForceLeaderTest.testReplicasInLIRNoLeader-seed#[6985005880625E85]) [n:127.0.0.1:33069_    ] o.a.s.c.CorePropertiesLocator Found core collection1 in /x1/jenkins/jenkins-slave/workspace/Lucene-Solr-Tests-master/solr/build/solr-core/test/J2/temp/solr.cloud.ForceLeaderTest_6985005880625E85-001/shard-1-001/cores/collection1
   [junit4]   2> 2584250 INFO  (TEST-ForceLeaderTest.testReplicasInLIRNoLeader-seed#[6985005880625E85]) [n:127.0.0.1:33069_    ] o.a.s.c.CorePropertiesLocator Found 1 core definitions
   [junit4]   2> 2584262 INFO  (TEST-ForceLeaderTest.testReplicasInLIRNoLeader-seed#[6985005880625E85]) [n:127.0.0.1:33069_    ] o.a.s.s.SolrDispatchFilter user.dir=/x1/jenkins/jenkins-slave/workspace/Lucene-Solr-Tests-master/solr/build/solr-core/test/J2
   [junit4]   2> 2584262 INFO  (TEST-ForceLeaderTest.testReplicasInLIRNoLeader-seed#[6985005880625E85]) [n:127.0.0.1:33069_    ] o.a.s.s.SolrDispatchFilter SolrDispatchFilter.init() done
   [junit4]   2> 2584282 INFO  (coreLoadExecutor-7381-thread-1-processing-n:127.0.0.1:33069_) [n:127.0.0.1:33069_ c:collection1   x:collection1] o.a.s.c.ZkController publishing state=down
   [junit4]   2> 2584282 INFO  (coreLoadExecutor-7381-thread-1-processing-n:127.0.0.1:33069_) [n:127.0.0.1:33069_ c:collection1   x:collection1] o.a.s.c.ZkController numShards not found on descriptor - reading it from system property
   [junit4]   2> 2584310 INFO  (coreLoadExecutor-7381-thread-1-processing-n:127.0.0.1:33069_) [n:127.0.0.1:33069_ c:collection1   x:collection1] o.a.s.c.ZkController Registering watch for collection collection1
   [junit4]   2> 2584318 INFO  (coreLoadExecutor-7381-thread-1-processing-n:127.0.0.1:33069_) [n:127.0.0.1:33069_ c:collection1   x:collection1] o.a.s.c.c.ZkStateReader Add data for [collection1] ver [0]
   [junit4]   2> 2584318 INFO  (OverseerStateUpdate-96590119001784324-127.0.0.1:46512_-n_0000000000) [n:127.0.0.1:46512_    ] o.a.s.c.Overseer processMessage: queueSize: 1, message = {
   [junit4]   2>   "core":"collection1",
   [junit4]   2>   "roles":null,
   [junit4]   2>   "base_url":"http

[...truncated too long message...]

rectoryFactory looking to close /x1/jenkins/jenkins-slave/workspace/Lucene-Solr-Tests-master/solr/build/solr-core/test/J2/temp/solr.cloud.ForceLeaderTest_6985005880625E85-001/shard-3-002/cores/collection1/data/snapshot_metadata [CachedDir<<refCount=0;path=/x1/jenkins/jenkins-slave/workspace/Lucene-Solr-Tests-master/solr/build/solr-core/test/J2/temp/solr.cloud.ForceLeaderTest_6985005880625E85-001/shard-3-002/cores/collection1/data/snapshot_metadata;done=false>>]
   [junit4]   2> 2701854 INFO  (zkCallback-2991-thread-2-processing-n:127.0.0.1:57658_) [n:127.0.0.1:57658_ c:collection1 s:shard2 r:core_node3 x:collection1] o.a.s.c.CachingDirectoryFactory Closing directory, CoreContainer#isShutdown=true
   [junit4]   2> 2701854 INFO  (zkCallback-2991-thread-2-processing-n:127.0.0.1:57658_) [n:127.0.0.1:57658_ c:collection1 s:shard2 r:core_node3 x:collection1] o.a.s.c.CachingDirectoryFactory Closing directory: /x1/jenkins/jenkins-slave/workspace/Lucene-Solr-Tests-master/solr/build/solr-core/test/J2/temp/solr.cloud.ForceLeaderTest_6985005880625E85-001/shard-3-002/cores/collection1/data/snapshot_metadata
   [junit4]   2> 2701854 INFO  (zkCallback-2991-thread-2-processing-n:127.0.0.1:57658_) [n:127.0.0.1:57658_ c:collection1 s:shard2 r:core_node3 x:collection1] o.a.s.c.ElectionContext Canceling election /collections/collection1/leader_elect/shard2/election/96590122045800463-core_node3-n_0000000001
   [junit4]   2> 2701855 INFO  (TEST-ForceLeaderTest.testLastPublishedStateIsActive-seed#[6985005880625E85]) [    ] o.e.j.s.ServerConnector Stopped ServerConnector@160bcee2{HTTP/1.1,[http/1.1]}{127.0.0.1:0}
   [junit4]   2> 2701855 INFO  (TEST-ForceLeaderTest.testLastPublishedStateIsActive-seed#[6985005880625E85]) [    ] o.e.j.s.h.ContextHandler Stopped o.e.j.s.ServletContextHandler@6901cfde{/,null,UNAVAILABLE}
   [junit4]   2> 2701859 INFO  (TEST-ForceLeaderTest.testLastPublishedStateIsActive-seed#[6985005880625E85]) [    ] o.a.s.c.ChaosMonkey monkey: stop shard! 50315
   [junit4]   2> 2701860 INFO  (TEST-ForceLeaderTest.testLastPublishedStateIsActive-seed#[6985005880625E85]) [    ] o.a.s.c.ZkTestServer connecting to 127.0.0.1:36693 36693
   [junit4]   2> 2702192 INFO  (Thread-3417) [    ] o.a.s.c.ZkTestServer connecting to 127.0.0.1:36693 36693
   [junit4]   2> 2702193 WARN  (Thread-3417) [    ] o.a.s.c.ZkTestServer Watch limit violations: 
   [junit4]   2> Maximum concurrent create/delete watches above limit:
   [junit4]   2> 
   [junit4]   2> 	5	/solr/aliases.json
   [junit4]   2> 	5	/solr/clusterprops.json
   [junit4]   2> 	4	/solr/security.json
   [junit4]   2> 	4	/solr/configs/conf1
   [junit4]   2> 
   [junit4]   2> Maximum concurrent data watches above limit:
   [junit4]   2> 
   [junit4]   2> 	5	/solr/clusterstate.json
   [junit4]   2> 	3	/solr/collections/forceleader_last_published/state.json
   [junit4]   2> 	3	/solr/collections/collection1/state.json
   [junit4]   2> 
   [junit4]   2> Maximum concurrent children watches above limit:
   [junit4]   2> 
   [junit4]   2> 	68	/solr/overseer/collection-queue-work
   [junit4]   2> 	40	/solr/overseer/queue
   [junit4]   2> 	16	/solr/overseer/queue-work
   [junit4]   2> 	5	/solr/live_nodes
   [junit4]   2> 	5	/solr/collections
   [junit4]   2> 
   [junit4]   2> 2702194 WARN  (TEST-ForceLeaderTest.testLastPublishedStateIsActive-seed#[6985005880625E85]) [    ] o.a.s.c.SocketProxy Closing 4 connections to: http://127.0.0.1:43085/, target: http://127.0.0.1:37420/
   [junit4]   2> 2702194 WARN  (TEST-ForceLeaderTest.testLastPublishedStateIsActive-seed#[6985005880625E85]) [    ] o.a.s.c.SocketProxy Closing 4 connections to: http://127.0.0.1:50315/, target: http://127.0.0.1:57018/
   [junit4]   2> 2702194 WARN  (TEST-ForceLeaderTest.testLastPublishedStateIsActive-seed#[6985005880625E85]) [    ] o.a.s.c.SocketProxy Closing 8 connections to: http://127.0.0.1:57658/, target: http://127.0.0.1:45107/
   [junit4]   2> 2702194 WARN  (TEST-ForceLeaderTest.testLastPublishedStateIsActive-seed#[6985005880625E85]) [    ] o.a.s.c.SocketProxy Closing 3 connections to: http://127.0.0.1:53978/, target: http://127.0.0.1:49392/
   [junit4]   2> 2702195 INFO  (SUITE-ForceLeaderTest-seed#[6985005880625E85]-worker) [    ] o.a.s.SolrTestCaseJ4 ###deleteCore
   [junit4]   2> NOTE: leaving temporary files on disk at: /x1/jenkins/jenkins-slave/workspace/Lucene-Solr-Tests-master/solr/build/solr-core/test/J2/temp/solr.cloud.ForceLeaderTest_6985005880625E85-001
   [junit4]   2> Sep 14, 2016 10:19:31 AM com.carrotsearch.randomizedtesting.ThreadLeakControl checkThreadLeaks
   [junit4]   2> WARNING: Will linger awaiting termination of 2 leaked thread(s).
   [junit4]   2> NOTE: test params are: codec=Asserting(Lucene62): {range_facet_l_dv=PostingsFormat(name=Memory doPackFST= false), _version_=FST50, multiDefault=PostingsFormat(name=MockRandom), a_t=PostingsFormat(name=MockRandom), intDefault=FST50, id=PostingsFormat(name=Memory doPackFST= false), range_facet_i_dv=PostingsFormat(name=MockRandom), text=PostingsFormat(name=LuceneFixedGap), range_facet_l=PostingsFormat(name=MockRandom), timestamp=PostingsFormat(name=MockRandom)}, docValues:{range_facet_l_dv=DocValuesFormat(name=Lucene54), range_facet_i_dv=DocValuesFormat(name=Direct), timestamp=DocValuesFormat(name=Direct)}, maxPointsInLeafNode=273, maxMBSortInHeap=5.769785893703164, sim=ClassicSimilarity, locale=vi, timezone=Africa/Freetown
   [junit4]   2> NOTE: Linux 3.13.0-85-generic amd64/Oracle Corporation 1.8.0_102 (64-bit)/cpus=4,threads=1,free=284914984,total=525336576
   [junit4]   2> NOTE: All tests run in this JVM: [TestReRankQParserPlugin, TestDynamicFieldCollectionResource, TestXIncludeConfig, TestSlowCompositeReaderWrapper, TestDistribIDF, TestRebalanceLeaders, TestCryptoKeys, TestConfigSetsAPI, TestOnReconnectListenerSupport, TestXmlQParserPlugin, TestOrdValues, OpenExchangeRatesOrgProviderTest, UpdateParamsTest, SuggesterTest, DOMUtilTest, DistributedQueryComponentOptimizationTest, NoCacheHeaderTest, TestRequestStatusCollectionAPI, TestMiniSolrCloudCluster, BasicDistributedZk2Test, TestTestInjection, SSLMigrationTest, TestUtils, JSONWriterTest, TestExclusionRuleCollectionAccess, PluginInfoTest, BinaryUpdateRequestHandlerTest, TestCloudManagedSchema, TestFilteredDocIdSet, DistributedDebugComponentTest, TestJmxMonitoredMap, TestManagedResourceStorage, SOLR749Test, SharedFSAutoReplicaFailoverTest, HardAutoCommitTest, SuggesterTSTTest, TestLRUStatsCache, TestSizeLimitedDistributedMap, TestAnalyzedSuggestions, TestClassicSimilarityFactory, CloneFieldUpdateProcessorFactoryTest, UnloadDistributedZkTest, EnumFieldTest, TestAnalyzeInfixSuggestions, TestUninvertingReader, TestSolrJ, TestWriterPerf, ConfigSetsAPITest, PrimitiveFieldTypeTest, SolrTestCaseJ4Test, TestSolrQueryParser, MinimalSchemaTest, AnalyticsMergeStrategyTest, XmlUpdateRequestHandlerTest, SolrCLIZkUtilsTest, SimpleFacetsTest, RecoveryAfterSoftCommitTest, TestTolerantUpdateProcessorCloud, SpellPossibilityIteratorTest, RuleEngineTest, StatsComponentTest, BitVectorTest, TestFieldCacheReopen, TestDFRSimilarityFactory, TestConfigSetImmutable, TestTrackingShardHandlerFactory, TestFieldCacheSortRandom, TestZkChroot, HdfsCollectionsAPIDistributedZkTest, TermVectorComponentDistributedTest, OverseerCollectionConfigSetProcessorTest, TestSearcherReuse, TestInitQParser, AutoCommitTest, TestCloudPivotFacet, TestAddFieldRealTimeGet, TestSchemaManager, CoreAdminHandlerTest, BadIndexSchemaTest, TestTolerantSearch, PreAnalyzedFieldTest, ReplicationFactorTest, OverseerTest, TestShardHandlerFactory, MultiThreadedOCPTest, CollectionsAPIAsyncDistributedZkTest, TestSort, HdfsBasicDistributedZkTest, TestSolrCloudWithSecureImpersonation, HdfsRecoveryZkTest, QueryParsingTest, CustomCollectionTest, PrimUtilsTest, ShowFileRequestHandlerTest, TestCollationFieldDocValues, PingRequestHandlerTest, TestBlobHandler, RecoveryZkTest, TestFreeTextSuggestions, CollectionReloadTest, SyncSliceTest, BasicZkTest, FullSolrCloudDistribCmdsTest, TestReplicationHandler, LeaderElectionTest, TestDistributedGrouping, TestFaceting, TestRecovery, DistributedSpellCheckComponentTest, TestStressReorder, TestReload, TestGroupingSearch, TestLazyCores, TestIndexSearcher, CurrencyFieldXmlFileTest, SolrIndexSplitterTest, TestExtendedDismaxParser, SpellCheckCollatorTest, SolrRequestParserTest, TestTrie, PolyFieldTest, SchemaVersionSpecificBehaviorTest, TestUpdate, TestAtomicUpdateErrorCases, DirectUpdateHandlerOptimizeTest, SortByFunctionTest, TestRemoteStreaming, DocValuesMultiTest, TestSolrDeletionPolicy1, LukeRequestHandlerTest, TestQueryTypes, RequestHandlersTest, TestIndexingPerformance, FieldAnalysisRequestHandlerTest, LoggingHandlerTest, TestCollationField, ReturnFieldsTest, MBeansHandlerTest, TestPHPSerializedResponseWriter, SearchHandlerTest, HighlighterConfigTest, AlternateDirectoryTest, TestQuerySenderNoQuery, ResponseLogComponentTest, BadComponentTest, TestStressRecovery, TestMergePolicyConfig, SampleTest, TestBinaryField, NumericFieldsTest, TestElisionMultitermQuery, TestConfig, TestFuzzyAnalyzedSuggestions, TestPostingsSolrHighlighter, DirectSolrConnectionTest, NotRequiredUniqueKeyTest, TestLuceneMatchVersion, TestPhraseSuggestions, SynonymTokenizerTest, EchoParamsTest, TestPerFieldSimilarity, TestLMDirichletSimilarityFactory, TestLMJelinekMercerSimilarityFactory, TestBM25SimilarityFactory, TestFastWriter, TimeZoneUtilsTest, ResourceLoaderTest, TestFastOutputStream, ScriptEngineTest, URLClassifyProcessorTest, TestFastLRUCache, DateMathParserTest, ChaosMonkeyNothingIsSafeTest, TestCrossCoreJoin, TestDistributedMissingSort, TestHighlightDedupGrouping, ConnectionReuseTest, AssignTest, BaseCdcrDistributedZkTest, CdcrBootstrapTest, ConcurrentDeleteAndCreateCollectionTest, ConnectionManagerTest, CreateCollectionCleanupTest, DeleteInactiveReplicaTest, DeleteShardTest, DistribJoinFromCollectionTest, ForceLeaderTest]
   [junit4] Completed [472/631 (1!)] on J2 in 119.94s, 3 tests, 1 error, 1 skipped <<< FAILURES!

[...truncated 60704 lines...]



Mime
View raw message