lucene-dev mailing list archives

Site index · List index
Message view « Date » · « Thread »
Top « Date » · « Thread »
From Policeman Jenkins Server <jenk...@thetaphi.de>
Subject [JENKINS] Lucene-Solr-5.5-Linux (64bit/jdk1.7.0_80) - Build # 360 - Unstable!
Date Thu, 01 Sep 2016 04:24:20 GMT
Build: http://jenkins.thetaphi.de/job/Lucene-Solr-5.5-Linux/360/
Java: 64bit/jdk1.7.0_80 -XX:+UseCompressedOops -XX:+UseSerialGC

2 tests failed.
FAILED:  org.apache.solr.cloud.DistribDocExpirationUpdateProcessorTest.test

Error Message:
Exactly one shard should have changed, instead: [shard2, shard1] nodes=([core_node4(shard1), core_node3(shard2), core_node2(shard1)]) expected:<1> but was:<2>

Stack Trace:
java.lang.AssertionError: Exactly one shard should have changed, instead: [shard2, shard1] nodes=([core_node4(shard1), core_node3(shard2), core_node2(shard1)]) expected:<1> but was:<2>
	at __randomizedtesting.SeedInfo.seed([C39D88D346280463:4BC9B709E8D4699B]:0)
	at org.junit.Assert.fail(Assert.java:93)
	at org.junit.Assert.failNotEquals(Assert.java:647)
	at org.junit.Assert.assertEquals(Assert.java:128)
	at org.junit.Assert.assertEquals(Assert.java:472)
	at org.apache.solr.cloud.DistribDocExpirationUpdateProcessorTest.test(DistribDocExpirationUpdateProcessorTest.java:119)
	at sun.reflect.NativeMethodAccessorImpl.invoke0(Native Method)
	at sun.reflect.NativeMethodAccessorImpl.invoke(NativeMethodAccessorImpl.java:57)
	at sun.reflect.DelegatingMethodAccessorImpl.invoke(DelegatingMethodAccessorImpl.java:43)
	at java.lang.reflect.Method.invoke(Method.java:606)
	at com.carrotsearch.randomizedtesting.RandomizedRunner.invoke(RandomizedRunner.java:1764)
	at com.carrotsearch.randomizedtesting.RandomizedRunner$8.evaluate(RandomizedRunner.java:871)
	at com.carrotsearch.randomizedtesting.RandomizedRunner$9.evaluate(RandomizedRunner.java:907)
	at com.carrotsearch.randomizedtesting.RandomizedRunner$10.evaluate(RandomizedRunner.java:921)
	at org.apache.solr.BaseDistributedSearchTestCase$ShardsRepeatRule$ShardsFixedStatement.callStatement(BaseDistributedSearchTestCase.java:996)
	at org.apache.solr.BaseDistributedSearchTestCase$ShardsRepeatRule$ShardsStatement.evaluate(BaseDistributedSearchTestCase.java:971)
	at com.carrotsearch.randomizedtesting.rules.SystemPropertiesRestoreRule$1.evaluate(SystemPropertiesRestoreRule.java:57)
	at org.apache.lucene.util.TestRuleSetupTeardownChained$1.evaluate(TestRuleSetupTeardownChained.java:49)
	at org.apache.lucene.util.AbstractBeforeAfterRule$1.evaluate(AbstractBeforeAfterRule.java:45)
	at org.apache.lucene.util.TestRuleThreadAndTestName$1.evaluate(TestRuleThreadAndTestName.java:48)
	at org.apache.lucene.util.TestRuleIgnoreAfterMaxFailures$1.evaluate(TestRuleIgnoreAfterMaxFailures.java:64)
	at org.apache.lucene.util.TestRuleMarkFailure$1.evaluate(TestRuleMarkFailure.java:47)
	at com.carrotsearch.randomizedtesting.rules.StatementAdapter.evaluate(StatementAdapter.java:36)
	at com.carrotsearch.randomizedtesting.ThreadLeakControl$StatementRunner.run(ThreadLeakControl.java:367)
	at com.carrotsearch.randomizedtesting.ThreadLeakControl.forkTimeoutingTask(ThreadLeakControl.java:809)
	at com.carrotsearch.randomizedtesting.ThreadLeakControl$3.evaluate(ThreadLeakControl.java:460)
	at com.carrotsearch.randomizedtesting.RandomizedRunner.runSingleTest(RandomizedRunner.java:880)
	at com.carrotsearch.randomizedtesting.RandomizedRunner$5.evaluate(RandomizedRunner.java:781)
	at com.carrotsearch.randomizedtesting.RandomizedRunner$6.evaluate(RandomizedRunner.java:816)
	at com.carrotsearch.randomizedtesting.RandomizedRunner$7.evaluate(RandomizedRunner.java:827)
	at com.carrotsearch.randomizedtesting.rules.StatementAdapter.evaluate(StatementAdapter.java:36)
	at com.carrotsearch.randomizedtesting.rules.SystemPropertiesRestoreRule$1.evaluate(SystemPropertiesRestoreRule.java:57)
	at org.apache.lucene.util.AbstractBeforeAfterRule$1.evaluate(AbstractBeforeAfterRule.java:45)
	at com.carrotsearch.randomizedtesting.rules.StatementAdapter.evaluate(StatementAdapter.java:36)
	at org.apache.lucene.util.TestRuleStoreClassName$1.evaluate(TestRuleStoreClassName.java:41)
	at com.carrotsearch.randomizedtesting.rules.NoShadowingOrOverridesOnMethodsRule$1.evaluate(NoShadowingOrOverridesOnMethodsRule.java:40)
	at com.carrotsearch.randomizedtesting.rules.NoShadowingOrOverridesOnMethodsRule$1.evaluate(NoShadowingOrOverridesOnMethodsRule.java:40)
	at com.carrotsearch.randomizedtesting.rules.StatementAdapter.evaluate(StatementAdapter.java:36)
	at com.carrotsearch.randomizedtesting.rules.StatementAdapter.evaluate(StatementAdapter.java:36)
	at com.carrotsearch.randomizedtesting.rules.StatementAdapter.evaluate(StatementAdapter.java:36)
	at org.apache.lucene.util.TestRuleAssertionsRequired$1.evaluate(TestRuleAssertionsRequired.java:53)
	at org.apache.lucene.util.TestRuleMarkFailure$1.evaluate(TestRuleMarkFailure.java:47)
	at org.apache.lucene.util.TestRuleIgnoreAfterMaxFailures$1.evaluate(TestRuleIgnoreAfterMaxFailures.java:64)
	at org.apache.lucene.util.TestRuleIgnoreTestSuites$1.evaluate(TestRuleIgnoreTestSuites.java:54)
	at com.carrotsearch.randomizedtesting.rules.StatementAdapter.evaluate(StatementAdapter.java:36)
	at com.carrotsearch.randomizedtesting.ThreadLeakControl$StatementRunner.run(ThreadLeakControl.java:367)
	at java.lang.Thread.run(Thread.java:745)


FAILED:  org.apache.solr.schema.TestManagedSchemaAPI.test

Error Message:
Error from server at http://127.0.0.1:38730/solr/testschemaapi_shard1_replica1: ERROR: [doc=2] unknown field 'myNewField1'

Stack Trace:
org.apache.solr.client.solrj.impl.CloudSolrClient$RouteException: Error from server at http://127.0.0.1:38730/solr/testschemaapi_shard1_replica1: ERROR: [doc=2] unknown field 'myNewField1'
	at __randomizedtesting.SeedInfo.seed([C39D88D346280463:4BC9B709E8D4699B]:0)
	at org.apache.solr.client.solrj.impl.CloudSolrClient.directUpdate(CloudSolrClient.java:653)
	at org.apache.solr.client.solrj.impl.CloudSolrClient.sendRequest(CloudSolrClient.java:1002)
	at org.apache.solr.client.solrj.impl.CloudSolrClient.requestWithRetryOnStaleState(CloudSolrClient.java:891)
	at org.apache.solr.client.solrj.impl.CloudSolrClient.request(CloudSolrClient.java:827)
	at org.apache.solr.schema.TestManagedSchemaAPI.testAddFieldAndDocument(TestManagedSchemaAPI.java:101)
	at org.apache.solr.schema.TestManagedSchemaAPI.test(TestManagedSchemaAPI.java:69)
	at sun.reflect.NativeMethodAccessorImpl.invoke0(Native Method)
	at sun.reflect.NativeMethodAccessorImpl.invoke(NativeMethodAccessorImpl.java:57)
	at sun.reflect.DelegatingMethodAccessorImpl.invoke(DelegatingMethodAccessorImpl.java:43)
	at java.lang.reflect.Method.invoke(Method.java:606)
	at com.carrotsearch.randomizedtesting.RandomizedRunner.invoke(RandomizedRunner.java:1764)
	at com.carrotsearch.randomizedtesting.RandomizedRunner$8.evaluate(RandomizedRunner.java:871)
	at com.carrotsearch.randomizedtesting.RandomizedRunner$9.evaluate(RandomizedRunner.java:907)
	at com.carrotsearch.randomizedtesting.RandomizedRunner$10.evaluate(RandomizedRunner.java:921)
	at com.carrotsearch.randomizedtesting.rules.SystemPropertiesRestoreRule$1.evaluate(SystemPropertiesRestoreRule.java:57)
	at org.apache.lucene.util.TestRuleSetupTeardownChained$1.evaluate(TestRuleSetupTeardownChained.java:49)
	at org.apache.lucene.util.AbstractBeforeAfterRule$1.evaluate(AbstractBeforeAfterRule.java:45)
	at org.apache.lucene.util.TestRuleThreadAndTestName$1.evaluate(TestRuleThreadAndTestName.java:48)
	at org.apache.lucene.util.TestRuleIgnoreAfterMaxFailures$1.evaluate(TestRuleIgnoreAfterMaxFailures.java:64)
	at org.apache.lucene.util.TestRuleMarkFailure$1.evaluate(TestRuleMarkFailure.java:47)
	at com.carrotsearch.randomizedtesting.rules.StatementAdapter.evaluate(StatementAdapter.java:36)
	at com.carrotsearch.randomizedtesting.ThreadLeakControl$StatementRunner.run(ThreadLeakControl.java:367)
	at com.carrotsearch.randomizedtesting.ThreadLeakControl.forkTimeoutingTask(ThreadLeakControl.java:809)
	at com.carrotsearch.randomizedtesting.ThreadLeakControl$3.evaluate(ThreadLeakControl.java:460)
	at com.carrotsearch.randomizedtesting.RandomizedRunner.runSingleTest(RandomizedRunner.java:880)
	at com.carrotsearch.randomizedtesting.RandomizedRunner$5.evaluate(RandomizedRunner.java:781)
	at com.carrotsearch.randomizedtesting.RandomizedRunner$6.evaluate(RandomizedRunner.java:816)
	at com.carrotsearch.randomizedtesting.RandomizedRunner$7.evaluate(RandomizedRunner.java:827)
	at com.carrotsearch.randomizedtesting.rules.StatementAdapter.evaluate(StatementAdapter.java:36)
	at com.carrotsearch.randomizedtesting.rules.SystemPropertiesRestoreRule$1.evaluate(SystemPropertiesRestoreRule.java:57)
	at org.apache.lucene.util.AbstractBeforeAfterRule$1.evaluate(AbstractBeforeAfterRule.java:45)
	at com.carrotsearch.randomizedtesting.rules.StatementAdapter.evaluate(StatementAdapter.java:36)
	at org.apache.lucene.util.TestRuleStoreClassName$1.evaluate(TestRuleStoreClassName.java:41)
	at com.carrotsearch.randomizedtesting.rules.NoShadowingOrOverridesOnMethodsRule$1.evaluate(NoShadowingOrOverridesOnMethodsRule.java:40)
	at com.carrotsearch.randomizedtesting.rules.NoShadowingOrOverridesOnMethodsRule$1.evaluate(NoShadowingOrOverridesOnMethodsRule.java:40)
	at com.carrotsearch.randomizedtesting.rules.StatementAdapter.evaluate(StatementAdapter.java:36)
	at com.carrotsearch.randomizedtesting.rules.StatementAdapter.evaluate(StatementAdapter.java:36)
	at com.carrotsearch.randomizedtesting.rules.StatementAdapter.evaluate(StatementAdapter.java:36)
	at org.apache.lucene.util.TestRuleAssertionsRequired$1.evaluate(TestRuleAssertionsRequired.java:53)
	at org.apache.lucene.util.TestRuleMarkFailure$1.evaluate(TestRuleMarkFailure.java:47)
	at org.apache.lucene.util.TestRuleIgnoreAfterMaxFailures$1.evaluate(TestRuleIgnoreAfterMaxFailures.java:64)
	at org.apache.lucene.util.TestRuleIgnoreTestSuites$1.evaluate(TestRuleIgnoreTestSuites.java:54)
	at com.carrotsearch.randomizedtesting.rules.StatementAdapter.evaluate(StatementAdapter.java:36)
	at com.carrotsearch.randomizedtesting.ThreadLeakControl$StatementRunner.run(ThreadLeakControl.java:367)
	at java.lang.Thread.run(Thread.java:745)
Caused by: org.apache.solr.client.solrj.impl.HttpSolrClient$RemoteSolrException: Error from server at http://127.0.0.1:38730/solr/testschemaapi_shard1_replica1: ERROR: [doc=2] unknown field 'myNewField1'
	at org.apache.solr.client.solrj.impl.HttpSolrClient.executeMethod(HttpSolrClient.java:577)
	at org.apache.solr.client.solrj.impl.HttpSolrClient.request(HttpSolrClient.java:241)
	at org.apache.solr.client.solrj.impl.HttpSolrClient.request(HttpSolrClient.java:230)
	at org.apache.solr.client.solrj.impl.LBHttpSolrClient.doRequest(LBHttpSolrClient.java:372)
	at org.apache.solr.client.solrj.impl.LBHttpSolrClient.request(LBHttpSolrClient.java:325)
	at org.apache.solr.client.solrj.impl.CloudSolrClient$2.call(CloudSolrClient.java:628)
	at org.apache.solr.client.solrj.impl.CloudSolrClient$2.call(CloudSolrClient.java:625)
	at java.util.concurrent.FutureTask.run(FutureTask.java:262)
	at org.apache.solr.common.util.ExecutorUtil$MDCAwareThreadPoolExecutor$1.run(ExecutorUtil.java:231)
	at java.util.concurrent.ThreadPoolExecutor.runWorker(ThreadPoolExecutor.java:1145)
	at java.util.concurrent.ThreadPoolExecutor$Worker.run(ThreadPoolExecutor.java:615)
	... 1 more




Build Log:
[...truncated 11912 lines...]
   [junit4] Suite: org.apache.solr.cloud.DistribDocExpirationUpdateProcessorTest
   [junit4]   2> Creating dataDir: /home/jenkins/workspace/Lucene-Solr-5.5-Linux/solr/build/solr-core/test/J1/temp/solr.cloud.DistribDocExpirationUpdateProcessorTest_C39D88D346280463-001/init-core-data-001
   [junit4]   2> 1360236 INFO  (SUITE-DistribDocExpirationUpdateProcessorTest-seed#[C39D88D346280463]-worker) [    ] o.a.s.SolrTestCaseJ4 Randomized ssl (true) and clientAuth (false)
   [junit4]   2> 1360236 INFO  (SUITE-DistribDocExpirationUpdateProcessorTest-seed#[C39D88D346280463]-worker) [    ] o.a.s.BaseDistributedSearchTestCase Setting hostContext system property: /
   [junit4]   2> 1360238 INFO  (TEST-DistribDocExpirationUpdateProcessorTest.test-seed#[C39D88D346280463]) [    ] o.a.s.c.ZkTestServer STARTING ZK TEST SERVER
   [junit4]   2> 1360238 INFO  (Thread-3707) [    ] o.a.s.c.ZkTestServer client port:0.0.0.0/0.0.0.0:0
   [junit4]   2> 1360238 INFO  (Thread-3707) [    ] o.a.s.c.ZkTestServer Starting server
   [junit4]   2> 1360338 INFO  (TEST-DistribDocExpirationUpdateProcessorTest.test-seed#[C39D88D346280463]) [    ] o.a.s.c.ZkTestServer start zk server on port:46764
   [junit4]   2> 1360339 INFO  (TEST-DistribDocExpirationUpdateProcessorTest.test-seed#[C39D88D346280463]) [    ] o.a.s.c.c.SolrZkClient Using default ZkCredentialsProvider
   [junit4]   2> 1360339 INFO  (TEST-DistribDocExpirationUpdateProcessorTest.test-seed#[C39D88D346280463]) [    ] o.a.s.c.c.ConnectionManager Waiting for client to connect to ZooKeeper
   [junit4]   2> 1360340 INFO  (zkCallback-2141-thread-1) [    ] o.a.s.c.c.ConnectionManager Watcher org.apache.solr.common.cloud.ConnectionManager@6aaf8709 name:ZooKeeperConnection Watcher:127.0.0.1:46764 got event WatchedEvent state:SyncConnected type:None path:null path:null type:None
   [junit4]   2> 1360340 INFO  (TEST-DistribDocExpirationUpdateProcessorTest.test-seed#[C39D88D346280463]) [    ] o.a.s.c.c.ConnectionManager Client is connected to ZooKeeper
   [junit4]   2> 1360340 INFO  (TEST-DistribDocExpirationUpdateProcessorTest.test-seed#[C39D88D346280463]) [    ] o.a.s.c.c.SolrZkClient Using default ZkACLProvider
   [junit4]   2> 1360340 INFO  (TEST-DistribDocExpirationUpdateProcessorTest.test-seed#[C39D88D346280463]) [    ] o.a.s.c.c.SolrZkClient makePath: /solr
   [junit4]   2> 1360342 INFO  (TEST-DistribDocExpirationUpdateProcessorTest.test-seed#[C39D88D346280463]) [    ] o.a.s.c.c.SolrZkClient Using default ZkCredentialsProvider
   [junit4]   2> 1360342 INFO  (TEST-DistribDocExpirationUpdateProcessorTest.test-seed#[C39D88D346280463]) [    ] o.a.s.c.c.ConnectionManager Waiting for client to connect to ZooKeeper
   [junit4]   2> 1360343 INFO  (zkCallback-2142-thread-1) [    ] o.a.s.c.c.ConnectionManager Watcher org.apache.solr.common.cloud.ConnectionManager@76f62088 name:ZooKeeperConnection Watcher:127.0.0.1:46764/solr got event WatchedEvent state:SyncConnected type:None path:null path:null type:None
   [junit4]   2> 1360343 INFO  (TEST-DistribDocExpirationUpdateProcessorTest.test-seed#[C39D88D346280463]) [    ] o.a.s.c.c.ConnectionManager Client is connected to ZooKeeper
   [junit4]   2> 1360343 INFO  (TEST-DistribDocExpirationUpdateProcessorTest.test-seed#[C39D88D346280463]) [    ] o.a.s.c.c.SolrZkClient Using default ZkACLProvider
   [junit4]   2> 1360343 INFO  (TEST-DistribDocExpirationUpdateProcessorTest.test-seed#[C39D88D346280463]) [    ] o.a.s.c.c.SolrZkClient makePath: /collections/collection1
   [junit4]   2> 1360344 INFO  (TEST-DistribDocExpirationUpdateProcessorTest.test-seed#[C39D88D346280463]) [    ] o.a.s.c.c.SolrZkClient makePath: /collections/collection1/shards
   [junit4]   2> 1360344 INFO  (TEST-DistribDocExpirationUpdateProcessorTest.test-seed#[C39D88D346280463]) [    ] o.a.s.c.c.SolrZkClient makePath: /collections/control_collection
   [junit4]   2> 1360344 INFO  (TEST-DistribDocExpirationUpdateProcessorTest.test-seed#[C39D88D346280463]) [    ] o.a.s.c.c.SolrZkClient makePath: /collections/control_collection/shards
   [junit4]   2> 1360345 INFO  (TEST-DistribDocExpirationUpdateProcessorTest.test-seed#[C39D88D346280463]) [    ] o.a.s.c.AbstractZkTestCase put /home/jenkins/workspace/Lucene-Solr-5.5-Linux/solr/core/src/test-files/solr/collection1/conf/solrconfig-doc-expire-update-processor.xml to /configs/conf1/solrconfig.xml
   [junit4]   2> 1360345 INFO  (TEST-DistribDocExpirationUpdateProcessorTest.test-seed#[C39D88D346280463]) [    ] o.a.s.c.c.SolrZkClient makePath: /configs/conf1/solrconfig.xml
   [junit4]   2> 1360346 INFO  (TEST-DistribDocExpirationUpdateProcessorTest.test-seed#[C39D88D346280463]) [    ] o.a.s.c.AbstractZkTestCase put /home/jenkins/workspace/Lucene-Solr-5.5-Linux/solr/core/src/test-files/solr/collection1/conf/schema15.xml to /configs/conf1/schema.xml
   [junit4]   2> 1360346 INFO  (TEST-DistribDocExpirationUpdateProcessorTest.test-seed#[C39D88D346280463]) [    ] o.a.s.c.c.SolrZkClient makePath: /configs/conf1/schema.xml
   [junit4]   2> 1360347 INFO  (TEST-DistribDocExpirationUpdateProcessorTest.test-seed#[C39D88D346280463]) [    ] o.a.s.c.AbstractZkTestCase put /home/jenkins/workspace/Lucene-Solr-5.5-Linux/solr/core/src/test-files/solr/collection1/conf/solrconfig.snippet.randomindexconfig.xml to /configs/conf1/solrconfig.snippet.randomindexconfig.xml
   [junit4]   2> 1360347 INFO  (TEST-DistribDocExpirationUpdateProcessorTest.test-seed#[C39D88D346280463]) [    ] o.a.s.c.c.SolrZkClient makePath: /configs/conf1/solrconfig.snippet.randomindexconfig.xml
   [junit4]   2> 1360347 INFO  (TEST-DistribDocExpirationUpdateProcessorTest.test-seed#[C39D88D346280463]) [    ] o.a.s.c.AbstractZkTestCase put /home/jenkins/workspace/Lucene-Solr-5.5-Linux/solr/core/src/test-files/solr/collection1/conf/stopwords.txt to /configs/conf1/stopwords.txt
   [junit4]   2> 1360347 INFO  (TEST-DistribDocExpirationUpdateProcessorTest.test-seed#[C39D88D346280463]) [    ] o.a.s.c.c.SolrZkClient makePath: /configs/conf1/stopwords.txt
   [junit4]   2> 1360348 INFO  (TEST-DistribDocExpirationUpdateProcessorTest.test-seed#[C39D88D346280463]) [    ] o.a.s.c.AbstractZkTestCase put /home/jenkins/workspace/Lucene-Solr-5.5-Linux/solr/core/src/test-files/solr/collection1/conf/protwords.txt to /configs/conf1/protwords.txt
   [junit4]   2> 1360348 INFO  (TEST-DistribDocExpirationUpdateProcessorTest.test-seed#[C39D88D346280463]) [    ] o.a.s.c.c.SolrZkClient makePath: /configs/conf1/protwords.txt
   [junit4]   2> 1360348 INFO  (TEST-DistribDocExpirationUpdateProcessorTest.test-seed#[C39D88D346280463]) [    ] o.a.s.c.AbstractZkTestCase put /home/jenkins/workspace/Lucene-Solr-5.5-Linux/solr/core/src/test-files/solr/collection1/conf/currency.xml to /configs/conf1/currency.xml
   [junit4]   2> 1360348 INFO  (TEST-DistribDocExpirationUpdateProcessorTest.test-seed#[C39D88D346280463]) [    ] o.a.s.c.c.SolrZkClient makePath: /configs/conf1/currency.xml
   [junit4]   2> 1360349 INFO  (TEST-DistribDocExpirationUpdateProcessorTest.test-seed#[C39D88D346280463]) [    ] o.a.s.c.AbstractZkTestCase put /home/jenkins/workspace/Lucene-Solr-5.5-Linux/solr/core/src/test-files/solr/collection1/conf/enumsConfig.xml to /configs/conf1/enumsConfig.xml
   [junit4]   2> 1360349 INFO  (TEST-DistribDocExpirationUpdateProcessorTest.test-seed#[C39D88D346280463]) [    ] o.a.s.c.c.SolrZkClient makePath: /configs/conf1/enumsConfig.xml
   [junit4]   2> 1360350 INFO  (TEST-DistribDocExpirationUpdateProcessorTest.test-seed#[C39D88D346280463]) [    ] o.a.s.c.AbstractZkTestCase put /home/jenkins/workspace/Lucene-Solr-5.5-Linux/solr/core/src/test-files/solr/collection1/conf/open-exchange-rates.json to /configs/conf1/open-exchange-rates.json
   [junit4]   2> 1360350 INFO  (TEST-DistribDocExpirationUpdateProcessorTest.test-seed#[C39D88D346280463]) [    ] o.a.s.c.c.SolrZkClient makePath: /configs/conf1/open-exchange-rates.json
   [junit4]   2> 1360350 INFO  (TEST-DistribDocExpirationUpdateProcessorTest.test-seed#[C39D88D346280463]) [    ] o.a.s.c.AbstractZkTestCase put /home/jenkins/workspace/Lucene-Solr-5.5-Linux/solr/core/src/test-files/solr/collection1/conf/mapping-ISOLatin1Accent.txt to /configs/conf1/mapping-ISOLatin1Accent.txt
   [junit4]   2> 1360350 INFO  (TEST-DistribDocExpirationUpdateProcessorTest.test-seed#[C39D88D346280463]) [    ] o.a.s.c.c.SolrZkClient makePath: /configs/conf1/mapping-ISOLatin1Accent.txt
   [junit4]   2> 1360351 INFO  (TEST-DistribDocExpirationUpdateProcessorTest.test-seed#[C39D88D346280463]) [    ] o.a.s.c.AbstractZkTestCase put /home/jenkins/workspace/Lucene-Solr-5.5-Linux/solr/core/src/test-files/solr/collection1/conf/old_synonyms.txt to /configs/conf1/old_synonyms.txt
   [junit4]   2> 1360351 INFO  (TEST-DistribDocExpirationUpdateProcessorTest.test-seed#[C39D88D346280463]) [    ] o.a.s.c.c.SolrZkClient makePath: /configs/conf1/old_synonyms.txt
   [junit4]   2> 1360351 INFO  (TEST-DistribDocExpirationUpdateProcessorTest.test-seed#[C39D88D346280463]) [    ] o.a.s.c.AbstractZkTestCase put /home/jenkins/workspace/Lucene-Solr-5.5-Linux/solr/core/src/test-files/solr/collection1/conf/synonyms.txt to /configs/conf1/synonyms.txt
   [junit4]   2> 1360351 INFO  (TEST-DistribDocExpirationUpdateProcessorTest.test-seed#[C39D88D346280463]) [    ] o.a.s.c.c.SolrZkClient makePath: /configs/conf1/synonyms.txt
   [junit4]   2> 1360352 INFO  (TEST-DistribDocExpirationUpdateProcessorTest.test-seed#[C39D88D346280463]) [    ] o.a.s.c.c.SolrZkClient Using default ZkCredentialsProvider
   [junit4]   2> 1360352 INFO  (TEST-DistribDocExpirationUpdateProcessorTest.test-seed#[C39D88D346280463]) [    ] o.a.s.c.c.ConnectionManager Waiting for client to connect to ZooKeeper
   [junit4]   2> 1360353 INFO  (zkCallback-2143-thread-1) [    ] o.a.s.c.c.ConnectionManager Watcher org.apache.solr.common.cloud.ConnectionManager@6125ad61 name:ZooKeeperConnection Watcher:127.0.0.1:46764/solr got event WatchedEvent state:SyncConnected type:None path:null path:null type:None
   [junit4]   2> 1360353 INFO  (TEST-DistribDocExpirationUpdateProcessorTest.test-seed#[C39D88D346280463]) [    ] o.a.s.c.c.ConnectionManager Client is connected to ZooKeeper
   [junit4]   2> 1360353 INFO  (TEST-DistribDocExpirationUpdateProcessorTest.test-seed#[C39D88D346280463]) [    ] o.a.s.c.c.SolrZkClient Using default ZkACLProvider
   [junit4]   2> 1360398 INFO  (TEST-DistribDocExpirationUpdateProcessorTest.test-seed#[C39D88D346280463]) [    ] o.a.s.SolrTestCaseJ4 Writing core.properties file to /home/jenkins/workspace/Lucene-Solr-5.5-Linux/solr/build/solr-core/test/J1/temp/solr.cloud.DistribDocExpirationUpdateProcessorTest_C39D88D346280463-001/control-001/cores/collection1
   [junit4]   2> 1360399 INFO  (TEST-DistribDocExpirationUpdateProcessorTest.test-seed#[C39D88D346280463]) [    ] o.e.j.s.Server jetty-9.2.13.v20150730
   [junit4]   2> 1360400 INFO  (TEST-DistribDocExpirationUpdateProcessorTest.test-seed#[C39D88D346280463]) [    ] o.e.j.s.h.ContextHandler Started o.e.j.s.ServletContextHandler@47862048{/,null,AVAILABLE}
   [junit4]   2> 1360403 INFO  (TEST-DistribDocExpirationUpdateProcessorTest.test-seed#[C39D88D346280463]) [    ] o.e.j.s.ServerConnector Started ServerConnector@499fb3d9{SSL-http/1.1}{127.0.0.1:35028}
   [junit4]   2> 1360403 INFO  (TEST-DistribDocExpirationUpdateProcessorTest.test-seed#[C39D88D346280463]) [    ] o.e.j.s.Server Started @1362068ms
   [junit4]   2> 1360403 INFO  (TEST-DistribDocExpirationUpdateProcessorTest.test-seed#[C39D88D346280463]) [    ] o.a.s.c.s.e.JettySolrRunner Jetty properties: {hostContext=/, solr.data.dir=/home/jenkins/workspace/Lucene-Solr-5.5-Linux/solr/build/solr-core/test/J1/temp/solr.cloud.DistribDocExpirationUpdateProcessorTest_C39D88D346280463-001/tempDir-001/control/data, hostPort=35028, coreRootDirectory=/home/jenkins/workspace/Lucene-Solr-5.5-Linux/solr/build/solr-core/test/J1/../../../../../../../../../home/jenkins/workspace/Lucene-Solr-5.5-Linux/solr/build/solr-core/test/J1/temp/solr.cloud.DistribDocExpirationUpdateProcessorTest_C39D88D346280463-001/control-001/cores}
   [junit4]   2> 1360403 INFO  (TEST-DistribDocExpirationUpdateProcessorTest.test-seed#[C39D88D346280463]) [    ] o.a.s.s.SolrDispatchFilter SolrDispatchFilter.init(): sun.misc.Launcher$AppClassLoader@2792e317
   [junit4]   2> 1360404 INFO  (TEST-DistribDocExpirationUpdateProcessorTest.test-seed#[C39D88D346280463]) [    ] o.a.s.c.SolrResourceLoader new SolrResourceLoader for directory: '/home/jenkins/workspace/Lucene-Solr-5.5-Linux/solr/build/solr-core/test/J1/temp/solr.cloud.DistribDocExpirationUpdateProcessorTest_C39D88D346280463-001/control-001'
   [junit4]   2> 1360404 INFO  (TEST-DistribDocExpirationUpdateProcessorTest.test-seed#[C39D88D346280463]) [    ] o.a.s.c.SolrResourceLoader JNDI not configured for solr (NoInitialContextEx)
   [junit4]   2> 1360404 INFO  (TEST-DistribDocExpirationUpdateProcessorTest.test-seed#[C39D88D346280463]) [    ] o.a.s.c.SolrResourceLoader solr home defaulted to 'solr/' (could not find system property or JNDI)
   [junit4]   2> 1360404 INFO  (TEST-DistribDocExpirationUpdateProcessorTest.test-seed#[C39D88D346280463]) [    ] o.a.s.c.c.SolrZkClient Using default ZkCredentialsProvider
   [junit4]   2> 1360404 INFO  (TEST-DistribDocExpirationUpdateProcessorTest.test-seed#[C39D88D346280463]) [    ] o.a.s.c.c.ConnectionManager Waiting for client to connect to ZooKeeper
   [junit4]   2> 1360405 INFO  (zkCallback-2144-thread-1) [    ] o.a.s.c.c.ConnectionManager Watcher org.apache.solr.common.cloud.ConnectionManager@63ef0369 name:ZooKeeperConnection Watcher:127.0.0.1:46764/solr got event WatchedEvent state:SyncConnected type:None path:null path:null type:None
   [junit4]   2> 1360405 INFO  (TEST-DistribDocExpirationUpdateProcessorTest.test-seed#[C39D88D346280463]) [    ] o.a.s.c.c.ConnectionManager Client is connected to ZooKeeper
   [junit4]   2> 1360405 INFO  (TEST-DistribDocExpirationUpdateProcessorTest.test-seed#[C39D88D346280463]) [    ] o.a.s.c.c.SolrZkClient Using default ZkACLProvider
   [junit4]   2> 1360406 INFO  (TEST-DistribDocExpirationUpdateProcessorTest.test-seed#[C39D88D346280463]) [    ] o.a.s.s.SolrDispatchFilter Loading solr.xml from SolrHome (not found in ZooKeeper)
   [junit4]   2> 1360406 INFO  (TEST-DistribDocExpirationUpdateProcessorTest.test-seed#[C39D88D346280463]) [    ] o.a.s.c.SolrXmlConfig Loading container configuration from /home/jenkins/workspace/Lucene-Solr-5.5-Linux/solr/build/solr-core/test/J1/temp/solr.cloud.DistribDocExpirationUpdateProcessorTest_C39D88D346280463-001/control-001/solr.xml
   [junit4]   2> 1360414 INFO  (TEST-DistribDocExpirationUpdateProcessorTest.test-seed#[C39D88D346280463]) [    ] o.a.s.c.CorePropertiesLocator Config-defined core root directory: /home/jenkins/workspace/Lucene-Solr-5.5-Linux/solr/build/solr-core/test/J1/../../../../../../../../../home/jenkins/workspace/Lucene-Solr-5.5-Linux/solr/build/solr-core/test/J1/temp/solr.cloud.DistribDocExpirationUpdateProcessorTest_C39D88D346280463-001/control-001/cores
   [junit4]   2> 1360414 INFO  (TEST-DistribDocExpirationUpdateProcessorTest.test-seed#[C39D88D346280463]) [    ] o.a.s.c.CoreContainer New CoreContainer 535624261
   [junit4]   2> 1360414 INFO  (TEST-DistribDocExpirationUpdateProcessorTest.test-seed#[C39D88D346280463]) [    ] o.a.s.c.CoreContainer Loading cores into CoreContainer [instanceDir=/home/jenkins/workspace/Lucene-Solr-5.5-Linux/solr/build/solr-core/test/J1/temp/solr.cloud.DistribDocExpirationUpdateProcessorTest_C39D88D346280463-001/control-001]
   [junit4]   2> 1360414 WARN  (TEST-DistribDocExpirationUpdateProcessorTest.test-seed#[C39D88D346280463]) [    ] o.a.s.c.CoreContainer Couldn't add files from /home/jenkins/workspace/Lucene-Solr-5.5-Linux/solr/build/solr-core/test/J1/temp/solr.cloud.DistribDocExpirationUpdateProcessorTest_C39D88D346280463-001/control-001/lib to classpath: /home/jenkins/workspace/Lucene-Solr-5.5-Linux/solr/build/solr-core/test/J1/temp/solr.cloud.DistribDocExpirationUpdateProcessorTest_C39D88D346280463-001/control-001/lib
   [junit4]   2> 1360415 INFO  (TEST-DistribDocExpirationUpdateProcessorTest.test-seed#[C39D88D346280463]) [    ] o.a.s.h.c.HttpShardHandlerFactory created with socketTimeout : 90000,urlScheme : ,connTimeout : 15000,maxConnectionsPerHost : 20,maxConnections : 10000,corePoolSize : 0,maximumPoolSize : 2147483647,maxThreadIdleTime : 5,sizeOfQueue : -1,fairnessPolicy : false,useRetries : false,connectionsEvictorSleepDelay : 5000,maxConnectionIdleTime : 40000,
   [junit4]   2> 1360416 INFO  (TEST-DistribDocExpirationUpdateProcessorTest.test-seed#[C39D88D346280463]) [    ] o.a.s.u.UpdateShardHandler Creating UpdateShardHandler HTTP client with params: socketTimeout=340000&connTimeout=45000&retry=true
   [junit4]   2> 1360417 INFO  (TEST-DistribDocExpirationUpdateProcessorTest.test-seed#[C39D88D346280463]) [    ] o.a.s.l.LogWatcher SLF4J impl is org.slf4j.impl.Log4jLoggerFactory
   [junit4]   2> 1360417 INFO  (TEST-DistribDocExpirationUpdateProcessorTest.test-seed#[C39D88D346280463]) [    ] o.a.s.l.LogWatcher Registering Log Listener [Log4j (org.slf4j.impl.Log4jLoggerFactory)]
   [junit4]   2> 1360417 INFO  (TEST-DistribDocExpirationUpdateProcessorTest.test-seed#[C39D88D346280463]) [    ] o.a.s.c.ZkContainer Zookeeper client=127.0.0.1:46764/solr
   [junit4]   2> 1360417 INFO  (TEST-DistribDocExpirationUpdateProcessorTest.test-seed#[C39D88D346280463]) [    ] o.a.s.c.ZkController zkHost includes chroot
   [junit4]   2> 1360417 INFO  (TEST-DistribDocExpirationUpdateProcessorTest.test-seed#[C39D88D346280463]) [    ] o.a.s.c.c.SolrZkClient Using default ZkCredentialsProvider
   [junit4]   2> 1360417 INFO  (TEST-DistribDocExpirationUpdateProcessorTest.test-seed#[C39D88D346280463]) [    ] o.a.s.c.c.ConnectionManager Waiting for client to connect to ZooKeeper
   [junit4]   2> 1360418 INFO  (zkCallback-2147-thread-1) [    ] o.a.s.c.c.ConnectionManager Watcher org.apache.solr.common.cloud.ConnectionManager@443b2ff3 name:ZooKeeperConnection Watcher:127.0.0.1:46764 got event WatchedEvent state:SyncConnected type:None path:null path:null type:None
   [junit4]   2> 1360418 INFO  (TEST-DistribDocExpirationUpdateProcessorTest.test-seed#[C39D88D346280463]) [    ] o.a.s.c.c.ConnectionManager Client is connected to ZooKeeper
   [junit4]   2> 1360419 INFO  (TEST-DistribDocExpirationUpdateProcessorTest.test-seed#[C39D88D346280463]) [    ] o.a.s.c.c.SolrZkClient Using default ZkACLProvider
   [junit4]   2> 1360419 INFO  (TEST-DistribDocExpirationUpdateProcessorTest.test-seed#[C39D88D346280463]) [n:127.0.0.1:35028_    ] o.a.s.c.ZkController Added new OnReconnect listener org.apache.solr.cloud.ZkController$6@34a635b3
   [junit4]   2> 1360419 INFO  (TEST-DistribDocExpirationUpdateProcessorTest.test-seed#[C39D88D346280463]) [n:127.0.0.1:35028_    ] o.a.s.c.c.ConnectionManager Waiting for client to connect to ZooKeeper
   [junit4]   2> 1360420 INFO  (zkCallback-2148-thread-1-processing-n:127.0.0.1:35028_) [n:127.0.0.1:35028_    ] o.a.s.c.c.ConnectionManager Watcher org.apache.solr.common.cloud.ConnectionManager@6725162b name:ZooKeeperConnection Watcher:127.0.0.1:46764/solr got event WatchedEvent state:SyncConnected type:None path:null path:null type:None
   [junit4]   2> 1360420 INFO  (TEST-DistribDocExpirationUpdateProcessorTest.test-seed#[C39D88D346280463]) [n:127.0.0.1:35028_    ] o.a.s.c.c.ConnectionManager Client is connected to ZooKeeper
   [junit4]   2> 1360421 INFO  (TEST-DistribDocExpirationUpdateProcessorTest.test-seed#[C39D88D346280463]) [n:127.0.0.1:35028_    ] o.a.s.c.c.SolrZkClient makePath: /overseer/queue
   [junit4]   2> 1360422 INFO  (TEST-DistribDocExpirationUpdateProcessorTest.test-seed#[C39D88D346280463]) [n:127.0.0.1:35028_    ] o.a.s.c.c.SolrZkClient makePath: /overseer/collection-queue-work
   [junit4]   2> 1360423 INFO  (TEST-DistribDocExpirationUpdateProcessorTest.test-seed#[C39D88D346280463]) [n:127.0.0.1:35028_    ] o.a.s.c.c.SolrZkClient makePath: /overseer/collection-map-running
   [junit4]   2> 1360423 INFO  (TEST-DistribDocExpirationUpdateProcessorTest.test-seed#[C39D88D346280463]) [n:127.0.0.1:35028_    ] o.a.s.c.c.SolrZkClient makePath: /overseer/collection-map-completed
   [junit4]   2> 1360424 INFO  (TEST-DistribDocExpirationUpdateProcessorTest.test-seed#[C39D88D346280463]) [n:127.0.0.1:35028_    ] o.a.s.c.c.SolrZkClient makePath: /overseer/collection-map-failure
   [junit4]   2> 1360424 INFO  (TEST-DistribDocExpirationUpdateProcessorTest.test-seed#[C39D88D346280463]) [n:127.0.0.1:35028_    ] o.a.s.c.c.SolrZkClient makePath: /live_nodes
   [junit4]   2> 1360425 INFO  (TEST-DistribDocExpirationUpdateProcessorTest.test-seed#[C39D88D346280463]) [n:127.0.0.1:35028_    ] o.a.s.c.c.SolrZkClient makePath: /aliases.json
   [junit4]   2> 1360425 INFO  (TEST-DistribDocExpirationUpdateProcessorTest.test-seed#[C39D88D346280463]) [n:127.0.0.1:35028_    ] o.a.s.c.c.SolrZkClient makePath: /clusterstate.json
   [junit4]   2> 1360425 INFO  (TEST-DistribDocExpirationUpdateProcessorTest.test-seed#[C39D88D346280463]) [n:127.0.0.1:35028_    ] o.a.s.c.c.SolrZkClient makePath: /security.json
   [junit4]   2> 1360426 INFO  (TEST-DistribDocExpirationUpdateProcessorTest.test-seed#[C39D88D346280463]) [n:127.0.0.1:35028_    ] o.a.s.c.ZkController Register node as live in ZooKeeper:/live_nodes/127.0.0.1:35028_
   [junit4]   2> 1360426 INFO  (TEST-DistribDocExpirationUpdateProcessorTest.test-seed#[C39D88D346280463]) [n:127.0.0.1:35028_    ] o.a.s.c.c.SolrZkClient makePath: /live_nodes/127.0.0.1:35028_
   [junit4]   2> 1360426 INFO  (TEST-DistribDocExpirationUpdateProcessorTest.test-seed#[C39D88D346280463]) [n:127.0.0.1:35028_    ] o.a.s.c.c.SolrZkClient makePath: /overseer_elect
   [junit4]   2> 1360427 INFO  (TEST-DistribDocExpirationUpdateProcessorTest.test-seed#[C39D88D346280463]) [n:127.0.0.1:35028_    ] o.a.s.c.c.SolrZkClient makePath: /overseer_elect/election
   [junit4]   2> 1360427 INFO  (TEST-DistribDocExpirationUpdateProcessorTest.test-seed#[C39D88D346280463]) [n:127.0.0.1:35028_    ] o.a.s.c.Overseer Overseer (id=null) closing
   [junit4]   2> 1360427 INFO  (TEST-DistribDocExpirationUpdateProcessorTest.test-seed#[C39D88D346280463]) [n:127.0.0.1:35028_    ] o.a.s.c.LeaderElector Joined leadership election with path: /overseer_elect/election/96514984327643141-127.0.0.1:35028_-n_0000000000
   [junit4]   2> 1360427 INFO  (TEST-DistribDocExpirationUpdateProcessorTest.test-seed#[C39D88D346280463]) [n:127.0.0.1:35028_    ] o.a.s.c.OverseerElectionContext I am going to be the leader 127.0.0.1:35028_
   [junit4]   2> 1360427 INFO  (TEST-DistribDocExpirationUpdateProcessorTest.test-seed#[C39D88D346280463]) [n:127.0.0.1:35028_    ] o.a.s.c.c.SolrZkClient makePath: /overseer_elect/leader
   [junit4]   2> 1360428 INFO  (TEST-DistribDocExpirationUpdateProcessorTest.test-seed#[C39D88D346280463]) [n:127.0.0.1:35028_    ] o.a.s.c.Overseer Overseer (id=96514984327643141-127.0.0.1:35028_-n_0000000000) starting
   [junit4]   2> 1360428 INFO  (TEST-DistribDocExpirationUpdateProcessorTest.test-seed#[C39D88D346280463]) [n:127.0.0.1:35028_    ] o.a.s.c.c.SolrZkClient makePath: /overseer/queue-work
   [junit4]   2> 1360430 INFO  (TEST-DistribDocExpirationUpdateProcessorTest.test-seed#[C39D88D346280463]) [n:127.0.0.1:35028_    ] o.a.s.c.OverseerAutoReplicaFailoverThread Starting OverseerAutoReplicaFailoverThread autoReplicaFailoverWorkLoopDelay=10000 autoReplicaFailoverWaitAfterExpiration=30000 autoReplicaFailoverBadNodeExpiration=60000
   [junit4]   2> 1360430 INFO  (TEST-DistribDocExpirationUpdateProcessorTest.test-seed#[C39D88D346280463]) [n:127.0.0.1:35028_    ] o.a.s.c.c.ZkStateReader Updating cluster state from ZooKeeper... 
   [junit4]   2> 1360430 INFO  (OverseerCollectionConfigSetProcessor-96514984327643141-127.0.0.1:35028_-n_0000000000) [n:127.0.0.1:35028_    ] o.a.s.c.OverseerTaskProcessor Process current queue of overseer operations
   [junit4]   2> 1360430 INFO  (OverseerStateUpdate-96514984327643141-127.0.0.1:35028_-n_0000000000) [n:127.0.0.1:35028_    ] o.a.s.c.Overseer Starting to work on the main queue
   [junit4]   2> 1360443 INFO  (TEST-DistribDocExpirationUpdateProcessorTest.test-seed#[C39D88D346280463]) [n:127.0.0.1:35028_    ] o.a.s.c.CoreContainer Security conf doesn't exist. Skipping setup for authorization module.
   [junit4]   2> 1360443 INFO  (TEST-DistribDocExpirationUpdateProcessorTest.test-seed#[C39D88D346280463]) [n:127.0.0.1:35028_    ] o.a.s.c.CoreContainer No authentication plugin used.
   [junit4]   2> 1360443 INFO  (TEST-DistribDocExpirationUpdateProcessorTest.test-seed#[C39D88D346280463]) [n:127.0.0.1:35028_    ] o.a.s.c.CorePropertiesLocator Looking for core definitions underneath /home/jenkins/workspace/Lucene-Solr-5.5-Linux/solr/build/solr-core/test/J1/../../../../../../../../../home/jenkins/workspace/Lucene-Solr-5.5-Linux/solr/build/solr-core/test/J1/temp/solr.cloud.DistribDocExpirationUpdateProcessorTest_C39D88D346280463-001/control-001/cores
   [junit4]   2> 1360444 INFO  (TEST-DistribDocExpirationUpdateProcessorTest.test-seed#[C39D88D346280463]) [n:127.0.0.1:35028_    ] o.a.s.c.CoreDescriptor Created CoreDescriptor: {collection=control_collection, transient=false, name=collection1, loadOnStartup=true, coreNodeName=, schema=schema.xml, shard=, configSetProperties=configsetprops.json, dataDir=data/, config=solrconfig.xml}
   [junit4]   2> 1360444 INFO  (TEST-DistribDocExpirationUpdateProcessorTest.test-seed#[C39D88D346280463]) [n:127.0.0.1:35028_    ] o.a.s.c.CorePropertiesLocator Found core collection1 in /home/jenkins/workspace/Lucene-Solr-5.5-Linux/solr/build/solr-core/test/J1/../../../../../../../../../home/jenkins/workspace/Lucene-Solr-5.5-Linux/solr/build/solr-core/test/J1/temp/solr.cloud.DistribDocExpirationUpdateProcessorTest_C39D88D346280463-001/control-001/cores/collection1
   [junit4]   2> 1360444 INFO  (TEST-DistribDocExpirationUpdateProcessorTest.test-seed#[C39D88D346280463]) [n:127.0.0.1:35028_    ] o.a.s.c.CorePropertiesLocator Found 1 core definitions
   [junit4]   2> 1360444 INFO  (TEST-DistribDocExpirationUpdateProcessorTest.test-seed#[C39D88D346280463]) [n:127.0.0.1:35028_    ] o.a.s.s.SolrDispatchFilter user.dir=/home/jenkins/workspace/Lucene-Solr-5.5-Linux/solr/build/solr-core/test/J1
   [junit4]   2> 1360444 INFO  (TEST-DistribDocExpirationUpdateProcessorTest.test-seed#[C39D88D346280463]) [n:127.0.0.1:35028_    ] o.a.s.s.SolrDispatchFilter SolrDispatchFilter.init() done
   [junit4]   2> 1360444 INFO  (coreLoadExecutor-5331-thread-1-processing-n:127.0.0.1:35028_) [n:127.0.0.1:35028_ c:control_collection   x:collection1] o.a.s.c.ZkController publishing state=down
   [junit4]   2> 1360444 INFO  (coreLoadExecutor-5331-thread-1-processing-n:127.0.0.1:35028_) [n:127.0.0.1:35028_ c:control_collection   x:collection1] o.a.s.c.ZkController numShards not found on descriptor - reading it from system property
   [junit4]   2> 1360445 INFO  (coreLoadExecutor-5331-thread-1-processing-n:127.0.0.1:35028_) [n:127.0.0.1:35028_ c:control_collection   x:collection1] o.a.s.c.ZkController Collection control_collection not visible yet, but flagging it so a watch is registered when it becomes visible
   [junit4]   2> 1360445 INFO  (coreLoadExecutor-5331-thread-1-processing-n:127.0.0.1:35028_) [n:127.0.0.1:35028_ c:control_collection   x:collection1] o.a.s.c.c.ZkStateReader addZkWatch [control_collection]
   [junit4]   2> 1360446 INFO  (OverseerStateUpdate-96514984327643141-127.0.0.1:35028_-n_0000000000) [n:127.0.0.1:35028_    ] o.a.s.c.Overseer processMessage: queueSize: 1, message = {
   [junit4]   2>   "shard":null,
   [junit4]   2>   "state":"down",
   [junit4]   2>   "collection":"control_collection",
   [junit4]   2>   "base_url":"https://127.0.0.1:35028",
   [junit4]   2>   "node_name":"127.0.0.1:35028_",
   [junit4]   2>   "numShards":"1",
   [junit4]   2>   "operation":"state",
   [junit4]   2>   "roles":null,
   [junit4]   2>   "core":"collection1"} current state version: 0
   [junit4]   2> 1360446 INFO  (coreLoadExecutor-5331-thread-1-processing-n:127.0.0.1:35028_) [n:127.0.0.1:35028_ c:control_collection   x:collection1] o.a.s.c.c.ZkStateReader Deleting data for [control_collection]
   [junit4]   2> 1360446 INFO  (OverseerStateUpdate-96514984327643141-127.0.0.1:35028_-n_0000000000) [n:127.0.0.1:35028_    ] o.a.s.c.o.ReplicaMutator Update state numShards=1 message={
   [junit4]   2>   "shard":null,
   [junit4]   2>   "state":"down",
   [junit4]   2>   "collection":"control_collection",
   [junit4]   2>   "base_url":"https://127.0.0.1:35028",
   [junit4]   2>   "node_name":"127.0.0.1:35028_",
   [junit4]   2>   "numShards":"1",
   [junit4]   2>   "operation":"state",
   [junit4]   2>   "roles":null,
   [junit4]   2>   "core":"collection1"}
   [junit4]   2> 1360446 INFO  (OverseerStateUpdate-96514984327643141-127.0.0.1:35028_-n_0000000000) [n:127.0.0.1:35028_    ] o.a.s.c.o.ClusterStateMutator building a new cName: control_collection
   [junit4]   2> 1360446 INFO  (coreLoadExecutor-5331-thread-1-processing-n:127.0.0.1:35028_) [n:127.0.0.1:35028_ c:control_collection   x:collection1] o.a.s.c.ZkController look for our core node name
   [junit4]   2> 1360446 INFO  (OverseerStateUpdate-96514984327643141-127.0.0.1:35028_-n_0000000000) [n:127.0.0.1:35028_    ] o.a.s.c.o.ReplicaMutator Assigning new node to shard shard=shard1
   [junit4]   2> 1360447 INFO  (zkCallback-2148-thread-1-processing-n:127.0.0.1:35028_) [n:127.0.0.1:35028_    ] o.a.s.c.c.ZkStateReader A cluster state change: [WatchedEvent state:SyncConnected type:NodeDataChanged path:/clusterstate.json], has occurred - updating... (live nodes size: [1])
   [junit4]   2> 1361446 INFO  (coreLoadExecutor-5331-thread-1-processing-n:127.0.0.1:35028_) [n:127.0.0.1:35028_ c:control_collection   x:collection1] o.a.s.c.ZkController waiting to find shard id in clusterstate for collection1
   [junit4]   2> 1361446 INFO  (coreLoadExecutor-5331-thread-1-processing-n:127.0.0.1:35028_) [n:127.0.0.1:35028_ c:control_collection   x:collection1] o.a.s.c.ZkController Check for collection zkNode:control_collection
   [junit4]   2> 1361447 INFO  (coreLoadExecutor-5331-thread-1-processing-n:127.0.0.1:35028_) [n:127.0.0.1:35028_ c:control_collection   x:collection1] o.a.s.c.ZkController Collection zkNode exists
   [junit4]   2> 1361447 INFO  (coreLoadExecutor-5331-thread-1-processing-n:127.0.0.1:35028_) [n:127.0.0.1:35028_ c:control_collection   x:collection1] o.a.s.c.c.ZkStateReader Load collection config from: [/collections/control_collection]
   [junit4]   2> 1361447 INFO  (coreLoadExecutor-5331-thread-1-processing-n:127.0.0.1:35028_) [n:127.0.0.1:35028_ c:control_collection   x:collection1] o.a.s.c.c.ZkStateReader path=[/collections/control_collection] [configName]=[conf1] specified config exists in ZooKeeper
   [junit4]   2> 1361447 INFO  (coreLoadExecutor-5331-thread-1-processing-n:127.0.0.1:35028_) [n:127.0.0.1:35028_ c:control_collection   x:collection1] o.a.s.c.SolrResourceLoader new SolrResourceLoader for directory: '/home/jenkins/workspace/Lucene-Solr-5.5-Linux/solr/build/solr-core/test/J1/temp/solr.cloud.DistribDocExpirationUpdateProcessorTest_C39D88D346280463-001/control-001/cores/collection1'
   [junit4]   2> 1361447 INFO  (coreLoadExecutor-5331-thread-1-processing-n:127.0.0.1:35028_) [n:127.0.0.1:35028_ c:control_collection   x:collection1] o.a.s.c.SolrResourceLoader JNDI not configured for solr (NoInitialContextEx)
   [junit4]   2> 1361447 INFO  (coreLoadExecutor-5331-thread-1-processing-n:127.0.0.1:35028_) [n:127.0.0.1:35028_ c:control_collection   x:collection1] o.a.s.c.SolrResourceLoader solr home defaulted to 'solr/' (could not find system property or JNDI)
   [junit4]   2> 1361448 INFO  (coreLoadExecutor-5331-thread-1-processing-n:127.0.0.1:35028_) [n:127.0.0.1:35028_ c:control_collection   x:collection1] o.a.s.c.Config loaded config solrconfig.xml with version 0 
   [junit4]   2> 1361451 INFO  (coreLoadExecutor-5331-thread-1-processing-n:127.0.0.1:35028_) [n:127.0.0.1:35028_ c:control_collection   x:collection1] o.a.s.c.SolrConfig current version of requestparams : -1
   [junit4]   2> 1361457 WARN  (coreLoadExecutor-5331-thread-1-processing-n:127.0.0.1:35028_) [n:127.0.0.1:35028_ c:control_collection   x:collection1] o.a.s.c.Config Beginning with Solr 5.5, <mergePolicy> is deprecated, use <mergePolicyFactory> instead.
   [junit4]   2> 1361459 INFO  (coreLoadExecutor-5331-thread-1-processing-n:127.0.0.1:35028_) [n:127.0.0.1:35028_ c:control_collection   x:collection1] o.a.s.c.SolrConfig Using Lucene MatchVersion: 5.5.3
   [junit4]   2> 1361472 INFO  (coreLoadExecutor-5331-thread-1-processing-n:127.0.0.1:35028_) [n:127.0.0.1:35028_ c:control_collection   x:collection1] o.a.s.c.SolrConfig Loaded SolrConfig: solrconfig.xml
   [junit4]   2> 1361476 INFO  (coreLoadExecutor-5331-thread-1-processing-n:127.0.0.1:35028_) [n:127.0.0.1:35028_ c:control_collection   x:collection1] o.a.s.s.IndexSchema [collection1] Schema name=test
   [junit4]   2> 1361596 INFO  (coreLoadExecutor-5331-thread-1-processing-n:127.0.0.1:35028_) [n:127.0.0.1:35028_ c:control_collection   x:collection1] o.a.s.s.IndexSchema default search field in schema is text
   [junit4]   2> 1361597 INFO  (coreLoadExecutor-5331-thread-1-processing-n:127.0.0.1:35028_) [n:127.0.0.1:35028_ c:control_collection   x:collection1] o.a.s.s.IndexSchema unique key field: id
   [junit4]   2> 1361598 INFO  (coreLoadExecutor-5331-thread-1-processing-n:127.0.0.1:35028_) [n:127.0.0.1:35028_ c:control_collection   x:collection1] o.a.s.s.FileExchangeRateProvider Reloading exchange rates from file currency.xml
   [junit4]   2> 1361599 INFO  (coreLoadExecutor-5331-thread-1-processing-n:127.0.0.1:35028_) [n:127.0.0.1:35028_ c:control_collection   x:collection1] o.a.s.s.FileExchangeRateProvider Reloading exchange rates from file currency.xml
   [junit4]   2> 1361606 INFO  (coreLoadExecutor-5331-thread-1-processing-n:127.0.0.1:35028_) [n:127.0.0.1:35028_ c:control_collection   x:collection1] o.a.s.c.ConfigSetProperties Did not find ConfigSet properties, assuming default properties: Can't find resource 'configsetprops.json' in classpath or '/configs/conf1', cwd=/home/jenkins/workspace/Lucene-Solr-5.5-Linux/solr/build/solr-core/test/J1
   [junit4]   2> 1361606 INFO  (coreLoadExecutor-5331-thread-1-processing-n:127.0.0.1:35028_) [n:127.0.0.1:35028_ c:control_collection   x:collection1] o.a.s.c.CoreContainer Creating SolrCore 'collection1' using configuration from collection control_collection
   [junit4]   2> 1361606 INFO  (coreLoadExecutor-5331-thread-1-processing-n:127.0.0.1:35028_) [n:127.0.0.1:35028_ c:control_collection s:shard1 r:core_node1 x:collection1] o.a.s.c.SolrCore org.apache.solr.core.MockDirectoryFactory
   [junit4]   2> 1361606 INFO  (coreLoadExecutor-5331-thread-1-processing-n:127.0.0.1:35028_) [n:127.0.0.1:35028_ c:control_collection s:shard1 r:core_node1 x:collection1] o.a.s.c.SolrCore [[collection1] ] Opening new SolrCore at [/home/jenkins/workspace/Lucene-Solr-5.5-Linux/solr/build/solr-core/test/J1/temp/solr.cloud.DistribDocExpirationUpdateProcessorTest_C39D88D346280463-001/control-001/cores/collection1], dataDir=[/home/jenkins/workspace/Lucene-Solr-5.5-Linux/solr/build/solr-core/test/J1/../../../../../../../../../home/jenkins/workspace/Lucene-Solr-5.5-Linux/solr/build/solr-core/test/J1/temp/solr.cloud.DistribDocExpirationUpdateProcessorTest_C39D88D346280463-001/control-001/cores/collection1/data/]
   [junit4]   2> 1361606 INFO  (coreLoadExecutor-5331-thread-1-processing-n:127.0.0.1:35028_) [n:127.0.0.1:35028_ c:control_collection s:shard1 r:core_node1 x:collection1] o.a.s.c.SolrCore JMX monitoring not detected for core: collection1
   [junit4]   2> 1361607 INFO  (coreLoadExecutor-5331-thread-1-processing-n:127.0.0.1:35028_) [n:127.0.0.1:35028_ c:control_collection s:shard1 r:core_node1 x:collection1] o.a.s.c.CachingDirectoryFactory return new directory for /home/jenkins/workspace/Lucene-Solr-5.5-Linux/solr/build/solr-core/test/J1/../../../../../../../../../home/jenkins/workspace/Lucene-Solr-5.5-Linux/solr/build/solr-core/test/J1/temp/solr.cloud.DistribDocExpirationUpdateProcessorTest_C39D88D346280463-001/control-001/cores/collection1/data
   [junit4]   2> 1361607 INFO  (coreLoadExecutor-5331-thread-1-processing-n:127.0.0.1:35028_) [n:127.0.0.1:35028_ c:control_collection s:shard1 r:core_node1 x:collection1] o.a.s.c.SolrCore New index directory detected: old=null new=/home/jenkins/workspace/Lucene-Solr-5.5-Linux/solr/build/solr-core/test/J1/../../../../../../../../../home/jenkins/workspace/Lucene-Solr-5.5-Linux/solr/build/solr-core/test/J1/temp/solr.cloud.DistribDocExpirationUpdateProcessorTest_C39D88D346280463-001/control-001/cores/collection1/data/index/
   [junit4]   2> 1361607 WARN  (coreLoadExecutor-5331-thread-1-processing-n:127.0.0.1:35028_) [n:127.0.0.1:35028_ c:control_collection s:shard1 r:core_node1 x:collection1] o.a.s.c.SolrCore [collection1] Solr index directory '/home/jenkins/workspace/Lucene-Solr-5.5-Linux/solr/build/solr-core/test/J1/../../../../../../../../../home/jenkins/workspace/Lucene-Solr-5.5-Linux/solr/build/solr-core/test/J1/temp/solr.cloud.DistribDocExpirationUpdateProcessorTest_C39D88D346280463-001/control-001/cores/collection1/data/index' doesn't exist. Creating new index...
   [junit4]   2> 1361607 INFO  (coreLoadExecutor-5331-thread-1-processing-n:127.0.0.1:35028_) [n:127.0.0.1:35028_ c:control_collection s:shard1 r:core_node1 x:collection1] o.a.s.c.CachingDirectoryFactory return new directory for /home/jenkins/workspace/Lucene-Solr-5.5-Linux/solr/build/solr-core/test/J1/../../../../../../../../../home/jenkins/workspace/Lucene-Solr-5.5-Linux/solr/build/solr-core/test/J1/temp/solr.cloud.DistribDocExpirationUpdateProcessorTest_C39D88D346280463-001/control-001/cores/collection1/data/index
   [junit4]   2> 1361607 INFO  (coreLoadExecutor-5331-thread-1-processing-n:127.0.0.1:35028_) [n:127.0.0.1:35028_ c:control_collection s:shard1 r:core_node1 x:collection1] o.a.s.u.RandomMergePolicy RandomMergePolicy wrapping class org.apache.lucene.index.TieredMergePolicy: [TieredMergePolicy: maxMergeAtOnce=32, maxMergeAtOnceExplicit=18, maxMergedSegmentMB=98.4462890625, floorSegmentMB=1.1865234375, forceMergeDeletesPctAllowed=14.744074193166789, segmentsPerTier=11.0, maxCFSSegmentSizeMB=8.796093022207999E12, noCFSRatio=0.0
   [junit4]   2> 1361607 INFO  (coreLoadExecutor-5331-thread-1-processing-n:127.0.0.1:35028_) [n:127.0.0.1:35028_ c:control_collection s:shard1 r:core_node1 x:collection1] o.a.s.c.SolrDeletionPolicy SolrDeletionPolicy.onCommit: commits: num=1
   [junit4]   2> 	commit{dir=MockDirectoryWrapper(RAMDirectory@61cf625c lockFactory=org.apache.lucene.store.SingleInstanceLockFactory@7642b82e),segFN=segments_1,generation=1}
   [junit4]   2> 1361607 INFO  (coreLoadExecutor-5331-thread-1-processing-n:127.0.0.1:35028_) [n:127.0.0.1:35028_ c:control_collection s:shard1 r:core_node1 x:collection1] o.a.s.c.SolrDeletionPolicy newest commit generation = 1
   [junit4]   2> 1361608 INFO  (OldIndexDirectoryCleanupThreadForCore-collection1) [n:127.0.0.1:35028_ c:control_collection s:shard1 r:core_node1 x:collection1] o.a.s.c.SolrCore Looking for old index directories to cleanup for core collection1 in /home/jenkins/workspace/Lucene-Solr-5.5-Linux/solr/build/solr-core/test/J1/../../../../../../../../../home/jenkins/workspace/Lucene-Solr-5.5-Linux/solr/build/solr-core/test/J1/temp/solr.cloud.DistribDocExpirationUpdateProcessorTest_C39D88D346280463-001/control-001/cores/collection1/data/
   [junit4]   2> 1361608 WARN  (OldIndexDirectoryCleanupThreadForCore-collection1) [n:127.0.0.1:35028_ c:control_collection s:shard1 r:core_node1 x:collection1] o.a.s.c.DirectoryFactory /home/jenkins/workspace/Lucene-Solr-5.5-Linux/solr/build/solr-core/test/J1/../../../../../../../../../home/jenkins/workspace/Lucene-Solr-5.5-Linux/solr/build/solr-core/test/J1/temp/solr.cloud.DistribDocExpirationUpdateProcessorTest_C39D88D346280463-001/control-001/cores/collection1/data/ does not point to a valid data directory; skipping clean-up of old index directories.
   [junit4]   2> 1361609 INFO  (coreLoadExecutor-5331-thread-1-processing-n:127.0.0.1:35028_) [n:127.0.0.1:35028_ c:control_collection s:shard1 r:core_node1 x:collection1] o.a.s.u.p.UpdateRequestProcessorChain creating updateRequestProcessorChain "convert-ttl-defaults"
   [junit4]   2> 1361609 INFO  (coreLoadExecutor-5331-thread-1-processing-n:127.0.0.1:35028_) [n:127.0.0.1:35028_ c:control_collection s:shard1 r:core_node1 x:collection1] o.a.s.u.p.UpdateRequestProcessorChain creating updateRequestProcessorChain "convert-ttl-field"
   [junit4]   2> 1361610 INFO  (coreLoadExecutor-5331-thread-1-processing-n:127.0.0.1:35028_) [n:127.0.0.1:35028_ c:control_collection s:shard1 r:core_node1 x:collection1] o.a.s.u.p.UpdateRequestProcessorChain creating updateRequestProcessorChain "convert-ttl-param"
   [junit4]   2> 1361610 INFO  (coreLoadExecutor-5331-thread-1-processing-n:127.0.0.1:35028_) [n:127.0.0.1:35028_ c:control_collection s:shard1 r:core_node1 x:collection1] o.a.s.u.p.UpdateRequestProcessorChain creating updateRequestProcessorChain "convert-ttl-field-with-param-default"
   [junit4]   2> 1361610 INFO  (coreLoadExecutor-5331-thread-1-processing-n:127.0.0.1:35028_) [n:127.0.0.1:35028_ c:control_collection s:shard1 r:core_node1 x:collection1] o.a.s.u.p.UpdateRequestProcessorChain creating updateRequestProcessorChain "scheduled-delete" (default)
   [junit4]   2> 1361610 INFO  (coreLoadExecutor-5331-thread-1-processing-n:127.0.0.1:35028_) [n:127.0.0.1:35028_ c:control_collection s:shard1 r:core_node1 x:collection1] o.a.s.u.p.UpdateRequestProcessorChain inserting DistributedUpdateProcessorFactory into updateRequestProcessorChain "scheduled-delete" (default)
   [junit4]   2> 1361611 INFO  (coreLoadExecutor-5331-thread-1-processing-n:127.0.0.1:35028_) [n:127.0.0.1:35028_ c:control_collection s:shard1 r:core_node1 x:collection1] o.a.s.h.l.XMLLoader xsltCacheLifetimeSeconds=60
   [junit4]   2> 1361612 INFO  (coreLoadExecutor-5331-thread-1-processing-n:127.0.0.1:35028_) [n:127.0.0.1:35028_ c:control_collection s:shard1 r:core_node1 x:collection1] o.a.s.h.l.XMLLoader xsltCacheLifetimeSeconds=60
   [junit4]   2> 1361613 INFO  (coreLoadExecutor-5331-thread-1-processing-n:127.0.0.1:35028_) [n:127.0.0.1:35028_ c:control_collection s:shard1 r:core_node1 x:collection1] o.a.s.h.l.XMLLoader xsltCacheLifetimeSeconds=60
   [junit4]   2> 1361613 INFO  (coreLoadExecutor-5331-thread-1-processing-n:127.0.0.1:35028_) [n:127.0.0.1:35028_ c:control_collection s:shard1 r:core_node1 x:collection1] o.a.s.h.l.XMLLoader xsltCacheLifetimeSeconds=60
   [junit4]   2> 1361614 INFO  (coreLoadExecutor-5331-thread-1-processing-n:127.0.0.1:35028_) [n:127.0.0.1:35028_ c:control_collection s:shard1 r:core_node1 x:collection1] o.a.s.c.RequestHandlers Registered paths: /admin/file,/admin/ping,/admin/system,/replication,/update/json/docs,,/admin/logging,/admin/luke,/admin/segments,/schema,/admin/plugins,/admin/mbeans,/update/csv,/config,/get,/select,/admin/properties,/update/json,/update,/admin/threads
   [junit4]   2> 1361615 INFO  (coreLoadExecutor-5331-thread-1-processing-n:127.0.0.1:35028_) [n:127.0.0.1:35028_ c:control_collection s:shard1 r:core_node1 x:collection1] o.a.s.c.SolrCore Using default statsCache cache: org.apache.solr.search.stats.LocalStatsCache
   [junit4]   2> 1361615 INFO  (coreLoadExecutor-5331-thread-1-processing-n:127.0.0.1:35028_) [n:127.0.0.1:35028_ c:control_collection s:shard1 r:core_node1 x:collection1] o.a.s.u.UpdateHandler Using UpdateLog implementation: org.apache.solr.update.UpdateLog
   [junit4]   2> 1361615 INFO  (coreLoadExecutor-5331-thread-1-processing-n:127.0.0.1:35028_) [n:127.0.0.1:35028_ c:control_collection s:shard1 r:core_node1 x:collection1] o.a.s.u.UpdateLog Initializing UpdateLog: dataDir= defaultSyncLevel=FLUSH numRecordsToKeep=100 maxNumLogsToKeep=10 numVersionBuckets=65536
   [junit4]   2> 1361615 INFO  (coreLoadExecutor-5331-thread-1-processing-n:127.0.0.1:35028_) [n:127.0.0.1:35028_ c:control_collection s:shard1 r:core_node1 x:collection1] o.a.s.u.CommitTracker Hard AutoCommit: disabled
   [junit4]   2> 1361615 INFO  (coreLoadExecutor-5331-thread-1-processing-n:127.0.0.1:35028_) [n:127.0.0.1:35028_ c:control_collection s:shard1 r:core_node1 x:collection1] o.a.s.u.CommitTracker Soft AutoCommit: disabled
   [junit4]   2> 1361616 INFO  (coreLoadExecutor-5331-thread-1-processing-n:127.0.0.1:35028_) [n:127.0.0.1:35028_ c:control_collection s:shard1 r:core_node1 x:collection1] o.a.s.u.RandomMergePolicy RandomMergePolicy wrapping class org.apache.lucene.index.LogByteSizeMergePolicy: [LogByteSizeMergePolicy: minMergeSize=1677721, mergeFactor=42, maxMergeSize=2147483648, maxMergeSizeForForcedMerge=9223372036854775807, calibrateSizeByDeletes=false, maxMergeDocs=2147483647, maxCFSSegmentSizeMB=0.8232421875, noCFSRatio=1.0]
   [junit4]   2> 1361616 INFO  (coreLoadExecutor-5331-thread-1-processing-n:127.0.0.1:35028_) [n:127.0.0.1:35028_ c:control_collection s:shard1 r:core_node1 x:collection1] o.a.s.c.SolrDeletionPolicy SolrDeletionPolicy.onInit: commits: num=1
   [junit4]   2> 	commit{dir=MockDirectoryWrapper(RAMDirectory@61cf625c lockFactory=org.apache.lucene.store.SingleInstanceLockFactory@7642b82e),segFN=segments_1,generation=1}
   [junit4]   2> 1361616 INFO  (coreLoadExecutor-5331-thread-1-processing-n:127.0.0.1:35028_) [n:127.0.0.1:35028_ c:control_collection s:shard1 r:core_node1 x:collection1] o.a.s.c.SolrDeletionPolicy newest commit generation = 1
   [junit4]   2> 1361616 INFO  (coreLoadExecutor-5331-thread-1-processing-n:127.0.0.1:35028_) [n:127.0.0.1:35028_ c:control_collection s:shard1 r:core_node1 x:collection1] o.a.s.s.SolrIndexSearcher Opening Searcher@75d52e5e[collection1] main
   [junit4]   2> 1361616 INFO  (coreLoadExecutor-5331-thread-1-processing-n:127.0.0.1:35028_) [n:127.0.0.1:35028_ c:control_collection s:shard1 r:core_node1 x:collection1] o.a.s.c.c.ZkStateReader Load collection config from: [/collections/control_collection]
   [junit4]   2> 1361616 INFO  (coreLoadExecutor-5331-thread-1-processing-n:127.0.0.1:35028_) [n:127.0.0.1:35028_ c:control_collection s:shard1 r:core_node1 x:collection1] o.a.s.c.c.ZkStateReader path=[/collections/control_collection] [configName]=[conf1] specified config exists in ZooKeeper
   [junit4]   2> 1361616 INFO  (coreLoadExecutor-5331-thread-1-processing-n:127.0.0.1:35028_) [n:127.0.0.1:35028_ c:control_collection s:shard1 r:core_node1 x:collection1] o.a.s.r.ManagedResourceStorage Setting up ZooKeeper-based storage for the RestManager with znodeBase: /configs/conf1
   [junit4]   2> 1361616 INFO  (coreLoadExecutor-5331-thread-1-processing-n:127.0.0.1:35028_) [n:127.0.0.1:35028_ c:control_collection s:shard1 r:core_node1 x:collection1] o.a.s.r.ManagedResourceStorage Configured ZooKeeperStorageIO with znodeBase: /configs/conf1
   [junit4]   2> 1361617 INFO  (coreLoadExecutor-5331-thread-1-processing-n:127.0.0.1:35028_) [n:127.0.0.1:35028_ c:control_collection s:shard1 r:core_node1 x:collection1] o.a.s.r.RestManager Initializing RestManager with initArgs: {}
   [junit4]   2> 1361617 INFO  (coreLoadExecutor-5331-thread-1-processing-n:127.0.0.1:35028_) [n:127.0.0.1:35028_ c:control_collection s:shard1 r:core_node1 x:collection1] o.a.s.r.ManagedResourceStorage Reading _rest_managed.json using ZooKeeperStorageIO:path=/configs/conf1
   [junit4]   2> 1361617 INFO  (coreLoadExecutor-5331-thread-1-processing-n:127.0.0.1:35028_) [n:127.0.0.1:35028_ c:control_collection s:shard1 r:core_node1 x:collection1] o.a.s.r.ManagedResourceStorage No data found for znode /configs/conf1/_rest_managed.json
   [junit4]   2> 1361617 INFO  (coreLoadExecutor-5331-thread-1-processing-n:127.0.0.1:35028_) [n:127.0.0.1:35028_ c:control_collection s:shard1 r:core_node1 x:collection1] o.a.s.r.ManagedResourceStorage Loaded null at path _rest_managed.json using ZooKeeperStorageIO:path=/configs/conf1
   [junit4]   2> 1361617 INFO  (coreLoadExecutor-5331-thread-1-processing-n:127.0.0.1:35028_) [n:127.0.0.1:35028_ c:control_collection s:shard1 r:core_node1 x:collection1] o.a.s.r.RestManager Initializing 0 registered ManagedResources
   [junit4]   2> 1361617 INFO  (coreLoadExecutor-5331-thread-1-processing-n:127.0.0.1:35028_) [n:127.0.0.1:35028_ c:control_collection s:shard1 r:core_node1 x:collection1] o.a.s.h.ReplicationHandler Commits will be reserved for  10000
   [junit4]   2> 1361617 INFO  (searcherExecutor-5332-thread-1-processing-s:shard1 r:core_node1 c:control_collection n:127.0.0.1:35028_ x:collection1) [n:127.0.0.1:35028_ c:control_collection s:shard1 r:core_node1 x:collection1] o.a.s.c.SolrCore [collection1] Registered new searcher Searcher@75d52e5e[collection1] main{ExitableDirectoryReader(UninvertingDirectoryReader())}
   [junit4]   2> 1361617 INFO  (coreLoadExecutor-5331-thread-1-processing-n:127.0.0.1:35028_) [n:127.0.0.1:35028_ c:control_collection s:shard1 r:core_node1 x:collection1] o.a.s.u.UpdateLog Looking up max value of version field to seed version buckets
   [junit4]   2> 1361617 INFO  (coreLoadExecutor-5331-thread-1-processing-n:127.0.0.1:35028_) [n:127.0.0.1:35028_ c:control_collection s:shard1 r:core_node1 x:collection1] o.a.s.u.VersionInfo Refreshing highest value of _version_ for 65536 version buckets from index
   [junit4]   2> 1361617 INFO  (coreLoadExecutor-5331-thread-1-processing-n:127.0.0.1:35028_) [n:127.0.0.1:35028_ c:control_collection s:shard1 r:core_node1 x:collection1] o.a.s.u.VersionInfo No terms found for _version_, cannot seed version bucket highest value from index
   [junit4]   2> 1361617 INFO  (coreLoadExecutor-5331-thread-1-processing-n:127.0.0.1:35028_) [n:127.0.0.1:35028_ c:control_collection s:shard1 r:core_node1 x:collection1] o.a.s.u.UpdateLog Could not find max version in index or recent updates, using new clock 1544239750687227904
   [junit4]   2> 1361619 INFO  (coreLoadExecutor-5331-thread-1-processing-n:127.0.0.1:35028_) [n:127.0.0.1:35028_ c:control_collection s:shard1 r:core_node1 x:collection1] o.a.s.u.UpdateLog Took 1.0ms to seed version buckets with highest version 1544239750687227904
   [junit4]   2> 1361619 INFO  (coreLoadExecutor-5331-thread-1-processing-n:127.0.0.1:35028_) [n:127.0.0.1:35028_ c:control_collection s:shard1 r:core_node1 x:collection1] o.a.s.c.ZkController watch zkdir /configs/conf1
   [junit4]   2> 1361619 INFO  (coreLoadExecutor-5331-thread-1-processing-n:127.0.0.1:35028_) [n:127.0.0.1:35028_ c:control_collection s:shard1 r:core_node1 x:collection1] o.a.s.c.CoreContainer registering core: collection1
   [junit4]   2> 1361619 INFO  (coreZkRegister-5325-thread-1-processing-s:shard1 r:core_node1 c:control_collection n:127.0.0.1:35028_ x:collection1) [n:127.0.0.1:35028_ c:control_collection s:shard1 r:core_node1 x:collection1] o.a.s.c.ZkController Register replica - core:collection1 address:https://127.0.0.1:35028 collection:control_collection shard:shard1
   [junit4]   2> 1361620 INFO  (coreZkRegister-5325-thread-1-processing-s:shard1 r:core_node1 c:control_collection n:127.0.0.1:35028_ x:collection1) [n:127.0.0.1:35028_ c:control_collection s:shard1 r:core_node1 x:collection1] o.a.s.c.c.SolrZkClient makePath: /collections/control_collection/leader_elect/shard1/election
   [junit4]   2> 1361621 INFO  (coreZkRegister-5325-thread-1-processing-s:shard1 r:core_node1 c:control_collection n:127.0.0.1:35028_ x:collection1) [n:127.0.0.1:35028_ c:control_collection s:shard1 r:core_node1 x:collection1] o.a.s.c.LeaderElector Joined leadership election with path: /collections/control_collection/leader_elect/shard1/election/96514984327643141-core_node1-n_0000000000
   [junit4]   2> 1361621 INFO  (coreZkRegister-5325-thread-1-processing-s:shard1 r:core_node1 c:control_collection n:127.0.0.1:35028_ x:collection1) [n:127.0.0.1:35028_ c:control_collection s:shard1 r:core_node1 x:collection1] o.a.s.c.ShardLeaderElectionContext Running the leader process for shard=shard1 and weAreReplacement=false and leaderVoteWait=10000
   [junit4]   2> 1361622 INFO  (coreZkRegister-5325-thread-1-processing-s:shard1 r:core_node1 c:control_collection n:127.0.0.1:35028_ x:collection1) [n:127.0.0.1:35028_ c:control_collection s:shard1 r:core_node1 x:collection1] o.a.s.c.ShardLeaderElectionContext Enough replicas found to continue.
   [junit4]   2> 1361622 INFO  (coreZkRegister-5325-thread-1-processing-s:shard1 r:core_node1 c:control_collection n:127.0.0.1:35028_ x:collection1) [n:127.0.0.1:35028_ c:control_collection s:shard1 r:core_node1 x:collection1] o.a.s.c.ShardLeaderElectionContext I may be the new leader - try and sync
   [junit4]   2> 1361622 INFO  (OverseerStateUpdate-96514984327643141-127.0.0.1:35028_-n_0000000000) [n:127.0.0.1:35028_    ] o.a.s.c.Overseer processMessage: queueSize: 1, message = {
   [junit4]   2>   "operation":"leader",
   [junit4]   2>   "shard":"shard1",
   [junit4]   2>   "collection":"control_collection"} current state version: 1
   [junit4]   2> 1361622 INFO  (coreZkRegister-5325-thread-1-processing-s:shard1 r:core_node1 c:control_collection n:127.0.0.1:35028_ x:collection1) [n:127.0.0.1:35028_ c:control_collection s:shard1 r:core_node1 x:collection1] o.a.s.c.SyncStrategy Sync replicas to https://127.0.0.1:35028/collection1/
   [junit4]   2> 1361622 INFO  (coreZkRegister-5325-thread-1-processing-s:shard1 r:core_node1 c:control_collection n:127.0.0.1:35028_ x:collection1) [n:127.0.0.1:35028_ c:control_collection s:shard1 r:core_node1 x:collection1] o.a.s.c.SyncStrategy Sync Success - now sync replicas to me
   [junit4]   2> 1361622 INFO  (coreZkRegister-5325-thread-1-processing-s:shard1 r:core_node1 c:control_collection n:127.0.0.1:35028_ x:collection1) [n:127.0.0.1:35028_ c:control_collection s:shard1 r:core_node1 x:collection1] o.a.s.c.SyncStrategy https://127.0.0.1:35028/collection1/ has no replicas
   [junit4]   2> 1361623 INFO  (coreZkRegister-5325-thread-1-processing-s:shard1 r:core_node1 c:control_collection n:127.0.0.1:35028_ x:collection1) [n:127.0.0.1:35028_ c:control_collection s:shard1 r:core_node1 x:collection1] o.a.s.c.c.SolrZkClient makePath: /collections/control_collection/leaders/shard1
   [junit4]   2> 1361623 INFO  (coreZkRegister-5325-thread-1-processing-s:shard1 r:core_node1 c:control_collection n:127.0.0.1:35028_ x:collection1) [n:127.0.0.1:35028_ c:control_collection s:shard1 r:core_node1 x:collection1] o.a.s.c.ShardLeaderElectionContextBase Creating leader registration node /collections/control_collection/leaders/shard1/leader after winning as /collections/control_collection/leader_elect/shard1/election/96514984327643141-core_node1-n_0000000000
   [junit4]   2> 1361624 INFO  (coreZkRegister-5325-thread-1-processing-s:shard1 r:core_node1 c:control_collection n:127.0.0.1:35028_ x:collection1) [n:127.0.0.1:35028_ c:control_collection s:shard1 r:core_node1 x:collection1] o.a.s.c.ShardLeaderElectionContext I am the new leader: https://127.0.0.1:35028/collection1/ shard1
   [junit4]   2> 1361624 INFO  (OverseerStateUpdate-96514984327643141-127.0.0.1:35028_-n_0000000000) [n:127.0.0.1:35028_    ] o.a.s.c.Overseer processMessage: queueSize: 1, message = {
   [junit4]   2>   "operation":"leader",
   [junit4]   2>   "shard":"shard1",
   [junit4]   2>   "collection":"control_collection",
   [junit4]   2>   "base_url":"https://127.0.0.1:35028",
   [junit4]   2>   "core":"collection1",
   [junit4]   2>   "state":"active"} current state version: 1
   [junit4]   2> 1361726 INFO  (zkCallback-2148-thread-1-processing-n:127.0.0.1:35028_) [n:127.0.0.1:35028_    ] o.a.s.c.c.ZkStateReader A cluster state change: [WatchedEvent state:SyncConnected type:NodeDataChanged path:/clusterstate.json], has occurred - updating... (live nodes size: [1])
   [junit4]   2> 1361775 INFO  (coreZkRegister-5325-thread-1-processing-s:shard1 r:core_node1 c:control_collection n:127.0.0.1:35028_ x:collection1) [n:127.0.0.1:35028_ c:control_collection s:shard1 r:core_node1 x:collection1] o.a.s.c.ZkController We are https://127.0.0.1:35028/collection1/ and leader is https://127.0.0.1:35028/collection1/
   [junit4]   2> 1361775 INFO  (coreZkRegister-5325-thread-1-processing-s:shard1 r:core_node1 c:control_collection n:127.0.0.1:35028_ x:collection1) [n:127.0.0.1:35028_ c:control_collection s:shard1 r:core_node1 x:collection1] o.a.s.c.ZkController No LogReplay needed for core=collection1 baseURL=https://127.0.0.1:35028
   [junit4]   2> 1361775 INFO  (coreZkRegister-5325-thread-1-processing-s:shard1 r:core_node1 c:control_collection n:127.0.0.1:35028_ x:collection1) [n:127.0.0.1:35028_ c:control_collection s:shard1 r:core_node1 x:collection1] o.a.s.c.ZkController I am the leader, no recovery necessary
   [junit4]   2> 1361775 INFO  (coreZkRegister-5325-thread-1-processing-s:shard1 r:core_node1 c:control_collection n:127.0.0.1:35028_ x:collection1) [n:127.0.0.1:35028_ c:control_collection s:shard1 r:core_node1 x:collection1] o.a.s.c.ZkController publishing state=active
   [junit4]   2> 1361775 INFO  (coreZkRegister-5325-thread-1-processing-s:shard1 r:core_node1 c:control_collection n:127.0.0.1:35028_ x:collection1) [n:127.0.0.1:35028_ c:control_collection s:shard1 r:core_node1 x:collection1] o.a.s.c.ZkController numShards not found on descriptor - reading it from system property
   [junit4]   2> 1361776 INFO  (OverseerStateUpdate-96514984327643141-127.0.0.1:35028_-n_0000000000) [n:127.0.0.1:35028_    ] o.a.s.c.Overseer processMessage: queueSize: 1, message = {
   [junit4]   2>   "core_node_name":"core_node1",
   [junit4]   2>   "shard":"shard1",
   [junit4]   2>   "state":"active",
   [junit4]   2>   "collection":"control_collection",
   [junit4]   2>   "base_url":"https://127.0.0.1:35028",
   [junit4]   2>   "node_name":"127.0.0.1:35028_",
   [junit4]   2>   "numShards":"1",
   [junit4]   2>   "operation":"state",
   [junit4]   2>   "roles":null,
   [junit4]   2>   "core":"collection1"} current state version: 2
   [junit4]   2> 1361776 INFO  (OverseerStateUpdate-96514984327643141-127.0.0.1:35028_-n_0000000000) [n:127.0.0.1:35028_    ] o.a.s.c.o.ReplicaMutator Update state numShards=1 message={
   [junit4]   2>   "core_node_name":"core_node1",
   [junit4]   2>   "shard":"shard1",
   [junit4]   2>   "state":"active",
   [junit4]   2>   "collection":"control_collection",
   [junit4]   2>   "base_url":"https://127.0.0.1:35028",
   [junit4]   2>   "node_name":"127.0.0.1:35028_",
   [junit4]   2>   "numShards":"1",
   [junit4]   2>   "operation":"state",
   [junit4]   2>   "roles":null,
   [junit4]   2>   "core":"collection1"}
   [junit4]   2> 1361877 INFO  (zkCallback-2148-thread-1-processing-n:127.0.0.1:35028_) [n:127.0.0.1:35028_    ] o.a.s.c.c.ZkStateReader A cluster state change: [WatchedEvent state:SyncConnected type:NodeDataChanged path:/clusterstate.json], has occurred - updating... (live nodes size: [1])
   [junit4]   2> 1361947 INFO  (TEST-DistribDocExpirationUpdateProcessorTest.test-seed#[C39D88D346280463]) [    ] o.a.s.c.c.SolrZkClient Using default ZkCredentialsProvider
   [junit4]   2> 1361948 INFO  (TEST-DistribDocExpirationUpdateProcessorTest.test-seed#[C39D88D346280463]) [    ] o.a.s.c.c.ConnectionManager Waiting for client to connect to ZooKeeper
   [junit4]   2> 1361948 INFO  (zkCallback-2150-thread-1) [    ] o.a.s.c.c.ConnectionManager Watcher org.apache.solr.common.cloud.ConnectionManager@4f5a854d name:ZooKeeperConnection Watcher:127.0.0.1:46764/solr got event WatchedEvent state:SyncConnected type:None path:null path:null type:None
   [junit4]   2> 1361948 INFO  (TEST-DistribDocExpirationUpdateProcessorTest.test-seed#[C39D88D346280463]) [    ] o.a.s.c.c.ConnectionManager Client is connected to ZooKeeper
   [junit4]   2> 1361949 INFO  (TEST-DistribDocExpirationUpdateProcessorTest.test-seed#[C39D88D346280463]) [    ] o.a.s.c.c.SolrZkClient Using default ZkACLProvider
   [junit4]   2> 1361949 INFO  (TEST-DistribDocExpirationUpdateProcessorTest.test-seed#[C39D88D346280463]) [    ] o.a.s.c.c.ZkStateReader Updating cluster state from ZooKeeper... 
   [junit4]   2> 1361949 INFO  (TEST-DistribDocExpirationUpdateProcessorTest.test-seed#[C39D88D346280463]) [    ] o.a.s.c.ChaosMonkey monkey: init - expire sessions:false cause connection loss:false
   [junit4]   2> 1361949 INFO  (TEST-DistribDocExpirationUpdateProcessorTest.test-seed#[C39D88D346280463]) [    ] o.a.s.c.AbstractFullDistribZkTestBase Creating collection1 with stateFormat=2
   [junit4]   2> 1361950 INFO  (TEST-DistribDocExpirationUpdateProcessorTest.test-seed#[C39D88D346280463]) [    ] o.a.s.c.c.SolrZkClient Using default ZkCredentialsProvider
   [junit4]   2> 1361950 INFO  (TEST-DistribDocExpirationUpdateProcessorTest.test-seed#[C39D88D346280463]) [    ] o.a.s.c.c.ConnectionManager Waiting for client to connect to ZooKeeper
   [junit4]   2> 1361951 INFO  (zkCallback-2151-thread-1) [    ] o.a.s.c.c.ConnectionManager Watcher org.apache.solr.common.cloud.ConnectionManager@5cda32e6 name:ZooKeeperConnection Watcher:127.0.0.1:46764/solr got event WatchedEvent state:SyncConnected type:None path:null path:null type:None
   [junit4]   2> 1361951 INFO  (TEST-DistribDocExpirationUpdateProcessorTest.test-seed#[C39D88D346280463]) [    ] o.a.s.c.c.ConnectionManager Client is connected to ZooKeeper
   [junit4]   2> 1361951 INFO  (TEST-DistribDocExpirationUpdateProcessorTest.test-seed#[C39D88D346280463]) [    ] o.a.s.c.c.SolrZkClient Using default ZkACLProvider
   [junit4]   2> 1361952 INFO  (OverseerStateUpdate-96514984327643141-127.0.0.1:35028_-n_0000000000) [n:127.0.0.1:35028_    ] o.a.s.c.Overseer processMessage: queueSize: 1, message = {
   [junit4]   2>   "operation":"create",
   [junit4]   2>   "name":"collection1",
   [junit4]   2>   "numShards":"2",
   [junit4]   2>   "stateFormat":"2"} current state version: 3
   [junit4]   2> 1361952 INFO  (OverseerStateUpdate-96514984327643141-127.0.0.1:35028_-n_0000000000) [n:127.0.0.1:35028_    ] o.a.s.c.o.ClusterStateMutator building a new cName: collection1
   [junit4]   2> 1362006 INFO  (TEST-DistribDocExpirationUpdateProcessorTest.test-seed#[C39D88D346280463]) [    ] o.a.s.SolrTestCaseJ4 Writing core.properties file to /home/jenkins/workspace/Lucene-Solr-5.5-Linux/solr/build/solr-core/test/J1/temp/solr.cloud.DistribDocExpirationUpdateProcessorTest_C39D88D346280463-001/shard-1-001/cores/collection1
   [junit4]   2> 1362007 INFO  (TEST-DistribDocExpirationUpdateProcessorTest.test-seed#[C39D88D346280463]) [    ] o.a.s.c.AbstractFullDistribZkTestBase create jetty 1 in directory /home/jenkins/workspace/Lucene-Solr-5.5-Linux/solr/build/solr-core/test/J1/temp/solr.cloud.DistribDocExpirationUpdateProcessorTest_C39D88D346280463-001/shard-1-001
   [junit4]   2> 1362007 INFO  (TEST-DistribDocExpirationUpdateProcessorTest.test-seed#[C39D88D346280463]) [    ] o.e.j.s.Server jetty-9.2.13.v20150730
   [junit4]   2> 1362008 INFO  (TEST-DistribDocExpirationUpdateProcessorTest.test-seed#[C39D88D346280463]) [    ] o.e.j.s.h.ContextHandler Started o.e.j.s.ServletContextHandler@3ec9e2e3{/,null,AVAILABLE}
   [junit4]   2> 1362011 INFO  (TEST-DistribDocExpirationUpdateProcessorTest.test-seed#[C39D88D346280463]) [    ] o.e.j.s.ServerConnector Started ServerConnector@3b7a5880{SSL-http/1.1}{127.0.0.1:42692}
   [junit4]   2> 1362011 INFO  (TEST-DistribDocExpirationUpdateProcessorTest.test-seed#[C39D88D346280463]) [    ] o.e.j.s.Server Started @1363676ms
   [junit4]   2> 1362011 INFO  (TEST-DistribDocExpirationUpdateProcessorTest.test-seed#[C39D88D346280463]) [    ] o.a.s.c.s.e.JettySolrRunner Jetty properties: {hostPort=42692, coreRootDirectory=/home/jenkins/workspace/Lucene-Solr-5.5-Linux/solr/build/solr-core/test/J1/../../../../../../../../../home/jenkins/workspace/Lucene-Solr-5.5-Linux/solr/build/solr-core/test/J1/temp/solr.cloud.DistribDocExpirationUpdateProcessorTest_C39D88D346280463-001/shard-1-001/cores, solrconfig=solrconfig.xml, hostContext=/, solr.data.dir=/home/jenkins/workspace/Lucene-Solr-5.5-Linux/solr/build/solr-core/test/J1/temp/solr.cloud.DistribDocExpirationUpdateProcessorTest_C39D88D346280463-001/tempDir-001/jetty1}
   [junit4]   2> 1362011 INFO  (TEST-DistribDocExpirationUpdateProcessorTest.test-seed#[C39D88D346280463]) [    ] o.a.s.s.SolrDispatchFilter SolrDispatchFilter.init(): sun.misc.Launcher$AppClassLoader@2792e317
   [junit4]   2> 1362011 INFO  (TEST-DistribDocExpirationUpdateProcessorTest.test-seed#[C39D88D346280463]) [    ] o.a.s.c.SolrResourceLoader new SolrResourceLoader for directory: '/home/jenkins/workspace/Lucene-Solr-5.5-Linux/solr/build/solr-core/test/J1/temp/solr.cloud.DistribDocExpirationUpdateProcessorTest_C39D88D346280463-001/shard-1-001'
   [junit4]   2> 1362011 INFO  (TEST-DistribDocExpirationUpdateProcessorTest.test-seed#[C39D88D346280463]) [    ] o.a.s.c.SolrResourceLoader JNDI not configured for solr (NoInitialContextEx)
   [junit4]   2> 1362011 INFO  (TEST-DistribDocExpirationUpdateProcessorTest.test-seed#[C39D88D346280463]) [    ] o.a.s.c.SolrResourceLoader solr home defaulted to 'solr/' (could not find system property or JNDI)
   [junit4]   2> 1362011 INFO  (TEST-DistribDocExpirationUpdateProcessorTest.test-seed#[C39D88D346280463]) [    ] o.a.s.c.c.SolrZkClient Using default ZkCredentialsProvider
   [junit4]   2> 1362012 INFO  (TEST-DistribDocExpirationUpdateProcessorTest.test-seed#[C39D88D346280463]) [    ] o.a.s.c.c.ConnectionManager Waiting for client to connect to ZooKeeper
   [junit4]   2> 1362012 INFO  (zkCallback-2152-thread-1) [    ] o.a.s.c.c.ConnectionManager Watcher org.apache.solr.common.cloud.ConnectionManager@3c6092b name:ZooKeeperConnection Watcher:127.0.0.1:46764/solr got event WatchedEvent state:SyncConnected type:None path:null path:null type:None
   [junit4]   2> 1362013 INFO  (TEST-DistribDocExpirationUpdateProcessorTest.test-seed#[C39D88D346280463]) [    ] o.a.s.c.c.ConnectionManager Client is connected to ZooKeeper
   [junit4]   2> 1362013 INFO  (TEST-DistribDocExpirationUpdateProcessorTest.test-seed#[C39D88D346280463]) [    ] o.a.s.c.c.SolrZkClient Using default ZkACLProvider
   [junit4]   2> 1362013 INFO  (TEST-DistribDocExpirationUpdateProcessorTest.test-seed#[C39D88D346280463]) [    ] o.a.s.s.SolrDispatchFilter Loading solr.xml from SolrHome (not found in ZooKeeper)
   [junit4]   2> 1362013 INFO  (TEST-DistribDocExpirationUpdateProcessorTest.test-seed#[C39D88D346280463]) [    ] o.a.s.c.SolrXmlConfig Loading container configuration from /home/jenkins/workspace/Lucene-Solr-5.5-Linux/solr/build/solr-core/test/J1/temp/solr.cloud.DistribDocExpirationUpdateProcessorTest_C39D88D346280463-001/shard-1-001/solr.xml
   [junit4]   2> 1362021 INFO  (TEST-DistribDocExpirationUpdateProcessorTest.test-seed#[C39D88D346280463]) [    ] o.a.s.c.CorePropertiesLocator Config-defined core root directory: /home/jenkins/workspace/Lucene-Solr-5.5-Linux/solr/build/solr-core/test/J1/../../../../../../../../../home/jenkins/workspace/Lucene-Solr-5.5-Linux/solr/build/solr-core/test/J1/temp/solr.cloud.DistribDocExpirationUpdateProcessorTest_C39D88D346280463-001/shard-1-001/cores
   [junit4]   2> 1362022 INFO  (TEST-DistribDocExpirationUpdateProcessorTest.test-seed#[C39D88D346280463]) [    ] o.a.s.c.CoreContainer New CoreContainer 867231137
   [junit4]   2> 1362022 INFO  (TEST-DistribDocExpirationUpdateProcessorTest.test-seed#[C39D88D346280463]) [    ] o.a.s.c.CoreContainer Loading cores into CoreContainer [instanceDir=/home/jenkins/workspace/Lucene-Solr-5.5-Linux/solr/build/solr-core/test/J1/temp/solr.cloud.DistribDocExpirationUpdateProcessorTest_C39D88D346280463-001/shard-1-001]
   [junit4]   2> 1362022 WARN  (TEST-DistribDocExpirationUpdateProcessorTest.test-seed#[C39D88D346280463]) [    ] o.a.s.c.CoreContainer Couldn't add files from /home/jenkins/workspace/Lucene-Solr-5.5-Linux/solr/build/solr-core/test/J1/temp/solr.cloud.DistribDocExpirationUpdateProcessorTest_C39D88D346280463-001/shard-1-001/lib to classpath: /home/jenkins/workspace/Lucene-Solr-5.5-Linux/solr/build/solr-core/test/J1/temp/solr.cloud.DistribDocExpirationUpdateProcessorTest_C39D88D346280463-001/shard-1-001/lib
   [junit4]   2> 1362022 INFO  (TEST-DistribDocExpirationUpdateProcessorTest.test-seed#[C39D88D346280463]) [    ] o.a.s.h.c.HttpShardHandlerFactory created with socketTimeout : 90000,urlScheme : ,connTimeout : 15000,maxConnectionsPerHost : 20,maxConnections : 10000,corePoolSize : 0,maximumPoolSize : 2147483647,maxThreadIdleTime : 5,sizeOfQueue : -1,fairnessPolicy : false,useRetries : false,connectionsEvictorSleepDelay : 5000,maxConnectionIdleTime : 40000,
   [junit4]   2> 1362023 INFO  (TEST-DistribDocExpirationUpdateProcessorTest.test-seed#[C39D88D346280463]) [    ] o.a.s.u.UpdateShardHandler Creating UpdateShardHandler HTTP client with params: socketTimeout=340000&connTimeout=45000&retry=true
   [junit4]   2> 1362024 INFO  (TEST-DistribDocExpirationUpdateProcessorTest.test-seed#[C39D88D346280463]) [    ] o.a.s.l.LogWatcher SLF4J impl is org.slf4j.impl.Log4jLoggerFactory
   [junit4]   2> 1362024 INFO  (TEST-DistribDocExpirationUpdateProcessorTest.test-seed#[C39D88D346280463]) [    ] o.a.s.l.LogWatcher Registering Log Listener [Log4j (org.slf4j.impl.Log4jLoggerFactory)]
   [junit4]   2> 1362024 INFO  (TEST-DistribDocExpirationUpdateProcessorTest.test-seed#[C39D88D346280463]) [    ] o.a.s.c.ZkContainer Zookeeper client=127.0.0.1:46764/solr
   [junit4]   2> 1362024 INFO  (TEST-DistribDocExpirationUpdateProcessorTest.test-seed#[C39D88D346280463]) [    ] o.a.s.c.ZkController zkHost includes chroot
   [junit4]   2> 1362024 INFO  (TEST-DistribDocExpirationUpdateProcessorTest.test-seed#[C39D88D346280463]) [    ] o.a.s.c.c.SolrZkClient Using default ZkCredentialsProvider
   [junit4]   2> 1362025 INFO  (TEST-DistribDocExpirationUpdateProcessorTest.test-seed#[C39D88D346280463]) [    ] o.a.s.c.c.ConnectionManager Waiting for client to connect to ZooKeeper
   [junit4]   2> 1362026 INFO  (zkCallback-2155-thread-1) [    ] o.a.s.c.c.ConnectionManager Watcher org.apache.solr.common.cloud.ConnectionManager@19b948c9 name:ZooKeeperConnection Watcher:127.0.0.1:46764 got event WatchedEvent state:SyncConnected type:None path:null path:null type:None
   [junit4]   2> 1362026 INFO  (TEST-DistribDocExpirationUpdateProcessorTest.test-seed#[C39D88D346280463]) [    ] o.a.s.c.c.ConnectionManager Client is connected to ZooKeeper
   [junit4]   2> 1362026 INFO  (TEST-DistribDocExpirationUpdateProcessorTest.test-seed#[C39D88D346280463]) [    ] o.a.s.c.c.SolrZkClient Using default ZkACLProvider
   [junit4]   2> 1362026 INFO  (TEST-DistribDocExpirationUpdateProcessorTest.test-seed#[C39D88D346280463]) [n:127.0.0.1:42692_    ] o.a.s.c.ZkController Added new OnReconnect listener org.apache.solr.cloud.ZkController$6@46149e9a
   [junit4]   2> 1362027 INFO  (TEST-DistribDocExpirationUpdateProcessorTest.test-seed#[C39D88D346280463]) [n:127.0.0.1:42692_    ] o.a.s.c.c.ConnectionManager Waiting for client to connect to ZooKeeper
   [junit4]   2> 1362028 INFO  (zkCallback-2156-thread-1-processing-n:127.0.0.1:42692_) [n:127.0.0.1:42692_    ] o.a.s.c.c.ConnectionManager Watcher org.apache.solr.common.cloud.ConnectionManager@1085df3e name:ZooKeeperConnection Watcher:127.0.0.1:46764/solr got event WatchedEvent state:SyncConnected type:None path:null path:null type:None
   [junit4]   2> 1362028 INFO  (TEST-DistribDocExpirationUpdateProcessorTest.test-seed#[C39D88D346280463]) [n:127.0.0.1:42692_    ] o.a.s.c.c.ConnectionManager Client is connected to ZooKeeper
   [junit4]   2> 1362030 INFO  (TEST-DistribDocExpirationUpdateProcessorTest.test-seed#[C39D88D346280463]) [n:127.0.0.1:42692_    ] o.a.s.c.c.ZkStateReader Updating cluster state from ZooKeeper... 
   [junit4]   2> 1362053 INFO  (OverseerStateUpdate-96514984327643141-127.0.0.1:35028_-n_0000000000) [n:127.0.0.1:35028_    ] o.a.s.c.o.ZkStateWriter going to create_collection /collections/collection1/state.json
   [junit4]   2> 1363032 INFO  (TEST-DistribDocExpirationUpdateProcessorTest.test-seed#[C39D88D346280463]) [n:127.0.0.1:42692_    ] o.a.s.c.ZkController Register node as live in ZooKeeper:/live_nodes/127.0.0.1:42692_
   [junit4]   2> 1363033 INFO  (TEST-DistribDocExpirationUpdateProcessorTest.test-seed#[C39D88D346280463]) [n:127.0.0.1:42692_    ] o.a.s.c.c.SolrZkClient makePath: /live_nodes/127.0.0.1:42692_
   [junit4]   2> 1363033 INFO  (zkCallback-2156-thread-1-processing-n:127.0.0.1:42692_) [n:127.0.0.1:42692_    ] o.a.s.c.c.ZkStateReader A live node change: [WatchedEvent state:SyncConnected type:NodeChildrenChanged path:/live_nodes], has occurred - updating... (live nodes size: [1])
   [junit4]   2> 1363033 INFO  (zkCallback-2150-thread-1) [    ] o.a.s.c.c.ZkStateReader A live node change: [WatchedEvent state:SyncConnected type:NodeChildrenChanged path:/live_nodes], has occurred - updating... (live nodes size: [1])
   [junit4]   2> 1363033 INFO  (zkCallback-2148-thread-1-processing-n:127.0.0.1:35028_) [n:127.0.0.1:35028_    ] o.a.s.c.c.ZkStateReader A live node change: [WatchedEvent state:SyncConnected type:NodeChildrenChanged path:/live_nodes], has occurred - updating... (live nodes size: [1])
   [junit4]   2> 1363034 INFO  (TEST-DistribDocExpirationUpdateProcessorTest.test-seed#[C39D88D346280463]) [n:127.0.0.1:42692_    ] o.a.s.c.Overseer Overseer (id=null) closing
   [junit4]   2> 1363035 INFO  (TEST-DistribDocExpirationUpdateProcessorTest.test-seed#[C39D88D346280463]) [n:127.0.0.1:42692_    ] o.a.s.c.LeaderElector Joined leadership election with path: /overseer_elect/election/96514984327643146-127.0.0.1:42692_-n_0000000001
   [junit4]   2> 1363035 INFO  (TEST-DistribDocExpirationUpdateProcessorTest.test-seed#[C39D88D346280463]) [n:127.0.0.1:42692_    ] o.a.s.c.LeaderElector Watching path /overseer_elect/election/96514984327643141-127.0.0.1:35028_-n_0000000000 to know if I could be the leader
   [junit4]   2> 1363050 INFO  (TEST-DistribDocExpirationUpdateProcessorTest.test-seed#[C39D88D346280463]) [n:127.0.0.1:42692_    ] o.a.s.c.CoreContainer Security conf doesn't exist. Skipping setup for authorization module.
   [junit4]   2> 1363050 INFO  (TEST-DistribDocExpirationUpdateProcessorTest.test-seed#[C39D88D346280463]) [n:127.0.0.1:42692_    ] o.a.s.c.CoreContainer No authentication plugin used.
   [junit4]   2> 1363050 INFO  (TEST-DistribDocExpirationUpdateProcessorTest.test-seed#[C39D88D346280463]) [n:127.0.0.1:42692_    ] o.a.s.c.CorePropertiesLocator Looking for core definitions underneath /home/jenkins/workspace/Lucene-Solr-5.5-Linux/solr/build/solr-core/test/J1/../../../../../../../../../home/jenkins/workspace/Lucene-Solr-5.5-Linux/solr/build/solr-core/test/J1/temp/solr.cloud.DistribDocExpirationUpdateProcessorTest_C39D88D346280463-001/shard-1-001/cores
   [junit4]   2> 1363051 INFO  (TEST-DistribDocExpirationUpdateProcessorTest.test-seed#[C39D88D346280463]) [n:127.0.0.1:42692_    ] o.a.s.c.CoreDescriptor Created CoreDescriptor: {loadOnStartup=true, collection=collection1, dataDir=data/, shard=, schema=schema.xml, coreNodeName=, configSetProperties=configsetprops.json, transient=false, name=collection1, config=solrconfig.xml}
   [junit4]   2> 1363051 INFO  (TEST-DistribDocExpirationUpdateProcessorTest.test-seed#[C39D88D346280463]) [n:127.0.0.1:42692_    ] o.a.s.c.CorePropertiesLocator Found core collection1 in /home/jenkins/workspace/Lucene-Solr-5.5-Linux/solr/build/solr-core/test/J1/../../../../../../../../../home/jenkins/workspace/Lucene-Solr-5.5-Linux/solr/build/solr-core/test/J1/temp/solr.cloud.DistribDocExpirationUpdateProcessorTest_C39D88D346280463-001/shard-1-001/cores/collection1
   [junit4]   2> 1363051 INFO  (TEST-DistribDocExpirationUpdateProcessorTest.test-seed#[C39D88D346280463]) [n:127.0.0.1:42692_    ] o.a.s.c.CorePropertiesLocator Found 1 core definitions
   [junit4]   2> 1363052 INFO  (TEST-DistribDocExpirationUpdateProcessorTest.test-seed#[C39D88D346280463]) [n:127.0.0.1:42692_    ] o.a.s.s.SolrDispatchFilter user.dir=/home/jenkins/workspace/Lucene-Solr-5.5-Linux/solr/build/solr-core/test/J1
   [junit4]   2> 1363052 INFO  (TEST-DistribDocExpirationUpdateProcessorTest.test-seed#[C39D88D346280463]) [n:127.0.0.1:42692_    ] o.a.s.s.SolrDispatchFilter SolrDispatchFilter.init() done
   [junit4]   2> 1363052 INFO  (coreLoadExecutor-5343-thread-1-processing-n:127.0.0.1:42692_) [n:127.0.0.1:42692_ c:collection1   x:collection1] o.a.s.c.ZkController publishing state=down
   [junit4]   2> 1363052 INFO  (coreLoadExecutor-5343-thread-1-processing-n:127.0.0.1:42692_) [n:127.0.0.1:42692_ c:collection1   x:collection1] o.a.s.c.ZkController numShards not found on descriptor - reading it from system property
   [junit4]   2> 1363052 INFO  (coreLoadExecutor-5343-thread-1-processing-n:127.0.0.1:42692_) [n:127.0.0.1:42692_ c:collection1   x:collection1] o.a.s.c.ZkController Registering watch for collection collection1
   [junit4]   2> 1363052 INFO  (coreLoadExecutor-5343-thread-1-processing-n:127.0.0.1:42692_) [n:127.0.0.1:42692_ c:collection1   x:collection1] o.a.s.c.c.ZkStateReader addZkWatch [collection1]
   [junit4]   2> 1363053 INFO  (OverseerStateUpdate-96514984327643141-127.0.0.1:35028_-n_0000000000) [n:127.0.0.1:35028_    ] o.a.s.c.Overseer processMessage: queueSize: 1, message = {
   [junit4]   2>   "shard":null,
   [junit4]   2>   "state":"down",
   [junit4]   2>   "collection":"collection1",
   [junit4]   2>   "base_url":"https://127.0.0.1:42692",
   [junit4]   2>   "node_name":"127.0.0.1:42692_",
   [junit4]   2>   "numShards":"2",
   [junit4]   2>   "operation":"state",
   [junit4]   2>   "roles":null,
   [junit4]   2>   "core":"collection1"} current state version: 3
   [junit4]   2> 1363053 INFO  (coreLoadExecutor-5343-thread-1-processing-n:127.0.0.1:42692_) [n:127.0.0.1:42692_ c:collection1   x:collection1] o.a.s.c.c.ZkStateReader Add data for [collection1] ver [0]
   [junit4]   2> 1363053 INFO  (coreLoadExecutor-5343-thread-1-processing-n:127.0.0.1:42692_) [n:127.0.0.1:42692_ c:collection1   x:collection1] o.a.s.c.ZkController look for our core node name
   [junit4]   2> 1363053 INFO  (OverseerStateUpdate-96514984327643141-127.0.0.1:35028_-n_0000000000) [n:127.0.0.1:35028_    ] o.a.s.c.o.ReplicaMutator Update state numShards=2 message={
   [junit4]   2>   "shard":null,
   [junit4]   2>   "state":"down",
   [junit4]   2>   "collection":"collection1",
   [junit4]   2>   "base_url":"https://127.0.0.1:42692",
   [junit4]   2>   "node_name":"127.0.0.1:42692_",
   [junit4]   2>   "numShards":"2",
   [junit4]   2>   "operation":"state",
   [junit4]   2>   "roles":null,
   [junit4]   2>   "core":"collection1"}
   [junit4]   2> 1363053 INFO  (OverseerStateUpdate-96514984327643141-127.0.0.1:35028_-n_0000000000) [n:127.0.0.1:35028_    ] o.a.s.c.o.ReplicaMutator Collection already exists with numShards=2
   [junit4]   2> 1363053 INFO  (OverseerStateUpdate-96514984327643141-127.0.0.1:35028_-n_0000000000) [n:127.0.0.1:35028_    ] o.a.s.c.o.ReplicaMutator Assigning new node to shard shard=shard2
   [junit4]   2> 1363154 INFO  (OverseerStateUpdate-96514984327643141-127.0.0.1:35028_-n_0000000000) [n:127.0.0.1:35028_    ] o.a.s.c.o.ZkStateWriter going to update_collection /collections/collection1/state.json version: 0
   [junit4]   2> 1363154 INF

[...truncated too long message...]

: Error attempting to access /configs/conf1/managed-schema
   [junit4]   2> 	at org.apache.solr.schema.ManagedIndexSchemaFactory.create(ManagedIndexSchemaFactory.java:143)
   [junit4]   2> 	at org.apache.solr.schema.ManagedIndexSchemaFactory.create(ManagedIndexSchemaFactory.java:47)
   [junit4]   2> 	at org.apache.solr.schema.IndexSchemaFactory.buildIndexSchema(IndexSchemaFactory.java:70)
   [junit4]   2> 	at org.apache.solr.core.ConfigSetService.createIndexSchema(ConfigSetService.java:108)
   [junit4]   2> 	at org.apache.solr.core.ConfigSetService.getConfig(ConfigSetService.java:79)
   [junit4]   2> 	... 3 more
   [junit4]   2> Caused by: org.apache.zookeeper.KeeperException$SessionExpiredException: KeeperErrorCode = Session expired for /configs/conf1/managed-schema
   [junit4]   2> 	at org.apache.zookeeper.KeeperException.create(KeeperException.java:127)
   [junit4]   2> 	at org.apache.zookeeper.KeeperException.create(KeeperException.java:51)
   [junit4]   2> 	at org.apache.zookeeper.ZooKeeper.getData(ZooKeeper.java:1155)
   [junit4]   2> 	at org.apache.solr.common.cloud.SolrZkClient$7.execute(SolrZkClient.java:345)
   [junit4]   2> 	at org.apache.solr.common.cloud.SolrZkClient$7.execute(SolrZkClient.java:342)
   [junit4]   2> 	at org.apache.solr.common.cloud.ZkCmdExecutor.retryOperation(ZkCmdExecutor.java:60)
   [junit4]   2> 	at org.apache.solr.common.cloud.SolrZkClient.getData(SolrZkClient.java:342)
   [junit4]   2> 	at org.apache.solr.schema.ManagedIndexSchemaFactory.create(ManagedIndexSchemaFactory.java:128)
   [junit4]   2> 	... 7 more
   [junit4]   2> 2032248 INFO  (Thread-4849) [    ] o.a.s.c.ZkTestServer connecting to 127.0.0.1:38621 38621
   [junit4]   2> 2032249 WARN  (Thread-4849) [    ] o.a.s.c.ZkTestServer Watch limit violations: 
   [junit4]   2> Maximum concurrent create/delete watches above limit:
   [junit4]   2> 
   [junit4]   2> 	6	/solr/configs/conf1
   [junit4]   2> 	6	/solr/configs/conf1/managed-schema
   [junit4]   2> 	3	/solr/aliases.json
   [junit4]   2> 	2	/solr/security.json
   [junit4]   2> 
   [junit4]   2> Maximum concurrent data watches above limit:
   [junit4]   2> 
   [junit4]   2> 	3	/solr/clusterstate.json
   [junit4]   2> 	2	/solr/collections/testschemaapi/state.json
   [junit4]   2> 
   [junit4]   2> Maximum concurrent children watches above limit:
   [junit4]   2> 
   [junit4]   2> 	9	/solr/overseer/queue
   [junit4]   2> 	9	/solr/overseer/collection-queue-work
   [junit4]   2> 	3	/solr/live_nodes
   [junit4]   2> 	3	/solr/collections
   [junit4]   2> 	3	/solr/overseer/queue-work
   [junit4]   2> 
   [junit4]   2> 2032249 INFO  (TEST-TestManagedSchemaAPI.test-seed#[C39D88D346280463]) [    ] o.a.s.SolrTestCaseJ4 ###Ending test
   [junit4]   2> NOTE: reproduce with: ant test  -Dtestcase=TestManagedSchemaAPI -Dtests.method=test -Dtests.seed=C39D88D346280463 -Dtests.multiplier=3 -Dtests.slow=true -Dtests.locale=fi -Dtests.timezone=Australia/Melbourne -Dtests.asserts=true -Dtests.file.encoding=ISO-8859-1
   [junit4] ERROR   11.8s J0 | TestManagedSchemaAPI.test <<<
   [junit4]    > Throwable #1: org.apache.solr.client.solrj.impl.CloudSolrClient$RouteException: Error from server at http://127.0.0.1:38730/solr/testschemaapi_shard1_replica1: ERROR: [doc=2] unknown field 'myNewField1'
   [junit4]    > 	at __randomizedtesting.SeedInfo.seed([C39D88D346280463:4BC9B709E8D4699B]:0)
   [junit4]    > 	at org.apache.solr.client.solrj.impl.CloudSolrClient.directUpdate(CloudSolrClient.java:653)
   [junit4]    > 	at org.apache.solr.client.solrj.impl.CloudSolrClient.sendRequest(CloudSolrClient.java:1002)
   [junit4]    > 	at org.apache.solr.client.solrj.impl.CloudSolrClient.requestWithRetryOnStaleState(CloudSolrClient.java:891)
   [junit4]    > 	at org.apache.solr.client.solrj.impl.CloudSolrClient.request(CloudSolrClient.java:827)
   [junit4]    > 	at org.apache.solr.schema.TestManagedSchemaAPI.testAddFieldAndDocument(TestManagedSchemaAPI.java:101)
   [junit4]    > 	at org.apache.solr.schema.TestManagedSchemaAPI.test(TestManagedSchemaAPI.java:69)
   [junit4]    > 	at java.lang.Thread.run(Thread.java:745)
   [junit4]    > Caused by: org.apache.solr.client.solrj.impl.HttpSolrClient$RemoteSolrException: Error from server at http://127.0.0.1:38730/solr/testschemaapi_shard1_replica1: ERROR: [doc=2] unknown field 'myNewField1'
   [junit4]    > 	at org.apache.solr.client.solrj.impl.HttpSolrClient.executeMethod(HttpSolrClient.java:577)
   [junit4]    > 	at org.apache.solr.client.solrj.impl.HttpSolrClient.request(HttpSolrClient.java:241)
   [junit4]    > 	at org.apache.solr.client.solrj.impl.HttpSolrClient.request(HttpSolrClient.java:230)
   [junit4]    > 	at org.apache.solr.client.solrj.impl.LBHttpSolrClient.doRequest(LBHttpSolrClient.java:372)
   [junit4]    > 	at org.apache.solr.client.solrj.impl.LBHttpSolrClient.request(LBHttpSolrClient.java:325)
   [junit4]    > 	at org.apache.solr.client.solrj.impl.CloudSolrClient$2.call(CloudSolrClient.java:628)
   [junit4]    > 	at org.apache.solr.client.solrj.impl.CloudSolrClient$2.call(CloudSolrClient.java:625)
   [junit4]    > 	at java.util.concurrent.FutureTask.run(FutureTask.java:262)
   [junit4]    > 	at org.apache.solr.common.util.ExecutorUtil$MDCAwareThreadPoolExecutor$1.run(ExecutorUtil.java:231)
   [junit4]    > 	at java.util.concurrent.ThreadPoolExecutor.runWorker(ThreadPoolExecutor.java:1145)
   [junit4]    > 	at java.util.concurrent.ThreadPoolExecutor$Worker.run(ThreadPoolExecutor.java:615)
   [junit4]    > 	... 1 more
   [junit4]   2> 2032253 INFO  (SUITE-TestManagedSchemaAPI-seed#[C39D88D346280463]-worker) [    ] o.a.s.SolrTestCaseJ4 ###deleteCore
   [junit4]   2> NOTE: leaving temporary files on disk at: /home/jenkins/workspace/Lucene-Solr-5.5-Linux/solr/build/solr-core/test/J0/temp/solr.schema.TestManagedSchemaAPI_C39D88D346280463-001
   [junit4]   2> Sep 01, 2016 4:00:59 AM com.carrotsearch.randomizedtesting.ThreadLeakControl checkThreadLeaks
   [junit4]   2> WARNING: Will linger awaiting termination of 4 leaked thread(s).
   [junit4]   2> NOTE: test params are: codec=CheapBastard, sim=DefaultSimilarity, locale=fi, timezone=Australia/Melbourne
   [junit4]   2> NOTE: Linux 4.4.0-31-generic amd64/Oracle Corporation 1.7.0_80 (64-bit)/cpus=12,threads=1,free=189719192,total=518979584
   [junit4]   2> NOTE: All tests run in this JVM: [TestFastOutputStream, ParsingFieldUpdateProcessorsTest, DistributedSpellCheckComponentTest, TestFoldingMultitermQuery, BigEndianAscendingWordDeserializerTest, TestRebalanceLeaders, JsonLoaderTest, TestRealTimeGet, SolrCoreTest, AnalyticsMergeStrategyTest, PolyFieldTest, TestConfigSetsAPI, CurrencyFieldOpenExchangeTest, IndexSchemaTest, TestDFISimilarityFactory, CollectionsAPISolrJTest, HLLUtilTest, QueryEqualityTest, TestHighFrequencyDictionaryFactory, SystemInfoHandlerTest, IndexSchemaRuntimeFieldTest, DistributedVersionInfoTest, TestComponentsName, TestXmlQParser, TestPKIAuthenticationPlugin, TestRTGBase, ChangedSchemaMergeTest, BlockJoinFacetDistribTest, TestStressLucene, TestValueSourceCache, HdfsChaosMonkeySafeLeaderTest, RulesTest, TestManagedResourceStorage, BufferStoreTest, TestDocSet, TestRecoveryHdfs, TestSolr4Spatial, ActionThrottleTest, RestartWhileUpdatingTest, CloneFieldUpdateProcessorFactoryTest, TestOmitPositions, TestMergePolicyConfig, SolrRequestParserTest, TestFieldResource, MergeStrategyTest, DisMaxRequestHandlerTest, TestBlendedInfixSuggestions, TestIBSimilarityFactory, AddBlockUpdateTest, TestAtomicUpdateErrorCases, SaslZkACLProviderTest, TestSolrQueryResponse, PrimUtilsTest, TestJoin, BasicAuthIntegrationTest, ResourceLoaderTest, TestConfig, TestDocBasedVersionConstraints, DefaultValueUpdateProcessorTest, ReturnFieldsTest, PeerSyncTest, ZkStateReaderTest, DeleteShardTest, TestSimpleQParserPlugin, JSONWriterTest, TestReplicationHandlerBackup, TestExactSharedStatsCache, TestPseudoReturnFields, TestImplicitCoreProperties, TestSchemaManager, TestRTimerTree, TestManagedStopFilterFactory, TestFunctionQuery, TestSolrConfigHandler, PathHierarchyTokenizerFactoryTest, TestPivotHelperCode, AnalysisAfterCoreReloadTest, DistributedQueryElevationComponentTest, URLClassifyProcessorTest, TestAddFieldRealTimeGet, CloudMLTQParserTest, StandardRequestHandlerTest, TestRangeQuery, HdfsSyncSliceTest, TestPhraseSuggestions, TestCollationFieldDocValues, TestBinaryField, TestRequestStatusCollectionAPI, SOLR749Test, ResponseHeaderTest, MigrateRouteKeyTest, DocumentAnalysisRequestHandlerTest, BasicDistributedZkTest, ChaosMonkeySafeLeaderTest, SyncSliceTest, OverseerTest, LeaderElectionIntegrationTest, ClusterStateUpdateTest, LeaderElectionTest, TestDistributedSearch, RequestHandlersTest, FieldAnalysisRequestHandlerTest, FastVectorHighlighterTest, SolrPluginUtilsTest, TestCSVResponseWriter, UniqFieldsUpdateProcessorFactoryTest, PingRequestHandlerTest, ScriptEngineTest, DateMathParserTest, PreAnalyzedFieldTest, DateFieldTest, ClusterStateTest, TestLRUCache, TestDocumentBuilder, FileUtilsTest, DistributedMLTComponentTest, SolrTestCaseJ4Test, TestCrossCoreJoin, ConnectionReuseTest, AsyncCallRequestStatusResponseTest, CleanupOldIndexTest, CollectionStateFormat2Test, ConcurrentDeleteAndCreateCollectionTest, ConnectionManagerTest, CreateCollectionCleanupTest, DeleteStatusTest, DistributedQueueTest, ForceLeaderTest, RemoteQueryErrorTest, SSLMigrationTest, ShardSplitTest, HdfsBasicDistributedZk2Test, HdfsBasicDistributedZkTest, HdfsNNFailoverTest, HdfsRecoverLeaseTest, HdfsThreadLeakTest, HdfsUnloadDistributedZkTest, HdfsWriteToMultipleCollectionsTest, StressHdfsTest, ZkStateWriterTest, CoreSorterTest, DirectoryFactoryTest, QueryResultKeyTest, TestConfigOverlay, TestConfigSetProperties, TestConfigSets, TestDynamicLoading, DistributedFacetPivotLongTailTest, DistributedFacetPivotSmallTest, FacetPivotSmallTest, SpatialHeatmapFacetsTest, TestDistributedStatsComponentCardinality, TestManagedSchema, TestManagedSchemaAPI]
   [junit4] Completed [536/575 (2!)] on J0 in 12.10s, 1 test, 1 error <<< FAILURES!

[...truncated 56786 lines...]


Mime
View raw message