lucene-dev mailing list archives

Site index · List index
Message view « Date » · « Thread »
Top « Date » · « Thread »
From Policeman Jenkins Server <jenk...@thetaphi.de>
Subject [JENKINS-EA] Lucene-Solr-6.x-Linux (64bit/jdk-9-ea+134) - Build # 1699 - Still Unstable!
Date Sat, 10 Sep 2016 21:08:10 GMT
Build: http://jenkins.thetaphi.de/job/Lucene-Solr-6.x-Linux/1699/
Java: 64bit/jdk-9-ea+134 -XX:-UseCompressedOops -XX:+UseSerialGC

1 tests failed.
FAILED:  org.apache.solr.security.BasicAuthIntegrationTest.testBasicAuth

Error Message:
IOException occured when talking to server at: https://127.0.0.1:37368/solr

Stack Trace:
org.apache.solr.client.solrj.SolrServerException: IOException occured when talking to server at: https://127.0.0.1:37368/solr
	at __randomizedtesting.SeedInfo.seed([5369EC070DA230CE:EF079A15A9F1B3B4]:0)
	at org.apache.solr.client.solrj.impl.HttpSolrClient.executeMethod(HttpSolrClient.java:606)
	at org.apache.solr.client.solrj.impl.HttpSolrClient.request(HttpSolrClient.java:261)
	at org.apache.solr.client.solrj.impl.HttpSolrClient.request(HttpSolrClient.java:250)
	at org.apache.solr.client.solrj.SolrClient.request(SolrClient.java:1219)
	at org.apache.solr.security.BasicAuthIntegrationTest.testBasicAuth(BasicAuthIntegrationTest.java:158)
	at jdk.internal.reflect.NativeMethodAccessorImpl.invoke0(java.base@9-ea/Native Method)
	at jdk.internal.reflect.NativeMethodAccessorImpl.invoke(java.base@9-ea/NativeMethodAccessorImpl.java:62)
	at jdk.internal.reflect.DelegatingMethodAccessorImpl.invoke(java.base@9-ea/DelegatingMethodAccessorImpl.java:43)
	at java.lang.reflect.Method.invoke(java.base@9-ea/Method.java:535)
	at com.carrotsearch.randomizedtesting.RandomizedRunner.invoke(RandomizedRunner.java:1764)
	at com.carrotsearch.randomizedtesting.RandomizedRunner$8.evaluate(RandomizedRunner.java:871)
	at com.carrotsearch.randomizedtesting.RandomizedRunner$9.evaluate(RandomizedRunner.java:907)
	at com.carrotsearch.randomizedtesting.RandomizedRunner$10.evaluate(RandomizedRunner.java:921)
	at com.carrotsearch.randomizedtesting.rules.SystemPropertiesRestoreRule$1.evaluate(SystemPropertiesRestoreRule.java:57)
	at org.apache.lucene.util.TestRuleSetupTeardownChained$1.evaluate(TestRuleSetupTeardownChained.java:49)
	at org.apache.lucene.util.AbstractBeforeAfterRule$1.evaluate(AbstractBeforeAfterRule.java:45)
	at org.apache.lucene.util.TestRuleThreadAndTestName$1.evaluate(TestRuleThreadAndTestName.java:48)
	at org.apache.lucene.util.TestRuleIgnoreAfterMaxFailures$1.evaluate(TestRuleIgnoreAfterMaxFailures.java:64)
	at org.apache.lucene.util.TestRuleMarkFailure$1.evaluate(TestRuleMarkFailure.java:47)
	at com.carrotsearch.randomizedtesting.rules.StatementAdapter.evaluate(StatementAdapter.java:36)
	at com.carrotsearch.randomizedtesting.ThreadLeakControl$StatementRunner.run(ThreadLeakControl.java:367)
	at com.carrotsearch.randomizedtesting.ThreadLeakControl.forkTimeoutingTask(ThreadLeakControl.java:809)
	at com.carrotsearch.randomizedtesting.ThreadLeakControl$3.evaluate(ThreadLeakControl.java:460)
	at com.carrotsearch.randomizedtesting.RandomizedRunner.runSingleTest(RandomizedRunner.java:880)
	at com.carrotsearch.randomizedtesting.RandomizedRunner$5.evaluate(RandomizedRunner.java:781)
	at com.carrotsearch.randomizedtesting.RandomizedRunner$6.evaluate(RandomizedRunner.java:816)
	at com.carrotsearch.randomizedtesting.RandomizedRunner$7.evaluate(RandomizedRunner.java:827)
	at com.carrotsearch.randomizedtesting.rules.StatementAdapter.evaluate(StatementAdapter.java:36)
	at com.carrotsearch.randomizedtesting.rules.SystemPropertiesRestoreRule$1.evaluate(SystemPropertiesRestoreRule.java:57)
	at org.apache.lucene.util.AbstractBeforeAfterRule$1.evaluate(AbstractBeforeAfterRule.java:45)
	at com.carrotsearch.randomizedtesting.rules.StatementAdapter.evaluate(StatementAdapter.java:36)
	at org.apache.lucene.util.TestRuleStoreClassName$1.evaluate(TestRuleStoreClassName.java:41)
	at com.carrotsearch.randomizedtesting.rules.NoShadowingOrOverridesOnMethodsRule$1.evaluate(NoShadowingOrOverridesOnMethodsRule.java:40)
	at com.carrotsearch.randomizedtesting.rules.NoShadowingOrOverridesOnMethodsRule$1.evaluate(NoShadowingOrOverridesOnMethodsRule.java:40)
	at com.carrotsearch.randomizedtesting.rules.StatementAdapter.evaluate(StatementAdapter.java:36)
	at com.carrotsearch.randomizedtesting.rules.StatementAdapter.evaluate(StatementAdapter.java:36)
	at com.carrotsearch.randomizedtesting.rules.StatementAdapter.evaluate(StatementAdapter.java:36)
	at org.apache.lucene.util.TestRuleAssertionsRequired$1.evaluate(TestRuleAssertionsRequired.java:53)
	at org.apache.lucene.util.TestRuleMarkFailure$1.evaluate(TestRuleMarkFailure.java:47)
	at org.apache.lucene.util.TestRuleIgnoreAfterMaxFailures$1.evaluate(TestRuleIgnoreAfterMaxFailures.java:64)
	at org.apache.lucene.util.TestRuleIgnoreTestSuites$1.evaluate(TestRuleIgnoreTestSuites.java:54)
	at com.carrotsearch.randomizedtesting.rules.StatementAdapter.evaluate(StatementAdapter.java:36)
	at com.carrotsearch.randomizedtesting.ThreadLeakControl$StatementRunner.run(ThreadLeakControl.java:367)
	at java.lang.Thread.run(java.base@9-ea/Thread.java:843)
Caused by: javax.net.ssl.SSLHandshakeException: sun.security.validator.ValidatorException: PKIX path building failed: sun.security.provider.certpath.SunCertPathBuilderException: unable to find valid certification path to requested target
	at sun.security.ssl.Alerts.getSSLException(java.base@9-ea/Alerts.java:198)
	at sun.security.ssl.SSLSocketImpl.fatal(java.base@9-ea/SSLSocketImpl.java:1962)
	at sun.security.ssl.Handshaker.fatalSE(java.base@9-ea/Handshaker.java:309)
	at sun.security.ssl.Handshaker.fatalSE(java.base@9-ea/Handshaker.java:303)
	at sun.security.ssl.ClientHandshaker.checkServerCerts(java.base@9-ea/ClientHandshaker.java:1843)
	at sun.security.ssl.ClientHandshaker.serverCertificate(java.base@9-ea/ClientHandshaker.java:1652)
	at sun.security.ssl.ClientHandshaker.processMessage(java.base@9-ea/ClientHandshaker.java:260)
	at sun.security.ssl.Handshaker.processLoop(java.base@9-ea/Handshaker.java:1061)
	at sun.security.ssl.Handshaker.processRecord(java.base@9-ea/Handshaker.java:995)
	at sun.security.ssl.SSLSocketImpl.processInputRecord(java.base@9-ea/SSLSocketImpl.java:1132)
	at sun.security.ssl.SSLSocketImpl.readRecord(java.base@9-ea/SSLSocketImpl.java:1069)
	at sun.security.ssl.SSLSocketImpl.readRecord(java.base@9-ea/SSLSocketImpl.java:968)
	at sun.security.ssl.SSLSocketImpl.performInitialHandshake(java.base@9-ea/SSLSocketImpl.java:1395)
	at sun.security.ssl.SSLSocketImpl.startHandshake(java.base@9-ea/SSLSocketImpl.java:1422)
	at sun.security.ssl.SSLSocketImpl.startHandshake(java.base@9-ea/SSLSocketImpl.java:1406)
	at org.apache.http.conn.ssl.SSLSocketFactory.connectSocket(SSLSocketFactory.java:543)
	at org.apache.http.conn.ssl.SSLSocketFactory.connectSocket(SSLSocketFactory.java:409)
	at org.apache.http.impl.conn.DefaultClientConnectionOperator.openConnection(DefaultClientConnectionOperator.java:177)
	at org.apache.http.impl.conn.ManagedClientConnectionImpl.open(ManagedClientConnectionImpl.java:304)
	at org.apache.http.impl.client.DefaultRequestDirector.tryConnect(DefaultRequestDirector.java:611)
	at org.apache.http.impl.client.DefaultRequestDirector.execute(DefaultRequestDirector.java:446)
	at org.apache.http.impl.client.AbstractHttpClient.doExecute(AbstractHttpClient.java:882)
	at org.apache.http.impl.client.CloseableHttpClient.execute(CloseableHttpClient.java:82)
	at org.apache.http.impl.client.CloseableHttpClient.execute(CloseableHttpClient.java:107)
	at org.apache.http.impl.client.CloseableHttpClient.execute(CloseableHttpClient.java:55)
	at org.apache.solr.client.solrj.impl.HttpSolrClient.executeMethod(HttpSolrClient.java:497)
	... 43 more
Caused by: sun.security.validator.ValidatorException: PKIX path building failed: sun.security.provider.certpath.SunCertPathBuilderException: unable to find valid certification path to requested target
	at sun.security.validator.PKIXValidator.doBuild(java.base@9-ea/PKIXValidator.java:386)
	at sun.security.validator.PKIXValidator.engineValidate(java.base@9-ea/PKIXValidator.java:291)
	at sun.security.validator.Validator.validate(java.base@9-ea/Validator.java:264)
	at sun.security.ssl.X509TrustManagerImpl.validate(java.base@9-ea/X509TrustManagerImpl.java:343)
	at sun.security.ssl.X509TrustManagerImpl.checkTrusted(java.base@9-ea/X509TrustManagerImpl.java:237)
	at sun.security.ssl.X509TrustManagerImpl.checkServerTrusted(java.base@9-ea/X509TrustManagerImpl.java:124)
	at sun.security.ssl.ClientHandshaker.checkServerCerts(java.base@9-ea/ClientHandshaker.java:1822)
	... 64 more
Caused by: sun.security.provider.certpath.SunCertPathBuilderException: unable to find valid certification path to requested target
	at sun.security.provider.certpath.SunCertPathBuilder.build(java.base@9-ea/SunCertPathBuilder.java:141)
	at sun.security.provider.certpath.SunCertPathBuilder.engineBuild(java.base@9-ea/SunCertPathBuilder.java:126)
	at java.security.cert.CertPathBuilder.build(java.base@9-ea/CertPathBuilder.java:288)
	at sun.security.validator.PKIXValidator.doBuild(java.base@9-ea/PKIXValidator.java:381)
	... 70 more




Build Log:
[...truncated 12502 lines...]
   [junit4] Suite: org.apache.solr.security.BasicAuthIntegrationTest
   [junit4]   2> Creating dataDir: /home/jenkins/workspace/Lucene-Solr-6.x-Linux/solr/build/solr-core/test/J2/temp/solr.security.BasicAuthIntegrationTest_5369EC070DA230CE-001/init-core-data-001
   [junit4]   2> 2005847 INFO  (SUITE-BasicAuthIntegrationTest-seed#[5369EC070DA230CE]-worker) [    ] o.a.s.SolrTestCaseJ4 Randomized ssl (true) and clientAuth (false) via: @org.apache.solr.util.RandomizeSSL(reason="", ssl=0.0/0.0, value=0.0/0.0, clientAuth=0.0/0.0)
   [junit4]   2> 2005848 INFO  (SUITE-BasicAuthIntegrationTest-seed#[5369EC070DA230CE]-worker) [    ] o.a.s.c.ZkTestServer STARTING ZK TEST SERVER
   [junit4]   2> 2005848 INFO  (Thread-3205) [    ] o.a.s.c.ZkTestServer client port:0.0.0.0/0.0.0.0:0
   [junit4]   2> 2005848 INFO  (Thread-3205) [    ] o.a.s.c.ZkTestServer Starting server
   [junit4]   2> 2005948 INFO  (SUITE-BasicAuthIntegrationTest-seed#[5369EC070DA230CE]-worker) [    ] o.a.s.c.ZkTestServer start zk server on port:35604
   [junit4]   2> 2005948 INFO  (SUITE-BasicAuthIntegrationTest-seed#[5369EC070DA230CE]-worker) [    ] o.a.s.c.c.SolrZkClient Using default ZkCredentialsProvider
   [junit4]   2> 2005949 INFO  (SUITE-BasicAuthIntegrationTest-seed#[5369EC070DA230CE]-worker) [    ] o.a.s.c.c.ConnectionManager Waiting for client to connect to ZooKeeper
   [junit4]   2> 2005950 INFO  (zkCallback-2801-thread-1) [    ] o.a.s.c.c.ConnectionManager Watcher org.apache.solr.common.cloud.ConnectionManager@5694024c name:ZooKeeperConnection Watcher:127.0.0.1:35604 got event WatchedEvent state:SyncConnected type:None path:null path:null type:None
   [junit4]   2> 2005950 INFO  (SUITE-BasicAuthIntegrationTest-seed#[5369EC070DA230CE]-worker) [    ] o.a.s.c.c.ConnectionManager Client is connected to ZooKeeper
   [junit4]   2> 2005950 INFO  (SUITE-BasicAuthIntegrationTest-seed#[5369EC070DA230CE]-worker) [    ] o.a.s.c.c.SolrZkClient Using default ZkACLProvider
   [junit4]   2> 2005950 INFO  (SUITE-BasicAuthIntegrationTest-seed#[5369EC070DA230CE]-worker) [    ] o.a.s.c.c.SolrZkClient makePath: /solr/solr.xml
   [junit4]   2> 2005951 INFO  (SUITE-BasicAuthIntegrationTest-seed#[5369EC070DA230CE]-worker) [    ] o.a.s.c.c.SolrZkClient makePath: /solr/clusterprops.json
   [junit4]   2> 2005953 INFO  (jetty-launcher-2800-thread-2) [    ] o.e.j.s.Server jetty-9.3.8.v20160314
   [junit4]   2> 2005953 INFO  (jetty-launcher-2800-thread-1) [    ] o.e.j.s.Server jetty-9.3.8.v20160314
   [junit4]   2> 2005953 INFO  (jetty-launcher-2800-thread-3) [    ] o.e.j.s.Server jetty-9.3.8.v20160314
   [junit4]   2> 2005954 INFO  (jetty-launcher-2800-thread-2) [    ] o.e.j.s.h.ContextHandler Started o.e.j.s.ServletContextHandler@7837ec8e{/solr,null,AVAILABLE}
   [junit4]   2> 2005955 INFO  (jetty-launcher-2800-thread-3) [    ] o.e.j.s.h.ContextHandler Started o.e.j.s.ServletContextHandler@596bca77{/solr,null,AVAILABLE}
   [junit4]   2> 2005955 INFO  (jetty-launcher-2800-thread-1) [    ] o.e.j.s.h.ContextHandler Started o.e.j.s.ServletContextHandler@2b270c2a{/solr,null,AVAILABLE}
   [junit4]   2> 2005956 INFO  (jetty-launcher-2800-thread-2) [    ] o.e.j.s.ServerConnector Started ServerConnector@30d4870c{SSL,[ssl, http/1.1]}{127.0.0.1:33167}
   [junit4]   2> 2005956 INFO  (jetty-launcher-2800-thread-1) [    ] o.e.j.s.ServerConnector Started ServerConnector@3dcf1f4e{SSL,[ssl, http/1.1]}{127.0.0.1:35896}
   [junit4]   2> 2005956 INFO  (jetty-launcher-2800-thread-2) [    ] o.e.j.s.Server Started @2008652ms
   [junit4]   2> 2005956 INFO  (jetty-launcher-2800-thread-1) [    ] o.e.j.s.Server Started @2008652ms
   [junit4]   2> 2005956 INFO  (jetty-launcher-2800-thread-2) [    ] o.a.s.c.s.e.JettySolrRunner Jetty properties: {hostContext=/solr, hostPort=33167}
   [junit4]   2> 2005956 INFO  (jetty-launcher-2800-thread-1) [    ] o.a.s.c.s.e.JettySolrRunner Jetty properties: {hostContext=/solr, hostPort=35896}
   [junit4]   2> 2005956 INFO  (jetty-launcher-2800-thread-3) [    ] o.e.j.s.ServerConnector Started ServerConnector@3c41fa36{SSL,[ssl, http/1.1]}{127.0.0.1:34984}
   [junit4]   2> 2005957 INFO  (jetty-launcher-2800-thread-2) [    ] o.a.s.s.SolrDispatchFilter SolrDispatchFilter.init(): jdk.internal.loader.ClassLoaders$AppClassLoader@7cdbc5d3
   [junit4]   2> 2005957 INFO  (jetty-launcher-2800-thread-3) [    ] o.e.j.s.Server Started @2008652ms
   [junit4]   2> 2005957 INFO  (jetty-launcher-2800-thread-1) [    ] o.a.s.s.SolrDispatchFilter SolrDispatchFilter.init(): jdk.internal.loader.ClassLoaders$AppClassLoader@7cdbc5d3
   [junit4]   2> 2005957 INFO  (jetty-launcher-2800-thread-3) [    ] o.a.s.c.s.e.JettySolrRunner Jetty properties: {hostContext=/solr, hostPort=34984}
   [junit4]   2> 2005957 INFO  (jetty-launcher-2800-thread-1) [    ] o.a.s.c.SolrResourceLoader new SolrResourceLoader for directory: '/home/jenkins/workspace/Lucene-Solr-6.x-Linux/solr/build/solr-core/test/J2/temp/solr.security.BasicAuthIntegrationTest_5369EC070DA230CE-001/tempDir-001/node1'
   [junit4]   2> 2005957 INFO  (jetty-launcher-2800-thread-2) [    ] o.a.s.c.SolrResourceLoader new SolrResourceLoader for directory: '/home/jenkins/workspace/Lucene-Solr-6.x-Linux/solr/build/solr-core/test/J2/temp/solr.security.BasicAuthIntegrationTest_5369EC070DA230CE-001/tempDir-001/node2'
   [junit4]   2> 2005957 INFO  (jetty-launcher-2800-thread-3) [    ] o.a.s.s.SolrDispatchFilter SolrDispatchFilter.init(): jdk.internal.loader.ClassLoaders$AppClassLoader@7cdbc5d3
   [junit4]   2> 2005958 INFO  (jetty-launcher-2800-thread-1) [    ] o.a.s.c.SolrResourceLoader JNDI not configured for solr (NoInitialContextEx)
   [junit4]   2> 2005958 INFO  (jetty-launcher-2800-thread-3) [    ] o.a.s.c.SolrResourceLoader new SolrResourceLoader for directory: '/home/jenkins/workspace/Lucene-Solr-6.x-Linux/solr/build/solr-core/test/J2/temp/solr.security.BasicAuthIntegrationTest_5369EC070DA230CE-001/tempDir-001/node3'
   [junit4]   2> 2005958 INFO  (jetty-launcher-2800-thread-2) [    ] o.a.s.c.SolrResourceLoader JNDI not configured for solr (NoInitialContextEx)
   [junit4]   2> 2005958 INFO  (jetty-launcher-2800-thread-3) [    ] o.a.s.c.SolrResourceLoader JNDI not configured for solr (NoInitialContextEx)
   [junit4]   2> 2005958 INFO  (jetty-launcher-2800-thread-2) [    ] o.a.s.c.SolrResourceLoader solr home defaulted to 'solr/' (could not find system property or JNDI)
   [junit4]   2> 2005958 INFO  (jetty-launcher-2800-thread-3) [    ] o.a.s.c.SolrResourceLoader solr home defaulted to 'solr/' (could not find system property or JNDI)
   [junit4]   2> 2005958 INFO  (jetty-launcher-2800-thread-1) [    ] o.a.s.c.SolrResourceLoader solr home defaulted to 'solr/' (could not find system property or JNDI)
   [junit4]   2> 2005958 INFO  (jetty-launcher-2800-thread-2) [    ] o.a.s.c.c.SolrZkClient Using default ZkCredentialsProvider
   [junit4]   2> 2005958 INFO  (jetty-launcher-2800-thread-3) [    ] o.a.s.c.c.SolrZkClient Using default ZkCredentialsProvider
   [junit4]   2> 2005958 INFO  (jetty-launcher-2800-thread-1) [    ] o.a.s.c.c.SolrZkClient Using default ZkCredentialsProvider
   [junit4]   2> 2005958 INFO  (jetty-launcher-2800-thread-2) [    ] o.a.s.c.c.ConnectionManager Waiting for client to connect to ZooKeeper
   [junit4]   2> 2005959 INFO  (jetty-launcher-2800-thread-3) [    ] o.a.s.c.c.ConnectionManager Waiting for client to connect to ZooKeeper
   [junit4]   2> 2005959 INFO  (jetty-launcher-2800-thread-1) [    ] o.a.s.c.c.ConnectionManager Waiting for client to connect to ZooKeeper
   [junit4]   2> 2005959 INFO  (zkCallback-2802-thread-1) [    ] o.a.s.c.c.ConnectionManager Watcher org.apache.solr.common.cloud.ConnectionManager@6d7c567 name:ZooKeeperConnection Watcher:127.0.0.1:35604/solr got event WatchedEvent state:SyncConnected type:None path:null path:null type:None
   [junit4]   2> 2005959 INFO  (zkCallback-2803-thread-1) [    ] o.a.s.c.c.ConnectionManager Watcher org.apache.solr.common.cloud.ConnectionManager@6147bf7f name:ZooKeeperConnection Watcher:127.0.0.1:35604/solr got event WatchedEvent state:SyncConnected type:None path:null path:null type:None
   [junit4]   2> 2005959 INFO  (jetty-launcher-2800-thread-2) [    ] o.a.s.c.c.ConnectionManager Client is connected to ZooKeeper
   [junit4]   2> 2005959 INFO  (zkCallback-2804-thread-1) [    ] o.a.s.c.c.ConnectionManager Watcher org.apache.solr.common.cloud.ConnectionManager@7e3dd7a2 name:ZooKeeperConnection Watcher:127.0.0.1:35604/solr got event WatchedEvent state:SyncConnected type:None path:null path:null type:None
   [junit4]   2> 2005959 INFO  (jetty-launcher-2800-thread-3) [    ] o.a.s.c.c.ConnectionManager Client is connected to ZooKeeper
   [junit4]   2> 2005959 INFO  (jetty-launcher-2800-thread-2) [    ] o.a.s.c.c.SolrZkClient Using default ZkACLProvider
   [junit4]   2> 2005959 INFO  (jetty-launcher-2800-thread-1) [    ] o.a.s.c.c.ConnectionManager Client is connected to ZooKeeper
   [junit4]   2> 2005960 INFO  (jetty-launcher-2800-thread-3) [    ] o.a.s.c.c.SolrZkClient Using default ZkACLProvider
   [junit4]   2> 2005960 INFO  (jetty-launcher-2800-thread-2) [    ] o.a.s.s.SolrDispatchFilter solr.xml found in ZooKeeper. Loading...
   [junit4]   2> 2005960 INFO  (jetty-launcher-2800-thread-1) [    ] o.a.s.c.c.SolrZkClient Using default ZkACLProvider
   [junit4]   2> 2005960 INFO  (jetty-launcher-2800-thread-3) [    ] o.a.s.s.SolrDispatchFilter solr.xml found in ZooKeeper. Loading...
   [junit4]   2> 2005960 INFO  (jetty-launcher-2800-thread-1) [    ] o.a.s.s.SolrDispatchFilter solr.xml found in ZooKeeper. Loading...
   [junit4]   2> 2005964 INFO  (jetty-launcher-2800-thread-2) [    ] o.a.s.c.CorePropertiesLocator Config-defined core root directory: /home/jenkins/workspace/Lucene-Solr-6.x-Linux/solr/build/solr-core/test/J2/temp/solr.security.BasicAuthIntegrationTest_5369EC070DA230CE-001/tempDir-001/node2/.
   [junit4]   2> 2005964 INFO  (jetty-launcher-2800-thread-2) [    ] o.a.s.c.CoreContainer New CoreContainer 937855892
   [junit4]   2> 2005965 INFO  (jetty-launcher-2800-thread-2) [    ] o.a.s.c.CoreContainer Loading cores into CoreContainer [instanceDir=/home/jenkins/workspace/Lucene-Solr-6.x-Linux/solr/build/solr-core/test/J2/temp/solr.security.BasicAuthIntegrationTest_5369EC070DA230CE-001/tempDir-001/node2]
   [junit4]   2> 2005965 INFO  (jetty-launcher-2800-thread-1) [    ] o.a.s.c.CorePropertiesLocator Config-defined core root directory: /home/jenkins/workspace/Lucene-Solr-6.x-Linux/solr/build/solr-core/test/J2/temp/solr.security.BasicAuthIntegrationTest_5369EC070DA230CE-001/tempDir-001/node1/.
   [junit4]   2> 2005965 WARN  (NIOServerCxn.Factory:0.0.0.0/0.0.0.0:0) [    ] o.a.z.s.NIOServerCnxn caught end of stream exception
   [junit4]   2> EndOfStreamException: Unable to read additional data from client sessionid 0x15715d61cd80002, likely client has closed socket
   [junit4]   2> 	at org.apache.zookeeper.server.NIOServerCnxn.doIO(NIOServerCnxn.java:228)
   [junit4]   2> 	at org.apache.zookeeper.server.NIOServerCnxnFactory.run(NIOServerCnxnFactory.java:208)
   [junit4]   2> 	at java.lang.Thread.run(java.base@9-ea/Thread.java:843)
   [junit4]   2> 2005965 WARN  (jetty-launcher-2800-thread-2) [    ] o.a.s.c.CoreContainer Couldn't add files from /home/jenkins/workspace/Lucene-Solr-6.x-Linux/solr/build/solr-core/test/J2/temp/solr.security.BasicAuthIntegrationTest_5369EC070DA230CE-001/tempDir-001/node2/lib to classpath: /home/jenkins/workspace/Lucene-Solr-6.x-Linux/solr/build/solr-core/test/J2/temp/solr.security.BasicAuthIntegrationTest_5369EC070DA230CE-001/tempDir-001/node2/lib
   [junit4]   2> 2005965 INFO  (jetty-launcher-2800-thread-1) [    ] o.a.s.c.CoreContainer New CoreContainer 72178839
   [junit4]   2> 2005965 INFO  (jetty-launcher-2800-thread-3) [    ] o.a.s.c.CorePropertiesLocator Config-defined core root directory: /home/jenkins/workspace/Lucene-Solr-6.x-Linux/solr/build/solr-core/test/J2/temp/solr.security.BasicAuthIntegrationTest_5369EC070DA230CE-001/tempDir-001/node3/.
   [junit4]   2> 2005965 INFO  (jetty-launcher-2800-thread-1) [    ] o.a.s.c.CoreContainer Loading cores into CoreContainer [instanceDir=/home/jenkins/workspace/Lucene-Solr-6.x-Linux/solr/build/solr-core/test/J2/temp/solr.security.BasicAuthIntegrationTest_5369EC070DA230CE-001/tempDir-001/node1]
   [junit4]   2> 2005965 INFO  (jetty-launcher-2800-thread-3) [    ] o.a.s.c.CoreContainer New CoreContainer 713192290
   [junit4]   2> 2005965 INFO  (jetty-launcher-2800-thread-3) [    ] o.a.s.c.CoreContainer Loading cores into CoreContainer [instanceDir=/home/jenkins/workspace/Lucene-Solr-6.x-Linux/solr/build/solr-core/test/J2/temp/solr.security.BasicAuthIntegrationTest_5369EC070DA230CE-001/tempDir-001/node3]
   [junit4]   2> 2005965 INFO  (jetty-launcher-2800-thread-2) [    ] o.a.s.h.c.HttpShardHandlerFactory created with socketTimeout : 90000,urlScheme : https,connTimeout : 15000,maxConnectionsPerHost : 20,maxConnections : 10000,corePoolSize : 0,maximumPoolSize : 2147483647,maxThreadIdleTime : 5,sizeOfQueue : -1,fairnessPolicy : false,useRetries : false,connectionsEvictorSleepDelay : 5000,maxConnectionIdleTime : 40000,
   [junit4]   2> 2005965 WARN  (jetty-launcher-2800-thread-3) [    ] o.a.s.c.CoreContainer Couldn't add files from /home/jenkins/workspace/Lucene-Solr-6.x-Linux/solr/build/solr-core/test/J2/temp/solr.security.BasicAuthIntegrationTest_5369EC070DA230CE-001/tempDir-001/node3/lib to classpath: /home/jenkins/workspace/Lucene-Solr-6.x-Linux/solr/build/solr-core/test/J2/temp/solr.security.BasicAuthIntegrationTest_5369EC070DA230CE-001/tempDir-001/node3/lib
   [junit4]   2> 2005965 WARN  (jetty-launcher-2800-thread-1) [    ] o.a.s.c.CoreContainer Couldn't add files from /home/jenkins/workspace/Lucene-Solr-6.x-Linux/solr/build/solr-core/test/J2/temp/solr.security.BasicAuthIntegrationTest_5369EC070DA230CE-001/tempDir-001/node1/lib to classpath: /home/jenkins/workspace/Lucene-Solr-6.x-Linux/solr/build/solr-core/test/J2/temp/solr.security.BasicAuthIntegrationTest_5369EC070DA230CE-001/tempDir-001/node1/lib
   [junit4]   2> 2005965 INFO  (jetty-launcher-2800-thread-3) [    ] o.a.s.h.c.HttpShardHandlerFactory created with socketTimeout : 90000,urlScheme : https,connTimeout : 15000,maxConnectionsPerHost : 20,maxConnections : 10000,corePoolSize : 0,maximumPoolSize : 2147483647,maxThreadIdleTime : 5,sizeOfQueue : -1,fairnessPolicy : false,useRetries : false,connectionsEvictorSleepDelay : 5000,maxConnectionIdleTime : 40000,
   [junit4]   2> 2005965 INFO  (jetty-launcher-2800-thread-1) [    ] o.a.s.h.c.HttpShardHandlerFactory created with socketTimeout : 90000,urlScheme : https,connTimeout : 15000,maxConnectionsPerHost : 20,maxConnections : 10000,corePoolSize : 0,maximumPoolSize : 2147483647,maxThreadIdleTime : 5,sizeOfQueue : -1,fairnessPolicy : false,useRetries : false,connectionsEvictorSleepDelay : 5000,maxConnectionIdleTime : 40000,
   [junit4]   2> 2005966 INFO  (jetty-launcher-2800-thread-3) [    ] o.a.s.u.UpdateShardHandler Creating UpdateShardHandler HTTP client with params: socketTimeout=340000&connTimeout=45000&retry=true
   [junit4]   2> 2005966 INFO  (jetty-launcher-2800-thread-1) [    ] o.a.s.u.UpdateShardHandler Creating UpdateShardHandler HTTP client with params: socketTimeout=340000&connTimeout=45000&retry=true
   [junit4]   2> 2005966 INFO  (jetty-launcher-2800-thread-2) [    ] o.a.s.u.UpdateShardHandler Creating UpdateShardHandler HTTP client with params: socketTimeout=340000&connTimeout=45000&retry=true
   [junit4]   2> 2005966 INFO  (jetty-launcher-2800-thread-1) [    ] o.a.s.l.LogWatcher SLF4J impl is org.slf4j.impl.Log4jLoggerFactory
   [junit4]   2> 2005966 INFO  (jetty-launcher-2800-thread-3) [    ] o.a.s.l.LogWatcher SLF4J impl is org.slf4j.impl.Log4jLoggerFactory
   [junit4]   2> 2005966 INFO  (jetty-launcher-2800-thread-1) [    ] o.a.s.l.LogWatcher Registering Log Listener [Log4j (org.slf4j.impl.Log4jLoggerFactory)]
   [junit4]   2> 2005966 INFO  (jetty-launcher-2800-thread-3) [    ] o.a.s.l.LogWatcher Registering Log Listener [Log4j (org.slf4j.impl.Log4jLoggerFactory)]
   [junit4]   2> 2005966 INFO  (jetty-launcher-2800-thread-1) [    ] o.a.s.c.ZkContainer Zookeeper client=127.0.0.1:35604/solr
   [junit4]   2> 2005966 INFO  (jetty-launcher-2800-thread-3) [    ] o.a.s.c.ZkContainer Zookeeper client=127.0.0.1:35604/solr
   [junit4]   2> 2005966 INFO  (jetty-launcher-2800-thread-2) [    ] o.a.s.l.LogWatcher SLF4J impl is org.slf4j.impl.Log4jLoggerFactory
   [junit4]   2> 2005967 INFO  (jetty-launcher-2800-thread-3) [    ] o.a.s.c.ZkController zkHost includes chroot
   [junit4]   2> 2005967 INFO  (jetty-launcher-2800-thread-2) [    ] o.a.s.l.LogWatcher Registering Log Listener [Log4j (org.slf4j.impl.Log4jLoggerFactory)]
   [junit4]   2> 2005967 INFO  (jetty-launcher-2800-thread-3) [    ] o.a.s.c.c.SolrZkClient Using default ZkCredentialsProvider
   [junit4]   2> 2005966 INFO  (jetty-launcher-2800-thread-1) [    ] o.a.s.c.ZkController zkHost includes chroot
   [junit4]   2> 2005967 INFO  (jetty-launcher-2800-thread-2) [    ] o.a.s.c.ZkContainer Zookeeper client=127.0.0.1:35604/solr
   [junit4]   2> 2005967 INFO  (jetty-launcher-2800-thread-1) [    ] o.a.s.c.c.SolrZkClient Using default ZkCredentialsProvider
   [junit4]   2> 2005967 INFO  (jetty-launcher-2800-thread-2) [    ] o.a.s.c.ZkController zkHost includes chroot
   [junit4]   2> 2005967 INFO  (jetty-launcher-2800-thread-2) [    ] o.a.s.c.c.SolrZkClient Using default ZkCredentialsProvider
   [junit4]   2> 2005967 INFO  (jetty-launcher-2800-thread-3) [    ] o.a.s.c.c.ConnectionManager Waiting for client to connect to ZooKeeper
   [junit4]   2> 2005967 INFO  (jetty-launcher-2800-thread-1) [    ] o.a.s.c.c.ConnectionManager Waiting for client to connect to ZooKeeper
   [junit4]   2> 2005967 INFO  (jetty-launcher-2800-thread-2) [    ] o.a.s.c.c.ConnectionManager Waiting for client to connect to ZooKeeper
   [junit4]   2> 2005967 INFO  (zkCallback-2811-thread-1) [    ] o.a.s.c.c.ConnectionManager Watcher org.apache.solr.common.cloud.ConnectionManager@7fe4d632 name:ZooKeeperConnection Watcher:127.0.0.1:35604 got event WatchedEvent state:SyncConnected type:None path:null path:null type:None
   [junit4]   2> 2005967 INFO  (zkCallback-2812-thread-1) [    ] o.a.s.c.c.ConnectionManager Watcher org.apache.solr.common.cloud.ConnectionManager@6dd7d149 name:ZooKeeperConnection Watcher:127.0.0.1:35604 got event WatchedEvent state:SyncConnected type:None path:null path:null type:None
   [junit4]   2> 2005967 INFO  (jetty-launcher-2800-thread-3) [    ] o.a.s.c.c.ConnectionManager Client is connected to ZooKeeper
   [junit4]   2> 2005967 INFO  (zkCallback-2813-thread-1) [    ] o.a.s.c.c.ConnectionManager Watcher org.apache.solr.common.cloud.ConnectionManager@5c49b9be name:ZooKeeperConnection Watcher:127.0.0.1:35604 got event WatchedEvent state:SyncConnected type:None path:null path:null type:None
   [junit4]   2> 2005967 INFO  (jetty-launcher-2800-thread-1) [    ] o.a.s.c.c.ConnectionManager Client is connected to ZooKeeper
   [junit4]   2> 2005968 INFO  (jetty-launcher-2800-thread-2) [    ] o.a.s.c.c.ConnectionManager Client is connected to ZooKeeper
   [junit4]   2> 2005968 INFO  (jetty-launcher-2800-thread-3) [    ] o.a.s.c.c.SolrZkClient Using default ZkACLProvider
   [junit4]   2> 2005968 INFO  (jetty-launcher-2800-thread-1) [    ] o.a.s.c.c.SolrZkClient Using default ZkACLProvider
   [junit4]   2> 2005968 INFO  (jetty-launcher-2800-thread-2) [    ] o.a.s.c.c.SolrZkClient Using default ZkACLProvider
   [junit4]   2> 2005968 INFO  (jetty-launcher-2800-thread-3) [    ] o.a.s.c.ZkController Added new OnReconnect listener org.apache.solr.cloud.ZkController$$Lambda$241/1677688084@255af020
   [junit4]   2> 2005968 WARN  (NIOServerCxn.Factory:0.0.0.0/0.0.0.0:0) [    ] o.a.z.s.NIOServerCnxn caught end of stream exception
   [junit4]   2> EndOfStreamException: Unable to read additional data from client sessionid 0x15715d61cd80005, likely client has closed socket
   [junit4]   2> 	at org.apache.zookeeper.server.NIOServerCnxn.doIO(NIOServerCnxn.java:228)
   [junit4]   2> 	at org.apache.zookeeper.server.NIOServerCnxnFactory.run(NIOServerCnxnFactory.java:208)
   [junit4]   2> 	at java.lang.Thread.run(java.base@9-ea/Thread.java:843)
   [junit4]   2> 2005968 INFO  (jetty-launcher-2800-thread-3) [    ] o.a.s.c.c.ConnectionManager Waiting for client to connect to ZooKeeper
   [junit4]   2> 2005968 INFO  (jetty-launcher-2800-thread-1) [    ] o.a.s.c.ZkController Added new OnReconnect listener org.apache.solr.cloud.ZkController$$Lambda$241/1677688084@2c9dc3c6
   [junit4]   2> 2005968 INFO  (jetty-launcher-2800-thread-1) [    ] o.a.s.c.c.ConnectionManager Waiting for client to connect to ZooKeeper
   [junit4]   2> 2005968 INFO  (jetty-launcher-2800-thread-2) [    ] o.a.s.c.ZkController Added new OnReconnect listener org.apache.solr.cloud.ZkController$$Lambda$241/1677688084@40a2cf9
   [junit4]   2> 2005969 INFO  (zkCallback-2814-thread-1) [    ] o.a.s.c.c.ConnectionManager Watcher org.apache.solr.common.cloud.ConnectionManager@6a552a25 name:ZooKeeperConnection Watcher:127.0.0.1:35604/solr got event WatchedEvent state:SyncConnected type:None path:null path:null type:None
   [junit4]   2> 2005969 INFO  (jetty-launcher-2800-thread-3) [    ] o.a.s.c.c.ConnectionManager Client is connected to ZooKeeper
   [junit4]   2> 2005969 INFO  (jetty-launcher-2800-thread-2) [    ] o.a.s.c.c.ConnectionManager Waiting for client to connect to ZooKeeper
   [junit4]   2> 2005969 INFO  (zkCallback-2815-thread-1) [    ] o.a.s.c.c.ConnectionManager Watcher org.apache.solr.common.cloud.ConnectionManager@121697f5 name:ZooKeeperConnection Watcher:127.0.0.1:35604/solr got event WatchedEvent state:SyncConnected type:None path:null path:null type:None
   [junit4]   2> 2005969 INFO  (jetty-launcher-2800-thread-1) [    ] o.a.s.c.c.ConnectionManager Client is connected to ZooKeeper
   [junit4]   2> 2005970 INFO  (zkCallback-2816-thread-1) [    ] o.a.s.c.c.ConnectionManager Watcher org.apache.solr.common.cloud.ConnectionManager@7814cc76 name:ZooKeeperConnection Watcher:127.0.0.1:35604/solr got event WatchedEvent state:SyncConnected type:None path:null path:null type:None
   [junit4]   2> 2005970 INFO  (jetty-launcher-2800-thread-2) [    ] o.a.s.c.c.ConnectionManager Client is connected to ZooKeeper
   [junit4]   2> 2005970 INFO  (jetty-launcher-2800-thread-3) [    ] o.a.s.c.c.SolrZkClient makePath: /overseer/queue
   [junit4]   2> 2005970 INFO  (jetty-launcher-2800-thread-1) [    ] o.a.s.c.c.SolrZkClient makePath: /overseer/queue
   [junit4]   2> 2005971 INFO  (jetty-launcher-2800-thread-2) [    ] o.a.s.c.c.SolrZkClient makePath: /overseer/queue
   [junit4]   2> 2005971 INFO  (jetty-launcher-2800-thread-1) [    ] o.a.s.c.c.SolrZkClient makePath: /overseer/collection-queue-work
   [junit4]   2> 2005971 INFO  (jetty-launcher-2800-thread-3) [    ] o.a.s.c.c.SolrZkClient makePath: /overseer/collection-queue-work
   [junit4]   2> 2005971 INFO  (jetty-launcher-2800-thread-2) [    ] o.a.s.c.c.SolrZkClient makePath: /overseer/collection-queue-work
   [junit4]   2> 2005972 INFO  (jetty-launcher-2800-thread-3) [    ] o.a.s.c.c.SolrZkClient makePath: /overseer/collection-map-running
   [junit4]   2> 2005972 INFO  (jetty-launcher-2800-thread-1) [    ] o.a.s.c.c.SolrZkClient makePath: /overseer/collection-map-running
   [junit4]   2> 2005972 INFO  (jetty-launcher-2800-thread-2) [    ] o.a.s.c.c.SolrZkClient makePath: /overseer/collection-map-running
   [junit4]   2> 2005972 INFO  (jetty-launcher-2800-thread-1) [    ] o.a.s.c.c.SolrZkClient makePath: /overseer/collection-map-completed
   [junit4]   2> 2005972 INFO  (jetty-launcher-2800-thread-3) [    ] o.a.s.c.c.SolrZkClient makePath: /overseer/collection-map-completed
   [junit4]   2> 2005973 INFO  (jetty-launcher-2800-thread-2) [    ] o.a.s.c.c.SolrZkClient makePath: /overseer/collection-map-completed
   [junit4]   2> 2005973 INFO  (jetty-launcher-2800-thread-3) [    ] o.a.s.c.c.SolrZkClient makePath: /overseer/collection-map-failure
   [junit4]   2> 2005973 INFO  (jetty-launcher-2800-thread-1) [    ] o.a.s.c.c.SolrZkClient makePath: /overseer/collection-map-failure
   [junit4]   2> 2005973 INFO  (jetty-launcher-2800-thread-2) [    ] o.a.s.c.c.SolrZkClient makePath: /overseer/collection-map-failure
   [junit4]   2> 2005973 INFO  (jetty-launcher-2800-thread-1) [    ] o.a.s.c.c.SolrZkClient makePath: /live_nodes
   [junit4]   2> 2005973 INFO  (jetty-launcher-2800-thread-3) [    ] o.a.s.c.c.SolrZkClient makePath: /live_nodes
   [junit4]   2> 2005974 INFO  (jetty-launcher-2800-thread-2) [    ] o.a.s.c.c.SolrZkClient makePath: /collections
   [junit4]   2> 2005974 INFO  (jetty-launcher-2800-thread-1) [    ] o.a.s.c.c.SolrZkClient makePath: /collections
   [junit4]   2> 2005974 INFO  (jetty-launcher-2800-thread-3) [    ] o.a.s.c.c.SolrZkClient makePath: /collections
   [junit4]   2> 2005974 INFO  (jetty-launcher-2800-thread-1) [    ] o.a.s.c.c.SolrZkClient makePath: /aliases.json
   [junit4]   2> 2005974 INFO  (jetty-launcher-2800-thread-2) [    ] o.a.s.c.c.SolrZkClient makePath: /aliases.json
   [junit4]   2> 2005974 INFO  (jetty-launcher-2800-thread-3) [    ] o.a.s.c.c.SolrZkClient makePath: /aliases.json
   [junit4]   2> 2005974 INFO  (jetty-launcher-2800-thread-2) [    ] o.a.s.c.c.SolrZkClient makePath: /clusterstate.json
   [junit4]   2> 2005974 INFO  (jetty-launcher-2800-thread-1) [    ] o.a.s.c.c.SolrZkClient makePath: /clusterstate.json
   [junit4]   2> 2005974 INFO  (jetty-launcher-2800-thread-3) [    ] o.a.s.c.c.SolrZkClient makePath: /clusterstate.json
   [junit4]   2> 2005975 INFO  (jetty-launcher-2800-thread-1) [    ] o.a.s.c.c.SolrZkClient makePath: /security.json
   [junit4]   2> 2005975 INFO  (jetty-launcher-2800-thread-3) [    ] o.a.s.c.c.SolrZkClient makePath: /security.json
   [junit4]   2> 2005975 INFO  (jetty-launcher-2800-thread-2) [    ] o.a.s.c.c.SolrZkClient makePath: /security.json
   [junit4]   2> 2005975 INFO  (jetty-launcher-2800-thread-3) [    ] o.a.s.c.c.ZkStateReader Updating cluster state from ZooKeeper... 
   [junit4]   2> 2005975 INFO  (jetty-launcher-2800-thread-1) [    ] o.a.s.c.c.ZkStateReader Updating cluster state from ZooKeeper... 
   [junit4]   2> 2005975 INFO  (jetty-launcher-2800-thread-2) [    ] o.a.s.c.c.ZkStateReader Updating cluster state from ZooKeeper... 
   [junit4]   2> 2005975 INFO  (jetty-launcher-2800-thread-3) [    ] o.a.s.c.c.ZkStateReader Loaded cluster properties: {urlScheme=https}
   [junit4]   2> 2005975 INFO  (jetty-launcher-2800-thread-1) [    ] o.a.s.c.c.ZkStateReader Loaded cluster properties: {urlScheme=https}
   [junit4]   2> 2005975 INFO  (jetty-launcher-2800-thread-2) [    ] o.a.s.c.c.ZkStateReader Loaded cluster properties: {urlScheme=https}
   [junit4]   2> 2005975 INFO  (jetty-launcher-2800-thread-3) [    ] o.a.s.c.c.ZkStateReader Updated live nodes from ZooKeeper... (0) -> (0)
   [junit4]   2> 2005975 INFO  (jetty-launcher-2800-thread-1) [    ] o.a.s.c.c.ZkStateReader Updated live nodes from ZooKeeper... (0) -> (0)
   [junit4]   2> 2005975 INFO  (jetty-launcher-2800-thread-2) [    ] o.a.s.c.c.ZkStateReader Updated live nodes from ZooKeeper... (0) -> (0)
   [junit4]   2> 2005976 INFO  (jetty-launcher-2800-thread-1) [    ] o.a.s.c.c.SolrZkClient makePath: /overseer_elect
   [junit4]   2> 2005976 INFO  (jetty-launcher-2800-thread-3) [    ] o.a.s.c.c.SolrZkClient makePath: /overseer_elect
   [junit4]   2> 2005976 INFO  (jetty-launcher-2800-thread-2) [    ] o.a.s.c.c.SolrZkClient makePath: /overseer_elect/election
   [junit4]   2> 2005976 INFO  (jetty-launcher-2800-thread-1) [    ] o.a.s.c.c.SolrZkClient makePath: /overseer_elect/election
   [junit4]   2> 2005976 INFO  (jetty-launcher-2800-thread-3) [    ] o.a.s.c.c.SolrZkClient makePath: /overseer_elect/election
   [junit4]   2> 2005977 INFO  (jetty-launcher-2800-thread-1) [    ] o.a.s.c.Overseer Overseer (id=null) closing
   [junit4]   2> 2005977 INFO  (jetty-launcher-2800-thread-2) [    ] o.a.s.c.Overseer Overseer (id=null) closing
   [junit4]   2> 2005977 INFO  (jetty-launcher-2800-thread-3) [    ] o.a.s.c.Overseer Overseer (id=null) closing
   [junit4]   2> 2005977 INFO  (jetty-launcher-2800-thread-1) [    ] o.a.s.c.LeaderElector Joined leadership election with path: /overseer_elect/election/96569926362857480-127.0.0.1:35896_solr-n_0000000000
   [junit4]   2> 2005977 INFO  (jetty-launcher-2800-thread-2) [    ] o.a.s.c.LeaderElector Joined leadership election with path: /overseer_elect/election/96569926362857481-127.0.0.1:33167_solr-n_0000000001
   [junit4]   2> 2005977 INFO  (jetty-launcher-2800-thread-3) [    ] o.a.s.c.LeaderElector Joined leadership election with path: /overseer_elect/election/96569926362857479-127.0.0.1:34984_solr-n_0000000002
   [junit4]   2> 2005977 INFO  (jetty-launcher-2800-thread-1) [    ] o.a.s.c.OverseerElectionContext I am going to be the leader 127.0.0.1:35896_solr
   [junit4]   2> 2005977 INFO  (jetty-launcher-2800-thread-1) [    ] o.a.s.c.c.SolrZkClient makePath: /overseer_elect/leader
   [junit4]   2> 2005977 INFO  (jetty-launcher-2800-thread-2) [    ] o.a.s.c.LeaderElector Watching path /overseer_elect/election/96569926362857480-127.0.0.1:35896_solr-n_0000000000 to know if I could be the leader
   [junit4]   2> 2005977 INFO  (jetty-launcher-2800-thread-3) [    ] o.a.s.c.LeaderElector Watching path /overseer_elect/election/96569926362857481-127.0.0.1:33167_solr-n_0000000001 to know if I could be the leader
   [junit4]   2> 2005977 INFO  (jetty-launcher-2800-thread-2) [    ] o.a.s.c.ZkController Register node as live in ZooKeeper:/live_nodes/127.0.0.1:33167_solr
   [junit4]   2> 2005977 INFO  (jetty-launcher-2800-thread-2) [    ] o.a.s.c.c.SolrZkClient makePath: /live_nodes/127.0.0.1:33167_solr
   [junit4]   2> 2005977 INFO  (jetty-launcher-2800-thread-3) [    ] o.a.s.c.ZkController Register node as live in ZooKeeper:/live_nodes/127.0.0.1:34984_solr
   [junit4]   2> 2005977 INFO  (jetty-launcher-2800-thread-1) [    ] o.a.s.c.Overseer Overseer (id=96569926362857480-127.0.0.1:35896_solr-n_0000000000) starting
   [junit4]   2> 2005977 INFO  (jetty-launcher-2800-thread-3) [    ] o.a.s.c.c.SolrZkClient makePath: /live_nodes/127.0.0.1:34984_solr
   [junit4]   2> 2005978 INFO  (zkCallback-2814-thread-1) [    ] o.a.s.c.c.ZkStateReader A live node change: [WatchedEvent state:SyncConnected type:NodeChildrenChanged path:/live_nodes], has occurred - updating... (live nodes size: [0])
   [junit4]   2> 2005978 INFO  (zkCallback-2815-thread-1) [    ] o.a.s.c.c.ZkStateReader A live node change: [WatchedEvent state:SyncConnected type:NodeChildrenChanged path:/live_nodes], has occurred - updating... (live nodes size: [0])
   [junit4]   2> 2005978 INFO  (zkCallback-2816-thread-1) [    ] o.a.s.c.c.ZkStateReader A live node change: [WatchedEvent state:SyncConnected type:NodeChildrenChanged path:/live_nodes], has occurred - updating... (live nodes size: [0])
   [junit4]   2> 2005978 INFO  (zkCallback-2814-thread-1) [    ] o.a.s.c.c.ZkStateReader Updated live nodes from ZooKeeper... (0) -> (1)
   [junit4]   2> 2005978 INFO  (zkCallback-2815-thread-1) [    ] o.a.s.c.c.ZkStateReader Updated live nodes from ZooKeeper... (0) -> (2)
   [junit4]   2> 2005978 INFO  (zkCallback-2814-thread-2) [    ] o.a.s.c.c.ZkStateReader A live node change: [WatchedEvent state:SyncConnected type:NodeChildrenChanged path:/live_nodes], has occurred - updating... (live nodes size: [1])
   [junit4]   2> 2005978 INFO  (zkCallback-2816-thread-1) [    ] o.a.s.c.c.ZkStateReader Updated live nodes from ZooKeeper... (0) -> (2)
   [junit4]   2> 2005978 INFO  (zkCallback-2814-thread-2) [    ] o.a.s.c.c.ZkStateReader Updated live nodes from ZooKeeper... (1) -> (2)
   [junit4]   2> 2005978 INFO  (jetty-launcher-2800-thread-1) [    ] o.a.s.c.c.SolrZkClient makePath: /overseer/queue-work
   [junit4]   2> 2005980 INFO  (jetty-launcher-2800-thread-1) [    ] o.a.s.c.OverseerAutoReplicaFailoverThread Starting OverseerAutoReplicaFailoverThread autoReplicaFailoverWorkLoopDelay=10000 autoReplicaFailoverWaitAfterExpiration=30000 autoReplicaFailoverBadNodeExpiration=60000
   [junit4]   2> 2005980 INFO  (OverseerCollectionConfigSetProcessor-96569926362857480-127.0.0.1:35896_solr-n_0000000000) [    ] o.a.s.c.OverseerTaskProcessor Process current queue of overseer operations
   [junit4]   2> 2005980 INFO  (OverseerStateUpdate-96569926362857480-127.0.0.1:35896_solr-n_0000000000) [    ] o.a.s.c.Overseer Starting to work on the main queue
   [junit4]   2> 2005980 INFO  (jetty-launcher-2800-thread-1) [    ] o.a.s.c.ZkController Publish node=127.0.0.1:35896_solr as DOWN
   [junit4]   2> 2005981 INFO  (OverseerStateUpdate-96569926362857480-127.0.0.1:35896_solr-n_0000000000) [    ] o.a.s.c.c.ZkStateReader Updated live nodes from ZooKeeper... (2) -> (2)
   [junit4]   2> 2005981 INFO  (jetty-launcher-2800-thread-1) [    ] o.a.s.c.ZkController Register node as live in ZooKeeper:/live_nodes/127.0.0.1:35896_solr
   [junit4]   2> 2005981 INFO  (jetty-launcher-2800-thread-1) [    ] o.a.s.c.c.SolrZkClient makePath: /live_nodes/127.0.0.1:35896_solr
   [junit4]   2> 2005982 INFO  (OverseerStateUpdate-96569926362857480-127.0.0.1:35896_solr-n_0000000000) [    ] o.a.s.c.Overseer processMessage: queueSize: 1, message = {
   [junit4]   2>   "operation":"downnode",
   [junit4]   2>   "node_name":"127.0.0.1:35896_solr"} current state version: 0
   [junit4]   2> 2005982 INFO  (OverseerStateUpdate-96569926362857480-127.0.0.1:35896_solr-n_0000000000) [    ] o.a.s.c.o.NodeMutator DownNode state invoked for node: 127.0.0.1:35896_solr
   [junit4]   2> 2005982 INFO  (zkCallback-2815-thread-1) [    ] o.a.s.c.c.ZkStateReader A live node change: [WatchedEvent state:SyncConnected type:NodeChildrenChanged path:/live_nodes], has occurred - updating... (live nodes size: [2])
   [junit4]   2> 2005982 INFO  (zkCallback-2816-thread-1) [    ] o.a.s.c.c.ZkStateReader A live node change: [WatchedEvent state:SyncConnected type:NodeChildrenChanged path:/live_nodes], has occurred - updating... (live nodes size: [2])
   [junit4]   2> 2005982 INFO  (zkCallback-2814-thread-2) [    ] o.a.s.c.c.ZkStateReader A live node change: [WatchedEvent state:SyncConnected type:NodeChildrenChanged path:/live_nodes], has occurred - updating... (live nodes size: [2])
   [junit4]   2> 2005982 INFO  (zkCallback-2815-thread-1) [    ] o.a.s.c.c.ZkStateReader Updated live nodes from ZooKeeper... (2) -> (3)
   [junit4]   2> 2005982 INFO  (zkCallback-2816-thread-1) [    ] o.a.s.c.c.ZkStateReader Updated live nodes from ZooKeeper... (2) -> (3)
   [junit4]   2> 2005983 INFO  (zkCallback-2814-thread-2) [    ] o.a.s.c.c.ZkStateReader Updated live nodes from ZooKeeper... (2) -> (3)
   [junit4]   2> 2005983 INFO  (jetty-launcher-2800-thread-2) [    ] o.a.s.c.CoreContainer Security conf doesn't exist. Skipping setup for authorization module.
   [junit4]   2> 2005983 INFO  (jetty-launcher-2800-thread-2) [    ] o.a.s.c.CoreContainer No authentication plugin used.
   [junit4]   2> 2005983 INFO  (jetty-launcher-2800-thread-2) [    ] o.a.s.c.CorePropertiesLocator Looking for core definitions underneath /home/jenkins/workspace/Lucene-Solr-6.x-Linux/solr/build/solr-core/test/J2/temp/solr.security.BasicAuthIntegrationTest_5369EC070DA230CE-001/tempDir-001/node2/.
   [junit4]   2> 2005983 INFO  (jetty-launcher-2800-thread-2) [    ] o.a.s.c.CorePropertiesLocator Found 0 core definitions
   [junit4]   2> 2005984 INFO  (jetty-launcher-2800-thread-2) [    ] o.a.s.s.SolrDispatchFilter user.dir=/home/jenkins/workspace/Lucene-Solr-6.x-Linux/solr/build/solr-core/test/J2
   [junit4]   2> 2005984 INFO  (jetty-launcher-2800-thread-2) [    ] o.a.s.s.SolrDispatchFilter SolrDispatchFilter.init() done
   [junit4]   2> 2005985 INFO  (jetty-launcher-2800-thread-3) [    ] o.a.s.c.CoreContainer Security conf doesn't exist. Skipping setup for authorization module.
   [junit4]   2> 2005985 INFO  (jetty-launcher-2800-thread-3) [    ] o.a.s.c.CoreContainer No authentication plugin used.
   [junit4]   2> 2005985 INFO  (jetty-launcher-2800-thread-3) [    ] o.a.s.c.CorePropertiesLocator Looking for core definitions underneath /home/jenkins/workspace/Lucene-Solr-6.x-Linux/solr/build/solr-core/test/J2/temp/solr.security.BasicAuthIntegrationTest_5369EC070DA230CE-001/tempDir-001/node3/.
   [junit4]   2> 2005985 INFO  (jetty-launcher-2800-thread-3) [    ] o.a.s.c.CorePropertiesLocator Found 0 core definitions
   [junit4]   2> 2005985 INFO  (jetty-launcher-2800-thread-3) [    ] o.a.s.s.SolrDispatchFilter user.dir=/home/jenkins/workspace/Lucene-Solr-6.x-Linux/solr/build/solr-core/test/J2
   [junit4]   2> 2005985 INFO  (jetty-launcher-2800-thread-3) [    ] o.a.s.s.SolrDispatchFilter SolrDispatchFilter.init() done
   [junit4]   2> 2005989 INFO  (jetty-launcher-2800-thread-1) [    ] o.a.s.c.CoreContainer Security conf doesn't exist. Skipping setup for authorization module.
   [junit4]   2> 2005989 INFO  (jetty-launcher-2800-thread-1) [    ] o.a.s.c.CoreContainer No authentication plugin used.
   [junit4]   2> 2005989 INFO  (jetty-launcher-2800-thread-1) [    ] o.a.s.c.CorePropertiesLocator Looking for core definitions underneath /home/jenkins/workspace/Lucene-Solr-6.x-Linux/solr/build/solr-core/test/J2/temp/solr.security.BasicAuthIntegrationTest_5369EC070DA230CE-001/tempDir-001/node1/.
   [junit4]   2> 2005990 INFO  (jetty-launcher-2800-thread-1) [    ] o.a.s.c.CorePropertiesLocator Found 0 core definitions
   [junit4]   2> 2005990 INFO  (jetty-launcher-2800-thread-1) [    ] o.a.s.s.SolrDispatchFilter user.dir=/home/jenkins/workspace/Lucene-Solr-6.x-Linux/solr/build/solr-core/test/J2
   [junit4]   2> 2005990 INFO  (jetty-launcher-2800-thread-1) [    ] o.a.s.s.SolrDispatchFilter SolrDispatchFilter.init() done
   [junit4]   2> 2005990 INFO  (SUITE-BasicAuthIntegrationTest-seed#[5369EC070DA230CE]-worker) [    ] o.a.s.c.c.SolrZkClient Using default ZkCredentialsProvider
   [junit4]   2> 2005990 INFO  (SUITE-BasicAuthIntegrationTest-seed#[5369EC070DA230CE]-worker) [    ] o.a.s.c.c.ConnectionManager Waiting for client to connect to ZooKeeper
   [junit4]   2> 2005991 INFO  (zkCallback-2820-thread-1) [    ] o.a.s.c.c.ConnectionManager Watcher org.apache.solr.common.cloud.ConnectionManager@2c5e2278 name:ZooKeeperConnection Watcher:127.0.0.1:35604 got event WatchedEvent state:SyncConnected type:None path:null path:null type:None
   [junit4]   2> 2005991 INFO  (SUITE-BasicAuthIntegrationTest-seed#[5369EC070DA230CE]-worker) [    ] o.a.s.c.c.ConnectionManager Client is connected to ZooKeeper
   [junit4]   2> 2005991 INFO  (SUITE-BasicAuthIntegrationTest-seed#[5369EC070DA230CE]-worker) [    ] o.a.s.c.c.SolrZkClient Using default ZkACLProvider
   [junit4]   2> 2005992 INFO  (SUITE-BasicAuthIntegrationTest-seed#[5369EC070DA230CE]-worker) [    ] o.a.s.c.c.SolrZkClient Using default ZkCredentialsProvider
   [junit4]   2> 2005992 INFO  (SUITE-BasicAuthIntegrationTest-seed#[5369EC070DA230CE]-worker) [    ] o.a.s.c.c.ConnectionManager Waiting for client to connect to ZooKeeper
   [junit4]   2> 2005992 INFO  (zkCallback-2823-thread-1) [    ] o.a.s.c.c.ConnectionManager Watcher org.apache.solr.common.cloud.ConnectionManager@3ee88a5 name:ZooKeeperConnection Watcher:127.0.0.1:35604/solr got event WatchedEvent state:SyncConnected type:None path:null path:null type:None
   [junit4]   2> 2005992 INFO  (SUITE-BasicAuthIntegrationTest-seed#[5369EC070DA230CE]-worker) [    ] o.a.s.c.c.ConnectionManager Client is connected to ZooKeeper
   [junit4]   2> 2005992 INFO  (SUITE-BasicAuthIntegrationTest-seed#[5369EC070DA230CE]-worker) [    ] o.a.s.c.c.SolrZkClient Using default ZkACLProvider
   [junit4]   2> 2005992 INFO  (SUITE-BasicAuthIntegrationTest-seed#[5369EC070DA230CE]-worker) [    ] o.a.s.c.c.ZkStateReader Updating cluster state from ZooKeeper... 
   [junit4]   2> 2005993 INFO  (SUITE-BasicAuthIntegrationTest-seed#[5369EC070DA230CE]-worker) [    ] o.a.s.c.c.ZkStateReader Loaded cluster properties: {urlScheme=https}
   [junit4]   2> 2005993 INFO  (SUITE-BasicAuthIntegrationTest-seed#[5369EC070DA230CE]-worker) [    ] o.a.s.c.c.ZkStateReader Updated live nodes from ZooKeeper... (0) -> (3)
   [junit4]   2> 2005994 INFO  (SUITE-BasicAuthIntegrationTest-seed#[5369EC070DA230CE]-worker) [    ] o.a.s.c.c.SolrZkClient makePath: /configs/conf/solrconfig.xml
   [junit4]   2> 2005995 INFO  (SUITE-BasicAuthIntegrationTest-seed#[5369EC070DA230CE]-worker) [    ] o.a.s.c.c.SolrZkClient makePath: /configs/conf/schema.xml
   [junit4]   2> 2006043 INFO  (qtp1607101069-15098) [    ] o.a.s.h.a.CollectionsHandler Invoked Collection Action :create with params replicationFactor=1&collection.configName=conf&name=authCollection&action=CREATE&numShards=3&wt=javabin&version=2 and sendToOCPQueue=true
   [junit4]   2> 2006045 INFO  (OverseerCollectionConfigSetProcessor-96569926362857480-127.0.0.1:35896_solr-n_0000000000) [    ] o.a.s.c.OverseerTaskProcessor Overseer Collection Message Handler: Get the message id:/overseer/collection-queue-work/qn-0000000000 message:{
   [junit4]   2>   "name":"authCollection",
   [junit4]   2>   "fromApi":"true",
   [junit4]   2>   "replicationFactor":"1",
   [junit4]   2>   "collection.configName":"conf",
   [junit4]   2>   "numShards":"3",
   [junit4]   2>   "stateFormat":"2",
   [junit4]   2>   "operation":"create"}
   [junit4]   2> 2006045 INFO  (OverseerThreadFactory-6989-thread-1) [    ] o.a.s.c.OverseerCollectionMessageHandler OverseerCollectionMessageHandler.processMessage : create , {
   [junit4]   2>   "name":"authCollection",
   [junit4]   2>   "fromApi":"true",
   [junit4]   2>   "replicationFactor":"1",
   [junit4]   2>   "collection.configName":"conf",
   [junit4]   2>   "numShards":"3",
   [junit4]   2>   "stateFormat":"2",
   [junit4]   2>   "operation":"create"}
   [junit4]   2> 2006045 INFO  (OverseerThreadFactory-6989-thread-1) [    ] o.a.s.c.CreateCollectionCmd Create collection authCollection
   [junit4]   2> 2006045 INFO  (OverseerThreadFactory-6989-thread-1) [    ] o.a.s.c.OverseerCollectionMessageHandler creating collections conf node /collections/authCollection 
   [junit4]   2> 2006046 INFO  (OverseerThreadFactory-6989-thread-1) [    ] o.a.s.c.c.SolrZkClient makePath: /collections/authCollection
   [junit4]   2> 2006046 INFO  (zkCallback-2814-thread-2) [    ] o.a.s.c.c.ZkStateReader A collections change: [WatchedEvent state:SyncConnected type:NodeChildrenChanged path:/collections], has occurred - updating...
   [junit4]   2> 2006046 INFO  (zkCallback-2823-thread-1) [    ] o.a.s.c.c.ZkStateReader A collections change: [WatchedEvent state:SyncConnected type:NodeChildrenChanged path:/collections], has occurred - updating...
   [junit4]   2> 2006046 INFO  (zkCallback-2816-thread-1) [    ] o.a.s.c.c.ZkStateReader A collections change: [WatchedEvent state:SyncConnected type:NodeChildrenChanged path:/collections], has occurred - updating...
   [junit4]   2> 2006046 INFO  (zkCallback-2815-thread-1) [    ] o.a.s.c.c.ZkStateReader A collections change: [WatchedEvent state:SyncConnected type:NodeChildrenChanged path:/collections], has occurred - updating...
   [junit4]   2> 2006047 INFO  (OverseerStateUpdate-96569926362857480-127.0.0.1:35896_solr-n_0000000000) [    ] o.a.s.c.Overseer processMessage: queueSize: 1, message = {
   [junit4]   2>   "name":"authCollection",
   [junit4]   2>   "fromApi":"true",
   [junit4]   2>   "replicationFactor":"1",
   [junit4]   2>   "collection.configName":"conf",
   [junit4]   2>   "numShards":"3",
   [junit4]   2>   "stateFormat":"2",
   [junit4]   2>   "operation":"create"} current state version: 0
   [junit4]   2> 2006047 INFO  (OverseerStateUpdate-96569926362857480-127.0.0.1:35896_solr-n_0000000000) [    ] o.a.s.c.o.ClusterStateMutator building a new cName: authCollection
   [junit4]   2> 2006047 INFO  (OverseerStateUpdate-96569926362857480-127.0.0.1:35896_solr-n_0000000000) [    ] o.a.s.c.o.ZkStateWriter going to create_collection /collections/authCollection/state.json
   [junit4]   2> 2006147 INFO  (OverseerThreadFactory-6989-thread-1) [    ] o.a.s.c.CreateCollectionCmd Creating SolrCores for new collection authCollection, shardNames [shard1, shard2, shard3] , replicationFactor : 1
   [junit4]   2> 2006147 INFO  (OverseerThreadFactory-6989-thread-1) [    ] o.a.s.c.CreateCollectionCmd Creating core authCollection_shard1_replica1 as part of shard shard1 of collection authCollection on 127.0.0.1:34984_solr
   [junit4]   2> 2006147 INFO  (OverseerThreadFactory-6989-thread-1) [    ] o.a.s.c.CreateCollectionCmd Creating core authCollection_shard2_replica1 as part of shard shard2 of collection authCollection on 127.0.0.1:35896_solr
   [junit4]   2> 2006148 INFO  (OverseerThreadFactory-6989-thread-1) [    ] o.a.s.c.CreateCollectionCmd Creating core authCollection_shard3_replica1 as part of shard shard3 of collection authCollection on 127.0.0.1:33167_solr
   [junit4]   2> 2006151 INFO  (qtp1607101069-15102) [    ] o.a.s.h.a.CoreAdminOperation core create command qt=/admin/cores&collection.configName=conf&name=authCollection_shard2_replica1&action=CREATE&numShards=3&collection=authCollection&shard=shard2&wt=javabin&version=2
   [junit4]   2> 2006151 INFO  (qtp1607101069-15102) [    ] o.a.s.c.CoreDescriptor Created CoreDescriptor: {schema=schema.xml, dataDir=data/, collection.configName=conf, collection=authCollection, loadOnStartup=true, transient=false, name=authCollection_shard2_replica1, numShards=3, shard=shard2, config=solrconfig.xml, configSetProperties=configsetprops.json}
   [junit4]   2> 2006152 INFO  (qtp1607101069-15102) [    ] o.a.s.c.ZkController publishing state=down
   [junit4]   2> 2006152 INFO  (qtp1607101069-15102) [    ] o.a.s.c.ZkController Registering watch for collection authCollection
   [junit4]   2> 2006152 INFO  (OverseerStateUpdate-96569926362857480-127.0.0.1:35896_solr-n_0000000000) [    ] o.a.s.c.Overseer processMessage: queueSize: 1, message = {
   [junit4]   2>   "core":"authCollection_shard2_replica1",
   [junit4]   2>   "roles":null,
   [junit4]   2>   "base_url":"https://127.0.0.1:35896/solr",
   [junit4]   2>   "node_name":"127.0.0.1:35896_solr",
   [junit4]   2>   "numShards":"3",
   [junit4]   2>   "state":"down",
   [junit4]   2>   "shard":"shard2",
   [junit4]   2>   "collection":"authCollection",
   [junit4]   2>   "operation":"state"} current state version: 0
   [junit4]   2> 2006152 INFO  (OverseerStateUpdate-96569926362857480-127.0.0.1:35896_solr-n_0000000000) [    ] o.a.s.c.o.ReplicaMutator Update state numShards=3 message={
   [junit4]   2>   "core":"authCollection_shard2_replica1",
   [junit4]   2>   "roles":null,
   [junit4]   2>   "base_url":"https://127.0.0.1:35896/solr",
   [junit4]   2>   "node_name":"127.0.0.1:35896_solr",
   [junit4]   2>   "numShards":"3",
   [junit4]   2>   "state":"down",
   [junit4]   2>   "shard":"shard2",
   [junit4]   2>   "collection":"authCollection",
   [junit4]   2>   "operation":"state"}
   [junit4]   2> 2006152 INFO  (qtp1607101069-15102) [    ] o.a.s.c.c.ZkStateReader Add data for [authCollection] ver [0]
   [junit4]   2> 2006152 INFO  (qtp1607101069-15102) [    ] o.a.s.c.ZkController look for our core node name
   [junit4]   2> 2006194 INFO  (qtp777546713-15097) [    ] o.a.s.h.a.CoreAdminOperation core create command qt=/admin/cores&collection.configName=conf&name=authCollection_shard1_replica1&action=CREATE&numShards=3&collection=authCollection&shard=shard1&wt=javabin&version=2
   [junit4]   2> 2006194 INFO  (qtp943367203-15096) [    ] o.a.s.h.a.CoreAdminOperation core create command qt=/admin/cores&collection.configName=conf&name=authCollection_shard3_replica1&action=CREATE&numShards=3&collection=authCollection&shard=shard3&wt=javabin&version=2
   [junit4]   2> 2006195 INFO  (qtp777546713-15097) [    ] o.a.s.c.CoreDescriptor Created CoreDescriptor: {schema=schema.xml, dataDir=data/, collection.configName=conf, collection=authCollection, loadOnStartup=true, transient=false, name=authCollection_shard1_replica1, numShards=3, shard=shard1, config=solrconfig.xml, configSetProperties=configsetprops.json}
   [junit4]   2> 2006195 INFO  (qtp943367203-15096) [    ] o.a.s.c.CoreDescriptor Created CoreDescriptor: {schema=schema.xml, dataDir=data/, collection.configName=conf, collection=authCollection, loadOnStartup=true, transient=false, name=authCollection_shard3_replica1, numShards=3, shard=shard3, config=solrconfig.xml, configSetProperties=configsetprops.json}
   [junit4]   2> 2006195 INFO  (qtp943367203-15096) [    ] o.a.s.c.ZkController publishing state=down
   [junit4]   2> 2006195 INFO  (qtp777546713-15097) [    ] o.a.s.c.ZkController publishing state=down
   [junit4]   2> 2006195 INFO  (qtp943367203-15096) [    ] o.a.s.c.ZkController Registering watch for collection authCollection
   [junit4]   2> 2006195 INFO  (qtp777546713-15097) [    ] o.a.s.c.ZkController Registering watch for collection authCollection
   [junit4]   2> 2006196 INFO  (OverseerStateUpdate-96569926362857480-127.0.0.1:35896_solr-n_0000000000) [    ] o.a.s.c.Overseer processMessage: queueSize: 2, message = {
   [junit4]   2>   "core":"authCollection_shard3_replica1",
   [junit4]   2>   "roles":null,
   [junit4]   2>   "base_url":"https://127.0.0.1:33167/solr",
   [junit4]   2>   "node_name":"127.0.0.1:33167_solr",
   [junit4]   2>   "numShards":"3",
   [junit4]   2>   "state":"down",
   [junit4]   2>   "shard":"shard3",
   [junit4]   2>   "collection":"authCollection",
   [junit4]   2>   "operation":"state"} current state version: 0
   [junit4]   2> 2006196 INFO  (qtp777546713-15097) [    ] o.a.s.c.c.ZkStateReader Add data for [authCollection] ver [0]
   [junit4]   2> 2006196 INFO  (OverseerStateUpdate-96569926362857480-127.0.0.1:35896_solr-n_0000000000) [    ] o.a.s.c.o.ReplicaMutator Update state numShards=3 message={
   [junit4]   2>   "core":"authCollection_shard3_replica1",
   [junit4]   2>   "roles":null,
   [junit4]   2>   "base_url":"https://127.0.0.1:33167/solr",
   [junit4]   2>   "node_name":"127.0.0.1:33167_solr",
   [junit4]   2>   "numShards":"3",
   [junit4]   2>   "state":"down",
   [junit4]   2>   "shard":"shard3",
   [junit4]   2>   "collection":"authCollection",
   [junit4]   2>   "operation":"state"}
   [junit4]   2> 2006196 INFO  (qtp943367203-15096) [    ] o.a.s.c.c.ZkStateReader Add data for [authCollection] ver [0]
   [junit4]   2> 2006196 INFO  (qtp777546713-15097) [    ] o.a.s.c.ZkController look for our core node name
   [junit4]   2> 2006196 INFO  (qtp943367203-15096) [    ] o.a.s.c.ZkController look for our core node name
   [junit4]   2> 2006196 INFO  (OverseerStateUpdate-96569926362857480-127.0.0.1:35896_solr-n_0000000000) [    ] o.a.s.c.Overseer processMessage: queueSize: 1, message = {
   [junit4]   2>   "core":"authCollection_shard1_replica1",
   [junit4]   2>   "roles":null,
   [junit4]   2>   "base_url":"https://127.0.0.1:34984/solr",
   [junit4]   2>   "node_name":"127.0.0.1:34984_solr",
   [junit4]   2>   "numShards":"3",
   [junit4]   2>   "state":"down",
   [junit4]   2>   "shard":"shard1",
   [junit4]   2>   "collection":"authCollection",
   [junit4]   2>   "operation":"state"} current state version: 0
   [junit4]   2> 2006196 INFO  (OverseerStateUpdate-96569926362857480-127.0.0.1:35896_solr-n_0000000000) [    ] o.a.s.c.o.ReplicaMutator Update state numShards=3 message={
   [junit4]   2>   "core":"authCollection_shard1_replica1",
   [junit4]   2>   "roles":null,
   [junit4]   2>   "base_url":"https://127.0.0.1:34984/solr",
   [junit4]   2>   "node_name":"127.0.0.1:34984_solr",
   [junit4]   2>   "numShards":"3",
   [junit4]   2>   "state":"down",
   [junit4]   2>   "shard":"shard1",
   [junit4]   2>   "collection":"authCollection",
   [junit4]   2>   "operation":"state"}
   [junit4]   2> 2006297 INFO  (OverseerStateUpdate-96569926362857480-127.0.0.1:35896_solr-n_0000000000) [    ] o.a.s.c.o.ZkStateWriter going to update_collection /collections/authCollection/state.json version: 0
   [junit4]   2> 2006297 INFO  (zkCallback-2815-thread-1) [    ] o.a.s.c.c.ZkStateReader A cluster state change: [WatchedEvent state:SyncConnected type:NodeDataChanged path:/collections/authCollection/state.json] for collection [authCollection] has occurred - updating... (live nodes size: [3])
   [junit4]   2> 2006297 INFO  (zkCallback-2816-thread-1) [    ] o.a.s.c.c.ZkStateReader A cluster state change: [WatchedEvent state:SyncConnected type:NodeDataChanged path:/collections/authCollection/state.json] for collection [authCollection] has occurred - updating... (live nodes size: [3])
   [junit4]   2> 2006297 INFO  (zkCallback-2814-thread-2) [    ] o.a.s.c.c.ZkStateReader A cluster state change: [WatchedEvent state:SyncConnected type:NodeDataChanged path:/collections/authCollection/state.json] for collection [authCollection] has occurred - updating... (live nodes size: [3])
   [junit4]   2> 2006297 INFO  (zkCallback-2815-thread-1) [    ] o.a.s.c.c.ZkStateReader Updating data for [authCollection] from [0] to [1]
   [junit4]   2> 2006298 INFO  (zkCallback-2816-thread-1) [    ] o.a.s.c.c.ZkStateReader Updating data for [authCollection] from [0] to [1]
   [junit4]   2> 2006298 INFO  (zkCallback-2814-thread-2) [    ] o.a.s.c.c.ZkStateReader Updating data for [authCollection] from [0] to [1]
   [junit4]   2> 2007153 INFO  (qtp1607101069-15102) [    ] o.a.s.c.ZkController waiting to find shard id in clusterstate for authCollection_shard2_replica1
   [junit4]   2> 2007153 INFO  (qtp1607101069-15102) [    ] o.a.s.c.ZkController Check for collection zkNode:authCollection
   [junit4]   2> 2007153 INFO  (qtp1607101069-15102) [    ] o.a.s.c.ZkController Collection zkNode exists
   [junit4]   2> 2007153 INFO  (qtp1607101069-15102) [    ] o.a.s.c.c.ZkStateReader Load collection config from: [/collections/authCollection]
   [junit4]   2> 2007153 INFO  (qtp1607101069-15102) [    ] o.a.s.c.c.ZkStateReader path=[/collections/authCollection] [configName]=[conf] specified config exists in ZooKeeper
   [junit4]   2> 2007153 INFO  (qtp1607101069-15102) [    ] o.a.s.c.SolrResourceLoader new SolrResourceLoader for directory: '/home/jenkins/workspace/Lucene-Solr-6.x-Linux/solr/build/solr-core/test/J2/temp/solr.security.BasicAuthIntegrationTest_5369EC070DA230CE-001/tempDir-001/node1/authCollection_shard2_replica1'
   [junit4]   2> 2007154 INFO  (qtp1607101069-15102) [    ] o.a.s.c.SolrResourceLoader JNDI not configured for solr (NoInitialContextEx)
   [junit4]   2> 2007154 INFO  (qtp1607101069-15102) [    ] o.a.s.c.SolrResourceLoader solr home defaulted to 'solr/' (could not find system property or JNDI)
   [junit4]   2> 2007154 INFO  (qtp1607101069-15102) [    ] o.a.s.c.Config loaded config solrconfig.xml with version 0 
   [junit4]   2> 2007155 INFO  (qtp1607101069-15102) [    ] o.a.s.c.SolrConfig current version of requestparams : -1
   [junit4]   2> 2007158 INFO  (qtp1607101069-15102) [    ] o.a.s.c.SolrConfig Using Lucene MatchVersion: 6.3.0
   [junit4]   2> 2007176 INFO  (qtp1607101069-15102) [    ] o.a.s.c.SolrConfig Loaded SolrConfig: solrconfig.xml
   [junit4]   2> 2007178 INFO  (qtp1607101069-15102) [    ] o.a.s.s.IndexSchema [authCollection_shard2_replica1] Schema name=minimal
   [junit4]   2> 2007180 INFO  (qtp1607101069-15102) [    ] o.a.s.s.IndexSchema unique key field: id
   [junit4]   2> 2007180 INFO  (qtp1607101069-15102) [    ] o.a.s.c.ConfigSetProperties Did not find ConfigSet properties, assuming default properties: Can't find resource 'configsetprops.json' in classpath or '/configs/conf', cwd=/home/jenkins/workspace/Lucene-Solr-6.x-Linux/solr/build/solr-core/test/J2
   [junit4]   2> 2007180 INFO  (qtp1607101069-15102) [    ] o.a.s.c.CoreContainer Creating SolrCore 'authCollection_shard2_replica1' using configuration from collection authCollection
   [junit4]   2> 2007180 INFO  (qtp1607101069-15102) [    ] o.a.s.c.SolrCore org.apache.solr.core.MockDirectoryFactory
   [junit4]   2> 2007180 INFO  (qtp1607101069-15102) [    ] o.a.s.c.SolrCore [[authCollection_shard2_replica1] ] Opening new SolrCore at [/home/jenkins/workspace/Lucene-Solr-6.x-Linux/solr/build/solr-core/test/J2/temp/solr.security.BasicAuthIntegrationTest_5369EC070DA230CE-001/tempDir-001/node1/authCollection_shard2_replica1], dataDir=[/home/jenkins/workspace/Lucene-Solr-6.x-Linux/solr/build/solr-core/test/J2/temp/solr.security.BasicAuthIntegrationTest_5369EC070DA230CE-001/tempDir-001/node1/./authCollection_shard2_replica1/data/]
   [junit4]   2> 2007181 INFO  (qtp1607101069-15102) [    ] o.a.s.c.SolrCore JMX monitoring not detected for core: authCollection_shard2_replica1
   [junit4]   2> 2007181 INFO  (qtp1607101069-15102) [    ] o.a.s.c.CachingDirectoryFactory return new directory for /home/jenkins/workspace/Lucene-Solr-6.x-Linux/solr/build/solr-core/test/J2/temp/solr.security.BasicAuthIntegrationTest_5369EC070DA230CE-001/tempDir-001/node1/./authCollection_shard2_replica1/data/snapshot_metadata
   [junit4]   2> 2007181 INFO  (qtp1607101069-15102) [    ] o.a.s.c.s.SolrSnapshotMetaDataManager Loading from snapshot metadata file...
   [junit4]   2> 2007182 INFO  (qtp1607101069-15102) [    ] o.a.s.c.CachingDirectoryFactory return new directory for /home/jenkins/workspace/Lucene-Solr-6.x-Linux/solr/build/solr-core/test/J2/temp/solr.security.BasicAuthIntegrationTest_5369EC070DA230CE-001/tempDir-001/node1/./authCollection_shard2_replica1/data
   [junit4]   2> 2007182 INFO  (qtp1607101069-15102) [    ] o.a.s.c.SolrCore New index directory detected: old=null new=/home/jenkins/workspace/Lucene-Solr-6.x-Linux/solr/build/solr-core/test/J2/temp/solr.security.BasicAuthIntegrationTest_5369EC070DA230CE-001/tempDir-001/node1/./authCollection_shard2_replica1/data/index/
   [junit4]   2> 2007182 WARN  (qtp1607101069-15102) [    ] o.a.s.c.SolrCore [authCollection_shard2_replica1] Solr index directory '/home/jenkins/workspace/Lucene-Solr-6.x-Linux/solr/build/solr-core/test/J2/temp/solr.security.BasicAuthIntegrationTest_5369EC070DA230CE-001/tempDir-001/node1/./authCollection_shard2_replica1/data/index' doesn't exist. Creating new index...
   [junit4]   2> 2007182 INFO  (qtp1607101069-15102) [    ] o.a.s.c.CachingDirectoryFactory return new directory for /home/jenkins/workspace/Lucene-Solr-6.x-Linux/solr/build/solr-core/test/J2/temp/solr.security.BasicAuthIntegrationTest_5369EC070DA230CE-001/tempDir-001/node1/./authCollection_shard2_replica1/data/index
   [junit4]   2> 2007182 INFO  (qtp1607101069-15102) [    ] o.a.s.c.SolrDeletionPolicy SolrDeletionPolicy.onCommit: commits: num=1
   [junit4]   2> 	commit{dir=MockDirectoryWrapper(RAMDirectory@2758c7dd lockFactory=org.apache.lucene.store.SingleInstanceLockFactory@4f532828),segFN=segments_1,generation=1}
   [junit4]   2> 2007182 INFO  (qtp1607101069-15102) [    ] o.a.s.c.SolrDeletionPolicy newest commit generation = 1
   [junit4]   2> 2007183 INFO  (OldIndexDirectoryCleanupThreadForCore-authCollection_shard2_replica1) [    ] o.a.s.c.SolrCore Looking for old index directories to cleanup for core authCollection_shard2_replica1 in /home/jenkins/workspace/Lucene-Solr-6.x-Linux/solr/build/solr-core/test/J2/temp/solr.security.BasicAuthIntegrationTest_5369EC070DA230CE-001/tempDir-001/node1/./authCollection_shard2_replica1/data/
   [junit4]   2> 2007183 WARN  (OldIndexDirectoryCleanupThreadForCore-authCollection_shard2_replica1) [    ] o.a.s.c.DirectoryFactory /home/jenkins/workspace/Lucene-Solr-6.x-Linux/solr/build/solr-core/test/J2/temp/solr.security.BasicAuthIntegrationTest_5369EC070DA230CE-001/tempDir-001/node1/./authCollection_shard2_replica1/data/ does not point to a valid data directory; skipping clean-up of old index directories.
   [junit4]   2> 2007183 INFO  (qtp1607101069-15102) [    ] o.a.s.c.SolrCore no updateRequestProcessorChain defined as default, creating implicit default
   [junit4]   2> 2007184 INFO  (qtp1607101069-15102) [    ] o.a.s.h.l.XMLLoader xsltCacheLifetimeSeconds=60
   [junit4]   2> 2007185 INFO  (qtp1607101069-15102) [    ] o.a.s.h.l.XMLLoader xsltCacheLifetimeSeconds=60
   [junit4]   2> 2007186 INFO  (qtp1607101069-15102) [    ] o.a.s.h.l.XMLLoader xsltCacheLifetimeSeconds=60
   [junit4]   2> 2007186 INFO  (qtp1607101069-15102) [    ] o.a.s.h.l.XMLLoader xsltCacheLifetimeSeconds=60
   [junit4]   2> 2007187 INFO  (qtp1607101069-15102) [    ] o.a.s.c.RequestHandlers Registered paths: /admin/mbeans,/update/json/docs,/admin/luke,/export,/get,/admin/properties,/update/json,/admin/threads,/update/csv,/sql,/graph,/select,/admin/segments,/admin/system,/replication,/config,/stream,/schema,/admin/plugins,/admin/logging,/admin/ping,/update,/admin/file,/terms
   [junit4]   2> 2007187 INFO  (qtp1607101069-15102) [    ] o.a.s.c.SolrCore Using default statsCache cache: org.apache.solr.search.stats.LocalStatsCache
   [junit4]   2> 2007187 INFO  (qtp1607101069-15102) [    ] o.a.s.u.UpdateHandler Using UpdateLog implementation: org.apache.solr.update.UpdateLog
   [junit4]   2> 2007187 INFO  (qtp1607101069-15102) [    ] o.a.s.u.UpdateLog Initializing UpdateLog: dataDir=null defaultSyncLevel=FLUSH numRecordsToKeep=100 maxNumLogsToKeep=10 numVersionBuckets=65536
   [junit4]   2> 2007188 INFO  (qtp1607101069-15102) [    ] o.a.s.u.CommitTracker Hard AutoCommit: disabled
   [junit4]   2> 2007188 INFO  (qtp1607101069-15102) [    ] o.a.s.u.CommitTracker Soft AutoCommit: disabled
   [junit4]   2> 2007188 INFO  (qtp1607101069-15102) [    ] o.a.s.c.SolrDeletionPolicy SolrDeletionPolicy.onInit: commits: num=1
   [junit4]   2> 	commit{dir=MockDirectoryWrapper(RAMDirectory@2758c7dd lockFactory=org.apache.lucene.store.SingleInstanceLockFactory@4f532828),segFN=segments_1,generation=1}
   [junit4]   2> 2007188 INFO  (qtp1607101069-15102) [    ] o.a.s.c.SolrDeletionPolicy newest commit generation = 1
   [junit4]   2> 2007188 INFO  (qtp1607101069-15102) [    ] o.a.s.s.SolrIndexSearcher Opening [Searcher@4e52dd74[authCollection_shard2_replica1] main]
   [junit4]   2> 2007188 INFO  (qtp1607101069-15102) [    ] o.a.s.c.c.ZkStateReader Load collection config from: [/collections/authCollection]
   [junit4]   2> 2007188 INFO  (qtp1607101069-15102) [    ] o.a.s.c.c.ZkStateReader path=[/collections/authCollection] [configName]=[conf] specified config exists in ZooKeeper
   [junit4]   2> 2007188 INFO  (qtp1607101069-15102) [    ] o.a.s.r.ManagedResourceStorage Setting up ZooKeeper-based storage for the RestManager with znodeBase: /configs/conf
   [junit4]   2> 2007188 INFO  (qtp1607101069-15102) [    ] o.a.s.r.ManagedResourceStorage Configured ZooKeeperStorageIO with znodeBase: /configs/conf
   [junit4]   2> 2007188 INFO  (qtp1607101069-15102) [    ] o.a.s.r.RestManager Initializing RestManager with initArgs: {}
   [junit4]   2> 2007188 INFO  (qtp1607101069-15102) [    ] o.a.s.r.ManagedResourceStorage Reading _rest_managed.json using ZooKeeperStorageIO:path=/configs/conf
   [junit4]   2> 2007188 INFO  (qtp1607101069-15102) [    ] o.a.s.r.ManagedResourceStorage No data found for znode /configs/conf/_rest_managed.json
   [junit4]   2> 2007189 INFO  (qtp1607101069-15102) [    ] o.a.s.r.ManagedResourceStorage Loaded null at path _rest_managed.json using ZooKeeperStorageIO:path=/configs/conf
   [junit4]   2> 2007189 INFO  (qtp1607101069-15102) [    ] o.a.s.r.RestManager Initializing 0 registered ManagedResources
   [junit4]   2> 2007189 INFO  (qtp1607101069-15102) [    ] o.a.s.h.ReplicationHandler Commits will be reserved for  10000
   [junit4]   2> 2007189 INFO  (searcherExecutor-6996-thread-1) [    ] o.a.s.c.SolrCore [authCollection_shard2_replica1] Registered new searcher Searcher@4e52dd74[authCollection_shard2_replica1] main{ExitableDirectoryReader(UninvertingDirectoryReader())}
   [junit4]   2> 2007189 INFO  (qtp1607101069-15102) [    ] o.a.s.u.UpdateLog Looking up max value of version field to seed version buckets
   [junit4]   2> 2007189 INFO  (qtp1607101069-15102) [    ] o.a.s.u.VersionInfo Refreshing highest value of _version_ for 65536 version buckets from index
   [junit4]   2> 2007189 INFO  (qtp1607101069-15102) [    ] o.a.s.u.VersionInfo No terms found for _version_, cannot seed version bucket highest value from index
   [junit4]   2> 2007189 INFO  (qtp1607101069-15102) [    ] o.a.s.u.UpdateLog Could not find max version in index or recent updates, using new clock 1545118823210811392
   [junit4]   2> 2007190 INFO  (qtp1607101069-15102) [    ] o.a.s.u.UpdateLog Took 1.0ms to seed version buckets with highest version 1545118823210811392
   [junit4]   2> 2007191 INFO  (qtp1607101069-15102) [    ] o.a.s.c.ZkController watch zkdir /configs/conf
   [junit4]   2> 2007191 INFO  (qtp1607101069-15102) [    ] o.a.s.c.CoreContainer registering core: authCollection_shard2_replica1
   [junit4]   2> 2007191 INFO  (qtp1607101069-15102) [    ] o.a.s.c.ZkController Register replica - core:authCollection_shard2_replica1 address:https://127.0.0.1:35896/solr collection:authCollection shard:shard2
   [junit4]   2> 2007191 INFO  (qtp1607101069-15102) [    ] o.a.s.c.c.SolrZkClient makePath: /collections/authCollection/leader_elect/shard2/election
   [junit4]   2> 2007192 INFO  (qtp1607101069-15102) [    ] o.a.s.c.LeaderElector Joined leadership election with path: /collections/authCollection/leader_elect/shard2/election/96569926362857480-core_node1-n_0000000000
   [junit4]   2> 2007192 INFO  (qtp1607101069-15102) [    ] o.a.s.c.ShardLeaderElectionContext Running the leader process for shard=shard2 and weAreReplacement=false and leaderVoteWait=10000
   [junit4]   2> 2007192 INFO  (qtp1607101069-15102) [    ] o.a.s.c.ShardLeaderElectionContext Enough replicas found to continue.
   [junit4]   2> 2007192 INFO  (qtp1607101069-15102) [    ] o.a.s.c.ShardLeaderElectionContext I may be the new leader - try and sync
   [junit4]   2> 2007192 INFO  (qtp1607101069-15102) [    ] o.a.s.c.SyncStrategy Sync replicas to https://127.0.0.1:35896/solr/authCollection_shard2_replica1/
   [junit4]   2> 2007192 INFO  (OverseerStateUpdate-96569926362857480-127.0.0.1:35896_solr-n_0000000000) [    ] o.a.s.c.Overseer processMessage: queueSize: 1, message = {
   [junit4]   2>   "operation":"leader",
   [junit4]   2>   "shard":"shard2",
   [junit4]   2>   "collection":"authCollection"} current state version: 0
   [junit4]   2> 2007192 INFO  (qtp1607101069-15102) [    ] o.a.s.c.SyncStrategy Sync Success - now sync replicas to me
   [junit4]   2> 2007193 INFO  (qtp1607101069-15102) [    ] o.a.s.c.SyncStrategy https://127.0.0.1:35896/solr/authCollection_shard2_replica1/ has no replicas
   [junit4]   2> 2007193 INFO  (qtp1607101069-15102) [    ] o.a.s.c.c.SolrZkClient makePath: /collections/authCollection/leaders/shard2
   [junit4]   2> 2007194 INFO  (qtp1607101069-15102) [    ] o.a.s.c.ShardLeaderElectionContextBase Creating leader registration node /collections/authCollection/leaders/shard2/leader after winning as /collections/authCollection/leader_elect/shard2/election/96569926362857480-core_node1-n_0000000000
   [junit4]   2> 2007194 INFO  (qtp1607101069-15102) [    ] o.a.s.c.ShardLeaderElectionContext I am the new leader: https://127.0.0.1:35896/solr/authCollection_shard2_replica1/ shard2
   [junit4]   2> 2007194 INFO  (OverseerStateUpdate-96569926362857480-127.0.0.1:35896_solr-n_0000000000) [    ] o.a.s.c.Overseer processMessage: queueSize: 1, message = {
   [junit4]   2>   "operation":"leader",
   [junit4]   2>   "shard":"shard2",
   [junit4]   2>   "collection":"authCollection",
   [junit4]   2>   "base_url":"https://127.0.0.1:35896/solr",
   [junit4]   2>   "core":"authCollection_shard2_replica1",
   [junit4]   2>   "state":"active"} current state version: 0
   [junit4]   2> 2007196 INFO  (qtp777546713-15097) [    ] o.a.s.c.ZkController waiting to find shard id in clusterstate for authCollection_shard1_replica1
   [junit4]   2> 2007196 INFO  (qtp777546713-15097) [    ] o.a.s.c.ZkController Check for collection zkNode:authCollection
   [junit4]   2> 2007196 INFO  (qtp943367203-15096) [    ] o.a.s.c.ZkController waiting to find shard id in clusterstate for authCollection_shard3_replica1
   [junit4]   2> 2007196 INFO  (qtp943367203-15096) [    ] o.a.s.c.ZkController Check for collection zkNode:authCollection
   [junit4]   2> 2007196 INFO  (qtp777546713-15097) [    ] o.a.s.c.ZkController Collection zkNode exists
   [junit4]   2> 2007196 INFO  (qtp777546713-15097) [    ] o.a.s.c.c.ZkStateReader Load collection config from: [/collections/authCollection]
   [junit4]   2> 2007196 INFO  (qtp943367203-15096) [    ] o.a.s.c.ZkController Collection zkNode exists
   [junit4]   2> 2007196 INFO  (qtp943367203-15096) [    ] o.a.s.c.c.ZkStateReader Load collection config from: [/collections/authCollection]
   [junit4]   2> 2007196 INFO  (qtp777546713-15097) [    ] o.a.s.c.c.ZkStateReader path=[/collections/authCollection] [configName]=[conf] specified config exists in ZooKeeper
   [junit4]   2> 2007196 INFO  (qtp777546713-15097) [    ] o.a.s.c.SolrResourceLoader new SolrResourceLoader for directory: '/home/jenkins/workspace/Lucene-Solr-6.x-Linux/solr/build/solr-core/test/J2/temp/solr.security.BasicAuthIntegrationTest_5369EC070DA230CE-001/tempDir-001/node3/authCollection_shard1_replica1'
   [junit4]   2> 2007196 INFO  (qtp943367203-15096) [    ] o.a.s.c.c.ZkStateReader path=[/collections/authCollection] [configName]=[conf] specified config exists in ZooKeeper
   [junit4]   2> 2007196 INFO  (qtp943367203-15096) [    ] o.a.s.c.SolrResourceLoader new SolrResourceLoader for directory: '/home/jenkins/workspace/Lucene-Solr-6.x-Linux/solr/build/solr-core/test/J2/temp/solr.security.BasicAuthIntegrationTest_5369EC070DA230CE-001/tempDir-001/node2/authCollection_shard3_replica1'
   [junit4]   2> 2007197 INFO  (qtp777546713-15097) [    ] o.a.s.c.SolrResourceLoader JNDI not configured for solr (NoInitialContextEx)
   [junit4]   2> 2007197 INFO  (qtp777546713-15097) [    ] o.a.s.c.SolrResourceLoader solr home defaulted to 'solr/' (could not find system property or JNDI)
   [junit4]   2> 2007197 INFO  (qtp943367203-15096) [    ] o.a.s.c.SolrResourceLoader JNDI not configured for solr (NoInitialContextEx)
   [junit4]   2> 2007197 INFO  (qtp943367203-15096) [    ] o.a.s.c.SolrResourceLoader solr home defaulted to 'solr/' (could not find system property or JNDI)
   [junit4]   2> 2007197 INFO  (qtp777546713-15097) [    ] o.a.s.c.Config loaded config solrconfig.xml with version 0 
   [junit4]   2> 2007197 INFO  (qtp943367203-15096) [    ] o.a.s.c.Config loaded config solrconfig.xml with version 0 
   [junit4]   2> 2007198 INFO  (qtp777546713-15097) [    ] o.a.s.c.SolrConfig current version of requestparams : -1
   [junit4]   2> 2007198 INFO  (qtp943367203-15096) [    ] o.a.s.c.SolrConfig current version of requestparams : -1
   [junit4]   2> 2007200 INFO  (qtp777546713-15097) [    ] o.a.s.c.SolrConfig Using Lucene MatchVersion: 6.3.0
   [junit4]   2> 2007200 INFO  (qtp943367203-15096) [    ] o.a.s.c.SolrConfig Using Lucene MatchVersion: 6.3.0
   [junit4]   2> 2007206 INFO  (qtp777546713-15097) [    ] o.a.s.c.SolrConfig Loaded SolrConfig: solrconfig.xml
   [junit4]   2> 2007206 INFO  (qtp943367203-15096) [    ] o.a.s.c.SolrConfig Loaded SolrConfig: solrconfig.xml
   [junit4]   2> 2007208 INFO  (qtp777546713-15097) [    ] o.a.s.s.IndexSchema [authCollection_shard1_replica1] Schema name=minimal
   [junit4]   2> 2007208 INFO  (qtp943367203-15096) [    ] o.a.s.s.IndexSchema [authCollection_shard3_replica1] Schema name=minimal
   [junit4]   2> 2007210 INFO  (qtp943367203-15096) [    ] o.a.s.s.IndexSchema unique key field: id
   [junit4]   2> 2007210 INFO  (qtp777546713-15097) [    ] o.a.s.s.IndexSchema unique key field: id
   [junit4]   2> 2007211 INFO  (qtp777546713-15097) [    ] o.a.s.c.ConfigSetProperties Did not find ConfigSet properties, assuming default properties: Can't find resource 'configsetprops.json' in classpath or '/configs/conf', cwd=/home/jenkins/workspace/Lucene-Solr-6.x-Linux/solr/build/solr-core/test/J2
   [junit4]   2> 2007211 INFO  (qtp943367203-15096) [    ] o.a.s.c.ConfigSetProperties Did not find ConfigSet properties, assuming default properties: Can't find resource 'configsetprops.json' in classpath or '/configs/conf', cwd=/home/jenkins/workspace/Lucene-Solr-6.x-Linux/solr/build/solr-core/test/J2
   [junit4]   2> 2007211 INFO  (qtp777546713-15097) [    ] o.a.s.c.CoreContainer Creating SolrCore 'authCollection_shard1_replica1' using configuration from collection authCollection
   [junit4]   2> 2007211 INFO  (qtp943367203-15096) [    ] o.a.s.c.CoreContainer Creating SolrCore 'authCollection_shard3_replica1' using configuration from collection authCollection
   [junit4]   2> 2007211 INFO  (qtp777546713-15097) [    ] o.a.s.c.SolrCore org.apache.solr.core.MockDirectoryFactory
   [junit4]   2> 2007211 INFO  (qtp943367203-15096) [    ] o.a.s.c.SolrCore org.apache.solr.core.MockDirectoryFactory
   [junit4]   2> 2007212 INFO  (qtp777546713-15097) [    ] o.a.s.c.SolrCore [[authCollection_shard1_replica1] ] Opening new SolrCore at [/home/jenkins/workspace/Lucene-Solr-6.x-Linux/solr/build/solr-core/test/J2/temp/solr.security.BasicAuthIntegrationTest_5369EC070DA230CE-001/tempDir-001/node3/authCollection_shard1_replica1], dataDir=[/home/jenkins/workspace/Lucene-Solr-6.x-Linux/solr/build/solr-core/test/J2/temp/solr.security.BasicAuthIntegrationTest_5369EC070DA230CE-001/tempDir-001/node3/./authCollection_shard1_replica1/data/]
   [junit4]   2> 2007212 INFO  (qtp943367203-15096) [    ] o.a.s.c.SolrCore [[authCollection_shard3_replica1] ] Opening new SolrCore at [/home/jenkins/workspace/Lucene-Solr-6.x-Linux/solr/build/solr-core/test/J2/temp/solr.security.BasicAuthIntegrationTest_5369EC070DA230CE-001/tempDir-001/node2/authCollection_shard3_replica1], dataDir=[/home/jenkins/workspace/Lucene-Solr-6.x-Linux/solr/build/solr-core/test/J2/temp/solr.security.BasicAuthIntegrationTest_5369EC070DA230CE-001/tempDir-001/node2/./authCollection_shard3_replica1/data/]
   [junit4]   2> 2007212 INFO  (qtp943367203-15096) [    ] o.a.s.c.SolrCore JMX monitoring not detected for core: authCollection_shard3_replica1
   [junit4]   2> 2007212 INFO  (qtp777546713-15097) [    ] o.a.s.c.SolrCore JMX monitoring not detected for core: authCollection_shard1_replica1
   [junit4]   2> 2007212 INFO  (qtp943367203-15096) [    ] o.a.s.c.CachingDirectoryFactory return new directory for /home/jenkins/workspace/Lucene-Solr-6.x-Linux/solr/build/solr-core/test/J2/temp/solr.security.BasicAuthIntegrationTest_5369EC070DA230CE-001/tempDir-001/node2/./authCollection_shard3_replica1/data/snapshot_metadata
   [junit4]   2> 2007212 INFO  (qtp943367203-15096) [    ] o.a.s.c.s.SolrSnapshotMetaDataManager Loading from snapshot metadata file...
   [junit4]   2> 2007212 INFO  (qtp777546713-15097) [    ] o.a.s.c.CachingDirectoryFactory return new directory for /home/jenkins/workspace/Lucene-Solr-6.x-Linux/solr/build/solr-core/test/J2/temp/solr.security.BasicAuthIntegrationTest_5369EC070DA230CE-001/tempDir-001/node3/./authCollection_shard1_replica1/data/snapshot_metadata
   [junit4]   2> 2007212 INFO  (qtp777546713-15097) [    ] o.a.s.c.s.SolrSnapshotMetaDataManager Loading from snapshot metadata file...
   [junit4]   2> 2007212 INFO  (qtp943367203-15096) [    ] o.a.s.c.CachingDirectoryFactory return new directory for /home/jenkins/workspace/Lucene-Solr-6.x-Linux/solr/build/solr-core/test/J2/temp/solr.security.BasicAuthIntegrationTest_5369EC070DA230CE-001/tempDir-001/node2/./authCollection_shard3_replica1/data
   [junit4]   2> 2007212 INFO  (qtp943367203-15096) [    ] o.a.s.c.SolrCore New index directory detected: old=null new=/home/jenkins/workspace/Lucene-Solr-6.x-Linux/solr/build/solr-core/test/J2/temp/solr.security.BasicAuthIntegrationTest_5369EC070DA230CE-001/tempDir-001/node2/./authCollection_shard3_replica1/data/index/
   [junit4]   2> 2007212 INFO  (qtp777546713-15097) [    ] o.a.s.c.CachingDirectoryFactory return new directory for /home/jenkins/workspace/Lucene-Solr-6.x-Linux/solr/build/solr-core/test/J2/temp/solr.security.BasicAuthIntegrationTest_5369EC070DA230CE-001/tempDir-001/node3/./authCollection_shard1_replica1/data
   [junit4]   2> 2007212 WARN  (qtp943367203-15096) [    ] o.a.s.c.SolrCore [authCollection_shard3_replica1] Solr index directory '/home/jenkins/workspace/Lucene-Solr-6.x-Linux/solr/build/solr-core/test/J2/temp/solr.security.BasicAuthIntegrationTest_5369EC070DA230CE-001/tempDir-001/node2/./authCollection_shard3_replica1/data/index' doesn't exist. Creating new index...
   [junit4]   2> 2007213 INFO  (qtp777546713-15097) [    ] o.a.s.c.SolrCore New index directory detected: old=null new=/home/jenkins/workspace/Lucene-Solr-6.x-Linux/solr/build/solr-core/test/J2/temp/solr.security.BasicAuthIntegrationTest_5369EC070DA230CE-001/tempDir-001/node3/./authCollection_shard1_replica1/data/index/
   [junit4]   2> 2007213 WARN  (qtp777546713-15097) [    ] o.a.s.c.SolrCore [authCollection_shard1_replica1] Solr index directory '/home/jenkins/workspace/Lucene-Solr-6.x-Linux/solr/build/solr-core/test/J2/temp/solr.security.BasicAuthIntegrationTest_5369EC070DA230CE-001/tempDir-001/node3/./authCollection_shard1_replica1/data/index' doesn't exist. Creating new index...
   [junit4]   2> 2007213 INFO  (qtp943367203-15096) [    ] o.a.s.c.CachingDirectoryFactory return new directory for /home/jenkins/workspace/Lucene-Solr-6.x-Linux/solr/build/solr-core/test/J2/temp/solr.security.BasicAuthIntegrationTest_5369EC070DA230CE-001/tempDir-001/node2/./authCollection_shard3_replica1/data/index
   [junit4]   2> 2007213 INFO  (qtp777546713-15097) [    ] o.a.s.c.CachingDirectoryFactory return new directory for /home/jenkins/workspace/Lucene-Solr-6.x-Linux/solr/build/solr-core/test/J2/temp/solr.security.BasicAuthIntegrationTest_5369EC070DA230CE-001/tempDir-001/node3/./authCollection_shard1_replica1/data/index
   [junit4]   2> 2007213 INFO  (qtp943367203-15096) [    ] o.a.s.c.SolrDeletionPolicy SolrDeletionPolicy.onCommit: commits: num=1
   [junit4]   2> 	commit{dir=MockDirectoryWrapper(RAMDirectory@5b5b835 lockFactory=org.apache.lucene.store.SingleInstanceLockFactory@8e03f2a),segFN=segments_1,generation=1}
   [junit4]   2> 2007213 INFO  (qtp777546713-15097) [    ] o.a.s.c.SolrDeletionPolicy SolrDeletionPolicy.onCommit: commits: num=1
   [junit4]   2> 	commit{dir=MockDirectoryWrapper(RAMDirectory@70d70fbc lockFactory=org.apache.lucene.store.SingleInstanceLockFactory@79f8f890),segFN=segments_1,generation=1}
   [junit4]   2> 2007213 INFO  (qtp943367203-15096) [    ] o.a.s.c.SolrDeletionPolicy newest commit generation = 1
   [junit4]   2> 2007213 INFO  (qtp777546713-15097) [    ] o.a.s.c.SolrDeletionPolicy newest commit generation = 1
   [junit4]   2> 2007213 INFO  (OldIndexDirectoryCleanupThreadForCore-authCollection_shard3_replica1) [    ] o.a.s.c.SolrCore Looking for old index directories to cleanup for core authCollection_shard3_replica1 in /home/jenkins/workspace/Lucene-Solr-6.x-Linux/solr/build/solr-core/test/J2/temp/solr.security.BasicAuthIntegrationTest_5369EC070DA230CE-001/tempDir-001/node2/./authCollection_shard3_replica1/data/
   [junit4]   2> 2007214 WARN  (OldIndexDirectoryCleanupThreadForCore-authCollection_shard3_replica1) [    ] o.a.s.c.DirectoryFactory /home/jenkins/workspace/Lucene-Solr-6.x-Linux/solr/build/solr-core/test/J2/temp/solr.security.BasicAuthIntegrationTest_5369EC070DA230CE-001/tempDir-001/node2/./authCollection_shard3_replica1/data/ does not point to a valid data directory; skipping clean-up of old index directories.
   [junit4]   2> 2007214 INFO  (OldIndexDirectoryCleanupThreadForCore-authCollection_shard1_replica1) [    ] o.a.s.c.SolrCore Looking for old index directories to cleanup for core authCollection_shard1_replica1 in /home/jenkins/workspace/Lucene-Solr-6.x-Linux/solr/build/solr-core/test/J2/temp/solr.security.BasicAuthIntegrationTest_5369EC070DA230CE-001/tempDir-001/node3/./authCollection_shard1_replica1/data/
   [junit4]   2> 2007214 WARN  (OldIndexDirectoryCleanupThreadForCore-authCollection_shard1_replica1) [    ] o.a.s.c.DirectoryFactory /home/jenkins/workspace/Lucene-Solr-6.x-Linux/solr/build/solr-core/test/J2/temp/solr.security.BasicAuthIntegrationTest_5369EC070DA230CE-001/tempDir-001/node3/./authCollection_shard1_replica1/data/ does not point to a valid data directory; skipping clean-up of old index directories.
   [junit4]   2> 2007214 INFO  (qtp943367203-15096) [    ] o.a.s.c.SolrCore no updateRequestProcessorChain defined as default, creating implicit default
   [junit4]   2> 2007214 INFO  (qtp777546713-15097) [    ] o.a.s.c.SolrCore no updateRequestProcessorChain defined as default, creating implicit default
   [junit4]   2> 2007215 INFO  (qtp777546713-15097) [    ] o.a.s.h.l.XMLLoader xsltCacheLifetimeSeconds=60
   [junit4]   2> 2007215 INFO  (qtp943367203-15096) [    ] o.a.s.h.l.XMLLoader xsltCacheLifetimeSeconds=60
   [junit4]   2> 2007215 INFO  (qtp777546713-15097) [    ] o.a.s.h.l.XMLLoader xsltCacheLifetimeSeconds=60
   [junit4]   2> 2007215 INFO  (qtp943367203-15096) [    ] o.a.s.h.l.XMLLoader xsltCacheLifetimeSeconds=60
   [junit4]   2> 2007216 INFO  (qtp777546713-15097) [    ] o.a.s.h.l.XMLLoader xsltCacheLifetimeSeconds=60
   [junit4]   2> 2007216 INFO  (qtp943367203-15096) [    ] o.a.s.h.l.XMLLoader xsltCacheLifetimeSeconds=60
   [junit4]   2> 2007216 INFO  (qtp777546713-15097) [    ] o.a.s.h.l.XMLLoader xsltCacheLifetimeSeconds=60
   [junit4]   2> 2

[...truncated too long message...]

eeper watch triggered, but Solr cannot talk to ZK: [KeeperErrorCode = Session expired for /live_nodes]
   [junit4]   2> 2010072 INFO  (zkCallback-2815-thread-1) [    ] o.a.s.c.c.ZkStateReader Updated live nodes from ZooKeeper... (3) -> (1)
   [junit4]   2> 2010072 WARN  (zkCallback-2828-thread-2) [    ] o.a.s.c.LeaderElector 
   [junit4]   2> org.apache.zookeeper.KeeperException$SessionExpiredException: KeeperErrorCode = Session expired for /overseer_elect/election
   [junit4]   2> 	at org.apache.zookeeper.KeeperException.create(KeeperException.java:127)
   [junit4]   2> 	at org.apache.zookeeper.KeeperException.create(KeeperException.java:51)
   [junit4]   2> 	at org.apache.zookeeper.ZooKeeper.getChildren(ZooKeeper.java:1472)
   [junit4]   2> 	at org.apache.solr.common.cloud.SolrZkClient$6.execute(SolrZkClient.java:331)
   [junit4]   2> 	at org.apache.solr.common.cloud.SolrZkClient$6.execute(SolrZkClient.java:328)
   [junit4]   2> 	at org.apache.solr.common.cloud.ZkCmdExecutor.retryOperation(ZkCmdExecutor.java:60)
   [junit4]   2> 	at org.apache.solr.common.cloud.SolrZkClient.getChildren(SolrZkClient.java:328)
   [junit4]   2> 	at org.apache.solr.cloud.LeaderElector.checkIfIamLeader(LeaderElector.java:105)
   [junit4]   2> 	at org.apache.solr.cloud.LeaderElector.access$200(LeaderElector.java:56)
   [junit4]   2> 	at org.apache.solr.cloud.LeaderElector$ElectionWatcher.process(LeaderElector.java:348)
   [junit4]   2> 	at org.apache.solr.common.cloud.SolrZkClient$3.lambda$process$0(SolrZkClient.java:266)
   [junit4]   2> 	at java.util.concurrent.Executors$RunnableAdapter.call(java.base@9-ea/Executors.java:514)
   [junit4]   2> 	at java.util.concurrent.FutureTask.run(java.base@9-ea/FutureTask.java:264)
   [junit4]   2> 	at org.apache.solr.common.util.ExecutorUtil$MDCAwareThreadPoolExecutor.lambda$execute$0(ExecutorUtil.java:229)
   [junit4]   2> 	at java.util.concurrent.ThreadPoolExecutor.runWorker(java.base@9-ea/ThreadPoolExecutor.java:1158)
   [junit4]   2> 	at java.util.concurrent.ThreadPoolExecutor$Worker.run(java.base@9-ea/ThreadPoolExecutor.java:632)
   [junit4]   2> 	at java.lang.Thread.run(java.base@9-ea/Thread.java:843)
   [junit4]   2> 2010072 WARN  (NIOServerCxn.Factory:0.0.0.0/0.0.0.0:0) [    ] o.a.z.s.NIOServerCnxn caught end of stream exception
   [junit4]   2> EndOfStreamException: Unable to read additional data from client sessionid 0x15715d61cd8000e, likely client has closed socket
   [junit4]   2> 	at org.apache.zookeeper.server.NIOServerCnxn.doIO(NIOServerCnxn.java:228)
   [junit4]   2> 	at org.apache.zookeeper.server.NIOServerCnxnFactory.run(NIOServerCnxnFactory.java:208)
   [junit4]   2> 	at java.lang.Thread.run(java.base@9-ea/Thread.java:843)
   [junit4]   2> 2010073 INFO  (jetty-launcher-2800-thread-1) [    ] o.e.j.s.h.ContextHandler Stopped o.e.j.s.ServletContextHandler@2d1a3845{/solr,null,UNAVAILABLE}
   [junit4]   2> 2010072 INFO  (jetty-launcher-2800-thread-3) [    ] o.e.j.s.h.ContextHandler Stopped o.e.j.s.ServletContextHandler@596bca77{/solr,null,UNAVAILABLE}
   [junit4]   2> 2010072 INFO  (jetty-launcher-2800-thread-2) [    ] o.a.s.c.Overseer Overseer (id=96569926362857480-127.0.0.1:35896_solr-n_0000000000) closing
   [junit4]   2> 2010074 INFO  (OverseerStateUpdate-96569926362857480-127.0.0.1:35896_solr-n_0000000000) [    ] o.a.s.c.Overseer Overseer Loop exiting : 127.0.0.1:35896_solr
   [junit4]   2> 2010074 INFO  (zkCallback-2815-thread-1) [    ] o.a.s.c.c.ZkStateReader A live node change: [WatchedEvent state:SyncConnected type:NodeChildrenChanged path:/live_nodes], has occurred - updating... (live nodes size: [1])
   [junit4]   2> 2010074 WARN  (zkCallback-2815-thread-1) [    ] o.a.s.c.c.ZkStateReader ZooKeeper watch triggered, but Solr cannot talk to ZK: [KeeperErrorCode = Session expired for /live_nodes]
   [junit4]   2> 2010075 INFO  (jetty-launcher-2800-thread-2) [    ] o.e.j.s.h.ContextHandler Stopped o.e.j.s.ServletContextHandler@2b270c2a{/solr,null,UNAVAILABLE}
   [junit4]   2> 2010075 INFO  (SUITE-BasicAuthIntegrationTest-seed#[5369EC070DA230CE]-worker) [    ] o.a.s.c.ZkTestServer connecting to 127.0.0.1:35604 35604
   [junit4]   2> 2010095 INFO  (Thread-3205) [    ] o.a.s.c.ZkTestServer connecting to 127.0.0.1:35604 35604
   [junit4]   2> 2010095 WARN  (Thread-3205) [    ] o.a.s.c.ZkTestServer Watch limit violations: 
   [junit4]   2> Maximum concurrent create/delete watches above limit:
   [junit4]   2> 
   [junit4]   2> 	5	/solr/aliases.json
   [junit4]   2> 	4	/solr/security.json
   [junit4]   2> 	4	/solr/configs/conf
   [junit4]   2> 
   [junit4]   2> Maximum concurrent data watches above limit:
   [junit4]   2> 
   [junit4]   2> 	5	/solr/clusterstate.json
   [junit4]   2> 	5	/solr/clusterprops.json
   [junit4]   2> 	4	/solr/collections/authCollection/state.json
   [junit4]   2> 	2	/solr/overseer_elect/election/96569926362857480-127.0.0.1:35896_solr-n_0000000000
   [junit4]   2> 
   [junit4]   2> Maximum concurrent children watches above limit:
   [junit4]   2> 
   [junit4]   2> 	7	/solr/overseer/queue
   [junit4]   2> 	5	/solr/collections
   [junit4]   2> 	5	/solr/overseer/collection-queue-work
   [junit4]   2> 	4	/solr/live_nodes
   [junit4]   2> 	2	/solr/overseer/queue-work
   [junit4]   2> 
   [junit4]   2> 2010096 INFO  (SUITE-BasicAuthIntegrationTest-seed#[5369EC070DA230CE]-worker) [    ] o.a.s.SolrTestCaseJ4 ###deleteCore
   [junit4]   2> NOTE: leaving temporary files on disk at: /home/jenkins/workspace/Lucene-Solr-6.x-Linux/solr/build/solr-core/test/J2/temp/solr.security.BasicAuthIntegrationTest_5369EC070DA230CE-001
   [junit4]   2> Sep 10, 2016 8:42:20 PM com.carrotsearch.randomizedtesting.ThreadLeakControl checkThreadLeaks
   [junit4]   2> WARNING: Will linger awaiting termination of 5 leaked thread(s).
   [junit4]   2> NOTE: test params are: codec=Asserting(Lucene62): {}, docValues:{}, maxPointsInLeafNode=571, maxMBSortInHeap=6.297863398202636, sim=RandomSimilarity(queryNorm=false,coord=crazy): {}, locale=si, timezone=US/Central
   [junit4]   2> NOTE: Linux 4.4.0-36-generic amd64/Oracle Corporation 9-ea (64-bit)/cpus=12,threads=1,free=168196272,total=518979584
   [junit4]   2> NOTE: All tests run in this JVM: [TestRTimerTree, OverseerCollectionConfigSetProcessorTest, SolrPluginUtilsTest, TestSolrJ, MultiThreadedOCPTest, DebugComponentTest, SpellPossibilityIteratorTest, OverseerTest, TestBackupRepositoryFactory, TestChildDocTransformer, StressHdfsTest, TestNumericTerms32, ReplicationFactorTest, TestGroupingSearch, LeaderElectionTest, TestConfigSetsAPI, SmileWriterTest, BJQParserTest, TestConfigReload, TestSolrQueryParser, DeleteNodeTest, TestRebalanceLeaders, TestSolrConfigHandlerCloud, DOMUtilTest, TestNonDefinedSimilarityFactory, TestLeaderInitiatedRecoveryThread, DateRangeFieldTest, TestFieldCacheVsDocValues, MinimalSchemaTest, TestJmxMonitoredMap, AutoCommitTest, TestSmileRequest, SecurityConfHandlerTest, TestBlendedInfixSuggestions, UnloadDistributedZkTest, OpenExchangeRatesOrgProviderTest, TestAnalyzedSuggestions, AtomicUpdatesTest, TestCryptoKeys, TestConfig, BaseCdcrDistributedZkTest, TestSolrConfigHandler, TestStressCloudBlindAtomicUpdates, TestReloadDeadlock, SuggesterTest, TestCopyFieldCollectionResource, NoCacheHeaderTest, CollectionsAPIAsyncDistributedZkTest, TestAuthenticationFramework, TestExclusionRuleCollectionAccess, TestPhraseSuggestions, RecoveryAfterSoftCommitTest, TestScoreJoinQPScore, TestTolerantSearch, TestFieldCacheSanityChecker, TimeZoneUtilsTest, TestConfigSetProperties, BigEndianAscendingWordDeserializerTest, TestMiniSolrCloudCluster, TestDynamicFieldResource, HdfsTlogReplayBufferedWhileIndexingTest, TestMinMaxOnMultiValuedField, BinaryUpdateRequestHandlerTest, TestNRTOpen, CustomCollectionTest, CurrencyFieldXmlFileTest, TestUniqueKeyFieldResource, TestSchemaResource, ResponseHeaderTest, DistributedSuggestComponentTest, TestOnReconnectListenerSupport, JavabinLoaderTest, DocValuesMultiTest, TestUseDocValuesAsStored, SolrCoreCheckLockOnStartupTest, TestLFUCache, CdcrReplicationHandlerTest, DistributedExpandComponentTest, FieldMutatingUpdateProcessorTest, HdfsRestartWhileUpdatingTest, ShowFileRequestHandlerTest, SuggestComponentContextFilterQueryTest, PluginInfoTest, TestHighFrequencyDictionaryFactory, StatelessScriptUpdateProcessorFactoryTest, ResponseLogComponentTest, TestOverriddenPrefixQueryForCustomFieldType, SimpleFacetsTest, BadComponentTest, TestCustomSort, FullSolrCloudDistribCmdsTest, JSONWriterTest, TestManagedSchema, TestIndexingPerformance, ExplicitHLLTest, TestGeoJSONResponseWriter, TestMergePolicyConfig, CachingDirectoryFactoryTest, HdfsChaosMonkeyNothingIsSafeTest, TestStressLucene, SuggesterWFSTTest, TestUpdate, TestWordDelimiterFilterFactory, SortByFunctionTest, DistanceFunctionTest, SolrInfoMBeanTest, TestSurroundQueryParser, LukeRequestHandlerTest, TestReversedWildcardFilterFactory, PrimitiveFieldTypeTest, XmlUpdateRequestHandlerTest, PathHierarchyTokenizerFactoryTest, FieldAnalysisRequestHandlerTest, LoggingHandlerTest, TestJmxIntegration, TestPartialUpdateDeduplication, PingRequestHandlerTest, PrimUtilsTest, DateFieldTest, ClusterStateTest, TestDocumentBuilder, SliceStateTest, CircularListTest, DistributedIntervalFacetingTest, CdcrBootstrapTest, HttpPartitionTest, SSLMigrationTest, ShardSplitTest, TestCollationFieldDocValues, TestSchemaManager, TestUseDocValuesAsStored2, AnalyticsMergeStrategyTest, AnalyticsQueryTest, MergeStrategyTest, RankQueryTest, TestCollapseQParserPlugin, TestComplexPhraseQParserPlugin, TestFieldSortValues, TestFilteredDocIdSet, TestGraphTermsQParserPlugin, TestHashQParserPlugin, TestMaxScoreQueryParser, TestNoOpRegenerator, TestRandomCollapseQParserPlugin, TestOrdValues, TestSortByMinMaxFunction, BlockJoinFacetDistribTest, BlockJoinFacetSimpleTest, TestJsonRequest, CloudMLTQParserTest, SimpleMLTQParserTest, TestDFISimilarityFactory, TestDistribIDF, BasicAuthIntegrationTest]
   [junit4] Completed [598/630 (1!)] on J2 in 5.01s, 1 test, 1 error <<< FAILURES!

[...truncated 49973 lines...]


Mime
View raw message