lucene-dev mailing list archives

Site index · List index
Message view « Date » · « Thread »
Top « Date » · « Thread »
From Apache Jenkins Server <jenk...@builds.apache.org>
Subject [JENKINS] Lucene-Solr-Tests-master - Build # 1387 - Unstable
Date Sat, 10 Sep 2016 02:36:20 GMT
Build: https://builds.apache.org/job/Lucene-Solr-Tests-master/1387/

1 tests failed.
FAILED:  org.apache.solr.cloud.TestSolrCloudWithDelegationTokens.testDelegationTokenCancelFail

Error Message:
expected:<200> but was:<404>

Stack Trace:
java.lang.AssertionError: expected:<200> but was:<404>
	at __randomizedtesting.SeedInfo.seed([4C667B4C94BDAE17:24D94E664427BCFB]:0)
	at org.junit.Assert.fail(Assert.java:93)
	at org.junit.Assert.failNotEquals(Assert.java:647)
	at org.junit.Assert.assertEquals(Assert.java:128)
	at org.junit.Assert.assertEquals(Assert.java:472)
	at org.junit.Assert.assertEquals(Assert.java:456)
	at org.apache.solr.cloud.TestSolrCloudWithDelegationTokens.cancelDelegationToken(TestSolrCloudWithDelegationTokens.java:137)
	at org.apache.solr.cloud.TestSolrCloudWithDelegationTokens.testDelegationTokenCancelFail(TestSolrCloudWithDelegationTokens.java:292)
	at sun.reflect.NativeMethodAccessorImpl.invoke0(Native Method)
	at sun.reflect.NativeMethodAccessorImpl.invoke(NativeMethodAccessorImpl.java:62)
	at sun.reflect.DelegatingMethodAccessorImpl.invoke(DelegatingMethodAccessorImpl.java:43)
	at java.lang.reflect.Method.invoke(Method.java:498)
	at com.carrotsearch.randomizedtesting.RandomizedRunner.invoke(RandomizedRunner.java:1764)
	at com.carrotsearch.randomizedtesting.RandomizedRunner$8.evaluate(RandomizedRunner.java:871)
	at com.carrotsearch.randomizedtesting.RandomizedRunner$9.evaluate(RandomizedRunner.java:907)
	at com.carrotsearch.randomizedtesting.RandomizedRunner$10.evaluate(RandomizedRunner.java:921)
	at com.carrotsearch.randomizedtesting.rules.SystemPropertiesRestoreRule$1.evaluate(SystemPropertiesRestoreRule.java:57)
	at org.apache.lucene.util.TestRuleSetupTeardownChained$1.evaluate(TestRuleSetupTeardownChained.java:49)
	at org.apache.lucene.util.AbstractBeforeAfterRule$1.evaluate(AbstractBeforeAfterRule.java:45)
	at org.apache.lucene.util.TestRuleThreadAndTestName$1.evaluate(TestRuleThreadAndTestName.java:48)
	at org.apache.lucene.util.TestRuleIgnoreAfterMaxFailures$1.evaluate(TestRuleIgnoreAfterMaxFailures.java:64)
	at org.apache.lucene.util.TestRuleMarkFailure$1.evaluate(TestRuleMarkFailure.java:47)
	at com.carrotsearch.randomizedtesting.rules.StatementAdapter.evaluate(StatementAdapter.java:36)
	at com.carrotsearch.randomizedtesting.ThreadLeakControl$StatementRunner.run(ThreadLeakControl.java:367)
	at com.carrotsearch.randomizedtesting.ThreadLeakControl.forkTimeoutingTask(ThreadLeakControl.java:809)
	at com.carrotsearch.randomizedtesting.ThreadLeakControl$3.evaluate(ThreadLeakControl.java:460)
	at com.carrotsearch.randomizedtesting.RandomizedRunner.runSingleTest(RandomizedRunner.java:880)
	at com.carrotsearch.randomizedtesting.RandomizedRunner$5.evaluate(RandomizedRunner.java:781)
	at com.carrotsearch.randomizedtesting.RandomizedRunner$6.evaluate(RandomizedRunner.java:816)
	at com.carrotsearch.randomizedtesting.RandomizedRunner$7.evaluate(RandomizedRunner.java:827)
	at com.carrotsearch.randomizedtesting.rules.StatementAdapter.evaluate(StatementAdapter.java:36)
	at com.carrotsearch.randomizedtesting.rules.SystemPropertiesRestoreRule$1.evaluate(SystemPropertiesRestoreRule.java:57)
	at org.apache.lucene.util.AbstractBeforeAfterRule$1.evaluate(AbstractBeforeAfterRule.java:45)
	at com.carrotsearch.randomizedtesting.rules.StatementAdapter.evaluate(StatementAdapter.java:36)
	at org.apache.lucene.util.TestRuleStoreClassName$1.evaluate(TestRuleStoreClassName.java:41)
	at com.carrotsearch.randomizedtesting.rules.NoShadowingOrOverridesOnMethodsRule$1.evaluate(NoShadowingOrOverridesOnMethodsRule.java:40)
	at com.carrotsearch.randomizedtesting.rules.NoShadowingOrOverridesOnMethodsRule$1.evaluate(NoShadowingOrOverridesOnMethodsRule.java:40)
	at com.carrotsearch.randomizedtesting.rules.StatementAdapter.evaluate(StatementAdapter.java:36)
	at com.carrotsearch.randomizedtesting.rules.StatementAdapter.evaluate(StatementAdapter.java:36)
	at com.carrotsearch.randomizedtesting.rules.StatementAdapter.evaluate(StatementAdapter.java:36)
	at org.apache.lucene.util.TestRuleAssertionsRequired$1.evaluate(TestRuleAssertionsRequired.java:53)
	at org.apache.lucene.util.TestRuleMarkFailure$1.evaluate(TestRuleMarkFailure.java:47)
	at org.apache.lucene.util.TestRuleIgnoreAfterMaxFailures$1.evaluate(TestRuleIgnoreAfterMaxFailures.java:64)
	at org.apache.lucene.util.TestRuleIgnoreTestSuites$1.evaluate(TestRuleIgnoreTestSuites.java:54)
	at com.carrotsearch.randomizedtesting.rules.StatementAdapter.evaluate(StatementAdapter.java:36)
	at com.carrotsearch.randomizedtesting.ThreadLeakControl$StatementRunner.run(ThreadLeakControl.java:367)
	at java.lang.Thread.run(Thread.java:745)




Build Log:
[...truncated 10653 lines...]
   [junit4] Suite: org.apache.solr.cloud.TestSolrCloudWithDelegationTokens
   [junit4]   2> Creating dataDir: /x1/jenkins/jenkins-slave/workspace/Lucene-Solr-Tests-master/solr/build/solr-core/test/J0/temp/solr.cloud.TestSolrCloudWithDelegationTokens_4C667B4C94BDAE17-001/init-core-data-001
   [junit4]   2> 244189 INFO  (SUITE-TestSolrCloudWithDelegationTokens-seed#[4C667B4C94BDAE17]-worker) [    ] o.a.s.SolrTestCaseJ4 Randomized ssl (false) and clientAuth (false) via: @org.apache.solr.util.RandomizeSSL(reason=, ssl=NaN, value=NaN, clientAuth=NaN)
   [junit4]   2> 244191 INFO  (SUITE-TestSolrCloudWithDelegationTokens-seed#[4C667B4C94BDAE17]-worker) [    ] o.a.s.c.ZkTestServer STARTING ZK TEST SERVER
   [junit4]   2> 244195 INFO  (Thread-332) [    ] o.a.s.c.ZkTestServer client port:0.0.0.0/0.0.0.0:0
   [junit4]   2> 244195 INFO  (Thread-332) [    ] o.a.s.c.ZkTestServer Starting server
   [junit4]   2> 244295 INFO  (SUITE-TestSolrCloudWithDelegationTokens-seed#[4C667B4C94BDAE17]-worker) [    ] o.a.s.c.ZkTestServer start zk server on port:35307
   [junit4]   2> 244295 INFO  (SUITE-TestSolrCloudWithDelegationTokens-seed#[4C667B4C94BDAE17]-worker) [    ] o.a.s.c.c.SolrZkClient Using default ZkCredentialsProvider
   [junit4]   2> 244300 INFO  (SUITE-TestSolrCloudWithDelegationTokens-seed#[4C667B4C94BDAE17]-worker) [    ] o.a.s.c.c.ConnectionManager Waiting for client to connect to ZooKeeper
   [junit4]   2> 244323 INFO  (zkCallback-291-thread-1) [    ] o.a.s.c.c.ConnectionManager Watcher org.apache.solr.common.cloud.ConnectionManager@4ea71edb name:ZooKeeperConnection Watcher:127.0.0.1:35307 got event WatchedEvent state:SyncConnected type:None path:null path:null type:None
   [junit4]   2> 244323 INFO  (SUITE-TestSolrCloudWithDelegationTokens-seed#[4C667B4C94BDAE17]-worker) [    ] o.a.s.c.c.ConnectionManager Client is connected to ZooKeeper
   [junit4]   2> 244323 INFO  (SUITE-TestSolrCloudWithDelegationTokens-seed#[4C667B4C94BDAE17]-worker) [    ] o.a.s.c.c.SolrZkClient Using default ZkACLProvider
   [junit4]   2> 244323 INFO  (SUITE-TestSolrCloudWithDelegationTokens-seed#[4C667B4C94BDAE17]-worker) [    ] o.a.s.c.c.SolrZkClient makePath: /solr/solr.xml
   [junit4]   2> 244330 INFO  (jetty-launcher-290-thread-1) [    ] o.e.j.s.Server jetty-9.3.8.v20160314
   [junit4]   2> 244334 INFO  (jetty-launcher-290-thread-2) [    ] o.e.j.s.Server jetty-9.3.8.v20160314
   [junit4]   2> 244335 INFO  (jetty-launcher-290-thread-1) [    ] o.e.j.s.h.ContextHandler Started o.e.j.s.ServletContextHandler@70d6d248{/solr,null,AVAILABLE}
   [junit4]   2> 244368 INFO  (jetty-launcher-290-thread-2) [    ] o.e.j.s.h.ContextHandler Started o.e.j.s.ServletContextHandler@42867335{/solr,null,AVAILABLE}
   [junit4]   2> 244368 INFO  (jetty-launcher-290-thread-2) [    ] o.e.j.s.ServerConnector Started ServerConnector@160244da{HTTP/1.1,[http/1.1]}{127.0.0.1:35788}
   [junit4]   2> 244368 INFO  (jetty-launcher-290-thread-2) [    ] o.e.j.s.Server Started @252253ms
   [junit4]   2> 244369 INFO  (jetty-launcher-290-thread-2) [    ] o.a.s.c.s.e.JettySolrRunner Jetty properties: {hostContext=/solr, hostPort=35788}
   [junit4]   2> 244369 INFO  (jetty-launcher-290-thread-2) [    ] o.a.s.s.SolrDispatchFilter SolrDispatchFilter.init(): sun.misc.Launcher$AppClassLoader@73d16e93
   [junit4]   2> 244369 INFO  (jetty-launcher-290-thread-2) [    ] o.a.s.c.SolrResourceLoader new SolrResourceLoader for directory: '/x1/jenkins/jenkins-slave/workspace/Lucene-Solr-Tests-master/solr/build/solr-core/test/J0/temp/solr.cloud.TestSolrCloudWithDelegationTokens_4C667B4C94BDAE17-001/tempDir-001/node2'
   [junit4]   2> 244369 INFO  (jetty-launcher-290-thread-2) [    ] o.a.s.c.SolrResourceLoader JNDI not configured for solr (NoInitialContextEx)
   [junit4]   2> 244369 INFO  (jetty-launcher-290-thread-2) [    ] o.a.s.c.SolrResourceLoader solr home defaulted to 'solr/' (could not find system property or JNDI)
   [junit4]   2> 244369 INFO  (jetty-launcher-290-thread-1) [    ] o.e.j.s.ServerConnector Started ServerConnector@3606358e{HTTP/1.1,[http/1.1]}{127.0.0.1:56078}
   [junit4]   2> 244369 INFO  (jetty-launcher-290-thread-1) [    ] o.e.j.s.Server Started @252254ms
   [junit4]   2> 244369 INFO  (jetty-launcher-290-thread-1) [    ] o.a.s.c.s.e.JettySolrRunner Jetty properties: {hostContext=/solr, hostPort=56078}
   [junit4]   2> 244370 INFO  (jetty-launcher-290-thread-1) [    ] o.a.s.s.SolrDispatchFilter SolrDispatchFilter.init(): sun.misc.Launcher$AppClassLoader@73d16e93
   [junit4]   2> 244370 INFO  (jetty-launcher-290-thread-1) [    ] o.a.s.c.SolrResourceLoader new SolrResourceLoader for directory: '/x1/jenkins/jenkins-slave/workspace/Lucene-Solr-Tests-master/solr/build/solr-core/test/J0/temp/solr.cloud.TestSolrCloudWithDelegationTokens_4C667B4C94BDAE17-001/tempDir-001/node1'
   [junit4]   2> 244370 INFO  (jetty-launcher-290-thread-1) [    ] o.a.s.c.SolrResourceLoader JNDI not configured for solr (NoInitialContextEx)
   [junit4]   2> 244370 INFO  (jetty-launcher-290-thread-1) [    ] o.a.s.c.SolrResourceLoader solr home defaulted to 'solr/' (could not find system property or JNDI)
   [junit4]   2> 244370 INFO  (jetty-launcher-290-thread-1) [    ] o.a.s.c.c.SolrZkClient Using default ZkCredentialsProvider
   [junit4]   2> 244370 INFO  (jetty-launcher-290-thread-2) [    ] o.a.s.c.c.SolrZkClient Using default ZkCredentialsProvider
   [junit4]   2> 244372 INFO  (jetty-launcher-290-thread-1) [    ] o.a.s.c.c.ConnectionManager Waiting for client to connect to ZooKeeper
   [junit4]   2> 244373 INFO  (jetty-launcher-290-thread-2) [    ] o.a.s.c.c.ConnectionManager Waiting for client to connect to ZooKeeper
   [junit4]   2> 244374 INFO  (zkCallback-292-thread-1) [    ] o.a.s.c.c.ConnectionManager Watcher org.apache.solr.common.cloud.ConnectionManager@5f94e2b9 name:ZooKeeperConnection Watcher:127.0.0.1:35307/solr got event WatchedEvent state:SyncConnected type:None path:null path:null type:None
   [junit4]   2> 244374 INFO  (jetty-launcher-290-thread-1) [    ] o.a.s.c.c.ConnectionManager Client is connected to ZooKeeper
   [junit4]   2> 244374 INFO  (jetty-launcher-290-thread-1) [    ] o.a.s.c.c.SolrZkClient Using default ZkACLProvider
   [junit4]   2> 244374 INFO  (jetty-launcher-290-thread-1) [    ] o.a.s.s.SolrDispatchFilter solr.xml found in ZooKeeper. Loading...
   [junit4]   2> 244385 INFO  (jetty-launcher-290-thread-1) [    ] o.a.s.c.CorePropertiesLocator Config-defined core root directory: /x1/jenkins/jenkins-slave/workspace/Lucene-Solr-Tests-master/solr/build/solr-core/test/J0/temp/solr.cloud.TestSolrCloudWithDelegationTokens_4C667B4C94BDAE17-001/tempDir-001/node1/.
   [junit4]   2> 244385 INFO  (jetty-launcher-290-thread-1) [    ] o.a.s.c.CoreContainer New CoreContainer 121998111
   [junit4]   2> 244385 INFO  (jetty-launcher-290-thread-1) [    ] o.a.s.c.CoreContainer Loading cores into CoreContainer [instanceDir=/x1/jenkins/jenkins-slave/workspace/Lucene-Solr-Tests-master/solr/build/solr-core/test/J0/temp/solr.cloud.TestSolrCloudWithDelegationTokens_4C667B4C94BDAE17-001/tempDir-001/node1]
   [junit4]   2> 244385 WARN  (jetty-launcher-290-thread-1) [    ] o.a.s.c.CoreContainer Couldn't add files from /x1/jenkins/jenkins-slave/workspace/Lucene-Solr-Tests-master/solr/build/solr-core/test/J0/temp/solr.cloud.TestSolrCloudWithDelegationTokens_4C667B4C94BDAE17-001/tempDir-001/node1/lib to classpath: /x1/jenkins/jenkins-slave/workspace/Lucene-Solr-Tests-master/solr/build/solr-core/test/J0/temp/solr.cloud.TestSolrCloudWithDelegationTokens_4C667B4C94BDAE17-001/tempDir-001/node1/lib
   [junit4]   2> 244387 INFO  (jetty-launcher-290-thread-1) [    ] o.a.s.h.c.HttpShardHandlerFactory created with socketTimeout : 90000,urlScheme : ,connTimeout : 15000,maxConnectionsPerHost : 20,maxConnections : 10000,corePoolSize : 0,maximumPoolSize : 2147483647,maxThreadIdleTime : 5,sizeOfQueue : -1,fairnessPolicy : false,
   [junit4]   2> 244385 INFO  (zkCallback-293-thread-1) [    ] o.a.s.c.c.ConnectionManager Watcher org.apache.solr.common.cloud.ConnectionManager@a669f0a name:ZooKeeperConnection Watcher:127.0.0.1:35307/solr got event WatchedEvent state:SyncConnected type:None path:null path:null type:None
   [junit4]   2> 244388 INFO  (jetty-launcher-290-thread-2) [    ] o.a.s.c.c.ConnectionManager Client is connected to ZooKeeper
   [junit4]   2> 244389 INFO  (jetty-launcher-290-thread-2) [    ] o.a.s.c.c.SolrZkClient Using default ZkACLProvider
   [junit4]   2> 244389 INFO  (jetty-launcher-290-thread-2) [    ] o.a.s.s.SolrDispatchFilter solr.xml found in ZooKeeper. Loading...
   [junit4]   2> 244395 INFO  (jetty-launcher-290-thread-1) [    ] o.a.s.u.UpdateShardHandler Created UpdateShardHandler HTTP client with params: socketTimeout=340000&connTimeout=45000&maxConnections=100000&maxConnectionsPerHost=100000
   [junit4]   2> 244395 INFO  (jetty-launcher-290-thread-1) [    ] o.a.s.l.LogWatcher SLF4J impl is org.slf4j.impl.Log4jLoggerFactory
   [junit4]   2> 244395 INFO  (jetty-launcher-290-thread-1) [    ] o.a.s.l.LogWatcher Registering Log Listener [Log4j (org.slf4j.impl.Log4jLoggerFactory)]
   [junit4]   2> 244395 INFO  (jetty-launcher-290-thread-1) [    ] o.a.s.c.ZkContainer Zookeeper client=127.0.0.1:35307/solr
   [junit4]   2> 244395 INFO  (jetty-launcher-290-thread-1) [    ] o.a.s.c.ZkController zkHost includes chroot
   [junit4]   2> 244395 INFO  (jetty-launcher-290-thread-1) [    ] o.a.s.c.c.SolrZkClient Using default ZkCredentialsProvider
   [junit4]   2> 244402 INFO  (jetty-launcher-290-thread-1) [    ] o.a.s.c.c.ConnectionManager Waiting for client to connect to ZooKeeper
   [junit4]   2> 244402 INFO  (jetty-launcher-290-thread-2) [    ] o.a.s.c.CorePropertiesLocator Config-defined core root directory: /x1/jenkins/jenkins-slave/workspace/Lucene-Solr-Tests-master/solr/build/solr-core/test/J0/temp/solr.cloud.TestSolrCloudWithDelegationTokens_4C667B4C94BDAE17-001/tempDir-001/node2/.
   [junit4]   2> 244415 INFO  (jetty-launcher-290-thread-2) [    ] o.a.s.c.CoreContainer New CoreContainer 1658368320
   [junit4]   2> 244415 INFO  (jetty-launcher-290-thread-2) [    ] o.a.s.c.CoreContainer Loading cores into CoreContainer [instanceDir=/x1/jenkins/jenkins-slave/workspace/Lucene-Solr-Tests-master/solr/build/solr-core/test/J0/temp/solr.cloud.TestSolrCloudWithDelegationTokens_4C667B4C94BDAE17-001/tempDir-001/node2]
   [junit4]   2> 244416 WARN  (jetty-launcher-290-thread-2) [    ] o.a.s.c.CoreContainer Couldn't add files from /x1/jenkins/jenkins-slave/workspace/Lucene-Solr-Tests-master/solr/build/solr-core/test/J0/temp/solr.cloud.TestSolrCloudWithDelegationTokens_4C667B4C94BDAE17-001/tempDir-001/node2/lib to classpath: /x1/jenkins/jenkins-slave/workspace/Lucene-Solr-Tests-master/solr/build/solr-core/test/J0/temp/solr.cloud.TestSolrCloudWithDelegationTokens_4C667B4C94BDAE17-001/tempDir-001/node2/lib
   [junit4]   2> 244416 INFO  (jetty-launcher-290-thread-2) [    ] o.a.s.h.c.HttpShardHandlerFactory created with socketTimeout : 90000,urlScheme : ,connTimeout : 15000,maxConnectionsPerHost : 20,maxConnections : 10000,corePoolSize : 0,maximumPoolSize : 2147483647,maxThreadIdleTime : 5,sizeOfQueue : -1,fairnessPolicy : false,
   [junit4]   2> 244459 INFO  (jetty-launcher-290-thread-2) [    ] o.a.s.u.UpdateShardHandler Created UpdateShardHandler HTTP client with params: socketTimeout=340000&connTimeout=45000&maxConnections=100000&maxConnectionsPerHost=100000
   [junit4]   2> 244459 INFO  (jetty-launcher-290-thread-2) [    ] o.a.s.l.LogWatcher SLF4J impl is org.slf4j.impl.Log4jLoggerFactory
   [junit4]   2> 244459 INFO  (jetty-launcher-290-thread-2) [    ] o.a.s.l.LogWatcher Registering Log Listener [Log4j (org.slf4j.impl.Log4jLoggerFactory)]
   [junit4]   2> 244459 INFO  (jetty-launcher-290-thread-2) [    ] o.a.s.c.ZkContainer Zookeeper client=127.0.0.1:35307/solr
   [junit4]   2> 244459 INFO  (jetty-launcher-290-thread-2) [    ] o.a.s.c.ZkController zkHost includes chroot
   [junit4]   2> 244459 INFO  (jetty-launcher-290-thread-2) [    ] o.a.s.c.c.SolrZkClient Using default ZkCredentialsProvider
   [junit4]   2> 244461 INFO  (jetty-launcher-290-thread-2) [    ] o.a.s.c.c.ConnectionManager Waiting for client to connect to ZooKeeper
   [junit4]   2> 244483 INFO  (zkCallback-299-thread-1) [    ] o.a.s.c.c.ConnectionManager Watcher org.apache.solr.common.cloud.ConnectionManager@6fba9705 name:ZooKeeperConnection Watcher:127.0.0.1:35307 got event WatchedEvent state:SyncConnected type:None path:null path:null type:None
   [junit4]   2> 244487 INFO  (jetty-launcher-290-thread-2) [    ] o.a.s.c.c.ConnectionManager Client is connected to ZooKeeper
   [junit4]   2> 244487 INFO  (jetty-launcher-290-thread-2) [    ] o.a.s.c.c.SolrZkClient Using default ZkACLProvider
   [junit4]   2> 244488 INFO  (jetty-launcher-290-thread-2) [n:127.0.0.1:35788_solr    ] o.a.s.c.ZkController Added new OnReconnect listener org.apache.solr.cloud.ZkController$$Lambda$12/429504657@643775cf
   [junit4]   2> 244483 INFO  (zkCallback-296-thread-1) [    ] o.a.s.c.c.ConnectionManager Watcher org.apache.solr.common.cloud.ConnectionManager@59124a1b name:ZooKeeperConnection Watcher:127.0.0.1:35307 got event WatchedEvent state:SyncConnected type:None path:null path:null type:None
   [junit4]   2> 244489 INFO  (jetty-launcher-290-thread-1) [    ] o.a.s.c.c.ConnectionManager Client is connected to ZooKeeper
   [junit4]   2> 244489 INFO  (jetty-launcher-290-thread-1) [    ] o.a.s.c.c.SolrZkClient Using default ZkACLProvider
   [junit4]   2> 244490 WARN  (NIOServerCxn.Factory:0.0.0.0/0.0.0.0:0) [    ] o.a.z.s.NIOServerCnxn caught end of stream exception
   [junit4]   2> EndOfStreamException: Unable to read additional data from client sessionid 0x15711a3e71d0003, likely client has closed socket
   [junit4]   2> 	at org.apache.zookeeper.server.NIOServerCnxn.doIO(NIOServerCnxn.java:228)
   [junit4]   2> 	at org.apache.zookeeper.server.NIOServerCnxnFactory.run(NIOServerCnxnFactory.java:208)
   [junit4]   2> 	at java.lang.Thread.run(Thread.java:745)
   [junit4]   2> 244501 INFO  (jetty-launcher-290-thread-1) [n:127.0.0.1:56078_solr    ] o.a.s.c.ZkController Added new OnReconnect listener org.apache.solr.cloud.ZkController$$Lambda$12/429504657@2e63844c
   [junit4]   2> 244490 INFO  (jetty-launcher-290-thread-2) [n:127.0.0.1:35788_solr    ] o.a.s.c.c.ConnectionManager Waiting for client to connect to ZooKeeper
   [junit4]   2> 244527 INFO  (jetty-launcher-290-thread-1) [n:127.0.0.1:56078_solr    ] o.a.s.c.c.ConnectionManager Waiting for client to connect to ZooKeeper
   [junit4]   2> 244553 INFO  (zkCallback-300-thread-1-processing-n:127.0.0.1:35788_solr) [n:127.0.0.1:35788_solr    ] o.a.s.c.c.ConnectionManager Watcher org.apache.solr.common.cloud.ConnectionManager@4a8616c name:ZooKeeperConnection Watcher:127.0.0.1:35307/solr got event WatchedEvent state:SyncConnected type:None path:null path:null type:None
   [junit4]   2> 244553 INFO  (jetty-launcher-290-thread-2) [n:127.0.0.1:35788_solr    ] o.a.s.c.c.ConnectionManager Client is connected to ZooKeeper
   [junit4]   2> 244554 INFO  (jetty-launcher-290-thread-2) [n:127.0.0.1:35788_solr    ] o.a.s.c.c.SolrZkClient makePath: /overseer/queue
   [junit4]   2> 244556 INFO  (jetty-launcher-290-thread-2) [n:127.0.0.1:35788_solr    ] o.a.s.c.c.SolrZkClient makePath: /overseer/collection-queue-work
   [junit4]   2> 244558 INFO  (jetty-launcher-290-thread-2) [n:127.0.0.1:35788_solr    ] o.a.s.c.c.SolrZkClient makePath: /overseer/collection-map-running
   [junit4]   2> 244559 INFO  (jetty-launcher-290-thread-2) [n:127.0.0.1:35788_solr    ] o.a.s.c.c.SolrZkClient makePath: /overseer/collection-map-completed
   [junit4]   2> 244560 INFO  (jetty-launcher-290-thread-2) [n:127.0.0.1:35788_solr    ] o.a.s.c.c.SolrZkClient makePath: /overseer/collection-map-failure
   [junit4]   2> 244562 INFO  (jetty-launcher-290-thread-2) [n:127.0.0.1:35788_solr    ] o.a.s.c.c.SolrZkClient makePath: /live_nodes
   [junit4]   2> 244562 INFO  (jetty-launcher-290-thread-2) [n:127.0.0.1:35788_solr    ] o.a.s.c.c.SolrZkClient makePath: /collections
   [junit4]   2> 244563 INFO  (jetty-launcher-290-thread-2) [n:127.0.0.1:35788_solr    ] o.a.s.c.c.SolrZkClient makePath: /aliases.json
   [junit4]   2> 244564 INFO  (jetty-launcher-290-thread-2) [n:127.0.0.1:35788_solr    ] o.a.s.c.c.SolrZkClient makePath: /clusterstate.json
   [junit4]   2> 244565 INFO  (jetty-launcher-290-thread-2) [n:127.0.0.1:35788_solr    ] o.a.s.c.c.SolrZkClient makePath: /security.json
   [junit4]   2> 244566 INFO  (jetty-launcher-290-thread-2) [n:127.0.0.1:35788_solr    ] o.a.s.c.c.ZkStateReader Updating cluster state from ZooKeeper... 
   [junit4]   2> 244566 INFO  (jetty-launcher-290-thread-2) [n:127.0.0.1:35788_solr    ] o.a.s.c.c.ZkStateReader Loaded empty cluster properties
   [junit4]   2> 244567 INFO  (jetty-launcher-290-thread-2) [n:127.0.0.1:35788_solr    ] o.a.s.c.c.ZkStateReader Updated live nodes from ZooKeeper... (0) -> (0)
   [junit4]   2> 244572 INFO  (jetty-launcher-290-thread-2) [n:127.0.0.1:35788_solr    ] o.a.s.c.c.SolrZkClient makePath: /overseer_elect
   [junit4]   2> 244573 INFO  (jetty-launcher-290-thread-2) [n:127.0.0.1:35788_solr    ] o.a.s.c.c.SolrZkClient makePath: /overseer_elect/election
   [junit4]   2> 244574 INFO  (jetty-launcher-290-thread-2) [n:127.0.0.1:35788_solr    ] o.a.s.c.Overseer Overseer (id=null) closing
   [junit4]   2> 244574 INFO  (jetty-launcher-290-thread-2) [n:127.0.0.1:35788_solr    ] o.a.s.c.LeaderElector Joined leadership election with path: /overseer_elect/election/96565312666533893-127.0.0.1:35788_solr-n_0000000000
   [junit4]   2> 244574 INFO  (jetty-launcher-290-thread-2) [n:127.0.0.1:35788_solr    ] o.a.s.c.OverseerElectionContext I am going to be the leader 127.0.0.1:35788_solr
   [junit4]   2> 244574 INFO  (jetty-launcher-290-thread-2) [n:127.0.0.1:35788_solr    ] o.a.s.c.c.SolrZkClient makePath: /overseer_elect/leader
   [junit4]   2> 244575 INFO  (jetty-launcher-290-thread-2) [n:127.0.0.1:35788_solr    ] o.a.s.c.Overseer Overseer (id=96565312666533893-127.0.0.1:35788_solr-n_0000000000) starting
   [junit4]   2> 244577 INFO  (jetty-launcher-290-thread-2) [n:127.0.0.1:35788_solr    ] o.a.s.c.c.SolrZkClient makePath: /overseer/queue-work
   [junit4]   2> 244577 INFO  (zkCallback-301-thread-1-processing-n:127.0.0.1:56078_solr) [n:127.0.0.1:56078_solr    ] o.a.s.c.c.ConnectionManager Watcher org.apache.solr.common.cloud.ConnectionManager@5ad5bff3 name:ZooKeeperConnection Watcher:127.0.0.1:35307/solr got event WatchedEvent state:SyncConnected type:None path:null path:null type:None
   [junit4]   2> 244578 INFO  (jetty-launcher-290-thread-1) [n:127.0.0.1:56078_solr    ] o.a.s.c.c.ConnectionManager Client is connected to ZooKeeper
   [junit4]   2> 244588 INFO  (jetty-launcher-290-thread-1) [n:127.0.0.1:56078_solr    ] o.a.s.c.c.ZkStateReader Updating cluster state from ZooKeeper... 
   [junit4]   2> 244588 INFO  (jetty-launcher-290-thread-1) [n:127.0.0.1:56078_solr    ] o.a.s.c.c.ZkStateReader Loaded empty cluster properties
   [junit4]   2> 244589 INFO  (jetty-launcher-290-thread-1) [n:127.0.0.1:56078_solr    ] o.a.s.c.c.ZkStateReader Updated live nodes from ZooKeeper... (0) -> (0)
   [junit4]   2> 244591 INFO  (jetty-launcher-290-thread-1) [n:127.0.0.1:56078_solr    ] o.a.s.c.Overseer Overseer (id=null) closing
   [junit4]   2> 244592 INFO  (jetty-launcher-290-thread-1) [n:127.0.0.1:56078_solr    ] o.a.s.c.LeaderElector Joined leadership election with path: /overseer_elect/election/96565312666533894-127.0.0.1:56078_solr-n_0000000001
   [junit4]   2> 244592 INFO  (jetty-launcher-290-thread-1) [n:127.0.0.1:56078_solr    ] o.a.s.c.LeaderElector Watching path /overseer_elect/election/96565312666533893-127.0.0.1:35788_solr-n_0000000000 to know if I could be the leader
   [junit4]   2> 244592 INFO  (jetty-launcher-290-thread-1) [n:127.0.0.1:56078_solr    ] o.a.s.c.ZkController Register node as live in ZooKeeper:/live_nodes/127.0.0.1:56078_solr
   [junit4]   2> 244593 INFO  (jetty-launcher-290-thread-1) [n:127.0.0.1:56078_solr    ] o.a.s.c.c.SolrZkClient makePath: /live_nodes/127.0.0.1:56078_solr
   [junit4]   2> 244611 INFO  (zkCallback-301-thread-1-processing-n:127.0.0.1:56078_solr) [n:127.0.0.1:56078_solr    ] o.a.s.c.c.ZkStateReader A live node change: [WatchedEvent state:SyncConnected type:NodeChildrenChanged path:/live_nodes], has occurred - updating... (live nodes size: [0])
   [junit4]   2> 244612 INFO  (zkCallback-300-thread-1-processing-n:127.0.0.1:35788_solr) [n:127.0.0.1:35788_solr    ] o.a.s.c.c.ZkStateReader A live node change: [WatchedEvent state:SyncConnected type:NodeChildrenChanged path:/live_nodes], has occurred - updating... (live nodes size: [0])
   [junit4]   2> 244624 INFO  (zkCallback-301-thread-1-processing-n:127.0.0.1:56078_solr) [n:127.0.0.1:56078_solr    ] o.a.s.c.c.ZkStateReader Updated live nodes from ZooKeeper... (0) -> (1)
   [junit4]   2> 244628 INFO  (jetty-launcher-290-thread-1) [n:127.0.0.1:56078_solr    ] o.a.s.c.CoreContainer Security conf doesn't exist. Skipping setup for authorization module.
   [junit4]   2> 244628 INFO  (jetty-launcher-290-thread-1) [n:127.0.0.1:56078_solr    ] o.a.s.c.CoreContainer Authentication plugin class obtained from system property 'authenticationPlugin': org.apache.solr.security.HttpParamDelegationTokenPlugin
   [junit4]   2> 244630 INFO  (zkCallback-300-thread-1-processing-n:127.0.0.1:35788_solr) [n:127.0.0.1:35788_solr    ] o.a.s.c.c.ZkStateReader Updated live nodes from ZooKeeper... (0) -> (1)
   [junit4]   2> 244633 INFO  (jetty-launcher-290-thread-2) [n:127.0.0.1:35788_solr    ] o.a.s.c.OverseerAutoReplicaFailoverThread Starting OverseerAutoReplicaFailoverThread autoReplicaFailoverWorkLoopDelay=10000 autoReplicaFailoverWaitAfterExpiration=30000 autoReplicaFailoverBadNodeExpiration=60000
   [junit4]   2> 244635 INFO  (OverseerCollectionConfigSetProcessor-96565312666533893-127.0.0.1:35788_solr-n_0000000000) [n:127.0.0.1:35788_solr    ] o.a.s.c.OverseerTaskProcessor Process current queue of overseer operations
   [junit4]   2> 244667 INFO  (jetty-launcher-290-thread-2) [n:127.0.0.1:35788_solr    ] o.a.s.c.ZkController Publish node=127.0.0.1:35788_solr as DOWN
   [junit4]   2> 244667 INFO  (OverseerStateUpdate-96565312666533893-127.0.0.1:35788_solr-n_0000000000) [n:127.0.0.1:35788_solr    ] o.a.s.c.Overseer Starting to work on the main queue
   [junit4]   2> 244683 INFO  (jetty-launcher-290-thread-2) [n:127.0.0.1:35788_solr    ] o.a.s.c.ZkController Register node as live in ZooKeeper:/live_nodes/127.0.0.1:35788_solr
   [junit4]   2> 244683 INFO  (jetty-launcher-290-thread-2) [n:127.0.0.1:35788_solr    ] o.a.s.c.c.SolrZkClient makePath: /live_nodes/127.0.0.1:35788_solr
   [junit4]   2> 244683 INFO  (OverseerStateUpdate-96565312666533893-127.0.0.1:35788_solr-n_0000000000) [n:127.0.0.1:35788_solr    ] o.a.s.c.c.ZkStateReader Updated live nodes from ZooKeeper... (1) -> (1)
   [junit4]   2> 244691 INFO  (zkCallback-301-thread-1-processing-n:127.0.0.1:56078_solr) [n:127.0.0.1:56078_solr    ] o.a.s.c.c.ZkStateReader A live node change: [WatchedEvent state:SyncConnected type:NodeChildrenChanged path:/live_nodes], has occurred - updating... (live nodes size: [1])
   [junit4]   2> 244692 INFO  (zkCallback-300-thread-1-processing-n:127.0.0.1:35788_solr) [n:127.0.0.1:35788_solr    ] o.a.s.c.c.ZkStateReader A live node change: [WatchedEvent state:SyncConnected type:NodeChildrenChanged path:/live_nodes], has occurred - updating... (live nodes size: [1])
   [junit4]   2> 244692 INFO  (zkCallback-301-thread-1-processing-n:127.0.0.1:56078_solr) [n:127.0.0.1:56078_solr    ] o.a.s.c.c.ZkStateReader Updated live nodes from ZooKeeper... (1) -> (2)
   [junit4]   2> 244692 INFO  (zkCallback-300-thread-1-processing-n:127.0.0.1:35788_solr) [n:127.0.0.1:35788_solr    ] o.a.s.c.c.ZkStateReader Updated live nodes from ZooKeeper... (1) -> (2)
   [junit4]   2> 244708 INFO  (OverseerStateUpdate-96565312666533893-127.0.0.1:35788_solr-n_0000000000) [n:127.0.0.1:35788_solr    ] o.a.s.c.Overseer processMessage: queueSize: 1, message = {
   [junit4]   2>   "operation":"downnode",
   [junit4]   2>   "node_name":"127.0.0.1:35788_solr"} current state version: 0
   [junit4]   2> 244708 INFO  (OverseerStateUpdate-96565312666533893-127.0.0.1:35788_solr-n_0000000000) [n:127.0.0.1:35788_solr    ] o.a.s.c.o.NodeMutator DownNode state invoked for node: 127.0.0.1:35788_solr
   [junit4]   2> 244713 INFO  (jetty-launcher-290-thread-2) [n:127.0.0.1:35788_solr    ] o.a.s.c.CoreContainer Security conf doesn't exist. Skipping setup for authorization module.
   [junit4]   2> 244713 INFO  (jetty-launcher-290-thread-2) [n:127.0.0.1:35788_solr    ] o.a.s.c.CoreContainer Authentication plugin class obtained from system property 'authenticationPlugin': org.apache.solr.security.HttpParamDelegationTokenPlugin
   [junit4]   2> 244729 INFO  (jetty-launcher-290-thread-1) [n:127.0.0.1:56078_solr    ] o.a.s.s.KerberosPlugin Params: {token.valid=30, delegation-token.token-kind=solr-dt, cookie.domain=127.0.0.1, cookie.path=/, zk-dt-secret-manager.znodeWorkingPath=solr/security/zkdtsm, token.validity=36000, signer.secret.provider.zookeeper.path=/token, type=kerberos, zk-dt-secret-manager.enable=true, kerberos.name.rules=DEFAULT, signer.secret.provider=zookeeper}
   [junit4]   2> 244735 INFO  (jetty-launcher-290-thread-2) [n:127.0.0.1:35788_solr    ] o.a.s.s.KerberosPlugin Params: {token.valid=30, delegation-token.token-kind=solr-dt, cookie.domain=127.0.0.1, cookie.path=/, zk-dt-secret-manager.znodeWorkingPath=solr/security/zkdtsm, token.validity=36000, signer.secret.provider.zookeeper.path=/token, type=kerberos, zk-dt-secret-manager.enable=true, kerberos.name.rules=DEFAULT, signer.secret.provider=zookeeper}
   [junit4]   2> 245166 INFO  (jetty-launcher-290-thread-2) [n:127.0.0.1:35788_solr    ] o.a.c.f.i.CuratorFrameworkImpl Starting
   [junit4]   2> 245167 INFO  (jetty-launcher-290-thread-1) [n:127.0.0.1:56078_solr    ] o.a.c.f.i.CuratorFrameworkImpl Starting
   [junit4]   2> 245268 INFO  (jetty-launcher-290-thread-1-EventThread) [n:127.0.0.1:56078_solr    ] o.a.c.f.s.ConnectionStateManager State change: CONNECTED
   [junit4]   2> 245271 INFO  (jetty-launcher-290-thread-2-EventThread) [n:127.0.0.1:35788_solr    ] o.a.c.f.s.ConnectionStateManager State change: CONNECTED
   [junit4]   2> 246881 INFO  (jetty-launcher-290-thread-1) [n:127.0.0.1:56078_solr    ] o.a.s.c.CoreContainer Reconfiguring HttpClient settings.
   [junit4]   2> 246881 INFO  (jetty-launcher-290-thread-1) [n:127.0.0.1:56078_solr    ] o.a.s.c.CorePropertiesLocator Looking for core definitions underneath /x1/jenkins/jenkins-slave/workspace/Lucene-Solr-Tests-master/solr/build/solr-core/test/J0/temp/solr.cloud.TestSolrCloudWithDelegationTokens_4C667B4C94BDAE17-001/tempDir-001/node1/.
   [junit4]   2> 246882 INFO  (jetty-launcher-290-thread-1) [n:127.0.0.1:56078_solr    ] o.a.s.c.CorePropertiesLocator Found 0 core definitions
   [junit4]   2> 246897 INFO  (jetty-launcher-290-thread-2) [n:127.0.0.1:35788_solr    ] o.a.s.c.CoreContainer Reconfiguring HttpClient settings.
   [junit4]   2> 246897 INFO  (jetty-launcher-290-thread-2) [n:127.0.0.1:35788_solr    ] o.a.s.c.CorePropertiesLocator Looking for core definitions underneath /x1/jenkins/jenkins-slave/workspace/Lucene-Solr-Tests-master/solr/build/solr-core/test/J0/temp/solr.cloud.TestSolrCloudWithDelegationTokens_4C667B4C94BDAE17-001/tempDir-001/node2/.
   [junit4]   2> 246897 INFO  (jetty-launcher-290-thread-2) [n:127.0.0.1:35788_solr    ] o.a.s.c.CorePropertiesLocator Found 0 core definitions
   [junit4]   2> 246955 INFO  (jetty-launcher-290-thread-2) [n:127.0.0.1:35788_solr    ] o.a.s.s.SolrDispatchFilter user.dir=/x1/jenkins/jenkins-slave/workspace/Lucene-Solr-Tests-master/solr/build/solr-core/test/J0
   [junit4]   2> 246955 INFO  (jetty-launcher-290-thread-2) [n:127.0.0.1:35788_solr    ] o.a.s.s.SolrDispatchFilter SolrDispatchFilter.init() done
   [junit4]   2> 246963 INFO  (jetty-launcher-290-thread-1) [n:127.0.0.1:56078_solr    ] o.a.s.s.SolrDispatchFilter user.dir=/x1/jenkins/jenkins-slave/workspace/Lucene-Solr-Tests-master/solr/build/solr-core/test/J0
   [junit4]   2> 246963 INFO  (jetty-launcher-290-thread-1) [n:127.0.0.1:56078_solr    ] o.a.s.s.SolrDispatchFilter SolrDispatchFilter.init() done
   [junit4]   2> 246967 INFO  (SUITE-TestSolrCloudWithDelegationTokens-seed#[4C667B4C94BDAE17]-worker) [    ] o.a.s.c.c.SolrZkClient Using default ZkCredentialsProvider
   [junit4]   2> 246975 INFO  (SUITE-TestSolrCloudWithDelegationTokens-seed#[4C667B4C94BDAE17]-worker) [    ] o.a.s.c.c.ConnectionManager Waiting for client to connect to ZooKeeper
   [junit4]   2> 246987 INFO  (zkCallback-304-thread-1) [    ] o.a.s.c.c.ConnectionManager Watcher org.apache.solr.common.cloud.ConnectionManager@1ee1d983 name:ZooKeeperConnection Watcher:127.0.0.1:35307 got event WatchedEvent state:SyncConnected type:None path:null path:null type:None
   [junit4]   2> 246987 INFO  (SUITE-TestSolrCloudWithDelegationTokens-seed#[4C667B4C94BDAE17]-worker) [    ] o.a.s.c.c.ConnectionManager Client is connected to ZooKeeper
   [junit4]   2> 246987 INFO  (SUITE-TestSolrCloudWithDelegationTokens-seed#[4C667B4C94BDAE17]-worker) [    ] o.a.s.c.c.SolrZkClient Using default ZkACLProvider
   [junit4]   2> 247099 INFO  (TEST-TestSolrCloudWithDelegationTokens.testDelegationOtherOp-seed#[4C667B4C94BDAE17]) [    ] o.a.s.SolrTestCaseJ4 ###Starting testDelegationOtherOp
   [junit4]   2> 247810 INFO  (qtp1940788455-1665) [n:127.0.0.1:35788_solr    ] o.a.s.h.a.CollectionsHandler Invoked Collection Action :list with params op=someSolrOperation&action=LIST&wt=javabin&version=2 and sendToOCPQueue=true
   [junit4]   2> 247810 INFO  (qtp1940788455-1665) [n:127.0.0.1:35788_solr    ] o.a.s.s.HttpSolrCall [admin] webapp=null path=/admin/collections params={op=someSolrOperation&action=LIST&wt=javabin&version=2} status=0 QTime=0
   [junit4]   2> 247823 WARN  (TEST-TestSolrCloudWithDelegationTokens.testDelegationOtherOp-seed#[4C667B4C94BDAE17]) [    ] o.a.h.c.p.ResponseProcessCookies Invalid cookie header: "Set-Cookie: hadoop.auth="u=bar&p=bar&t=test&e=1473505739658&s=kLsNoFi8KICvTZTj5S1tMP6NDoQ="; Path=/; Domain=127.0.0.1; Expires=Th 7, 10-thg 9-2016 11:08:59 GMT; HttpOnly". Invalid 'expires' attribute: Th 7, 10-thg 9-2016 11:08:59 GMT
   [junit4]   2> 247824 INFO  (TEST-TestSolrCloudWithDelegationTokens.testDelegationOtherOp-seed#[4C667B4C94BDAE17]) [    ] o.a.s.SolrTestCaseJ4 ###Ending testDelegationOtherOp
   [junit4]   2> 247846 INFO  (TEST-TestSolrCloudWithDelegationTokens.testDelegationTokenRenew-seed#[4C667B4C94BDAE17]) [    ] o.a.s.SolrTestCaseJ4 ###Starting testDelegationTokenRenew
   [junit4]   2> 251625 INFO  (qtp1940788455-1667) [n:127.0.0.1:35788_solr    ] o.a.s.h.a.CollectionsHandler Invoked Collection Action :list with params action=LIST&delegation=GgADYmFyA2JhcgCKAVcRo_VmigFXNbB5ZgEEFIzMEwdU-mh_fft2eSJIjCh9McBpB3NvbHItZHQA&wt=javabin&version=2 and sendToOCPQueue=true
   [junit4]   2> 251625 INFO  (qtp1940788455-1667) [n:127.0.0.1:35788_solr    ] o.a.s.s.HttpSolrCall [admin] webapp=null path=/admin/collections params={action=LIST&delegation=GgADYmFyA2JhcgCKAVcRo_VmigFXNbB5ZgEEFIzMEwdU-mh_fft2eSJIjCh9McBpB3NvbHItZHQA&wt=javabin&version=2} status=0 QTime=0
   [junit4]   2> 251647 WARN  (TEST-TestSolrCloudWithDelegationTokens.testDelegationTokenRenew-seed#[4C667B4C94BDAE17]) [    ] o.a.h.c.p.ResponseProcessCookies Invalid cookie header: "Set-Cookie: hadoop.auth=; Path=/; Domain=127.0.0.1; Expires=Th 5, 01-thg 1-1970 00:00:00 GMT; HttpOnly". Invalid 'expires' attribute: Th 5, 01-thg 1-1970 00:00:00 GMT
   [junit4]   2> 251674 INFO  (qtp1275673795-1656) [n:127.0.0.1:56078_solr    ] o.a.s.h.a.CollectionsHandler Invoked Collection Action :list with params action=LIST&delegation=GgADYmFyA2JhcgCKAVcRo_VmigFXNbB5ZgEEFIzMEwdU-mh_fft2eSJIjCh9McBpB3NvbHItZHQA&wt=javabin&version=2 and sendToOCPQueue=true
   [junit4]   2> 251674 INFO  (qtp1275673795-1656) [n:127.0.0.1:56078_solr    ] o.a.s.s.HttpSolrCall [admin] webapp=null path=/admin/collections params={action=LIST&delegation=GgADYmFyA2JhcgCKAVcRo_VmigFXNbB5ZgEEFIzMEwdU-mh_fft2eSJIjCh9McBpB3NvbHItZHQA&wt=javabin&version=2} status=0 QTime=0
   [junit4]   2> 251682 WARN  (TEST-TestSolrCloudWithDelegationTokens.testDelegationTokenRenew-seed#[4C667B4C94BDAE17]) [    ] o.a.h.c.p.ResponseProcessCookies Invalid cookie header: "Set-Cookie: hadoop.auth=; Path=/; Domain=127.0.0.1; Expires=Th 5, 01-thg 1-1970 00:00:00 GMT; HttpOnly". Invalid 'expires' attribute: Th 5, 01-thg 1-1970 00:00:00 GMT
   [junit4]   2> 251808 INFO  (qtp1940788455-1668) [n:127.0.0.1:35788_solr    ] o.a.s.h.a.CollectionsHandler Invoked Collection Action :list with params action=LIST&delegation=GgADYmFyA2JhcgCKAVcRpARRigFXNbCIUQIEFLG_MO-D2Iwwnw2kccSDssbcYP8bB3NvbHItZHQA&wt=javabin&version=2 and sendToOCPQueue=true
   [junit4]   2> 251808 INFO  (qtp1940788455-1668) [n:127.0.0.1:35788_solr    ] o.a.s.s.HttpSolrCall [admin] webapp=null path=/admin/collections params={action=LIST&delegation=GgADYmFyA2JhcgCKAVcRpARRigFXNbCIUQIEFLG_MO-D2Iwwnw2kccSDssbcYP8bB3NvbHItZHQA&wt=javabin&version=2} status=0 QTime=0
   [junit4]   2> 251832 WARN  (TEST-TestSolrCloudWithDelegationTokens.testDelegationTokenRenew-seed#[4C667B4C94BDAE17]) [    ] o.a.h.c.p.ResponseProcessCookies Invalid cookie header: "Set-Cookie: hadoop.auth=; Path=/; Domain=127.0.0.1; Expires=Th 5, 01-thg 1-1970 00:00:00 GMT; HttpOnly". Invalid 'expires' attribute: Th 5, 01-thg 1-1970 00:00:00 GMT
   [junit4]   2> 251849 INFO  (qtp1275673795-1658) [n:127.0.0.1:56078_solr    ] o.a.s.h.a.CollectionsHandler Invoked Collection Action :list with params action=LIST&delegation=GgADYmFyA2JhcgCKAVcRpARRigFXNbCIUQIEFLG_MO-D2Iwwnw2kccSDssbcYP8bB3NvbHItZHQA&wt=javabin&version=2 and sendToOCPQueue=true
   [junit4]   2> 251849 INFO  (qtp1275673795-1658) [n:127.0.0.1:56078_solr    ] o.a.s.s.HttpSolrCall [admin] webapp=null path=/admin/collections params={action=LIST&delegation=GgADYmFyA2JhcgCKAVcRpARRigFXNbCIUQIEFLG_MO-D2Iwwnw2kccSDssbcYP8bB3NvbHItZHQA&wt=javabin&version=2} status=0 QTime=0
   [junit4]   2> 252167 WARN  (TEST-TestSolrCloudWithDelegationTokens.testDelegationTokenRenew-seed#[4C667B4C94BDAE17]) [    ] o.a.h.c.p.ResponseProcessCookies Invalid cookie header: "Set-Cookie: hadoop.auth=; Path=/; Domain=127.0.0.1; Expires=Th 5, 01-thg 1-1970 00:00:00 GMT; HttpOnly". Invalid 'expires' attribute: Th 5, 01-thg 1-1970 00:00:00 GMT
   [junit4]   2> 252241 INFO  (qtp1940788455-1665) [n:127.0.0.1:35788_solr    ] o.a.s.h.a.CollectionsHandler Invoked Collection Action :list with params action=LIST&delegation=GgADYmFyA2JhcgCKAVcRpAY4igFXNbCKOAMEFLLCl_vBcOuXse_04tMB9e25XDQMB3NvbHItZHQA&wt=javabin&version=2 and sendToOCPQueue=true
   [junit4]   2> 252241 INFO  (qtp1940788455-1665) [n:127.0.0.1:35788_solr    ] o.a.s.s.HttpSolrCall [admin] webapp=null path=/admin/collections params={action=LIST&delegation=GgADYmFyA2JhcgCKAVcRpAY4igFXNbCKOAMEFLLCl_vBcOuXse_04tMB9e25XDQMB3NvbHItZHQA&wt=javabin&version=2} status=0 QTime=0
   [junit4]   2> 252273 WARN  (TEST-TestSolrCloudWithDelegationTokens.testDelegationTokenRenew-seed#[4C667B4C94BDAE17]) [    ] o.a.h.c.p.ResponseProcessCookies Invalid cookie header: "Set-Cookie: hadoop.auth=; Path=/; Domain=127.0.0.1; Expires=Th 5, 01-thg 1-1970 00:00:00 GMT; HttpOnly". Invalid 'expires' attribute: Th 5, 01-thg 1-1970 00:00:00 GMT
   [junit4]   2> 252285 INFO  (qtp1275673795-1658) [n:127.0.0.1:56078_solr    ] o.a.s.h.a.CollectionsHandler Invoked Collection Action :list with params action=LIST&delegation=GgADYmFyA2JhcgCKAVcRpAY4igFXNbCKOAMEFLLCl_vBcOuXse_04tMB9e25XDQMB3NvbHItZHQA&wt=javabin&version=2 and sendToOCPQueue=true
   [junit4]   2> 252285 INFO  (qtp1275673795-1658) [n:127.0.0.1:56078_solr    ] o.a.s.s.HttpSolrCall [admin] webapp=null path=/admin/collections params={action=LIST&delegation=GgADYmFyA2JhcgCKAVcRpAY4igFXNbCKOAMEFLLCl_vBcOuXse_04tMB9e25XDQMB3NvbHItZHQA&wt=javabin&version=2} status=0 QTime=0
   [junit4]   2> 252308 WARN  (TEST-TestSolrCloudWithDelegationTokens.testDelegationTokenRenew-seed#[4C667B4C94BDAE17]) [    ] o.a.h.c.p.ResponseProcessCookies Invalid cookie header: "Set-Cookie: hadoop.auth=; Path=/; Domain=127.0.0.1; Expires=Th 5, 01-thg 1-1970 00:00:00 GMT; HttpOnly". Invalid 'expires' attribute: Th 5, 01-thg 1-1970 00:00:00 GMT
   [junit4]   2> 252385 INFO  (qtp1940788455-1665) [n:127.0.0.1:35788_solr    ] o.a.s.h.a.CollectionsHandler Invoked Collection Action :list with params action=LIST&delegation=GgADYmFyA2JhcgCKAVcRpAbFigFXNbCKxQQEFDOIdgZMlRq2MjYQCeFzhJnVNiVoB3NvbHItZHQA&wt=javabin&version=2 and sendToOCPQueue=true
   [junit4]   2> 252385 INFO  (qtp1940788455-1665) [n:127.0.0.1:35788_solr    ] o.a.s.s.HttpSolrCall [admin] webapp=null path=/admin/collections params={action=LIST&delegation=GgADYmFyA2JhcgCKAVcRpAbFigFXNbCKxQQEFDOIdgZMlRq2MjYQCeFzhJnVNiVoB3NvbHItZHQA&wt=javabin&version=2} status=0 QTime=0
   [junit4]   2> 252401 WARN  (TEST-TestSolrCloudWithDelegationTokens.testDelegationTokenRenew-seed#[4C667B4C94BDAE17]) [    ] o.a.h.c.p.ResponseProcessCookies Invalid cookie header: "Set-Cookie: hadoop.auth=; Path=/; Domain=127.0.0.1; Expires=Th 5, 01-thg 1-1970 00:00:00 GMT; HttpOnly". Invalid 'expires' attribute: Th 5, 01-thg 1-1970 00:00:00 GMT
   [junit4]   2> 252410 INFO  (qtp1275673795-1660) [n:127.0.0.1:56078_solr    ] o.a.s.h.a.CollectionsHandler Invoked Collection Action :list with params action=LIST&delegation=GgADYmFyA2JhcgCKAVcRpAbFigFXNbCKxQQEFDOIdgZMlRq2MjYQCeFzhJnVNiVoB3NvbHItZHQA&wt=javabin&version=2 and sendToOCPQueue=true
   [junit4]   2> 252410 INFO  (qtp1275673795-1660) [n:127.0.0.1:56078_solr    ] o.a.s.s.HttpSolrCall [admin] webapp=null path=/admin/collections params={action=LIST&delegation=GgADYmFyA2JhcgCKAVcRpAbFigFXNbCKxQQEFDOIdgZMlRq2MjYQCeFzhJnVNiVoB3NvbHItZHQA&wt=javabin&version=2} status=0 QTime=0
   [junit4]   2> 252423 WARN  (TEST-TestSolrCloudWithDelegationTokens.testDelegationTokenRenew-seed#[4C667B4C94BDAE17]) [    ] o.a.h.c.p.ResponseProcessCookies Invalid cookie header: "Set-Cookie: hadoop.auth=; Path=/; Domain=127.0.0.1; Expires=Th 5, 01-thg 1-1970 00:00:00 GMT; HttpOnly". Invalid 'expires' attribute: Th 5, 01-thg 1-1970 00:00:00 GMT
   [junit4]   2> 252423 INFO  (TEST-TestSolrCloudWithDelegationTokens.testDelegationTokenRenew-seed#[4C667B4C94BDAE17]) [    ] o.a.s.SolrTestCaseJ4 ###Ending testDelegationTokenRenew
   [junit4]   2> 252451 INFO  (TEST-TestSolrCloudWithDelegationTokens.testDelegationTokenCancelFail-seed#[4C667B4C94BDAE17]) [    ] o.a.s.SolrTestCaseJ4 ###Starting testDelegationTokenCancelFail
   [junit4]   2> 252788 ERROR (qtp1275673795-1660) [n:127.0.0.1:56078_solr    ] o.a.h.s.t.d.ZKDelegationTokenSecretManager No node in path [/ZKDTSMTokensRoot/DT_5]
   [junit4]   2> 252807 ERROR (qtp1940788455-1667) [n:127.0.0.1:35788_solr    ] o.a.h.s.t.d.ZKDelegationTokenSecretManager No node in path [/ZKDTSMTokensRoot/DT_5]
   [junit4]   2> 252822 ERROR (qtp1275673795-1653) [    ] o.a.h.s.t.d.ZKDelegationTokenSecretManager No node in path [/ZKDTSMTokensRoot/DT_6]
   [junit4]   2> 252824 INFO  (TEST-TestSolrCloudWithDelegationTokens.testDelegationTokenCancelFail-seed#[4C667B4C94BDAE17]) [    ] o.a.s.SolrTestCaseJ4 ###Ending testDelegationTokenCancelFail
   [junit4]   2> NOTE: reproduce with: ant test  -Dtestcase=TestSolrCloudWithDelegationTokens -Dtests.method=testDelegationTokenCancelFail -Dtests.seed=4C667B4C94BDAE17 -Dtests.multiplier=2 -Dtests.slow=true -Dtests.locale=vi -Dtests.timezone=ROK -Dtests.asserts=true -Dtests.file.encoding=UTF-8
   [junit4] FAILURE 0.41s J0 | TestSolrCloudWithDelegationTokens.testDelegationTokenCancelFail <<<
   [junit4]    > Throwable #1: java.lang.AssertionError: expected:<200> but was:<404>
   [junit4]    > 	at __randomizedtesting.SeedInfo.seed([4C667B4C94BDAE17:24D94E664427BCFB]:0)
   [junit4]    > 	at org.apache.solr.cloud.TestSolrCloudWithDelegationTokens.cancelDelegationToken(TestSolrCloudWithDelegationTokens.java:137)
   [junit4]    > 	at org.apache.solr.cloud.TestSolrCloudWithDelegationTokens.testDelegationTokenCancelFail(TestSolrCloudWithDelegationTokens.java:292)
   [junit4]    > 	at java.lang.Thread.run(Thread.java:745)
   [junit4]   2> 252877 INFO  (TEST-TestSolrCloudWithDelegationTokens.testDelegationTokenCancel-seed#[4C667B4C94BDAE17]) [    ] o.a.s.SolrTestCaseJ4 ###Starting testDelegationTokenCancel
   [junit4]   2> 252896 ERROR (qtp1940788455-1663) [    ] o.a.h.s.t.d.ZKDelegationTokenSecretManager No node in path [/ZKDTSMTokensRoot/DT_7]
   [junit4]   2> 252982 WARN  (TEST-TestSolrCloudWithDelegationTokens.testDelegationTokenCancel-seed#[4C667B4C94BDAE17]) [    ] o.a.h.c.p.ResponseProcessCookies Invalid cookie header: "Set-Cookie: hadoop.auth=; Path=/; Domain=127.0.0.1; Expires=Th 5, 01-thg 1-1970 00:00:00 GMT; HttpOnly". Invalid 'expires' attribute: Th 5, 01-thg 1-1970 00:00:00 GMT
   [junit4]   2> 252987 WARN  (TEST-TestSolrCloudWithDelegationTokens.testDelegationTokenCancel-seed#[4C667B4C94BDAE17]) [    ] o.a.h.c.p.ResponseProcessCookies Invalid cookie header: "Set-Cookie: hadoop.auth=; Path=/; Domain=127.0.0.1; Expires=Th 5, 01-thg 1-1970 00:00:00 GMT; HttpOnly". Invalid 'expires' attribute: Th 5, 01-thg 1-1970 00:00:00 GMT
   [junit4]   2> 253025 ERROR (qtp1275673795-1658) [n:127.0.0.1:56078_solr    ] o.a.h.s.t.d.ZKDelegationTokenSecretManager No node in path [/ZKDTSMTokensRoot/DT_8]
   [junit4]   2> 253034 WARN  (TEST-TestSolrCloudWithDelegationTokens.testDelegationTokenCancel-seed#[4C667B4C94BDAE17]) [    ] o.a.h.c.p.ResponseProcessCookies Invalid cookie header: "Set-Cookie: hadoop.auth=; Path=/; Domain=127.0.0.1; Expires=Th 5, 01-thg 1-1970 00:00:00 GMT; HttpOnly". Invalid 'expires' attribute: Th 5, 01-thg 1-1970 00:00:00 GMT
   [junit4]   2> 253041 WARN  (TEST-TestSolrCloudWithDelegationTokens.testDelegationTokenCancel-seed#[4C667B4C94BDAE17]) [    ] o.a.h.c.p.ResponseProcessCookies Invalid cookie header: "Set-Cookie: hadoop.auth=; Path=/; Domain=127.0.0.1; Expires=Th 5, 01-thg 1-1970 00:00:00 GMT; HttpOnly". Invalid 'expires' attribute: Th 5, 01-thg 1-1970 00:00:00 GMT
   [junit4]   2> 253041 INFO  (TEST-TestSolrCloudWithDelegationTokens.testDelegationTokenCancel-seed#[4C667B4C94BDAE17]) [    ] o.a.s.SolrTestCaseJ4 ###Ending testDelegationTokenCancel
   [junit4]   2> 253098 INFO  (TEST-TestSolrCloudWithDelegationTokens.testZNodePaths-seed#[4C667B4C94BDAE17]) [    ] o.a.s.SolrTestCaseJ4 ###Starting testZNodePaths
   [junit4]   2> 253108 INFO  (TEST-TestSolrCloudWithDelegationTokens.testZNodePaths-seed#[4C667B4C94BDAE17]) [    ] o.a.s.c.c.SolrZkClient Using default ZkCredentialsProvider
   [junit4]   2> 253121 INFO  (TEST-TestSolrCloudWithDelegationTokens.testZNodePaths-seed#[4C667B4C94BDAE17]) [    ] o.a.s.c.c.ConnectionManager Waiting for client to connect to ZooKeeper
   [junit4]   2> 253156 INFO  (zkCallback-306-thread-1) [    ] o.a.s.c.c.ConnectionManager Watcher org.apache.solr.common.cloud.ConnectionManager@59c013e5 name:ZooKeeperConnection Watcher:127.0.0.1:35307/solr got event WatchedEvent state:SyncConnected type:None path:null path:null type:None
   [junit4]   2> 253157 INFO  (TEST-TestSolrCloudWithDelegationTokens.testZNodePaths-seed#[4C667B4C94BDAE17]) [    ] o.a.s.c.c.ConnectionManager Client is connected to ZooKeeper
   [junit4]   2> 253157 INFO  (TEST-TestSolrCloudWithDelegationTokens.testZNodePaths-seed#[4C667B4C94BDAE17]) [    ] o.a.s.c.c.SolrZkClient Using default ZkACLProvider
   [junit4]   2> 253160 INFO  (TEST-TestSolrCloudWithDelegationTokens.testZNodePaths-seed#[4C667B4C94BDAE17]) [    ] o.a.s.SolrTestCaseJ4 ###Ending testZNodePaths
   [junit4]   2> 253200 INFO  (TEST-TestSolrCloudWithDelegationTokens.testDelegationTokenSolrClient-seed#[4C667B4C94BDAE17]) [    ] o.a.s.SolrTestCaseJ4 ###Starting testDelegationTokenSolrClient
   [junit4]   2> 253231 WARN  (TEST-TestSolrCloudWithDelegationTokens.testDelegationTokenSolrClient-seed#[4C667B4C94BDAE17]) [    ] o.a.h.c.p.ResponseProcessCookies Invalid cookie header: "Set-Cookie: hadoop.auth=; Path=/; Domain=127.0.0.1; Expires=Th 5, 01-thg 1-1970 00:00:00 GMT; HttpOnly". Invalid 'expires' attribute: Th 5, 01-thg 1-1970 00:00:00 GMT
   [junit4]   2> 253236 INFO  (qtp1940788455-1667) [n:127.0.0.1:35788_solr    ] o.a.s.h.a.CollectionsHandler Invoked Collection Action :list with params action=LIST&delegation=GgADYmFyA2JhcgCKAVcRpAo_igFXNbCOPwoEFCfVFnNA9gmb-IffPA8HKCLLrvCFB3NvbHItZHQA&wt=javabin&version=2 and sendToOCPQueue=true
   [junit4]   2> 253236 INFO  (qtp1940788455-1667) [n:127.0.0.1:35788_solr    ] o.a.s.s.HttpSolrCall [admin] webapp=null path=/admin/collections params={action=LIST&delegation=GgADYmFyA2JhcgCKAVcRpAo_igFXNbCOPwoEFCfVFnNA9gmb-IffPA8HKCLLrvCFB3NvbHItZHQA&wt=javabin&version=2} status=0 QTime=0
   [junit4]   2> 253241 INFO  (TEST-TestSolrCloudWithDelegationTokens.testDelegationTokenSolrClient-seed#[4C667B4C94BDAE17]) [    ] o.a.s.SolrTestCaseJ4 ###Ending testDelegationTokenSolrClient
   [junit4]   2> 253319 INFO  (TEST-TestSolrCloudWithDelegationTokens.testDelegationTokenRenewFail-seed#[4C667B4C94BDAE17]) [    ] o.a.s.SolrTestCaseJ4 ###Starting testDelegationTokenRenewFail
   [junit4]   2> 253340 WARN  (qtp1940788455-1662) [    ] o.a.h.s.a.s.AuthenticationFilter Authentication exception: org.apache.hadoop.security.AccessControlException: foo tries to renew a token with renewer bar
   [junit4]   2> 253340 WARN  (qtp1940788455-1662) [    ] o.a.s.s.KerberosPlugin Could not find org.apache.solr.security.kerberosplugin.requestcontinues
   [junit4]   2> 253347 WARN  (TEST-TestSolrCloudWithDelegationTokens.testDelegationTokenRenewFail-seed#[4C667B4C94BDAE17]) [    ] o.a.h.c.p.ResponseProcessCookies Invalid cookie header: "Set-Cookie: hadoop.auth=; Path=/; Domain=127.0.0.1; Expires=Th 5, 01-thg 1-1970 00:00:00 GMT; HttpOnly". Invalid 'expires' attribute: Th 5, 01-thg 1-1970 00:00:00 GMT
   [junit4]   2> 253377 WARN  (qtp1275673795-1660) [n:127.0.0.1:56078_solr    ] o.a.h.s.a.s.AuthenticationFilter Authentication exception: org.apache.hadoop.security.AccessControlException: foo tries to renew a token with renewer bar
   [junit4]   2> 253378 WARN  (qtp1275673795-1660) [n:127.0.0.1:56078_solr    ] o.a.s.s.KerberosPlugin Could not find org.apache.solr.security.kerberosplugin.requestcontinues
   [junit4]   2> 253378 WARN  (TEST-TestSolrCloudWithDelegationTokens.testDelegationTokenRenewFail-seed#[4C667B4C94BDAE17]) [    ] o.a.h.c.p.ResponseProcessCookies Invalid cookie header: "Set-Cookie: hadoop.auth=; Path=/; Domain=127.0.0.1; Expires=Th 5, 01-thg 1-1970 00:00:00 GMT; HttpOnly". Invalid 'expires' attribute: Th 5, 01-thg 1-1970 00:00:00 GMT
   [junit4]   2> 253511 WARN  (qtp1940788455-1662) [    ] o.a.h.s.a.s.AuthenticationFilter Authentication exception: org.apache.hadoop.security.AccessControlException: notRenewUser tries to renew a token with renewer renewUser
   [junit4]   2> 253512 WARN  (qtp1940788455-1662) [    ] o.a.s.s.KerberosPlugin Could not find org.apache.solr.security.kerberosplugin.requestcontinues
   [junit4]   2> 253519 WARN  (TEST-TestSolrCloudWithDelegationTokens.testDelegationTokenRenewFail-seed#[4C667B4C94BDAE17]) [    ] o.a.h.c.p.ResponseProcessCookies Invalid cookie header: "Set-Cookie: hadoop.auth=; Path=/; Domain=127.0.0.1; Expires=Th 5, 01-thg 1-1970 00:00:00 GMT; HttpOnly". Invalid 'expires' attribute: Th 5, 01-thg 1-1970 00:00:00 GMT
   [junit4]   2> 253520 WARN  (qtp1275673795-1658) [n:127.0.0.1:56078_solr    ] o.a.h.s.a.s.AuthenticationFilter Authentication exception: org.apache.hadoop.security.AccessControlException: notRenewUser tries to renew a token with renewer renewUser
   [junit4]   2> 253521 WARN  (qtp1275673795-1658) [n:127.0.0.1:56078_solr    ] o.a.s.s.KerberosPlugin Could not find org.apache.solr.security.kerberosplugin.requestcontinues
   [junit4]   2> 253525 WARN  (TEST-TestSolrCloudWithDelegationTokens.testDelegationTokenRenewFail-seed#[4C667B4C94BDAE17]) [    ] o.a.h.c.p.ResponseProcessCookies Invalid cookie header: "Set-Cookie: hadoop.auth=; Path=/; Domain=127.0.0.1; Expires=Th 5, 01-thg 1-1970 00:00:00 GMT; HttpOnly". Invalid 'expires' attribute: Th 5, 01-thg 1-1970 00:00:00 GMT
   [junit4]   2> 253543 INFO  (TEST-TestSolrCloudWithDelegationTokens.testDelegationTokenRenewFail-seed#[4C667B4C94BDAE17]) [    ] o.a.s.SolrTestCaseJ4 ###Ending testDelegationTokenRenewFail
   [junit4]   2> 253708 INFO  (TEST-TestSolrCloudWithDelegationTokens.testDelegationTokenVerify-seed#[4C667B4C94BDAE17]) [    ] o.a.s.SolrTestCaseJ4 ###Starting testDelegationTokenVerify
   [junit4]   2> 253737 INFO  (qtp1940788455-1667) [n:127.0.0.1:35788_solr    ] o.a.s.h.a.CollectionsHandler Invoked Collection Action :list with params action=LIST&delegation=GgADYmFyA2JhcgCKAVcRpAw7igFXNbCQOw0EFAjcnuMHC4kZziv_uaGO8HrCLzdWB3NvbHItZHQA&wt=javabin&version=2 and sendToOCPQueue=true
   [junit4]   2> 253737 INFO  (qtp1940788455-1667) [n:127.0.0.1:35788_solr    ] o.a.s.s.HttpSolrCall [admin] webapp=null path=/admin/collections params={action=LIST&delegation=GgADYmFyA2JhcgCKAVcRpAw7igFXNbCQOw0EFAjcnuMHC4kZziv_uaGO8HrCLzdWB3NvbHItZHQA&wt=javabin&version=2} status=0 QTime=0
   [junit4]   2> 253746 WARN  (TEST-TestSolrCloudWithDelegationTokens.testDelegationTokenVerify-seed#[4C667B4C94BDAE17]) [    ] o.a.h.c.p.ResponseProcessCookies Invalid cookie header: "Set-Cookie: hadoop.auth=; Path=/; Domain=127.0.0.1; Expires=Th 5, 01-thg 1-1970 00:00:00 GMT; HttpOnly". Invalid 'expires' attribute: Th 5, 01-thg 1-1970 00:00:00 GMT
   [junit4]   2> 253780 INFO  (qtp1275673795-1657) [n:127.0.0.1:56078_solr    ] o.a.s.h.a.CollectionsHandler Invoked Collection Action :list with params action=LIST&delegation=GgADYmFyA2JhcgCKAVcRpAw7igFXNbCQOw0EFAjcnuMHC4kZziv_uaGO8HrCLzdWB3NvbHItZHQA&wt=javabin&version=2 and sendToOCPQueue=true
   [junit4]   2> 253780 INFO  (qtp1275673795-1657) [n:127.0.0.1:56078_solr    ] o.a.s.s.HttpSolrCall [admin] webapp=null path=/admin/collections params={action=LIST&delegation=GgADYmFyA2JhcgCKAVcRpAw7igFXNbCQOw0EFAjcnuMHC4kZziv_uaGO8HrCLzdWB3NvbHItZHQA&wt=javabin&version=2} status=0 QTime=0
   [junit4]   2> 253800 WARN  (TEST-TestSolrCloudWithDelegationTokens.testDelegationTokenVerify-seed#[4C667B4C94BDAE17]) [    ] o.a.h.c.p.ResponseProcessCookies Invalid cookie header: "Set-Cookie: hadoop.auth=; Path=/; Domain=127.0.0.1; Expires=Th 5, 01-thg 1-1970 00:00:00 GMT; HttpOnly". Invalid 'expires' attribute: Th 5, 01-thg 1-1970 00:00:00 GMT
   [junit4]   2> 253800 INFO  (TEST-TestSolrCloudWithDelegationTokens.testDelegationTokenVerify-seed#[4C667B4C94BDAE17]) [    ] o.a.s.SolrTestCaseJ4 ###Ending testDelegationTokenVerify
   [junit4]   2> 253802 INFO  (jetty-launcher-290-thread-1) [    ] o.e.j.s.ServerConnector Stopped ServerConnector@160244da{HTTP/1.1,[http/1.1]}{127.0.0.1:0}
   [junit4]   2> 253803 INFO  (jetty-launcher-290-thread-1) [    ] o.a.s.c.CoreContainer Shutting down CoreContainer instance=1658368320
   [junit4]   2> 253803 INFO  (jetty-launcher-290-thread-1) [    ] o.a.s.c.ZkController Publish node=127.0.0.1:35788_solr as DOWN
   [junit4]   2> 253811 INFO  (jetty-launcher-290-thread-2) [    ] o.e.j.s.ServerConnector Stopped ServerConnector@3606358e{HTTP/1.1,[http/1.1]}{127.0.0.1:0}
   [junit4]   2> 253820 INFO  (OverseerStateUpdate-96565312666533893-127.0.0.1:35788_solr-n_0000000000) [n:127.0.0.1:35788_solr    ] o.a.s.c.Overseer processMessage: queueSize: 1, message = {
   [junit4]   2>   "operation":"downnode",
   [junit4]   2>   "node_name":"127.0.0.1:35788_solr"} current state version: 0
   [junit4]   2> 253820 INFO  (OverseerStateUpdate-96565312666533893-127.0.0.1:35788_solr-n_0000000000) [n:127.0.0.1:35788_solr    ] o.a.s.c.o.NodeMutator DownNode state invoked for node: 127.0.0.1:35788_solr
   [junit4]   2> 253821 INFO  (jetty-launcher-290-thread-2) [    ] o.a.s.c.CoreContainer Shutting down CoreContainer instance=121998111
   [junit4]   2> 253821 INFO  (jetty-launcher-290-thread-1) [    ] o.a.s.c.Overseer Overseer (id=96565312666533893-127.0.0.1:35788_solr-n_0000000000) closing
   [junit4]   2> 253822 INFO  (jetty-launcher-290-thread-2) [    ] o.a.s.c.ZkController Publish node=127.0.0.1:56078_solr as DOWN
   [junit4]   2> 253822 INFO  (OverseerStateUpdate-96565312666533893-127.0.0.1:35788_solr-n_0000000000) [n:127.0.0.1:35788_solr    ] o.a.s.c.Overseer Overseer Loop exiting : 127.0.0.1:35788_solr
   [junit4]   2> 253824 INFO  (zkCallback-300-thread-1-processing-n:127.0.0.1:35788_solr) [n:127.0.0.1:35788_solr    ] o.a.s.c.c.ZkStateReader A live node change: [WatchedEvent state:SyncConnected type:NodeChildrenChanged path:/live_nodes], has occurred - updating... (live nodes size: [2])
   [junit4]   2> 253824 WARN  (zkCallback-300-thread-1-processing-n:127.0.0.1:35788_solr) [n:127.0.0.1:35788_solr    ] o.a.s.c.c.ZkStateReader ZooKeeper watch triggered, but Solr cannot talk to ZK: [KeeperErrorCode = Session expired for /live_nodes]
   [junit4]   2> 253832 ERROR (Thread[Thread-352,5,TGRP-TestSolrCloudWithDelegationTokens]) [n:127.0.0.1:35788_solr    ] o.a.h.s.t.d.AbstractDelegationTokenSecretManager ExpiredTokenRemover received java.lang.InterruptedException: sleep interrupted
   [junit4]   2> 253833 INFO  (zkCallback-301-thread-1-processing-n:127.0.0.1:56078_solr) [n:127.0.0.1:56078_solr    ] o.a.s.c.OverseerElectionContext I am going to be the leader 127.0.0.1:56078_solr
   [junit4]   2> 253833 INFO  (zkCallback-301-thread-1-processing-n:127.0.0.1:56078_solr) [n:127.0.0.1:56078_solr    ] o.a.s.c.c.SolrZkClient makePath: /overseer_elect/leader
   [junit4]   2> 253834 INFO  (zkCallback-301-thread-1-processing-n:127.0.0.1:56078_solr) [n:127.0.0.1:56078_solr    ] o.a.s.c.Overseer Overseer (id=96565312666533894-127.0.0.1:56078_solr-n_0000000001) starting
   [junit4]   2> 253999 INFO  (zkCallback-301-thread-2-processing-n:127.0.0.1:56078_solr) [n:127.0.0.1:56078_solr    ] o.a.s.c.c.ZkStateReader A live node change: [WatchedEvent state:SyncConnected type:NodeChildrenChanged path:/live_nodes], has occurred - updating... (live nodes size: [2])
   [junit4]   2> 254003 INFO  (zkCallback-301-thread-2-processing-n:127.0.0.1:56078_solr) [n:127.0.0.1:56078_solr    ] o.a.s.c.c.ZkStateReader Updated live nodes from ZooKeeper... (2) -> (1)
   [junit4]   2> 254005 INFO  (zkCallback-301-thread-1-processing-n:127.0.0.1:56078_solr) [n:127.0.0.1:56078_solr    ] o.a.s.c.OverseerAutoReplicaFailoverThread Starting OverseerAutoReplicaFailoverThread autoReplicaFailoverWorkLoopDelay=10000 autoReplicaFailoverWaitAfterExpiration=30000 autoReplicaFailoverBadNodeExpiration=60000
   [junit4]   2> 254008 INFO  (OverseerStateUpdate-96565312666533894-127.0.0.1:56078_solr-n_0000000001) [n:127.0.0.1:56078_solr    ] o.a.s.c.Overseer Starting to work on the main queue
   [junit4]   2> 254010 INFO  (OverseerStateUpdate-96565312666533894-127.0.0.1:56078_solr-n_0000000001) [n:127.0.0.1:56078_solr    ] o.a.s.c.c.ZkStateReader Updated live nodes from ZooKeeper... (1) -> (1)
   [junit4]   2> 254011 INFO  (OverseerStateUpdate-96565312666533894-127.0.0.1:56078_solr-n_0000000001) [n:127.0.0.1:56078_solr    ] o.a.s.c.Overseer processMessage: queueSize: 1, message = {
   [junit4]   2>   "operation":"downnode",
   [junit4]   2>   "node_name":"127.0.0.1:56078_solr"} current state version: 0
   [junit4]   2> 254011 INFO  (OverseerStateUpdate-96565312666533894-127.0.0.1:56078_solr-n_0000000001) [n:127.0.0.1:56078_solr    ] o.a.s.c.o.NodeMutator DownNode state invoked for node: 127.0.0.1:56078_solr
   [junit4]   2> 254013 INFO  (OverseerCollectionConfigSetProcessor-96565312666533894-127.0.0.1:56078_solr-n_0000000001) [n:127.0.0.1:56078_solr    ] o.a.s.c.OverseerTaskProcessor Process current queue of overseer operations
   [junit4]   2> 254017 INFO  (jetty-launcher-290-thread-2) [    ] o.a.s.c.Overseer Overseer (id=96565312666533894-127.0.0.1:56078_solr-n_0000000001) closing
   [junit4]   2> 254018 INFO  (zkCallback-301-thread-2-processing-n:127.0.0.1:56078_solr) [n:127.0.0.1:56078_solr    ] o.a.s.c.c.ZkStateReader A live node change: [WatchedEvent state:SyncConnected type:NodeChildrenChanged path:/live_nodes], has occurred - updating... (live nodes size: [1])
   [junit4]   2> 254031 INFO  (OverseerStateUpdate-96565312666533894-127.0.0.1:56078_solr-n_0000000001) [n:127.0.0.1:56078_solr    ] o.a.s.c.Overseer Overseer Loop exiting : 127.0.0.1:56078_solr
   [junit4]   2> 254092 INFO  (jetty-launcher-290-thread-1) [    ] o.e.j.s.h.ContextHandler Stopped o.e.j.s.ServletContextHandler@42867335{/solr,null,UNAVAILABLE}
   [junit4]   2> 255519 WARN  (zkCallback-301-thread-2-processing-n:127.0.0.1:56078_solr) [n:127.0.0.1:56078_solr    ] o.a.s.c.c.ZkStateReader ZooKeeper watch triggered, but Solr cannot talk to ZK: [KeeperErrorCode = Session expired for /live_nodes]
   [junit4]   2> 255519 ERROR (Thread[Thread-350,5,TGRP-TestSolrCloudWithDelegationTokens]) [n:127.0.0.1:56078_solr    ] o.a.h.s.t.d.AbstractDelegationTokenSecretManager ExpiredTokenRemover received java.lang.InterruptedException: sleep interrupted
   [junit4]   2> 255522 INFO  (jetty-launcher-290-thread-2) [    ] o.e.j.s.h.ContextHandler Stopped o.e.j.s.ServletContextHandler@70d6d248{/solr,null,UNAVAILABLE}
   [junit4]   2> 255523 INFO  (SUITE-TestSolrCloudWithDelegationTokens-seed#[4C667B4C94BDAE17]-worker) [    ] o.a.s.c.ZkTestServer connecting to 127.0.0.1:35307 35307
   [junit4]   2> 255627 INFO  (Thread-332) [    ] o.a.s.c.ZkTestServer connecting to 127.0.0.1:35307 35307
   [junit4]   2> 255628 WARN  (Thread-332) [    ] o.a.s.c.ZkTestServer Watch limit violations: 
   [junit4]   2> Maximum concurrent create/delete watches above limit:
   [junit4]   2> 
   [junit4]   2> 	2	/solr/aliases.json
   [junit4]   2> 	2	/solr/security.json
   [junit4]   2> 	2	/solr/clusterprops.json
   [junit4]   2> 
   [junit4]   2> Maximum concurrent data watches above limit:
   [junit4]   2> 
   [junit4]   2> 	3	/solr/security/zkdtsm/ZKDTSMRoot/ZKDTSMKeyIdRoot
   [junit4]   2> 	2	/solr/security/zkdtsm/ZKDTSMRoot/ZKDTSMTokensRoot/DT_7
   [junit4]   2> 	2	/solr/security/zkdtsm/ZKDTSMRoot/ZKDTSMTokensRoot/DT_6
   [junit4]   2> 	2	/solr/security/zkdtsm/ZKDTSMRoot/ZKDTSMTokensRoot/DT_9
   [junit4]   2> 	2	/solr/security/zkdtsm/ZKDTSMRoot/ZKDTSMMasterKeyRoot/DK_1
   [junit4]   2> 	2	/solr/security/zkdtsm/ZKDTSMRoot/ZKDTSMTokensRoot/DT_1
   [junit4]   2> 	2	/solr/security/zkdtsm/ZKDTSMRoot/ZKDTSMMasterKeyRoot/DK_3
   [junit4]   2> 	2	/solr/security/zkdtsm/ZKDTSMRoot/ZKDTSMTokensRoot/DT_3
   [junit4]   2> 	2	/solr/security/zkdtsm/ZKDTSMRoot/ZKDTSMMasterKeyRoot/DK_2
   [junit4]   2> 	2	/solr/security/zkdtsm/ZKDTSMRoot/ZKDTSMTokensRoot/DT_2
   [junit4]   2> 	2	/solr/clusterstate.json
   [junit4]   2> 	2	/solr/security/zkdtsm/ZKDTSMRoot/ZKDTSMTokensRoot/DT_5
   [junit4]   2> 	2	/solr/security/zkdtsm/ZKDTSMRoot/ZKDTSMMasterKeyRoot/DK_4
   [junit4]   2> 	2	/solr/security/zkdtsm/ZKDTSMRoot/ZKDTSMTokensRoot/DT_4
   [junit4]   2> 	2	/solr/security/zkdtsm/ZKDTSMRoot/ZKDTSMTokensRoot/DT_13
   [junit4]   2> 	2	/solr/security/zkdtsm/ZKDTSMRoot/ZKDTSMTokensRoot/DT_12
   [junit4]   2> 	2	/solr/security/zkdtsm/ZKDTSMRoot/ZKDTSMSeqNumRoot
   [junit4]   2> 	2	/solr/security/zkdtsm/ZKDTSMRoot/ZKDTSMTokensRoot/DT_11
   [junit4]   2> 	2	/solr/security/zkdtsm/ZKDTSMRoot/ZKDTSMTokensRoot/DT_10
   [junit4]   2> 
   [junit4]   2> Maximum concurrent children watches above limit:
   [junit4]   2> 
   [junit4]   2> 	10	/solr/overseer/collection-queue-work
   [junit4]   2> 	3	/solr/overseer/queue
   [junit4]   2> 	3	/solr/overseer/queue-work
   [junit4]   2> 	2	/solr/live_nodes
   [junit4]   2> 	2	/solr/collections
   [junit4]   2> 	2	/solr/security/zkdtsm/ZKDTSMRoot/ZKDTSMMasterKeyRoot
   [junit4]   2> 	2	/solr/security/zkdtsm/ZKDTSMRoot/ZKDTSMTokensRoot
   [junit4]   2> 
   [junit4]   2> 255630 INFO  (SUITE-TestSolrCloudWithDelegationTokens-seed#[4C667B4C94BDAE17]-worker) [    ] o.a.s.SolrTestCaseJ4 ###deleteCore
   [junit4]   2> NOTE: leaving temporary files on disk at: /x1/jenkins/jenkins-slave/workspace/Lucene-Solr-Tests-master/solr/build/solr-core/test/J0/temp/solr.cloud.TestSolrCloudWithDelegationTokens_4C667B4C94BDAE17-001
   [junit4]   2> Sep 10, 2016 1:09:08 AM com.carrotsearch.randomizedtesting.ThreadLeakControl checkThreadLeaks
   [junit4]   2> WARNING: Will linger awaiting termination of 2 leaked thread(s).
   [junit4]   2> NOTE: test params are: codec=Asserting(Lucene62): {}, docValues:{}, maxPointsInLeafNode=1521, maxMBSortInHeap=5.330038388384793, sim=ClassicSimilarity, locale=vi, timezone=ROK
   [junit4]   2> NOTE: Linux 3.13.0-85-generic amd64/Oracle Corporation 1.8.0_102 (64-bit)/cpus=4,threads=1,free=78146176,total=411566080
   [junit4]   2> NOTE: All tests run in this JVM: [ZkNodePropsTest, TestSSLRandomization, TestDocumentBuilder, TestReplicaProperties, TestCustomSort, SignatureUpdateProcessorFactoryTest, DeleteReplicaTest, BadCopyFieldTest, TestCloudPseudoReturnFields, PathHierarchyTokenizerFactoryTest, TestPKIAuthenticationPlugin, SolrRequestParserTest, SynonymTokenizerTest, TestFunctionQuery, WrapperMergePolicyFactoryTest, TestCodecSupport, TestDFISimilarityFactory, TestSolrCloudWithDelegationTokens]
   [junit4] Completed [45/631 (1!)] on J0 in 12.41s, 8 tests, 1 failure <<< FAILURES!

[...truncated 62101 lines...]



Mime
View raw message