lucene-dev mailing list archives

Site index · List index
Message view « Date » · « Thread »
Top « Date » · « Thread »
From Policeman Jenkins Server <jenk...@thetaphi.de>
Subject [JENKINS] Lucene-Solr-5.5-Windows (64bit/jdk1.7.0_80) - Build # 120 - Unstable!
Date Thu, 08 Sep 2016 11:40:49 GMT
Build: http://jenkins.thetaphi.de/job/Lucene-Solr-5.5-Windows/120/
Java: 64bit/jdk1.7.0_80 -XX:-UseCompressedOops -XX:+UseSerialGC

1 tests failed.
FAILED:  org.apache.solr.schema.TestManagedSchemaAPI.test

Error Message:
Error from server at http://127.0.0.1:54079/solr/testschemaapi_shard1_replica1: ERROR: [doc=2] unknown field 'myNewField1'

Stack Trace:
org.apache.solr.client.solrj.impl.CloudSolrClient$RouteException: Error from server at http://127.0.0.1:54079/solr/testschemaapi_shard1_replica1: ERROR: [doc=2] unknown field 'myNewField1'
	at __randomizedtesting.SeedInfo.seed([1DA3DCBD0B585EF9:95F7E367A5A43301]:0)
	at org.apache.solr.client.solrj.impl.CloudSolrClient.directUpdate(CloudSolrClient.java:653)
	at org.apache.solr.client.solrj.impl.CloudSolrClient.sendRequest(CloudSolrClient.java:1002)
	at org.apache.solr.client.solrj.impl.CloudSolrClient.requestWithRetryOnStaleState(CloudSolrClient.java:891)
	at org.apache.solr.client.solrj.impl.CloudSolrClient.request(CloudSolrClient.java:827)
	at org.apache.solr.schema.TestManagedSchemaAPI.testAddFieldAndDocument(TestManagedSchemaAPI.java:101)
	at org.apache.solr.schema.TestManagedSchemaAPI.test(TestManagedSchemaAPI.java:69)
	at sun.reflect.NativeMethodAccessorImpl.invoke0(Native Method)
	at sun.reflect.NativeMethodAccessorImpl.invoke(NativeMethodAccessorImpl.java:57)
	at sun.reflect.DelegatingMethodAccessorImpl.invoke(DelegatingMethodAccessorImpl.java:43)
	at java.lang.reflect.Method.invoke(Method.java:606)
	at com.carrotsearch.randomizedtesting.RandomizedRunner.invoke(RandomizedRunner.java:1764)
	at com.carrotsearch.randomizedtesting.RandomizedRunner$8.evaluate(RandomizedRunner.java:871)
	at com.carrotsearch.randomizedtesting.RandomizedRunner$9.evaluate(RandomizedRunner.java:907)
	at com.carrotsearch.randomizedtesting.RandomizedRunner$10.evaluate(RandomizedRunner.java:921)
	at com.carrotsearch.randomizedtesting.rules.SystemPropertiesRestoreRule$1.evaluate(SystemPropertiesRestoreRule.java:57)
	at org.apache.lucene.util.TestRuleSetupTeardownChained$1.evaluate(TestRuleSetupTeardownChained.java:49)
	at org.apache.lucene.util.AbstractBeforeAfterRule$1.evaluate(AbstractBeforeAfterRule.java:45)
	at org.apache.lucene.util.TestRuleThreadAndTestName$1.evaluate(TestRuleThreadAndTestName.java:48)
	at org.apache.lucene.util.TestRuleIgnoreAfterMaxFailures$1.evaluate(TestRuleIgnoreAfterMaxFailures.java:64)
	at org.apache.lucene.util.TestRuleMarkFailure$1.evaluate(TestRuleMarkFailure.java:47)
	at com.carrotsearch.randomizedtesting.rules.StatementAdapter.evaluate(StatementAdapter.java:36)
	at com.carrotsearch.randomizedtesting.ThreadLeakControl$StatementRunner.run(ThreadLeakControl.java:367)
	at com.carrotsearch.randomizedtesting.ThreadLeakControl.forkTimeoutingTask(ThreadLeakControl.java:809)
	at com.carrotsearch.randomizedtesting.ThreadLeakControl$3.evaluate(ThreadLeakControl.java:460)
	at com.carrotsearch.randomizedtesting.RandomizedRunner.runSingleTest(RandomizedRunner.java:880)
	at com.carrotsearch.randomizedtesting.RandomizedRunner$5.evaluate(RandomizedRunner.java:781)
	at com.carrotsearch.randomizedtesting.RandomizedRunner$6.evaluate(RandomizedRunner.java:816)
	at com.carrotsearch.randomizedtesting.RandomizedRunner$7.evaluate(RandomizedRunner.java:827)
	at com.carrotsearch.randomizedtesting.rules.StatementAdapter.evaluate(StatementAdapter.java:36)
	at com.carrotsearch.randomizedtesting.rules.SystemPropertiesRestoreRule$1.evaluate(SystemPropertiesRestoreRule.java:57)
	at org.apache.lucene.util.AbstractBeforeAfterRule$1.evaluate(AbstractBeforeAfterRule.java:45)
	at com.carrotsearch.randomizedtesting.rules.StatementAdapter.evaluate(StatementAdapter.java:36)
	at org.apache.lucene.util.TestRuleStoreClassName$1.evaluate(TestRuleStoreClassName.java:41)
	at com.carrotsearch.randomizedtesting.rules.NoShadowingOrOverridesOnMethodsRule$1.evaluate(NoShadowingOrOverridesOnMethodsRule.java:40)
	at com.carrotsearch.randomizedtesting.rules.NoShadowingOrOverridesOnMethodsRule$1.evaluate(NoShadowingOrOverridesOnMethodsRule.java:40)
	at com.carrotsearch.randomizedtesting.rules.StatementAdapter.evaluate(StatementAdapter.java:36)
	at com.carrotsearch.randomizedtesting.rules.StatementAdapter.evaluate(StatementAdapter.java:36)
	at com.carrotsearch.randomizedtesting.rules.StatementAdapter.evaluate(StatementAdapter.java:36)
	at org.apache.lucene.util.TestRuleAssertionsRequired$1.evaluate(TestRuleAssertionsRequired.java:53)
	at org.apache.lucene.util.TestRuleMarkFailure$1.evaluate(TestRuleMarkFailure.java:47)
	at org.apache.lucene.util.TestRuleIgnoreAfterMaxFailures$1.evaluate(TestRuleIgnoreAfterMaxFailures.java:64)
	at org.apache.lucene.util.TestRuleIgnoreTestSuites$1.evaluate(TestRuleIgnoreTestSuites.java:54)
	at com.carrotsearch.randomizedtesting.rules.StatementAdapter.evaluate(StatementAdapter.java:36)
	at com.carrotsearch.randomizedtesting.ThreadLeakControl$StatementRunner.run(ThreadLeakControl.java:367)
	at java.lang.Thread.run(Thread.java:745)
Caused by: org.apache.solr.client.solrj.impl.HttpSolrClient$RemoteSolrException: Error from server at http://127.0.0.1:54079/solr/testschemaapi_shard1_replica1: ERROR: [doc=2] unknown field 'myNewField1'
	at org.apache.solr.client.solrj.impl.HttpSolrClient.executeMethod(HttpSolrClient.java:577)
	at org.apache.solr.client.solrj.impl.HttpSolrClient.request(HttpSolrClient.java:241)
	at org.apache.solr.client.solrj.impl.HttpSolrClient.request(HttpSolrClient.java:230)
	at org.apache.solr.client.solrj.impl.LBHttpSolrClient.doRequest(LBHttpSolrClient.java:372)
	at org.apache.solr.client.solrj.impl.LBHttpSolrClient.request(LBHttpSolrClient.java:325)
	at org.apache.solr.client.solrj.impl.CloudSolrClient$2.call(CloudSolrClient.java:628)
	at org.apache.solr.client.solrj.impl.CloudSolrClient$2.call(CloudSolrClient.java:625)
	at java.util.concurrent.FutureTask.run(FutureTask.java:262)
	at org.apache.solr.common.util.ExecutorUtil$MDCAwareThreadPoolExecutor$1.run(ExecutorUtil.java:231)
	at java.util.concurrent.ThreadPoolExecutor.runWorker(ThreadPoolExecutor.java:1145)
	at java.util.concurrent.ThreadPoolExecutor$Worker.run(ThreadPoolExecutor.java:615)
	... 1 more




Build Log:
[...truncated 11378 lines...]
   [junit4] Suite: org.apache.solr.schema.TestManagedSchemaAPI
   [junit4]   2> Creating dataDir: C:\Users\jenkins\workspace\Lucene-Solr-5.5-Windows\solr\build\solr-core\test\J1\temp\solr.schema.TestManagedSchemaAPI_1DA3DCBD0B585EF9-001\init-core-data-001
   [junit4]   2> 1729196 INFO  (SUITE-TestManagedSchemaAPI-seed#[1DA3DCBD0B585EF9]-worker) [    ] o.a.s.SolrTestCaseJ4 Randomized ssl (false) and clientAuth (false)
   [junit4]   2> 1729201 INFO  (TEST-TestManagedSchemaAPI.test-seed#[1DA3DCBD0B585EF9]) [    ] o.a.s.SolrTestCaseJ4 ###Starting test
   [junit4]   2> 1729203 INFO  (TEST-TestManagedSchemaAPI.test-seed#[1DA3DCBD0B585EF9]) [    ] o.a.s.c.ZkTestServer STARTING ZK TEST SERVER
   [junit4]   2> 1729205 INFO  (Thread-4164) [    ] o.a.s.c.ZkTestServer client port:0.0.0.0/0.0.0.0:0
   [junit4]   2> 1729205 INFO  (Thread-4164) [    ] o.a.s.c.ZkTestServer Starting server
   [junit4]   2> 1729303 INFO  (TEST-TestManagedSchemaAPI.test-seed#[1DA3DCBD0B585EF9]) [    ] o.a.s.c.ZkTestServer start zk server on port:54070
   [junit4]   2> 1729303 INFO  (TEST-TestManagedSchemaAPI.test-seed#[1DA3DCBD0B585EF9]) [    ] o.a.s.c.c.SolrZkClient Using default ZkCredentialsProvider
   [junit4]   2> 1729305 INFO  (TEST-TestManagedSchemaAPI.test-seed#[1DA3DCBD0B585EF9]) [    ] o.a.s.c.c.ConnectionManager Waiting for client to connect to ZooKeeper
   [junit4]   2> 1729314 INFO  (zkCallback-2597-thread-1) [    ] o.a.s.c.c.ConnectionManager Watcher org.apache.solr.common.cloud.ConnectionManager@9ac1fce name:ZooKeeperConnection Watcher:127.0.0.1:54070 got event WatchedEvent state:SyncConnected type:None path:null path:null type:None
   [junit4]   2> 1729315 INFO  (TEST-TestManagedSchemaAPI.test-seed#[1DA3DCBD0B585EF9]) [    ] o.a.s.c.c.ConnectionManager Client is connected to ZooKeeper
   [junit4]   2> 1729315 INFO  (TEST-TestManagedSchemaAPI.test-seed#[1DA3DCBD0B585EF9]) [    ] o.a.s.c.c.SolrZkClient Using default ZkACLProvider
   [junit4]   2> 1729315 INFO  (TEST-TestManagedSchemaAPI.test-seed#[1DA3DCBD0B585EF9]) [    ] o.a.s.c.c.SolrZkClient makePath: /solr/solr.xml
   [junit4]   2> 1729325 INFO  (jetty-launcher-2596-thread-2) [    ] o.e.j.s.Server jetty-9.2.13.v20150730
   [junit4]   2> 1729326 INFO  (jetty-launcher-2596-thread-2) [    ] o.e.j.s.h.ContextHandler Started o.e.j.s.ServletContextHandler@411fe1b0{/solr,null,AVAILABLE}
   [junit4]   2> 1729329 INFO  (jetty-launcher-2596-thread-1) [    ] o.e.j.s.Server jetty-9.2.13.v20150730
   [junit4]   2> 1729331 INFO  (jetty-launcher-2596-thread-2) [    ] o.e.j.s.ServerConnector Started ServerConnector@1f7aa7ad{HTTP/1.1}{127.0.0.1:54074}
   [junit4]   2> 1729331 INFO  (jetty-launcher-2596-thread-2) [    ] o.e.j.s.Server Started @1733552ms
   [junit4]   2> 1729332 INFO  (jetty-launcher-2596-thread-2) [    ] o.a.s.c.s.e.JettySolrRunner Jetty properties: {hostPort=54074, hostContext=/solr}
   [junit4]   2> 1729332 INFO  (jetty-launcher-2596-thread-2) [    ] o.a.s.s.SolrDispatchFilter SolrDispatchFilter.init(): sun.misc.Launcher$AppClassLoader@4d885088
   [junit4]   2> 1729332 INFO  (jetty-launcher-2596-thread-2) [    ] o.a.s.c.SolrResourceLoader new SolrResourceLoader for directory: 'C:\Users\jenkins\workspace\Lucene-Solr-5.5-Windows\solr\build\solr-core\test\J1\temp\solr.schema.TestManagedSchemaAPI_1DA3DCBD0B585EF9-001\tempDir-001\node1'
   [junit4]   2> 1729332 INFO  (jetty-launcher-2596-thread-2) [    ] o.a.s.c.SolrResourceLoader JNDI not configured for solr (NoInitialContextEx)
   [junit4]   2> 1729332 INFO  (jetty-launcher-2596-thread-2) [    ] o.a.s.c.SolrResourceLoader solr home defaulted to 'solr/' (could not find system property or JNDI)
   [junit4]   2> 1729333 INFO  (jetty-launcher-2596-thread-2) [    ] o.a.s.c.c.SolrZkClient Using default ZkCredentialsProvider
   [junit4]   2> 1729335 INFO  (jetty-launcher-2596-thread-2) [    ] o.a.s.c.c.ConnectionManager Waiting for client to connect to ZooKeeper
   [junit4]   2> 1729335 INFO  (jetty-launcher-2596-thread-1) [    ] o.e.j.s.h.ContextHandler Started o.e.j.s.ServletContextHandler@bd3926{/solr,null,AVAILABLE}
   [junit4]   2> 1729336 INFO  (jetty-launcher-2596-thread-1) [    ] o.e.j.s.ServerConnector Started ServerConnector@6f2ee2b{HTTP/1.1}{127.0.0.1:54079}
   [junit4]   2> 1729336 INFO  (jetty-launcher-2596-thread-1) [    ] o.e.j.s.Server Started @1733557ms
   [junit4]   2> 1729336 INFO  (jetty-launcher-2596-thread-1) [    ] o.a.s.c.s.e.JettySolrRunner Jetty properties: {hostPort=54079, hostContext=/solr}
   [junit4]   2> 1729336 INFO  (jetty-launcher-2596-thread-1) [    ] o.a.s.s.SolrDispatchFilter SolrDispatchFilter.init(): sun.misc.Launcher$AppClassLoader@4d885088
   [junit4]   2> 1729336 INFO  (jetty-launcher-2596-thread-1) [    ] o.a.s.c.SolrResourceLoader new SolrResourceLoader for directory: 'C:\Users\jenkins\workspace\Lucene-Solr-5.5-Windows\solr\build\solr-core\test\J1\temp\solr.schema.TestManagedSchemaAPI_1DA3DCBD0B585EF9-001\tempDir-001\node2'
   [junit4]   2> 1729336 INFO  (jetty-launcher-2596-thread-1) [    ] o.a.s.c.SolrResourceLoader JNDI not configured for solr (NoInitialContextEx)
   [junit4]   2> 1729336 INFO  (jetty-launcher-2596-thread-1) [    ] o.a.s.c.SolrResourceLoader solr home defaulted to 'solr/' (could not find system property or JNDI)
   [junit4]   2> 1729339 INFO  (jetty-launcher-2596-thread-1) [    ] o.a.s.c.c.SolrZkClient Using default ZkCredentialsProvider
   [junit4]   2> 1729342 INFO  (jetty-launcher-2596-thread-1) [    ] o.a.s.c.c.ConnectionManager Waiting for client to connect to ZooKeeper
   [junit4]   2> 1729346 INFO  (zkCallback-2598-thread-1) [    ] o.a.s.c.c.ConnectionManager Watcher org.apache.solr.common.cloud.ConnectionManager@16fc6da8 name:ZooKeeperConnection Watcher:127.0.0.1:54070/solr got event WatchedEvent state:SyncConnected type:None path:null path:null type:None
   [junit4]   2> 1729346 INFO  (jetty-launcher-2596-thread-2) [    ] o.a.s.c.c.ConnectionManager Client is connected to ZooKeeper
   [junit4]   2> 1729347 INFO  (jetty-launcher-2596-thread-2) [    ] o.a.s.c.c.SolrZkClient Using default ZkACLProvider
   [junit4]   2> 1729347 INFO  (jetty-launcher-2596-thread-2) [    ] o.a.s.s.SolrDispatchFilter solr.xml found in ZooKeeper. Loading...
   [junit4]   2> 1729349 INFO  (zkCallback-2599-thread-1) [    ] o.a.s.c.c.ConnectionManager Watcher org.apache.solr.common.cloud.ConnectionManager@48bfbdac name:ZooKeeperConnection Watcher:127.0.0.1:54070/solr got event WatchedEvent state:SyncConnected type:None path:null path:null type:None
   [junit4]   2> 1729350 INFO  (jetty-launcher-2596-thread-1) [    ] o.a.s.c.c.ConnectionManager Client is connected to ZooKeeper
   [junit4]   2> 1729350 INFO  (jetty-launcher-2596-thread-1) [    ] o.a.s.c.c.SolrZkClient Using default ZkACLProvider
   [junit4]   2> 1729351 INFO  (jetty-launcher-2596-thread-1) [    ] o.a.s.s.SolrDispatchFilter solr.xml found in ZooKeeper. Loading...
   [junit4]   2> 1729404 INFO  (jetty-launcher-2596-thread-2) [    ] o.a.s.c.CorePropertiesLocator Config-defined core root directory: C:\Users\jenkins\workspace\Lucene-Solr-5.5-Windows\solr\build\solr-core\test\J1\temp\solr.schema.TestManagedSchemaAPI_1DA3DCBD0B585EF9-001\tempDir-001\node1\.
   [junit4]   2> 1729404 INFO  (jetty-launcher-2596-thread-2) [    ] o.a.s.c.CoreContainer New CoreContainer 1966588914
   [junit4]   2> 1729404 INFO  (jetty-launcher-2596-thread-2) [    ] o.a.s.c.CoreContainer Loading cores into CoreContainer [instanceDir=C:\Users\jenkins\workspace\Lucene-Solr-5.5-Windows\solr\build\solr-core\test\J1\temp\solr.schema.TestManagedSchemaAPI_1DA3DCBD0B585EF9-001\tempDir-001\node1]
   [junit4]   2> 1729404 WARN  (jetty-launcher-2596-thread-2) [    ] o.a.s.c.CoreContainer Couldn't add files from C:\Users\jenkins\workspace\Lucene-Solr-5.5-Windows\solr\build\solr-core\test\J1\temp\solr.schema.TestManagedSchemaAPI_1DA3DCBD0B585EF9-001\tempDir-001\node1\lib to classpath: C:\Users\jenkins\workspace\Lucene-Solr-5.5-Windows\solr\build\solr-core\test\J1\temp\solr.schema.TestManagedSchemaAPI_1DA3DCBD0B585EF9-001\tempDir-001\node1\lib
   [junit4]   2> 1729405 INFO  (jetty-launcher-2596-thread-2) [    ] o.a.s.h.c.HttpShardHandlerFactory created with socketTimeout : 90000,urlScheme : ,connTimeout : 15000,maxConnectionsPerHost : 20,maxConnections : 10000,corePoolSize : 0,maximumPoolSize : 2147483647,maxThreadIdleTime : 5,sizeOfQueue : -1,fairnessPolicy : false,useRetries : false,connectionsEvictorSleepDelay : 5000,maxConnectionIdleTime : 40000,
   [junit4]   2> 1729411 INFO  (jetty-launcher-2596-thread-2) [    ] o.a.s.u.UpdateShardHandler Creating UpdateShardHandler HTTP client with params: socketTimeout=340000&connTimeout=45000&retry=true
   [junit4]   2> 1729411 INFO  (jetty-launcher-2596-thread-2) [    ] o.a.s.l.LogWatcher SLF4J impl is org.slf4j.impl.Log4jLoggerFactory
   [junit4]   2> 1729411 INFO  (jetty-launcher-2596-thread-2) [    ] o.a.s.l.LogWatcher Registering Log Listener [Log4j (org.slf4j.impl.Log4jLoggerFactory)]
   [junit4]   2> 1729411 INFO  (jetty-launcher-2596-thread-2) [    ] o.a.s.c.ZkContainer Zookeeper client=127.0.0.1:54070/solr
   [junit4]   2> 1729411 INFO  (jetty-launcher-2596-thread-2) [    ] o.a.s.c.ZkController zkHost includes chroot
   [junit4]   2> 1729411 INFO  (jetty-launcher-2596-thread-2) [    ] o.a.s.c.c.SolrZkClient Using default ZkCredentialsProvider
   [junit4]   2> 1729413 INFO  (jetty-launcher-2596-thread-2) [    ] o.a.s.c.c.ConnectionManager Waiting for client to connect to ZooKeeper
   [junit4]   2> 1729416 INFO  (zkCallback-2602-thread-1) [    ] o.a.s.c.c.ConnectionManager Watcher org.apache.solr.common.cloud.ConnectionManager@253e16ab name:ZooKeeperConnection Watcher:127.0.0.1:54070 got event WatchedEvent state:SyncConnected type:None path:null path:null type:None
   [junit4]   2> 1729418 INFO  (jetty-launcher-2596-thread-2) [    ] o.a.s.c.c.ConnectionManager Client is connected to ZooKeeper
   [junit4]   2> 1729418 INFO  (jetty-launcher-2596-thread-2) [    ] o.a.s.c.c.SolrZkClient Using default ZkACLProvider
   [junit4]   2> 1729419 WARN  (NIOServerCxn.Factory:0.0.0.0/0.0.0.0:0) [    ] o.a.z.s.NIOServerCnxn caught end of stream exception
   [junit4]   2> EndOfStreamException: Unable to read additional data from client sessionid 0x15709608b3f0003, likely client has closed socket
   [junit4]   2> 	at org.apache.zookeeper.server.NIOServerCnxn.doIO(NIOServerCnxn.java:228)
   [junit4]   2> 	at org.apache.zookeeper.server.NIOServerCnxnFactory.run(NIOServerCnxnFactory.java:208)
   [junit4]   2> 	at java.lang.Thread.run(Thread.java:745)
   [junit4]   2> 1729419 INFO  (jetty-launcher-2596-thread-2) [n:127.0.0.1:54074_solr    ] o.a.s.c.ZkController Added new OnReconnect listener org.apache.solr.cloud.ZkController$6@3bf8e71e
   [junit4]   2> 1729421 INFO  (jetty-launcher-2596-thread-2) [n:127.0.0.1:54074_solr    ] o.a.s.c.c.ConnectionManager Waiting for client to connect to ZooKeeper
   [junit4]   2> 1729424 INFO  (zkCallback-2603-thread-1-processing-n:127.0.0.1:54074_solr) [n:127.0.0.1:54074_solr    ] o.a.s.c.c.ConnectionManager Watcher org.apache.solr.common.cloud.ConnectionManager@d7e5186 name:ZooKeeperConnection Watcher:127.0.0.1:54070/solr got event WatchedEvent state:SyncConnected type:None path:null path:null type:None
   [junit4]   2> 1729425 INFO  (jetty-launcher-2596-thread-2) [n:127.0.0.1:54074_solr    ] o.a.s.c.c.ConnectionManager Client is connected to ZooKeeper
   [junit4]   2> 1729427 INFO  (jetty-launcher-2596-thread-2) [n:127.0.0.1:54074_solr    ] o.a.s.c.c.SolrZkClient makePath: /overseer/queue
   [junit4]   2> 1729429 INFO  (jetty-launcher-2596-thread-2) [n:127.0.0.1:54074_solr    ] o.a.s.c.c.SolrZkClient makePath: /overseer/collection-queue-work
   [junit4]   2> 1729434 INFO  (jetty-launcher-2596-thread-2) [n:127.0.0.1:54074_solr    ] o.a.s.c.c.SolrZkClient makePath: /overseer/collection-map-running
   [junit4]   2> 1729437 INFO  (jetty-launcher-2596-thread-2) [n:127.0.0.1:54074_solr    ] o.a.s.c.c.SolrZkClient makePath: /overseer/collection-map-completed
   [junit4]   2> 1729440 INFO  (jetty-launcher-2596-thread-2) [n:127.0.0.1:54074_solr    ] o.a.s.c.c.SolrZkClient makePath: /overseer/collection-map-failure
   [junit4]   2> 1729445 INFO  (jetty-launcher-2596-thread-2) [n:127.0.0.1:54074_solr    ] o.a.s.c.c.SolrZkClient makePath: /live_nodes
   [junit4]   2> 1729447 INFO  (jetty-launcher-2596-thread-2) [n:127.0.0.1:54074_solr    ] o.a.s.c.c.SolrZkClient makePath: /collections
   [junit4]   2> 1729448 INFO  (jetty-launcher-2596-thread-2) [n:127.0.0.1:54074_solr    ] o.a.s.c.c.SolrZkClient makePath: /aliases.json
   [junit4]   2> 1729452 INFO  (jetty-launcher-2596-thread-2) [n:127.0.0.1:54074_solr    ] o.a.s.c.c.SolrZkClient makePath: /clusterstate.json
   [junit4]   2> 1729454 INFO  (jetty-launcher-2596-thread-2) [n:127.0.0.1:54074_solr    ] o.a.s.c.c.SolrZkClient makePath: /security.json
   [junit4]   2> 1729455 INFO  (jetty-launcher-2596-thread-2) [n:127.0.0.1:54074_solr    ] o.a.s.c.ZkController Register node as live in ZooKeeper:/live_nodes/127.0.0.1:54074_solr
   [junit4]   2> 1729456 INFO  (jetty-launcher-2596-thread-2) [n:127.0.0.1:54074_solr    ] o.a.s.c.c.SolrZkClient makePath: /live_nodes/127.0.0.1:54074_solr
   [junit4]   2> 1729459 INFO  (jetty-launcher-2596-thread-2) [n:127.0.0.1:54074_solr    ] o.a.s.c.c.SolrZkClient makePath: /overseer_elect
   [junit4]   2> 1729461 INFO  (jetty-launcher-2596-thread-2) [n:127.0.0.1:54074_solr    ] o.a.s.c.c.SolrZkClient makePath: /overseer_elect/election
   [junit4]   2> 1729463 INFO  (jetty-launcher-2596-thread-2) [n:127.0.0.1:54074_solr    ] o.a.s.c.Overseer Overseer (id=null) closing
   [junit4]   2> 1729463 INFO  (jetty-launcher-2596-thread-2) [n:127.0.0.1:54074_solr    ] o.a.s.c.LeaderElector Joined leadership election with path: /overseer_elect/election/96556227269427204-127.0.0.1:54074_solr-n_0000000000
   [junit4]   2> 1729464 INFO  (jetty-launcher-2596-thread-2) [n:127.0.0.1:54074_solr    ] o.a.s.c.OverseerElectionContext I am going to be the leader 127.0.0.1:54074_solr
   [junit4]   2> 1729464 INFO  (jetty-launcher-2596-thread-2) [n:127.0.0.1:54074_solr    ] o.a.s.c.c.SolrZkClient makePath: /overseer_elect/leader
   [junit4]   2> 1729466 INFO  (jetty-launcher-2596-thread-1) [    ] o.a.s.c.CorePropertiesLocator Config-defined core root directory: C:\Users\jenkins\workspace\Lucene-Solr-5.5-Windows\solr\build\solr-core\test\J1\temp\solr.schema.TestManagedSchemaAPI_1DA3DCBD0B585EF9-001\tempDir-001\node2\.
   [junit4]   2> 1729466 INFO  (jetty-launcher-2596-thread-2) [n:127.0.0.1:54074_solr    ] o.a.s.c.Overseer Overseer (id=96556227269427204-127.0.0.1:54074_solr-n_0000000000) starting
   [junit4]   2> 1729466 INFO  (jetty-launcher-2596-thread-1) [    ] o.a.s.c.CoreContainer New CoreContainer 1312398533
   [junit4]   2> 1729466 INFO  (jetty-launcher-2596-thread-1) [    ] o.a.s.c.CoreContainer Loading cores into CoreContainer [instanceDir=C:\Users\jenkins\workspace\Lucene-Solr-5.5-Windows\solr\build\solr-core\test\J1\temp\solr.schema.TestManagedSchemaAPI_1DA3DCBD0B585EF9-001\tempDir-001\node2]
   [junit4]   2> 1729467 WARN  (jetty-launcher-2596-thread-1) [    ] o.a.s.c.CoreContainer Couldn't add files from C:\Users\jenkins\workspace\Lucene-Solr-5.5-Windows\solr\build\solr-core\test\J1\temp\solr.schema.TestManagedSchemaAPI_1DA3DCBD0B585EF9-001\tempDir-001\node2\lib to classpath: C:\Users\jenkins\workspace\Lucene-Solr-5.5-Windows\solr\build\solr-core\test\J1\temp\solr.schema.TestManagedSchemaAPI_1DA3DCBD0B585EF9-001\tempDir-001\node2\lib
   [junit4]   2> 1729468 INFO  (jetty-launcher-2596-thread-1) [    ] o.a.s.h.c.HttpShardHandlerFactory created with socketTimeout : 90000,urlScheme : ,connTimeout : 15000,maxConnectionsPerHost : 20,maxConnections : 10000,corePoolSize : 0,maximumPoolSize : 2147483647,maxThreadIdleTime : 5,sizeOfQueue : -1,fairnessPolicy : false,useRetries : false,connectionsEvictorSleepDelay : 5000,maxConnectionIdleTime : 40000,
   [junit4]   2> 1729470 INFO  (jetty-launcher-2596-thread-2) [n:127.0.0.1:54074_solr    ] o.a.s.c.c.SolrZkClient makePath: /overseer/queue-work
   [junit4]   2> 1729471 INFO  (jetty-launcher-2596-thread-1) [    ] o.a.s.u.UpdateShardHandler Creating UpdateShardHandler HTTP client with params: socketTimeout=340000&connTimeout=45000&retry=true
   [junit4]   2> 1729473 INFO  (jetty-launcher-2596-thread-1) [    ] o.a.s.l.LogWatcher SLF4J impl is org.slf4j.impl.Log4jLoggerFactory
   [junit4]   2> 1729473 INFO  (jetty-launcher-2596-thread-1) [    ] o.a.s.l.LogWatcher Registering Log Listener [Log4j (org.slf4j.impl.Log4jLoggerFactory)]
   [junit4]   2> 1729474 INFO  (jetty-launcher-2596-thread-1) [    ] o.a.s.c.ZkContainer Zookeeper client=127.0.0.1:54070/solr
   [junit4]   2> 1729474 INFO  (jetty-launcher-2596-thread-1) [    ] o.a.s.c.ZkController zkHost includes chroot
   [junit4]   2> 1729474 INFO  (jetty-launcher-2596-thread-1) [    ] o.a.s.c.c.SolrZkClient Using default ZkCredentialsProvider
   [junit4]   2> 1729477 INFO  (jetty-launcher-2596-thread-1) [    ] o.a.s.c.c.ConnectionManager Waiting for client to connect to ZooKeeper
   [junit4]   2> 1729480 INFO  (jetty-launcher-2596-thread-2) [n:127.0.0.1:54074_solr    ] o.a.s.c.OverseerAutoReplicaFailoverThread Starting OverseerAutoReplicaFailoverThread autoReplicaFailoverWorkLoopDelay=10000 autoReplicaFailoverWaitAfterExpiration=30000 autoReplicaFailoverBadNodeExpiration=60000
   [junit4]   2> 1729481 INFO  (jetty-launcher-2596-thread-2) [n:127.0.0.1:54074_solr    ] o.a.s.c.c.ZkStateReader Updating cluster state from ZooKeeper... 
   [junit4]   2> 1729481 INFO  (zkCallback-2606-thread-1) [    ] o.a.s.c.c.ConnectionManager Watcher org.apache.solr.common.cloud.ConnectionManager@63686051 name:ZooKeeperConnection Watcher:127.0.0.1:54070 got event WatchedEvent state:SyncConnected type:None path:null path:null type:None
   [junit4]   2> 1729482 INFO  (jetty-launcher-2596-thread-1) [    ] o.a.s.c.c.ConnectionManager Client is connected to ZooKeeper
   [junit4]   2> 1729483 INFO  (jetty-launcher-2596-thread-1) [    ] o.a.s.c.c.SolrZkClient Using default ZkACLProvider
   [junit4]   2> 1729485 WARN  (NIOServerCxn.Factory:0.0.0.0/0.0.0.0:0) [    ] o.a.z.s.NIOServerCnxn caught end of stream exception
   [junit4]   2> EndOfStreamException: Unable to read additional data from client sessionid 0x15709608b3f0005, likely client has closed socket
   [junit4]   2> 	at org.apache.zookeeper.server.NIOServerCnxn.doIO(NIOServerCnxn.java:228)
   [junit4]   2> 	at org.apache.zookeeper.server.NIOServerCnxnFactory.run(NIOServerCnxnFactory.java:208)
   [junit4]   2> 	at java.lang.Thread.run(Thread.java:745)
   [junit4]   2> 1729485 INFO  (jetty-launcher-2596-thread-1) [n:127.0.0.1:54079_solr    ] o.a.s.c.ZkController Added new OnReconnect listener org.apache.solr.cloud.ZkController$6@6ee36a93
   [junit4]   2> 1729487 INFO  (jetty-launcher-2596-thread-1) [n:127.0.0.1:54079_solr    ] o.a.s.c.c.ConnectionManager Waiting for client to connect to ZooKeeper
   [junit4]   2> 1729488 INFO  (OverseerCollectionConfigSetProcessor-96556227269427204-127.0.0.1:54074_solr-n_0000000000) [n:127.0.0.1:54074_solr    ] o.a.s.c.OverseerTaskProcessor Process current queue of overseer operations
   [junit4]   2> 1729492 INFO  (OverseerStateUpdate-96556227269427204-127.0.0.1:54074_solr-n_0000000000) [n:127.0.0.1:54074_solr    ] o.a.s.c.Overseer Starting to work on the main queue
   [junit4]   2> 1729495 INFO  (jetty-launcher-2596-thread-2) [n:127.0.0.1:54074_solr    ] o.a.s.c.CoreContainer Security conf doesn't exist. Skipping setup for authorization module.
   [junit4]   2> 1729495 INFO  (jetty-launcher-2596-thread-2) [n:127.0.0.1:54074_solr    ] o.a.s.c.CoreContainer No authentication plugin used.
   [junit4]   2> 1729498 INFO  (jetty-launcher-2596-thread-2) [n:127.0.0.1:54074_solr    ] o.a.s.c.CorePropertiesLocator Looking for core definitions underneath C:\Users\jenkins\workspace\Lucene-Solr-5.5-Windows\solr\build\solr-core\test\J1\temp\solr.schema.TestManagedSchemaAPI_1DA3DCBD0B585EF9-001\tempDir-001\node1\.
   [junit4]   2> 1729499 INFO  (jetty-launcher-2596-thread-2) [n:127.0.0.1:54074_solr    ] o.a.s.c.CorePropertiesLocator Found 0 core definitions
   [junit4]   2> 1729500 INFO  (jetty-launcher-2596-thread-2) [n:127.0.0.1:54074_solr    ] o.a.s.s.SolrDispatchFilter user.dir=C:\Users\jenkins\workspace\Lucene-Solr-5.5-Windows\solr\build\solr-core\test\J1
   [junit4]   2> 1729500 INFO  (jetty-launcher-2596-thread-2) [n:127.0.0.1:54074_solr    ] o.a.s.s.SolrDispatchFilter SolrDispatchFilter.init() done
   [junit4]   2> 1729504 INFO  (zkCallback-2607-thread-1-processing-n:127.0.0.1:54079_solr) [n:127.0.0.1:54079_solr    ] o.a.s.c.c.ConnectionManager Watcher org.apache.solr.common.cloud.ConnectionManager@78f65db5 name:ZooKeeperConnection Watcher:127.0.0.1:54070/solr got event WatchedEvent state:SyncConnected type:None path:null path:null type:None
   [junit4]   2> 1729505 INFO  (jetty-launcher-2596-thread-1) [n:127.0.0.1:54079_solr    ] o.a.s.c.c.ConnectionManager Client is connected to ZooKeeper
   [junit4]   2> 1729513 INFO  (jetty-launcher-2596-thread-1) [n:127.0.0.1:54079_solr    ] o.a.s.c.c.ZkStateReader Updating cluster state from ZooKeeper... 
   [junit4]   2> 1730521 INFO  (jetty-launcher-2596-thread-1) [n:127.0.0.1:54079_solr    ] o.a.s.c.ZkController Register node as live in ZooKeeper:/live_nodes/127.0.0.1:54079_solr
   [junit4]   2> 1730523 INFO  (jetty-launcher-2596-thread-1) [n:127.0.0.1:54079_solr    ] o.a.s.c.c.SolrZkClient makePath: /live_nodes/127.0.0.1:54079_solr
   [junit4]   2> 1730525 INFO  (zkCallback-2603-thread-1-processing-n:127.0.0.1:54074_solr) [n:127.0.0.1:54074_solr    ] o.a.s.c.c.ZkStateReader A live node change: [WatchedEvent state:SyncConnected type:NodeChildrenChanged path:/live_nodes], has occurred - updating... (live nodes size: [1])
   [junit4]   2> 1730525 INFO  (zkCallback-2607-thread-1-processing-n:127.0.0.1:54079_solr) [n:127.0.0.1:54079_solr    ] o.a.s.c.c.ZkStateReader A live node change: [WatchedEvent state:SyncConnected type:NodeChildrenChanged path:/live_nodes], has occurred - updating... (live nodes size: [1])
   [junit4]   2> 1730530 INFO  (jetty-launcher-2596-thread-1) [n:127.0.0.1:54079_solr    ] o.a.s.c.Overseer Overseer (id=null) closing
   [junit4]   2> 1730531 INFO  (jetty-launcher-2596-thread-1) [n:127.0.0.1:54079_solr    ] o.a.s.c.LeaderElector Joined leadership election with path: /overseer_elect/election/96556227269427206-127.0.0.1:54079_solr-n_0000000001
   [junit4]   2> 1730535 INFO  (jetty-launcher-2596-thread-1) [n:127.0.0.1:54079_solr    ] o.a.s.c.LeaderElector Watching path /overseer_elect/election/96556227269427204-127.0.0.1:54074_solr-n_0000000000 to know if I could be the leader
   [junit4]   2> 1730558 INFO  (jetty-launcher-2596-thread-1) [n:127.0.0.1:54079_solr    ] o.a.s.c.CoreContainer Security conf doesn't exist. Skipping setup for authorization module.
   [junit4]   2> 1730559 INFO  (jetty-launcher-2596-thread-1) [n:127.0.0.1:54079_solr    ] o.a.s.c.CoreContainer No authentication plugin used.
   [junit4]   2> 1730560 INFO  (jetty-launcher-2596-thread-1) [n:127.0.0.1:54079_solr    ] o.a.s.c.CorePropertiesLocator Looking for core definitions underneath C:\Users\jenkins\workspace\Lucene-Solr-5.5-Windows\solr\build\solr-core\test\J1\temp\solr.schema.TestManagedSchemaAPI_1DA3DCBD0B585EF9-001\tempDir-001\node2\.
   [junit4]   2> 1730561 INFO  (jetty-launcher-2596-thread-1) [n:127.0.0.1:54079_solr    ] o.a.s.c.CorePropertiesLocator Found 0 core definitions
   [junit4]   2> 1730563 INFO  (jetty-launcher-2596-thread-1) [n:127.0.0.1:54079_solr    ] o.a.s.s.SolrDispatchFilter user.dir=C:\Users\jenkins\workspace\Lucene-Solr-5.5-Windows\solr\build\solr-core\test\J1
   [junit4]   2> 1730563 INFO  (jetty-launcher-2596-thread-1) [n:127.0.0.1:54079_solr    ] o.a.s.s.SolrDispatchFilter SolrDispatchFilter.init() done
   [junit4]   2> 1730563 INFO  (TEST-TestManagedSchemaAPI.test-seed#[1DA3DCBD0B585EF9]) [    ] o.a.s.c.c.SolrZkClient Using default ZkCredentialsProvider
   [junit4]   2> 1730565 INFO  (TEST-TestManagedSchemaAPI.test-seed#[1DA3DCBD0B585EF9]) [    ] o.a.s.c.c.ConnectionManager Waiting for client to connect to ZooKeeper
   [junit4]   2> 1730568 INFO  (zkCallback-2608-thread-1) [    ] o.a.s.c.c.ConnectionManager Watcher org.apache.solr.common.cloud.ConnectionManager@603346ea name:ZooKeeperConnection Watcher:127.0.0.1:54070 got event WatchedEvent state:SyncConnected type:None path:null path:null type:None
   [junit4]   2> 1730568 INFO  (TEST-TestManagedSchemaAPI.test-seed#[1DA3DCBD0B585EF9]) [    ] o.a.s.c.c.ConnectionManager Client is connected to ZooKeeper
   [junit4]   2> 1730568 INFO  (TEST-TestManagedSchemaAPI.test-seed#[1DA3DCBD0B585EF9]) [    ] o.a.s.c.c.SolrZkClient Using default ZkACLProvider
   [junit4]   2> 1730574 INFO  (TEST-TestManagedSchemaAPI.test-seed#[1DA3DCBD0B585EF9]) [    ] o.a.s.c.c.SolrZkClient Using default ZkCredentialsProvider
   [junit4]   2> 1730576 INFO  (TEST-TestManagedSchemaAPI.test-seed#[1DA3DCBD0B585EF9]) [    ] o.a.s.c.c.ConnectionManager Waiting for client to connect to ZooKeeper
   [junit4]   2> 1730580 INFO  (zkCallback-2610-thread-1) [    ] o.a.s.c.c.ConnectionManager Watcher org.apache.solr.common.cloud.ConnectionManager@2df9a5e4 name:ZooKeeperConnection Watcher:127.0.0.1:54070/solr got event WatchedEvent state:SyncConnected type:None path:null path:null type:None
   [junit4]   2> 1730580 INFO  (TEST-TestManagedSchemaAPI.test-seed#[1DA3DCBD0B585EF9]) [    ] o.a.s.c.c.ConnectionManager Client is connected to ZooKeeper
   [junit4]   2> 1730580 INFO  (TEST-TestManagedSchemaAPI.test-seed#[1DA3DCBD0B585EF9]) [    ] o.a.s.c.c.SolrZkClient Using default ZkACLProvider
   [junit4]   2> 1730584 INFO  (TEST-TestManagedSchemaAPI.test-seed#[1DA3DCBD0B585EF9]) [    ] o.a.s.c.c.SolrZkClient makePath: /configs/conf1/managed-schema
   [junit4]   2> 1730598 INFO  (TEST-TestManagedSchemaAPI.test-seed#[1DA3DCBD0B585EF9]) [    ] o.a.s.c.c.SolrZkClient makePath: /configs/conf1/solrconfig.xml
   [junit4]   2> 1730644 INFO  (TEST-TestManagedSchemaAPI.test-seed#[1DA3DCBD0B585EF9]) [    ] o.a.s.c.c.SolrZkClient Using default ZkCredentialsProvider
   [junit4]   2> 1730644 INFO  (TEST-TestManagedSchemaAPI.test-seed#[1DA3DCBD0B585EF9]) [    ] o.a.s.c.c.ConnectionManager Waiting for client to connect to ZooKeeper
   [junit4]   2> 1730651 INFO  (zkCallback-2611-thread-1) [    ] o.a.s.c.c.ConnectionManager Watcher org.apache.solr.common.cloud.ConnectionManager@438ec1d name:ZooKeeperConnection Watcher:127.0.0.1:54070/solr got event WatchedEvent state:SyncConnected type:None path:null path:null type:None
   [junit4]   2> 1730651 INFO  (TEST-TestManagedSchemaAPI.test-seed#[1DA3DCBD0B585EF9]) [    ] o.a.s.c.c.ConnectionManager Client is connected to ZooKeeper
   [junit4]   2> 1730651 INFO  (TEST-TestManagedSchemaAPI.test-seed#[1DA3DCBD0B585EF9]) [    ] o.a.s.c.c.SolrZkClient Using default ZkACLProvider
   [junit4]   2> 1730651 INFO  (TEST-TestManagedSchemaAPI.test-seed#[1DA3DCBD0B585EF9]) [    ] o.a.s.c.c.ZkStateReader Updating cluster state from ZooKeeper... 
   [junit4]   2> 1730673 INFO  (qtp337251127-13726) [n:127.0.0.1:54079_solr    ] o.a.s.h.a.CollectionsHandler Invoked Collection Action :create with params name=testschemaapi&wt=javabin&numShards=1&collection.configName=conf1&replicationFactor=2&action=CREATE&version=2 and sendToOCPQueue=true
   [junit4]   2> 1730684 INFO  (OverseerCollectionConfigSetProcessor-96556227269427204-127.0.0.1:54074_solr-n_0000000000) [n:127.0.0.1:54074_solr    ] o.a.s.c.OverseerTaskProcessor Overseer Collection Message Handler: Get the message id:/overseer/collection-queue-work/qn-0000000000 message:{
   [junit4]   2>   "name":"testschemaapi",
   [junit4]   2>   "fromApi":"true",
   [junit4]   2>   "replicationFactor":"2",
   [junit4]   2>   "collection.configName":"conf1",
   [junit4]   2>   "numShards":"1",
   [junit4]   2>   "stateFormat":"2",
   [junit4]   2>   "operation":"create"}
   [junit4]   2> 1730686 INFO  (OverseerThreadFactory-4698-thread-1-processing-n:127.0.0.1:54074_solr) [n:127.0.0.1:54074_solr    ] o.a.s.c.OverseerCollectionMessageHandler OverseerCollectionMessageHandler.processMessage : create , {
   [junit4]   2>   "name":"testschemaapi",
   [junit4]   2>   "fromApi":"true",
   [junit4]   2>   "replicationFactor":"2",
   [junit4]   2>   "collection.configName":"conf1",
   [junit4]   2>   "numShards":"1",
   [junit4]   2>   "stateFormat":"2",
   [junit4]   2>   "operation":"create"}
   [junit4]   2> 1730688 INFO  (OverseerThreadFactory-4698-thread-1-processing-n:127.0.0.1:54074_solr) [n:127.0.0.1:54074_solr    ] o.a.s.c.OverseerCollectionMessageHandler Create collection testschemaapi
   [junit4]   2> 1730690 INFO  (OverseerThreadFactory-4698-thread-1-processing-n:127.0.0.1:54074_solr) [n:127.0.0.1:54074_solr    ] o.a.s.c.OverseerCollectionMessageHandler creating collections conf node /collections/testschemaapi 
   [junit4]   2> 1730690 INFO  (OverseerThreadFactory-4698-thread-1-processing-n:127.0.0.1:54074_solr) [n:127.0.0.1:54074_solr    ] o.a.s.c.c.SolrZkClient makePath: /collections/testschemaapi
   [junit4]   2> 1730692 INFO  (zkCallback-2603-thread-1-processing-n:127.0.0.1:54074_solr) [n:127.0.0.1:54074_solr    ] o.a.s.c.c.ZkStateReader A collections change: [WatchedEvent state:SyncConnected type:NodeChildrenChanged path:/collections], has occurred - updating...
   [junit4]   2> 1730692 INFO  (zkCallback-2607-thread-1-processing-n:127.0.0.1:54079_solr) [n:127.0.0.1:54079_solr    ] o.a.s.c.c.ZkStateReader A collections change: [WatchedEvent state:SyncConnected type:NodeChildrenChanged path:/collections], has occurred - updating...
   [junit4]   2> 1730693 INFO  (zkCallback-2611-thread-1) [    ] o.a.s.c.c.ZkStateReader A collections change: [WatchedEvent state:SyncConnected type:NodeChildrenChanged path:/collections], has occurred - updating...
   [junit4]   2> 1730700 INFO  (OverseerStateUpdate-96556227269427204-127.0.0.1:54074_solr-n_0000000000) [n:127.0.0.1:54074_solr    ] o.a.s.c.Overseer processMessage: queueSize: 1, message = {
   [junit4]   2>   "name":"testschemaapi",
   [junit4]   2>   "fromApi":"true",
   [junit4]   2>   "replicationFactor":"2",
   [junit4]   2>   "collection.configName":"conf1",
   [junit4]   2>   "numShards":"1",
   [junit4]   2>   "stateFormat":"2",
   [junit4]   2>   "operation":"create"} current state version: 0
   [junit4]   2> 1730700 INFO  (OverseerStateUpdate-96556227269427204-127.0.0.1:54074_solr-n_0000000000) [n:127.0.0.1:54074_solr    ] o.a.s.c.o.ClusterStateMutator building a new cName: testschemaapi
   [junit4]   2> 1730702 INFO  (OverseerStateUpdate-96556227269427204-127.0.0.1:54074_solr-n_0000000000) [n:127.0.0.1:54074_solr    ] o.a.s.c.o.ZkStateWriter going to create_collection /collections/testschemaapi/state.json
   [junit4]   2> 1730801 INFO  (OverseerThreadFactory-4698-thread-1-processing-n:127.0.0.1:54074_solr) [n:127.0.0.1:54074_solr    ] o.a.s.c.OverseerCollectionMessageHandler Creating SolrCores for new collection testschemaapi, shardNames [shard1] , replicationFactor : 2
   [junit4]   2> 1730801 INFO  (OverseerThreadFactory-4698-thread-1-processing-n:127.0.0.1:54074_solr) [n:127.0.0.1:54074_solr    ] o.a.s.c.OverseerCollectionMessageHandler Creating core testschemaapi_shard1_replica2 as part of shard shard1 of collection testschemaapi on 127.0.0.1:54074_solr
   [junit4]   2> 1730803 INFO  (OverseerThreadFactory-4698-thread-1-processing-n:127.0.0.1:54074_solr) [n:127.0.0.1:54074_solr    ] o.a.s.c.OverseerCollectionMessageHandler Creating core testschemaapi_shard1_replica1 as part of shard shard1 of collection testschemaapi on 127.0.0.1:54079_solr
   [junit4]   2> 1730815 INFO  (qtp337251127-13730) [n:127.0.0.1:54079_solr    ] o.a.s.h.a.CoreAdminOperation core create command name=testschemaapi_shard1_replica1&numShards=1&wt=javabin&collection.configName=conf1&collection=testschemaapi&qt=/admin/cores&shard=shard1&action=CREATE&version=2
   [junit4]   2> 1730815 INFO  (qtp1145516899-13715) [n:127.0.0.1:54074_solr    ] o.a.s.h.a.CoreAdminOperation core create command name=testschemaapi_shard1_replica2&numShards=1&wt=javabin&collection.configName=conf1&collection=testschemaapi&qt=/admin/cores&shard=shard1&action=CREATE&version=2
   [junit4]   2> 1730815 INFO  (qtp337251127-13730) [n:127.0.0.1:54079_solr    ] o.a.s.c.CoreDescriptor Created CoreDescriptor: {dataDir=data\, shard=shard1, collection=testschemaapi, schema=schema.xml, collection.configName=conf1, configSetProperties=configsetprops.json, transient=false, loadOnStartup=true, config=solrconfig.xml, numShards=1, name=testschemaapi_shard1_replica1}
   [junit4]   2> 1730824 INFO  (qtp337251127-13730) [n:127.0.0.1:54079_solr c:testschemaapi s:shard1  x:testschemaapi_shard1_replica1] o.a.s.c.ZkController publishing state=down
   [junit4]   2> 1730825 INFO  (qtp1145516899-13715) [n:127.0.0.1:54074_solr    ] o.a.s.c.CoreDescriptor Created CoreDescriptor: {collection=testschemaapi, numShards=1, name=testschemaapi_shard1_replica2, transient=false, collection.configName=conf1, dataDir=data\, configSetProperties=configsetprops.json, config=solrconfig.xml, shard=shard1, loadOnStartup=true, schema=schema.xml}
   [junit4]   2> 1730828 INFO  (qtp337251127-13730) [n:127.0.0.1:54079_solr c:testschemaapi s:shard1  x:testschemaapi_shard1_replica1] o.a.s.c.ZkController Registering watch for collection testschemaapi
   [junit4]   2> 1730828 INFO  (qtp337251127-13730) [n:127.0.0.1:54079_solr c:testschemaapi s:shard1  x:testschemaapi_shard1_replica1] o.a.s.c.c.ZkStateReader addZkWatch [testschemaapi]
   [junit4]   2> 1730830 INFO  (qtp337251127-13730) [n:127.0.0.1:54079_solr c:testschemaapi s:shard1  x:testschemaapi_shard1_replica1] o.a.s.c.c.ZkStateReader Add data for [testschemaapi] ver [0]
   [junit4]   2> 1730830 INFO  (qtp337251127-13730) [n:127.0.0.1:54079_solr c:testschemaapi s:shard1  x:testschemaapi_shard1_replica1] o.a.s.c.ZkController look for our core node name
   [junit4]   2> 1730831 INFO  (qtp1145516899-13715) [n:127.0.0.1:54074_solr c:testschemaapi s:shard1  x:testschemaapi_shard1_replica2] o.a.s.c.ZkController publishing state=down
   [junit4]   2> 1730833 INFO  (OverseerStateUpdate-96556227269427204-127.0.0.1:54074_solr-n_0000000000) [n:127.0.0.1:54074_solr    ] o.a.s.c.Overseer processMessage: queueSize: 1, message = {
   [junit4]   2>   "state":"down",
   [junit4]   2>   "operation":"state",
   [junit4]   2>   "core":"testschemaapi_shard1_replica1",
   [junit4]   2>   "numShards":"1",
   [junit4]   2>   "node_name":"127.0.0.1:54079_solr",
   [junit4]   2>   "roles":null,
   [junit4]   2>   "base_url":"http://127.0.0.1:54079/solr",
   [junit4]   2>   "collection":"testschemaapi",
   [junit4]   2>   "shard":"shard1"} current state version: 0
   [junit4]   2> 1730834 INFO  (OverseerStateUpdate-96556227269427204-127.0.0.1:54074_solr-n_0000000000) [n:127.0.0.1:54074_solr    ] o.a.s.c.o.ReplicaMutator Update state numShards=1 message={
   [junit4]   2>   "state":"down",
   [junit4]   2>   "operation":"state",
   [junit4]   2>   "core":"testschemaapi_shard1_replica1",
   [junit4]   2>   "numShards":"1",
   [junit4]   2>   "node_name":"127.0.0.1:54079_solr",
   [junit4]   2>   "roles":null,
   [junit4]   2>   "base_url":"http://127.0.0.1:54079/solr",
   [junit4]   2>   "collection":"testschemaapi",
   [junit4]   2>   "shard":"shard1"}
   [junit4]   2> 1730836 INFO  (qtp1145516899-13715) [n:127.0.0.1:54074_solr c:testschemaapi s:shard1  x:testschemaapi_shard1_replica2] o.a.s.c.ZkController Registering watch for collection testschemaapi
   [junit4]   2> 1730836 INFO  (qtp1145516899-13715) [n:127.0.0.1:54074_solr c:testschemaapi s:shard1  x:testschemaapi_shard1_replica2] o.a.s.c.c.ZkStateReader addZkWatch [testschemaapi]
   [junit4]   2> 1730837 INFO  (qtp1145516899-13715) [n:127.0.0.1:54074_solr c:testschemaapi s:shard1  x:testschemaapi_shard1_replica2] o.a.s.c.c.ZkStateReader Add data for [testschemaapi] ver [0]
   [junit4]   2> 1730837 INFO  (qtp1145516899-13715) [n:127.0.0.1:54074_solr c:testschemaapi s:shard1  x:testschemaapi_shard1_replica2] o.a.s.c.ZkController look for our core node name
   [junit4]   2> 1730840 INFO  (OverseerStateUpdate-96556227269427204-127.0.0.1:54074_solr-n_0000000000) [n:127.0.0.1:54074_solr    ] o.a.s.c.Overseer processMessage: queueSize: 2, message = {
   [junit4]   2>   "state":"down",
   [junit4]   2>   "operation":"state",
   [junit4]   2>   "core":"testschemaapi_shard1_replica2",
   [junit4]   2>   "numShards":"1",
   [junit4]   2>   "node_name":"127.0.0.1:54074_solr",
   [junit4]   2>   "roles":null,
   [junit4]   2>   "base_url":"http://127.0.0.1:54074/solr",
   [junit4]   2>   "collection":"testschemaapi",
   [junit4]   2>   "shard":"shard1"} current state version: 0
   [junit4]   2> 1730840 INFO  (OverseerStateUpdate-96556227269427204-127.0.0.1:54074_solr-n_0000000000) [n:127.0.0.1:54074_solr    ] o.a.s.c.o.ReplicaMutator Update state numShards=1 message={
   [junit4]   2>   "state":"down",
   [junit4]   2>   "operation":"state",
   [junit4]   2>   "core":"testschemaapi_shard1_replica2",
   [junit4]   2>   "numShards":"1",
   [junit4]   2>   "node_name":"127.0.0.1:54074_solr",
   [junit4]   2>   "roles":null,
   [junit4]   2>   "base_url":"http://127.0.0.1:54074/solr",
   [junit4]   2>   "collection":"testschemaapi",
   [junit4]   2>   "shard":"shard1"}
   [junit4]   2> 1730945 INFO  (OverseerStateUpdate-96556227269427204-127.0.0.1:54074_solr-n_0000000000) [n:127.0.0.1:54074_solr    ] o.a.s.c.o.ZkStateWriter going to update_collection /collections/testschemaapi/state.json version: 0
   [junit4]   2> 1730946 INFO  (zkCallback-2603-thread-1-processing-n:127.0.0.1:54074_solr) [n:127.0.0.1:54074_solr    ] o.a.s.c.c.ZkStateReader A cluster state change: [WatchedEvent state:SyncConnected type:NodeDataChanged path:/collections/testschemaapi/state.json] for collection [testschemaapi] has occurred - updating... (live nodes size: [2])
   [junit4]   2> 1730949 INFO  (zkCallback-2607-thread-1-processing-n:127.0.0.1:54079_solr) [n:127.0.0.1:54079_solr    ] o.a.s.c.c.ZkStateReader A cluster state change: [WatchedEvent state:SyncConnected type:NodeDataChanged path:/collections/testschemaapi/state.json] for collection [testschemaapi] has occurred - updating... (live nodes size: [2])
   [junit4]   2> 1730949 INFO  (zkCallback-2603-thread-1-processing-n:127.0.0.1:54074_solr) [n:127.0.0.1:54074_solr    ] o.a.s.c.c.ZkStateReader Updating data for [testschemaapi] from [0] to [1]
   [junit4]   2> 1730950 INFO  (zkCallback-2607-thread-1-processing-n:127.0.0.1:54079_solr) [n:127.0.0.1:54079_solr    ] o.a.s.c.c.ZkStateReader Updating data for [testschemaapi] from [0] to [1]
   [junit4]   2> 1731830 INFO  (qtp337251127-13730) [n:127.0.0.1:54079_solr c:testschemaapi s:shard1  x:testschemaapi_shard1_replica1] o.a.s.c.ZkController waiting to find shard id in clusterstate for testschemaapi_shard1_replica1
   [junit4]   2> 1731830 INFO  (qtp337251127-13730) [n:127.0.0.1:54079_solr c:testschemaapi s:shard1  x:testschemaapi_shard1_replica1] o.a.s.c.ZkController Check for collection zkNode:testschemaapi
   [junit4]   2> 1731830 INFO  (qtp337251127-13730) [n:127.0.0.1:54079_solr c:testschemaapi s:shard1  x:testschemaapi_shard1_replica1] o.a.s.c.ZkController Collection zkNode exists
   [junit4]   2> 1731831 INFO  (qtp337251127-13730) [n:127.0.0.1:54079_solr c:testschemaapi s:shard1  x:testschemaapi_shard1_replica1] o.a.s.c.c.ZkStateReader Load collection config from: [/collections/testschemaapi]
   [junit4]   2> 1731831 INFO  (qtp337251127-13730) [n:127.0.0.1:54079_solr c:testschemaapi s:shard1  x:testschemaapi_shard1_replica1] o.a.s.c.c.ZkStateReader path=[/collections/testschemaapi] [configName]=[conf1] specified config exists in ZooKeeper
   [junit4]   2> 1731832 INFO  (qtp337251127-13730) [n:127.0.0.1:54079_solr c:testschemaapi s:shard1  x:testschemaapi_shard1_replica1] o.a.s.c.SolrResourceLoader new SolrResourceLoader for directory: 'C:\Users\jenkins\workspace\Lucene-Solr-5.5-Windows\solr\build\solr-core\test\J1\temp\solr.schema.TestManagedSchemaAPI_1DA3DCBD0B585EF9-001\tempDir-001\node2\testschemaapi_shard1_replica1'
   [junit4]   2> 1731832 INFO  (qtp337251127-13730) [n:127.0.0.1:54079_solr c:testschemaapi s:shard1  x:testschemaapi_shard1_replica1] o.a.s.c.SolrResourceLoader JNDI not configured for solr (NoInitialContextEx)
   [junit4]   2> 1731832 INFO  (qtp337251127-13730) [n:127.0.0.1:54079_solr c:testschemaapi s:shard1  x:testschemaapi_shard1_replica1] o.a.s.c.SolrResourceLoader solr home defaulted to 'solr/' (could not find system property or JNDI)
   [junit4]   2> 1731837 INFO  (qtp1145516899-13715) [n:127.0.0.1:54074_solr c:testschemaapi s:shard1  x:testschemaapi_shard1_replica2] o.a.s.c.ZkController waiting to find shard id in clusterstate for testschemaapi_shard1_replica2
   [junit4]   2> 1731837 INFO  (qtp337251127-13730) [n:127.0.0.1:54079_solr c:testschemaapi s:shard1  x:testschemaapi_shard1_replica1] o.a.s.c.Config loaded config solrconfig.xml with version 0 
   [junit4]   2> 1731837 INFO  (qtp1145516899-13715) [n:127.0.0.1:54074_solr c:testschemaapi s:shard1  x:testschemaapi_shard1_replica2] o.a.s.c.ZkController Check for collection zkNode:testschemaapi
   [junit4]   2> 1731838 INFO  (qtp1145516899-13715) [n:127.0.0.1:54074_solr c:testschemaapi s:shard1  x:testschemaapi_shard1_replica2] o.a.s.c.ZkController Collection zkNode exists
   [junit4]   2> 1731838 INFO  (qtp1145516899-13715) [n:127.0.0.1:54074_solr c:testschemaapi s:shard1  x:testschemaapi_shard1_replica2] o.a.s.c.c.ZkStateReader Load collection config from: [/collections/testschemaapi]
   [junit4]   2> 1731839 INFO  (qtp1145516899-13715) [n:127.0.0.1:54074_solr c:testschemaapi s:shard1  x:testschemaapi_shard1_replica2] o.a.s.c.c.ZkStateReader path=[/collections/testschemaapi] [configName]=[conf1] specified config exists in ZooKeeper
   [junit4]   2> 1731839 INFO  (qtp1145516899-13715) [n:127.0.0.1:54074_solr c:testschemaapi s:shard1  x:testschemaapi_shard1_replica2] o.a.s.c.SolrResourceLoader new SolrResourceLoader for directory: 'C:\Users\jenkins\workspace\Lucene-Solr-5.5-Windows\solr\build\solr-core\test\J1\temp\solr.schema.TestManagedSchemaAPI_1DA3DCBD0B585EF9-001\tempDir-001\node1\testschemaapi_shard1_replica2'
   [junit4]   2> 1731839 INFO  (qtp1145516899-13715) [n:127.0.0.1:54074_solr c:testschemaapi s:shard1  x:testschemaapi_shard1_replica2] o.a.s.c.SolrResourceLoader JNDI not configured for solr (NoInitialContextEx)
   [junit4]   2> 1731840 INFO  (qtp1145516899-13715) [n:127.0.0.1:54074_solr c:testschemaapi s:shard1  x:testschemaapi_shard1_replica2] o.a.s.c.SolrResourceLoader solr home defaulted to 'solr/' (could not find system property or JNDI)
   [junit4]   2> 1731845 INFO  (qtp1145516899-13715) [n:127.0.0.1:54074_solr c:testschemaapi s:shard1  x:testschemaapi_shard1_replica2] o.a.s.c.Config loaded config solrconfig.xml with version 0 
   [junit4]   2> 1731865 INFO  (qtp1145516899-13715) [n:127.0.0.1:54074_solr c:testschemaapi s:shard1  x:testschemaapi_shard1_replica2] o.a.s.c.SolrConfig current version of requestparams : -1
   [junit4]   2> 1731865 INFO  (qtp337251127-13730) [n:127.0.0.1:54079_solr c:testschemaapi s:shard1  x:testschemaapi_shard1_replica1] o.a.s.c.SolrConfig current version of requestparams : -1
   [junit4]   2> 1731910 INFO  (qtp337251127-13730) [n:127.0.0.1:54079_solr c:testschemaapi s:shard1  x:testschemaapi_shard1_replica1] o.a.s.c.SolrConfig Using Lucene MatchVersion: 5.5.3
   [junit4]   2> 1731912 INFO  (qtp1145516899-13715) [n:127.0.0.1:54074_solr c:testschemaapi s:shard1  x:testschemaapi_shard1_replica2] o.a.s.c.SolrConfig Using Lucene MatchVersion: 5.5.3
   [junit4]   2> 1732014 INFO  (qtp337251127-13730) [n:127.0.0.1:54079_solr c:testschemaapi s:shard1  x:testschemaapi_shard1_replica1] o.a.s.c.SolrConfig Loaded SolrConfig: solrconfig.xml
   [junit4]   2> 1732027 INFO  (qtp337251127-13730) [n:127.0.0.1:54079_solr c:testschemaapi s:shard1  x:testschemaapi_shard1_replica1] o.a.s.s.IndexSchema [testschemaapi_shard1_replica1] Schema name=minimal
   [junit4]   2> 1732051 INFO  (qtp1145516899-13715) [n:127.0.0.1:54074_solr c:testschemaapi s:shard1  x:testschemaapi_shard1_replica2] o.a.s.c.SolrConfig Loaded SolrConfig: solrconfig.xml
   [junit4]   2> 1732061 INFO  (qtp1145516899-13715) [n:127.0.0.1:54074_solr c:testschemaapi s:shard1  x:testschemaapi_shard1_replica2] o.a.s.s.IndexSchema [testschemaapi_shard1_replica2] Schema name=minimal
   [junit4]   2> 1732079 INFO  (qtp337251127-13730) [n:127.0.0.1:54079_solr c:testschemaapi s:shard1  x:testschemaapi_shard1_replica1] o.a.s.s.IndexSchema unique key field: id
   [junit4]   2> 1732081 INFO  (qtp1145516899-13715) [n:127.0.0.1:54074_solr c:testschemaapi s:shard1  x:testschemaapi_shard1_replica2] o.a.s.s.IndexSchema unique key field: id
   [junit4]   2> 1732087 INFO  (qtp337251127-13730) [n:127.0.0.1:54079_solr c:testschemaapi s:shard1  x:testschemaapi_shard1_replica1] o.a.s.c.ConfigSetProperties Did not find ConfigSet properties, assuming default properties: Can't find resource 'configsetprops.json' in classpath or '/configs/conf1', cwd=C:\Users\jenkins\workspace\Lucene-Solr-5.5-Windows\solr\build\solr-core\test\J1
   [junit4]   2> 1732087 INFO  (qtp1145516899-13715) [n:127.0.0.1:54074_solr c:testschemaapi s:shard1  x:testschemaapi_shard1_replica2] o.a.s.c.ConfigSetProperties Did not find ConfigSet properties, assuming default properties: Can't find resource 'configsetprops.json' in classpath or '/configs/conf1', cwd=C:\Users\jenkins\workspace\Lucene-Solr-5.5-Windows\solr\build\solr-core\test\J1
   [junit4]   2> 1732088 INFO  (qtp1145516899-13715) [n:127.0.0.1:54074_solr c:testschemaapi s:shard1  x:testschemaapi_shard1_replica2] o.a.s.c.CoreContainer Creating SolrCore 'testschemaapi_shard1_replica2' using configuration from collection testschemaapi
   [junit4]   2> 1732088 INFO  (qtp337251127-13730) [n:127.0.0.1:54079_solr c:testschemaapi s:shard1  x:testschemaapi_shard1_replica1] o.a.s.c.CoreContainer Creating SolrCore 'testschemaapi_shard1_replica1' using configuration from collection testschemaapi
   [junit4]   2> 1732088 INFO  (qtp337251127-13730) [n:127.0.0.1:54079_solr c:testschemaapi s:shard1 r:core_node1 x:testschemaapi_shard1_replica1] o.a.s.c.SolrCore org.apache.solr.core.MockDirectoryFactory
   [junit4]   2> 1732088 INFO  (qtp1145516899-13715) [n:127.0.0.1:54074_solr c:testschemaapi s:shard1 r:core_node2 x:testschemaapi_shard1_replica2] o.a.s.c.SolrCore org.apache.solr.core.MockDirectoryFactory
   [junit4]   2> 1732089 INFO  (qtp337251127-13730) [n:127.0.0.1:54079_solr c:testschemaapi s:shard1 r:core_node1 x:testschemaapi_shard1_replica1] o.a.s.c.SolrCore [[testschemaapi_shard1_replica1] ] Opening new SolrCore at [C:\Users\jenkins\workspace\Lucene-Solr-5.5-Windows\solr\build\solr-core\test\J1\temp\solr.schema.TestManagedSchemaAPI_1DA3DCBD0B585EF9-001\tempDir-001\node2\testschemaapi_shard1_replica1], dataDir=[C:\Users\jenkins\workspace\Lucene-Solr-5.5-Windows\solr\build\solr-core\test\J1\temp\solr.schema.TestManagedSchemaAPI_1DA3DCBD0B585EF9-001\tempDir-001\node2\.\testschemaapi_shard1_replica1\data\]
   [junit4]   2> 1732089 INFO  (qtp337251127-13730) [n:127.0.0.1:54079_solr c:testschemaapi s:shard1 r:core_node1 x:testschemaapi_shard1_replica1] o.a.s.c.SolrCore JMX monitoring not detected for core: testschemaapi_shard1_replica1
   [junit4]   2> 1732089 INFO  (qtp1145516899-13715) [n:127.0.0.1:54074_solr c:testschemaapi s:shard1 r:core_node2 x:testschemaapi_shard1_replica2] o.a.s.c.SolrCore [[testschemaapi_shard1_replica2] ] Opening new SolrCore at [C:\Users\jenkins\workspace\Lucene-Solr-5.5-Windows\solr\build\solr-core\test\J1\temp\solr.schema.TestManagedSchemaAPI_1DA3DCBD0B585EF9-001\tempDir-001\node1\testschemaapi_shard1_replica2], dataDir=[C:\Users\jenkins\workspace\Lucene-Solr-5.5-Windows\solr\build\solr-core\test\J1\temp\solr.schema.TestManagedSchemaAPI_1DA3DCBD0B585EF9-001\tempDir-001\node1\.\testschemaapi_shard1_replica2\data\]
   [junit4]   2> 1732089 INFO  (qtp1145516899-13715) [n:127.0.0.1:54074_solr c:testschemaapi s:shard1 r:core_node2 x:testschemaapi_shard1_replica2] o.a.s.c.SolrCore JMX monitoring not detected for core: testschemaapi_shard1_replica2
   [junit4]   2> 1732089 INFO  (qtp337251127-13730) [n:127.0.0.1:54079_solr c:testschemaapi s:shard1 r:core_node1 x:testschemaapi_shard1_replica1] o.a.s.c.CachingDirectoryFactory return new directory for C:\Users\jenkins\workspace\Lucene-Solr-5.5-Windows\solr\build\solr-core\test\J1\temp\solr.schema.TestManagedSchemaAPI_1DA3DCBD0B585EF9-001\tempDir-001\node2\.\testschemaapi_shard1_replica1\data\
   [junit4]   2> 1732090 INFO  (qtp337251127-13730) [n:127.0.0.1:54079_solr c:testschemaapi s:shard1 r:core_node1 x:testschemaapi_shard1_replica1] o.a.s.c.SolrCore New index directory detected: old=null new=C:\Users\jenkins\workspace\Lucene-Solr-5.5-Windows\solr\build\solr-core\test\J1\temp\solr.schema.TestManagedSchemaAPI_1DA3DCBD0B585EF9-001\tempDir-001\node2\.\testschemaapi_shard1_replica1\data\index/
   [junit4]   2> 1732090 INFO  (qtp1145516899-13715) [n:127.0.0.1:54074_solr c:testschemaapi s:shard1 r:core_node2 x:testschemaapi_shard1_replica2] o.a.s.c.CachingDirectoryFactory return new directory for C:\Users\jenkins\workspace\Lucene-Solr-5.5-Windows\solr\build\solr-core\test\J1\temp\solr.schema.TestManagedSchemaAPI_1DA3DCBD0B585EF9-001\tempDir-001\node1\.\testschemaapi_shard1_replica2\data\
   [junit4]   2> 1732090 WARN  (qtp337251127-13730) [n:127.0.0.1:54079_solr c:testschemaapi s:shard1 r:core_node1 x:testschemaapi_shard1_replica1] o.a.s.c.SolrCore [testschemaapi_shard1_replica1] Solr index directory 'C:\Users\jenkins\workspace\Lucene-Solr-5.5-Windows\solr\build\solr-core\test\J1\temp\solr.schema.TestManagedSchemaAPI_1DA3DCBD0B585EF9-001\tempDir-001\node2\.\testschemaapi_shard1_replica1\data\index' doesn't exist. Creating new index...
   [junit4]   2> 1732090 INFO  (qtp1145516899-13715) [n:127.0.0.1:54074_solr c:testschemaapi s:shard1 r:core_node2 x:testschemaapi_shard1_replica2] o.a.s.c.SolrCore New index directory detected: old=null new=C:\Users\jenkins\workspace\Lucene-Solr-5.5-Windows\solr\build\solr-core\test\J1\temp\solr.schema.TestManagedSchemaAPI_1DA3DCBD0B585EF9-001\tempDir-001\node1\.\testschemaapi_shard1_replica2\data\index/
   [junit4]   2> 1732091 WARN  (qtp1145516899-13715) [n:127.0.0.1:54074_solr c:testschemaapi s:shard1 r:core_node2 x:testschemaapi_shard1_replica2] o.a.s.c.SolrCore [testschemaapi_shard1_replica2] Solr index directory 'C:\Users\jenkins\workspace\Lucene-Solr-5.5-Windows\solr\build\solr-core\test\J1\temp\solr.schema.TestManagedSchemaAPI_1DA3DCBD0B585EF9-001\tempDir-001\node1\.\testschemaapi_shard1_replica2\data\index' doesn't exist. Creating new index...
   [junit4]   2> 1732091 INFO  (qtp337251127-13730) [n:127.0.0.1:54079_solr c:testschemaapi s:shard1 r:core_node1 x:testschemaapi_shard1_replica1] o.a.s.c.CachingDirectoryFactory return new directory for C:\Users\jenkins\workspace\Lucene-Solr-5.5-Windows\solr\build\solr-core\test\J1\temp\solr.schema.TestManagedSchemaAPI_1DA3DCBD0B585EF9-001\tempDir-001\node2\.\testschemaapi_shard1_replica1\data\index
   [junit4]   2> 1732092 INFO  (qtp1145516899-13715) [n:127.0.0.1:54074_solr c:testschemaapi s:shard1 r:core_node2 x:testschemaapi_shard1_replica2] o.a.s.c.CachingDirectoryFactory return new directory for C:\Users\jenkins\workspace\Lucene-Solr-5.5-Windows\solr\build\solr-core\test\J1\temp\solr.schema.TestManagedSchemaAPI_1DA3DCBD0B585EF9-001\tempDir-001\node1\.\testschemaapi_shard1_replica2\data\index
   [junit4]   2> 1732093 INFO  (qtp1145516899-13715) [n:127.0.0.1:54074_solr c:testschemaapi s:shard1 r:core_node2 x:testschemaapi_shard1_replica2] o.a.s.c.SolrDeletionPolicy SolrDeletionPolicy.onCommit: commits: num=1
   [junit4]   2> 	commit{dir=MockDirectoryWrapper(RAMDirectory@571f6f70 lockFactory=org.apache.lucene.store.SingleInstanceLockFactory@50cd4ebf),segFN=segments_1,generation=1}
   [junit4]   2> 1732094 INFO  (qtp1145516899-13715) [n:127.0.0.1:54074_solr c:testschemaapi s:shard1 r:core_node2 x:testschemaapi_shard1_replica2] o.a.s.c.SolrDeletionPolicy newest commit generation = 1
   [junit4]   2> 1732094 INFO  (qtp337251127-13730) [n:127.0.0.1:54079_solr c:testschemaapi s:shard1 r:core_node1 x:testschemaapi_shard1_replica1] o.a.s.c.SolrDeletionPolicy SolrDeletionPolicy.onCommit: commits: num=1
   [junit4]   2> 	commit{dir=MockDirectoryWrapper(RAMDirectory@56ed070a lockFactory=org.apache.lucene.store.SingleInstanceLockFactory@63694e1b),segFN=segments_1,generation=1}
   [junit4]   2> 1732094 INFO  (qtp337251127-13730) [n:127.0.0.1:54079_solr c:testschemaapi s:shard1 r:core_node1 x:testschemaapi_shard1_replica1] o.a.s.c.SolrDeletionPolicy newest commit generation = 1
   [junit4]   2> 1732097 INFO  (qtp1145516899-13715) [n:127.0.0.1:54074_solr c:testschemaapi s:shard1 r:core_node2 x:testschemaapi_shard1_replica2] o.a.s.c.SolrCore no updateRequestProcessorChain defined as default, creating implicit default
   [junit4]   2> 1732098 INFO  (qtp337251127-13730) [n:127.0.0.1:54079_solr c:testschemaapi s:shard1 r:core_node1 x:testschemaapi_shard1_replica1] o.a.s.c.SolrCore no updateRequestProcessorChain defined as default, creating implicit default
   [junit4]   2> 1732117 INFO  (qtp1145516899-13715) [n:127.0.0.1:54074_solr c:testschemaapi s:shard1 r:core_node2 x:testschemaapi_shard1_replica2] o.a.s.h.l.XMLLoader xsltCacheLifetimeSeconds=60
   [junit4]   2> 1732117 INFO  (qtp337251127-13730) [n:127.0.0.1:54079_solr c:testschemaapi s:shard1 r:core_node1 x:testschemaapi_shard1_replica1] o.a.s.h.l.XMLLoader xsltCacheLifetimeSeconds=60
   [junit4]   2> 1732120 INFO  (qtp1145516899-13715) [n:127.0.0.1:54074_solr c:testschemaapi s:shard1 r:core_node2 x:testschemaapi_shard1_replica2] o.a.s.h.l.XMLLoader xsltCacheLifetimeSeconds=60
   [junit4]   2> 1732121 INFO  (qtp337251127-13730) [n:127.0.0.1:54079_solr c:testschemaapi s:shard1 r:core_node1 x:testschemaapi_shard1_replica1] o.a.s.h.l.XMLLoader xsltCacheLifetimeSeconds=60
   [junit4]   2> 1732123 INFO  (qtp1145516899-13715) [n:127.0.0.1:54074_solr c:testschemaapi s:shard1 r:core_node2 x:testschemaapi_shard1_replica2] o.a.s.h.l.XMLLoader xsltCacheLifetimeSeconds=60
   [junit4]   2> 1732124 INFO  (qtp337251127-13730) [n:127.0.0.1:54079_solr c:testschemaapi s:shard1 r:core_node1 x:testschemaapi_shard1_replica1] o.a.s.h.l.XMLLoader xsltCacheLifetimeSeconds=60
   [junit4]   2> 1732126 INFO  (qtp1145516899-13715) [n:127.0.0.1:54074_solr c:testschemaapi s:shard1 r:core_node2 x:testschemaapi_shard1_replica2] o.a.s.h.l.XMLLoader xsltCacheLifetimeSeconds=60
   [junit4]   2> 1732126 INFO  (qtp337251127-13730) [n:127.0.0.1:54079_solr c:testschemaapi s:shard1 r:core_node1 x:testschemaapi_shard1_replica1] o.a.s.h.l.XMLLoader xsltCacheLifetimeSeconds=60
   [junit4]   2> 1732128 INFO  (qtp1145516899-13715) [n:127.0.0.1:54074_solr c:testschemaapi s:shard1 r:core_node2 x:testschemaapi_shard1_replica2] o.a.s.c.RequestHandlers Registered paths: /admin/ping,/admin/properties,/admin/mbeans,/admin/file,/admin/threads,/admin/luke,/get,/admin/segments,/update/json,/schema,/replication,/update/json/docs,/select,/config,/admin/plugins,/admin/system,/update,/admin/logging,/update/csv
   [junit4]   2> 1732128 INFO  (qtp337251127-13730) [n:127.0.0.1:54079_solr c:testschemaapi s:shard1 r:core_node1 x:testschemaapi_shard1_replica1] o.a.s.c.RequestHandlers Registered paths: /admin/ping,/admin/properties,/admin/mbeans,/admin/file,/admin/threads,/admin/luke,/get,/admin/segments,/update/json,/schema,/replication,/update/json/docs,/select,/config,/admin/plugins,/admin/system,/update,/admin/logging,/update/csv
   [junit4]   2> 1732130 INFO  (qtp1145516899-13715) [n:127.0.0.1:54074_solr c:testschemaapi s:shard1 r:core_node2 x:testschemaapi_shard1_replica2] o.a.s.c.SolrCore Using default statsCache cache: org.apache.solr.search.stats.LocalStatsCache
   [junit4]   2> 1732131 INFO  (qtp337251127-13730) [n:127.0.0.1:54079_solr c:testschemaapi s:shard1 r:core_node1 x:testschemaapi_shard1_replica1] o.a.s.c.SolrCore Using default statsCache cache: org.apache.solr.search.stats.LocalStatsCache
   [junit4]   2> 1732133 INFO  (qtp1145516899-13715) [n:127.0.0.1:54074_solr c:testschemaapi s:shard1 r:core_node2 x:testschemaapi_shard1_replica2] o.a.s.u.UpdateHandler Using UpdateLog implementation: org.apache.solr.update.UpdateLog
   [junit4]   2> 1732133 INFO  (qtp1145516899-13715) [n:127.0.0.1:54074_solr c:testschemaapi s:shard1 r:core_node2 x:testschemaapi_shard1_replica2] o.a.s.u.UpdateLog Initializing UpdateLog: dataDir=null defaultSyncLevel=FLUSH numRecordsToKeep=100 maxNumLogsToKeep=10 numVersionBuckets=65536
   [junit4]   2> 1732133 INFO  (qtp337251127-13730) [n:127.0.0.1:54079_solr c:testschemaapi s:shard1 r:core_node1 x:testschemaapi_shard1_replica1] o.a.s.u.UpdateHandler Using UpdateLog implementation: org.apache.solr.update.UpdateLog
   [junit4]   2> 1732133 INFO  (qtp337251127-13730) [n:127.0.0.1:54079_solr c:testschemaapi s:shard1 r:core_node1 x:testschemaapi_shard1_replica1] o.a.s.u.UpdateLog Initializing UpdateLog: dataDir=null defaultSyncLevel=FLUSH numRecordsToKeep=100 maxNumLogsToKeep=10 numVersionBuckets=65536
   [junit4]   2> 1732137 INFO  (qtp1145516899-13715) [n:127.0.0.1:54074_solr c:testschemaapi s:shard1 r:core_node2 x:testschemaapi_shard1_replica2] o.a.s.u.CommitTracker Hard AutoCommit: disabled
   [junit4]   2> 1732137 INFO  (qtp1145516899-13715) [n:127.0.0.1:54074_solr c:testschemaapi s:shard1 r:core_node2 x:testschemaapi_shard1_replica2] o.a.s.u.CommitTracker Soft AutoCommit: disabled
   [junit4]   2> 1732138 INFO  (OldIndexDirectoryCleanupThreadForCore-testschemaapi_shard1_replica2) [n:127.0.0.1:54074_solr c:testschemaapi s:shard1 r:core_node2 x:testschemaapi_shard1_replica2] o.a.s.c.SolrCore Looking for old index directories to cleanup for core testschemaapi_shard1_replica2 in C:\Users\jenkins\workspace\Lucene-Solr-5.5-Windows\solr\build\solr-core\test\J1\temp\solr.schema.TestManagedSchemaAPI_1DA3DCBD0B585EF9-001\tempDir-001\node1\.\testschemaapi_shard1_replica2\data\
   [junit4]   2> 1732146 INFO  (OldIndexDirectoryCleanupThreadForCore-testschemaapi_shard1_replica1) [n:127.0.0.1:54079_solr c:testschemaapi s:shard1 r:core_node1 x:testschemaapi_shard1_replica1] o.a.s.c.SolrCore Looking for old index directories to cleanup for core testschemaapi_shard1_replica1 in C:\Users\jenkins\workspace\Lucene-Solr-5.5-Windows\solr\build\solr-core\test\J1\temp\solr.schema.TestManagedSchemaAPI_1DA3DCBD0B585EF9-001\tempDir-001\node2\.\testschemaapi_shard1_replica1\data\
   [junit4]   2> 1732147 INFO  (qtp337251127-13730) [n:127.0.0.1:54079_solr c:testschemaapi s:shard1 r:core_node1 x:testschemaapi_shard1_replica1] o.a.s.u.CommitTracker Hard AutoCommit: disabled
   [junit4]   2> 1732147 INFO  (qtp337251127-13730) [n:127.0.0.1:54079_solr c:testschemaapi s:shard1 r:core_node1 x:testschemaapi_shard1_replica1] o.a.s.u.CommitTracker Soft AutoCommit: disabled
   [junit4]   2> 1732150 INFO  (qtp1145516899-13715) [n:127.0.0.1:54074_solr c:testschemaapi s:shard1 r:core_node2 x:testschemaapi_shard1_replica2] o.a.s.c.SolrDeletionPolicy SolrDeletionPolicy.onInit: commits: num=1
   [junit4]   2> 	commit{dir=MockDirectoryWrapper(RAMDirectory@571f6f70 lockFactory=org.apache.lucene.store.SingleInstanceLockFactory@50cd4ebf),segFN=segments_1,generation=1}
   [junit4]   2> 1732150 INFO  (qtp337251127-13730) [n:127.0.0.1:54079_solr c:testschemaapi s:shard1 r:core_node1 x:testschemaapi_shard1_replica1] o.a.s.c.SolrDeletionPolicy SolrDeletionPolicy.onInit: commits: num=1
   [junit4]   2> 	commit{dir=MockDirectoryWrapper(RAMDirectory@56ed070a lockFactory=org.apache.lucene.store.SingleInstanceLockFactory@63694e1b),segFN=segments_1,generation=1}
   [junit4]   2> 1732150 INFO  (qtp337251127-13730) [n:127.0.0.1:54079_solr c:testschemaapi s:shard1 r:core_node1 x:testschemaapi_shard1_replica1] o.a.s.c.SolrDeletionPolicy newest commit generation = 1
   [junit4]   2> 1732151 INFO  (qtp337251127-13730) [n:127.0.0.1:54079_solr c:testschemaapi s:shard1 r:core_node1 x:testschemaapi_shard1_replica1] o.a.s.s.SolrIndexSearcher Opening Searcher@2eaf8e87[testschemaapi_shard1_replica1] main
   [junit4]   2> 1732151 INFO  (qtp1145516899-13715) [n:127.0.0.1:54074_solr c:testschemaapi s:shard1 r:core_node2 x:testschemaapi_shard1_replica2] o.a.s.c.SolrDeletionPolicy newest commit generation = 1
   [junit4]   2> 1732151 INFO  (qtp337251127-13730) [n:127.0.0.1:54079_solr c:testschemaapi s:shard1 r:core_node1 x:testschemaapi_shard1_replica1] o.a.s.c.c.ZkStateReader Load collection config from: [/collections/testschemaapi]
   [junit4]   2> 1732154 INFO  (qtp337251127-13730) [n:127.0.0.1:54079_solr c:testschemaapi s:shard1 r:core_node1 x:testschemaapi_shard1_replica1] o.a.s.c.c.ZkStateReader path=[/collections/testschemaapi] [configName]=[conf1] specified config exists in ZooKeeper
   [junit4]   2> 1732154 INFO  (qtp337251127-13730) [n:127.0.0.1:54079_solr c:testschemaapi s:shard1 r:core_node1 x:testschemaapi_shard1_replica1] o.a.s.r.ManagedResourceStorage Setting up ZooKeeper-based storage for the RestManager with znodeBase: /configs/conf1
   [junit4]   2> 1732154 INFO  (qtp337251127-13730) [n:127.0.0.1:54079_solr c:testschemaapi s:shard1 r:core_node1 x:testschemaapi_shard1_replica1] o.a.s.r.ManagedResourceStorage Configured ZooKeeperStorageIO with znodeBase: /configs/conf1
   [junit4]   2> 1732154 INFO  (qtp337251127-13730) [n:127.0.0.1:54079_solr c:testschemaapi s:shard1 r:core_node1 x:testschemaapi_shard1_replica1] o.a.s.r.RestManager Initializing RestManager with initArgs: {}
   [junit4]   2> 1732154 INFO  (qtp337251127-13730) [n:127.0.0.1:54079_solr c:testschemaapi s:shard1 r:core_node1 x:testschemaapi_shard1_replica1] o.a.s.r.ManagedResourceStorage Reading _rest_managed.json using ZooKeeperStorageIO:path=/configs/conf1
   [junit4]   2> 1732154 INFO  (qtp337251127-13730) [n:127.0.0.1:54079_solr c:testschemaapi s:shard1 r:core_node1 x:testschemaapi_shard1_replica1] o.a.s.r.ManagedResourceStorage No data found for znode /configs/conf1/_rest_managed.json
   [junit4]   2> 1732154 INFO  (qtp337251127-13730) [n:127.0.0.1:54079_solr c:testschemaapi s:shard1 r:core_node1 x:testschemaapi_shard1_replica1] o.a.s.r.ManagedResourceStorage Loaded null at path _rest_managed.json using ZooKeeperStorageIO:path=/configs/conf1
   [junit4]   2> 1732154 INFO  (qtp337251127-13730) [n:127.0.0.1:54079_solr c:testschemaapi s:shard1 r:core_node1 x:testschemaapi_shard1_replica1] o.a.s.r.RestManager Initializing 0 registered ManagedResources
   [junit4]   2> 1732154 INFO  (qtp337251127-13730) [n:127.0.0.1:54079_solr c:testschemaapi s:shard1 r:core_node1 x:testschemaapi_shard1_replica1] o.a.s.s.ZkIndexSchemaReader Creating ZooKeeper watch for the managed schema at /configs/conf1/managed-schema
   [junit4]   2> 1732155 INFO  (qtp1145516899-13715) [n:127.0.0.1:54074_solr c:testschemaapi s:shard1 r:core_node2 x:testschemaapi_shard1_replica2] o.a.s.s.SolrIndexSearcher Opening Searcher@548dd7e9[testschemaapi_shard1_replica2] main
   [junit4]   2> 1732155 INFO  (qtp337251127-13730) [n:127.0.0.1:54079_solr c:testschemaapi s:shard1 r:core_node1 x:testschemaapi_shard1_replica1] o.a.s.c.ZkController Added new OnReconnect listener ZkIndexSchemaReader: /configs/conf1/managed-schema, uniqueCoreId: testschemaapi_shard1_replica1:469732251806028
   [junit4]   2> 1732155 INFO  (qtp337251127-13730) [n:127.0.0.1:54079_solr c:testschemaapi s:shard1 r:core_node1 x:testschemaapi_shard1_replica1] o.a.s.h.ReplicationHandler Commits will be reserved for  10000
   [junit4]   2> 1732155 INFO  (qtp337251127-13730) [n:127.0.0.1:54079_solr c:testschemaapi s:shard1 r:core_node1 x:testschemaapi_shard1_replica1] o.a.s.u.UpdateLog Looking up max value of version field to seed version buckets
   [junit4]   2> 1732155 INFO  (qtp337251127-13730) [n:127.0.0.1:54079_solr c:testschemaapi s:shard1 r:core_node1 x:testschemaapi_shard1_replica1] o.a.s.u.VersionInfo Refreshing highest value of _version_ for 65536 version buckets from index
   [junit4]   2> 1732155 INFO  (qtp337251127-13730) [n:127.0.0.1:54079_solr c:testschemaapi s:shard1 r:core_node1 x:testschemaapi_shard1_replica1] o.a.s.u.VersionInfo No terms found for _version_, cannot seed version bucket highest value from index
   [junit4]   2> 1732157 INFO  (searcherExecutor-4704-thread-1-processing-x:testschemaapi_shard1_replica1 n:127.0.0.1:54079_solr r:core_node1 c:testschemaapi s:shard1) [n:127.0.0.1:54079_solr c:testschemaapi s:shard1 r:core_node1 x:testschemaapi_shard1_replica1] o.a.s.c.SolrCore [testschemaapi_shard1_replica1] Registered new searcher Searcher@2eaf8e87[testschemaapi_shard1_replica1] main{ExitableDirectoryReader(UninvertingDirectoryReader())}
   [junit4]   2> 1732157 INFO  (qtp337251127-13730) [n:127.0.0.1:54079_solr c:testschemaapi s:shard1 r:core_node1 x:testschemaapi_shard1_replica1] o.a.s.u.UpdateLog Could not find max version in index or recent updates, using new clock 1544899639392600064
   [junit4]   2> 1732159 INFO  (qtp337251127-13730) [n:127.0.0.1:54079_solr c:testschemaapi s:shard1 r:core_node1 x:testschemaapi_shard1_replica1] o.a.s.u.UpdateLog Took 3.0ms to seed version buckets with highest version 1544899639392600064
   [junit4]   2> 1732160 INFO  (qtp337251127-13730) [n:127.0.0.1:54079_solr c:testschemaapi s:shard1 r:core_node1 x:testschemaapi_shard1_replica1] o.a.s.c.ZkController watch zkdir /configs/conf1
   [junit4]   2> 1732160 INFO  (qtp1145516899-13715) [n:127.0.0.1:54074_solr c:testschemaapi s:shard1 r:core_node2 x:testschemaapi_shard1_replica2] o.a.s.c.c.ZkStateReader Load collection config from: [/collections/testschemaapi]
   [junit4]   2> 1732165 INFO  (qtp337251127-13730) [n:127.0.0.1:54079_solr c:testschemaapi s:shard1 r:core_node1 x:testschemaapi_shard1_replica1] o.a.s.c.CoreContainer registering core: testschemaapi_shard1_replica1
   [junit4]   2> 1732165 INFO  (qtp337251127-13730) [n:127.0.0.1:54079_solr c:testschemaapi s:shard1 r:core_node1 x:testschemaapi_shard1_replica1] o.a.s.c.ZkController Register replica - core:testschemaapi_shard1_replica1 address:http://127.0.0.1:54079/solr collection:testschemaapi shard:shard1
   [junit4]   2> 1732166 INFO  (qtp1145516899-13715) [n:127.0.0.1:54074_solr c:testschemaapi s:shard1 r:core_node2 x:testschemaapi_shard1_replica2] o.a.s.c.c.ZkStateReader path=[/collections/testschemaapi] [configName]=[conf1] specified config exists in ZooKeeper
   [junit4]   2> 1732166 INFO  (qtp1145516899-13715) [n:127.0.0.1:54074_solr c:testschemaapi s:shard1 r:core_node2 x:testschemaapi_shard1_replica2] o.a.s.r.ManagedResourceStorage Setting up ZooKeeper-based storage for the RestManager with znodeBase: /configs/conf1
   [junit4]   2> 1732166 INFO  (qtp1145516899-13715) [n:127.0.0.1:54074_solr c:testschemaapi s:shard1 r:core_node2 x:testschemaapi_shard1_replica2] o.a.s.r.ManagedResourceStorage Configured ZooKeeperStorageIO with znodeBase: /configs/conf1
   [junit4]   2> 1732166 INFO  (qtp1145516899-13715) [n:127.0.0.1:54074_solr c:testschemaapi s:shard1 r:core_node2 x:testschemaapi_shard1_replica2] o.a.s.r.RestManager Initializing RestManager with initArgs: {}
   [junit4]   2> 1732166 INFO  (qtp1145516899-13715) [n:127.0.0.1:54074_solr c:testschemaapi s:shard1 r:core_node2 x:testschemaapi_shard1_replica2] o.a.s.r.ManagedResourceStorage Reading _rest_managed.json using ZooKeeperStorageIO:path=/configs/conf1
   [junit4]   2> 1732167 INFO  (qtp337251127-13730) [n:127.0.0.1:54079_solr c:testschemaapi s:shard1 r:core_node1 x:testschemaapi_shard1_replica1] o.a.s.c.c.SolrZkClient makePath: /collections/testschemaapi/leader_elect/shard1/election
   [junit4]   2> 1732167 INFO  (qtp1145516899-13715) [n:127.0.0.1:54074_solr c:testschemaapi s:shard1 r:core_node2 x:testschemaapi_shard1_replica2] o.a.s.r.ManagedResourceStorage No data found for znode /configs/conf1/_rest_managed.json
   [junit4]   2> 1732167 INFO  (qtp1145516899-13715) [n:127.0.0.1:54074_solr c:testschemaapi s:shard1 r:core_node2 x:testschemaapi_shard1_replica2] o.a.s.r.ManagedResourceStorage Loaded null at path _rest_managed.json using ZooKeeperStorageIO:path=/configs/conf1
   [junit4]   2> 1732167 INFO  (qtp1145516899-13715) [n:127.0.0.1:54074_solr c:testschemaapi s:shard1 r:core_node2 x:testschemaapi_shard1_replica2] o.a.s.r.RestManager Initializing 0 registered ManagedResources
   [junit4]   2> 1732167 INFO  (qtp1145516899-13715) [n:127.0.0.1:54074_solr c:testschemaapi s:shard1 r:core_node2 x:testschemaapi_shard1_replica2] o.a.s.s.ZkIndexSchemaReader Creating ZooKeeper watch for the managed schema at /configs/conf1/managed-schema
   [junit4]   2> 1732167 INFO  (qtp1145516899-13715) [n:127.0.0.1:54074_solr c:testschemaapi s:shard1 r:core_node2 x:testschemaapi_shard1_replica2] o.a.s.c.ZkController Added new OnReconnect listener ZkIndexSchemaReader: /configs/conf1/managed-schema, uniqueCoreId: testschemaapi_shard1_replica2:469732251736401
   [junit4]   2> 1732167 INFO  (qtp1145516899-13715) [n:127.0.0.1:54074_solr c:testschemaapi s:shard1 r:core_node2 x:testschemaapi_shard1_replica2] o.a.s.h.ReplicationHandler Commits will be reserved for  10000
   [junit4]   2> 1732168 INFO  (qtp1145516899-13715) [n:127.0.0.1:54074_solr c:testschemaapi s:shard1 r:core_node2 x:testschemaapi_shard1_replica2] o.a.s.u.UpdateLog Looking up max value of version field to seed version buckets
   [junit4]   2> 1732168 INFO  (qtp1145516899-13715) [n:127.0.0.1:54074_solr c:testschemaapi s:shard1 r:core_node2 x:testschemaapi_shard1_replica2] o.a.s.u.VersionInfo Refreshing highest value of _version_ for 65536 version buckets from index
   [junit4]   2> 1732168 INFO  (qtp1145516899-13715) [n:127.0.0.1:54074_solr c:testschemaapi s:shard1 r:core_node2 x:testschemaapi_shard1_replica2] o.a.s.u.VersionInfo No terms found for _version_, cannot seed version bucket highest value from index
   [junit4]   2> 1732168 INFO  (searcherExecutor-4703-thread-1-processing-x:testschemaapi_shard1_replica2 n:127.0.0.1:54074_solr r:core_node2 c:testschemaapi s:shard1) [n:127.0.0.1:54074_solr c:testschemaapi s:shard1 r:core_node2 x:testschemaapi_shard1_replica2] o.a.s.c.SolrCore [testschemaapi_shard1_replica2] Registered new searcher Searcher@548dd7e9[testschemaapi_shard1_replica2] main{ExitableDirectoryReader(UninvertingDirectoryReader())}
   [junit4]   2> 1732168 INFO  (qtp1145516899-13715) [n:127.0.0.1:54074_solr c:testschemaapi s:shard1 r:core_node2 x:testschemaapi_shard1_replica2] o.a.s.u.UpdateLog Could not find max version in index or recent updates, using new clock 1544899639404134400
   [junit4]   2> 1732171 INFO  (qtp1145516899-13715) [n:127.0.0.1:54074_solr c:testschemaapi s:shard1 r:core_node2 x:testschemaapi_shard1_replica2] o.a.s.u.UpdateLog Took 2.0ms to seed version buckets with highest version 1544899639404134400
   [junit4]   2> 1732171 INFO  (qtp1145516899-13715) [n:127.0.0.1:54074_solr c:testschemaapi s:shard1 r:core_node2 x:testschemaapi_shard1_replica2] o.a.s.c.ZkController watch zkdir /configs/conf1
   [junit4]   2> 1732171 INFO  (qtp1145516899-13715) [n:127.0.0.1:54074_solr c:testschemaapi s:shard1 r:core_node2 x:testschemaapi_shard1_replica2] o.a.s.c.CoreContainer registering core: testschemaapi_shard1_replica2
   [junit4]   2> 1732173 INFO  (qtp1145516899-13715) [n:127.0.0.1:54074_solr c:testschemaapi s:shard1 r:core_node2 x:testschemaapi_shard1_replica2] o.a.s.c.ZkController Register replica - core:testschemaapi_shard1_replica2 address:http://127.0.0.1:54074/solr collection:testschemaapi shard:shard1
   [junit4]   2> 1732174 INFO  (qtp337251127-13730) [n:127.0.0.1:54079_solr c:testschemaapi s:shard1 r:core_node1 x:testschemaapi_shard1_replica1] o.a.s.c.LeaderElector Joined leadership election with path: /collections/testschemaapi/leader_elect/shard1/election/96556227269427206-core_node1-n_0000000000
   [junit4]   2> 1732174 INFO  (qtp1145516899-13715) [n:127.0.0.1:54074_solr c:testschemaapi s:shard1 r:core_node2 x:testschemaapi_shard1_replica2] o.a.s.c.LeaderElector Joined leadership election with path: /collections/testschemaapi/leader_elect/shard1/election/96556227269427204-core_node2-n_0000000001
   [junit4]   2> 1732174 INFO  (qtp337251127-13730) [n:127.0.0.1:54079_solr c:testschemaapi s:shard1 r:core_node1 x:testschemaapi_shard1_replica1] o.a.s.c.ShardLeaderElectionContext Running the leader process for shard=shard1 and weAreReplacement=false and leaderVoteWait=10000
   [junit4]   2> 1732175 INFO  (qtp1145516899-13715) [n:127.0.0.1:54074_solr c:testschemaapi s:shard1 r:core_node2 x:testschemaapi_shard1_replica2] o.a.s.c.LeaderElector Watching path /collections/testschemaapi/leader_elect/shard1/election/96556227269427206-core_node1-n_0000000000 to know if I could be the leader
   [junit4]   2> 1732177 INFO  (qtp337251127-13730) [n:127.0.0.1:54079_solr c:testschemaapi s:shard1 r:core_node1 x:testschemaapi_shard1_replica1] o.a.s.c.ShardLeaderElectionContext Enough replicas found to continue.
   [junit4]   2> 1732177 INFO  (qtp337251127-13730) [n:127.0.0.1:54079_solr c:testschemaapi s:shard1 r:core_node1 x:testschemaapi_shard1_replica1] o.a.s.c.ShardLeaderElectionContext I may be the new leader - try and sync
   [junit4]   2> 1732177 INFO  (qtp337251127-13730) [n:127.0.0.1:54079_solr c:testschemaapi s:shard1 r:core_node1 x:testschemaapi_shard1_replica1] o.a.s.c.SyncStrategy Sync replicas to http://127.0.0.1:54079/solr/testschemaapi_shard1_replica1/
   [junit4]   2> 1732178 INFO  (qtp337251127-13730) [n:127.0.0.1:54079_solr c:testschemaapi s:shard1 r:core_node1 x:testschemaapi_shard1_replica1] o.a.s.u.PeerSync PeerSync: core=testschemaapi_shard1_replica1 url=http://127.0.0.1:54079/solr START replicas=[http://127.0.0.1:54074/solr/testschemaapi_shard1_replica2/] nUpdates=100
   [junit4]   2> 1732178 INFO  (qtp337251127-13730) [n:127.0.0.1:54079_solr c:testschemaapi s:shard1 r:core_node1 x:testschemaapi_shard1_replica1] o.a.s.u.PeerSync PeerSync: core=testschemaapi_shard1_replica1 url=http://127.0.0.1:54079/solr DONE.  We have no versions.  sync failed.
   [junit4]   2> 1732178 INFO  (qtp337251127-13730) [n:127.0.0.1:54079_solr c:testschemaapi s:shard1 r:core_node1 x:testschemaapi_shard1_replica1] o.a.s.c.SyncStrategy Leader's attempt to sync with shard failed, moving to the next candidate
   [junit4]   2> 1732178 INFO  (qtp337251127-13730) [n:127.0.0.1:54079_solr c:testschemaapi s:shard1 r:core_node1 x:testschemaapi_shard1_replica1] o.a.s.c.ShardLeaderElectionContext We failed sync, but we have no versions - we can't sync in that case - we were active before, so become leader anyway
   [junit4]   2> 1732178 INFO  (OverseerStateUpdate-96556227269427204-127.0.0.1:54074_solr-n_0000000000) [n:127.0.0.1:54074_solr    ] o.a.s.c.Overseer processMessage: queueSize: 1, message = {
   [junit4]   2>   "operation":"leader",
   [junit4]   2>   "shard":"shard1",
   [junit4]   2>   "collection":"testschemaapi"} current state version: 0
   [junit4]   2> 1732180 INFO  (qtp337251127-13730) [n:127.0.0.1:54079_solr c:testschemaapi s:shard1 r:core_node1 x:testschemaapi_shard1_replica1] o.a.s.c.c.SolrZkClient makePath: /collections/testschemaapi/leaders/shard1
   [junit4]   2> 1732186 INFO  (qtp337251127-13730) [n:127.0.0.1:54079_solr c:testschemaapi s:shard1 r:core_node1 x:testschemaapi_shard1_replica1] o.a.s.c.ShardLeaderElectionContextBase Creating leader registration node /collections/testschemaapi/leaders/shard1/leader after winning as /collections/testschemaapi/leader_elect/shard1/election/96556227269427206-core_node1-n_0000000000
   [junit4]   2> 1732188 INFO  (qtp337251127-13730) [n:127.0.0.1:54079_solr c:testschemaapi s:shard1 r:core_node1 x:testschemaapi_shard1_replica1] o.a.s.c.ShardLeaderElectionContext I am the new leader: http://127.0.0.1:54079/solr/testschemaapi_shard1_replica1/ shard1
   [junit4]   2> 1732190 INFO  (OverseerStateUpdate-96556227269427204-127.0.0.1:54074_solr-n_0000000000) [n:127.0.0.1:54074_solr    ] o.a.s.c.Overseer processMessage: queueSize: 1, message = {
   [junit4]   2>   "operation":"leader",
   [junit4]   2>   "shard":"shard1",
   [junit4]   2>   "collection":"testschemaapi",
   [junit4]   2>   "base_url":"http://127.0.0.1:54079/solr",
   [junit4]   2>   "core":"testschemaapi_shard1_replica1",
   [junit4]   2>   "state":"active"} current state version: 0
   [junit4]   2> 1732198 INFO  (qtp1145516899-13717) [n:127.0.0.1:54074_solr c:testschemaapi s:shard1 r:core_node2 x:testschemaapi_shard1_replica2] o.a.s.c.S.Request [testschemaapi_shard1_replica2]  webapp=/solr path=/get params={fingerprint=false&getVersions=100&wt=javabin&distrib=false&qt=/get&version=2} status=0 QTime=0
   [junit4]   2> 1732301 INFO  (OverseerStateUpdate-96556227269427204-127.0.0.1:54074_solr-n_0000000000) [n:127.0.0.1:54074_solr    ] o.a.s.c.o.ZkStateWriter going to update_collection /collections/testschemaapi/state.json version: 1
   [junit4]   2> 1732302 INFO  (zkCallback-2607-thread-1-processing-n:127.0.0.1:54079_solr) [n:127.0.0.1:54079_solr    ] o.a.s.c.c.ZkStateReader A cluster state change: [WatchedEvent state:SyncConnected type:NodeDataChanged path:/collections/testschemaapi/state.json] for collection [testschemaapi] has occurred - updating... (live nodes size: [2])
   [junit4]   2> 1732302 INFO  (zkCallback-2603-thread-1-processing-n:127.0.0.1:54074_solr) [n:127.0.0.1:54074_solr    ] o.a.s.c.c.ZkStateReader A cluster state change: [WatchedEvent state:SyncConnected type:NodeDataChanged path:/collections/testschemaapi/state.json] for collection [testschemaapi] has occurred - updating... (live nodes size: [2])
   [junit4]   2> 1732303 INFO  (zkCallback-2607-thread-1-processing-n:127.0.0.1:54079_solr) [n:127.0.0.1:54079_solr    ] o.a.s.c.c.ZkStateReader Updating data for [testschemaapi] from [1] to [2]
   [junit4]   2> 1732303 INFO  (zkCallback-2603-thread-1-processing-n:127.0.0.1:54074_solr) [n:127.0.0.1:54074_solr    ] o.a.s.c.c.ZkStateReader Updating data for [testschemaapi] from [1] to [2]
   [junit4]   2> 1732341 INFO  (qtp337251127-13730) [n:127.0.0.1:54079_solr c:testschemaapi s:shard1 r:core_node1 x:testschemaapi_shard1_replica1] o.a.s.c.ZkController We are http://127.0.0.1:54079/solr/testschemaapi_shard1_replica1/ and leader is http://127.0.0.1:54079/solr/testschemaapi_shard1_replica1/
   [junit4]   2> 1732341 INFO  (qtp337251127-13730) [n:127.0.0.1:54079_solr c:testschemaapi s:shard1 r:core_node1 x:testschemaapi_shard1_replica1] o.a.s.c.ZkController No LogReplay needed for core=testschemaapi_shard1_replica1 baseURL=http://127.0.0.1:54079/solr
   [junit4]   2> 1732341 INFO  (qtp337251127-13730) [n:127.0.0.1:54079_solr c:testschemaapi s:shard1 r:core_node1 x:testschemaapi_shard1_replica1] o.a.s.c.ZkController I am the leader, no recovery necessary
   [junit4]   2> 1732341 INFO  (qtp337251127-13730) [n:127.0.0.1:54079_solr c:testschemaapi s:shard1 r:core_node1 x:testschemaapi_shard1_replica1] o.a.s.c.ZkController publishing state=active
   [junit4]   2> 1732344 INFO  (OverseerStateUpdate-96556227269427204-127.0.0.1:54074_solr-n_0000000000) [n:127.0.0.1:54074_solr    ] o.a.s.c.Overseer processMessage: queueSize: 1, message = {
   [junit4]   2>   "state":"active",
   [junit4]   2>   "operation":"state",
   [junit4]   2>   "core":"testschemaapi_shard1_replica1",
   [junit4]   2>   "numShards":"1",
   [junit4]   2>   "node_name":"127.0.0.1:54079_solr",
   [junit4]   2>   "roles":null,
   [junit4]   2>   "base_url":"http://127.0.0.1:54079/solr",
   [junit4]   2>   "core_node_name":"core_node1",
   [junit4]   2>   "collection":"testschemaapi",
   [junit4]   2>   "shard":"shard1"} current state version: 0
   [junit4]   2> 1732345 INFO  (OverseerStateUpdate-96556227269427204-127.0.0.1:54074_solr-n_0000000000) [n:127.0.0.1:54074_solr    ] o.a.s.c.o.ReplicaMutator Update state numShards=1 message={
   [junit4]   2>   "state":"active",
   [junit4]   2>   "operation":"state",
   [junit4]   2>   "core":"testschemaapi_shard1_replica1",
   [junit4]   2>   "numShards":"1",
   [junit4]   2>   "node_name":"127.0.0.1:54079_solr",
   [junit4]   2>   "roles":null,
   [junit4]   2>   "base_url":"http://127.0.0.1:54079/solr",
   [junit4]   2>   "core_node_name":"core_node1",
   [junit4]   2>   "collection":"testschemaapi",
   [junit4]   2>   "shard":"shard1"}
   [junit4]   2> 1732350 INFO  (qtp337251127-13730) [n:127.0.0.1:54079_solr c:testschemaapi s:shard1 r:core_node1 x:testschemaapi_shard1_replica1] o.a.s.s.HttpSolrCall [admin] webapp=null path=/admin/cores params={name=testschemaapi_shard1_replica1&wt=javabin&numShards=1&qt=/admin/cores&collection=testschemaapi&collection.configName=conf1&shard=shard1&action=CREATE&version=2} status=0 QTime=1535
   [junit4]   2> 1732452 INFO  (OverseerStateUpdate-96556227269427204-127.0.0.1:54074_solr-n_0000000000) [n:127.0.0.1:54074_solr    ] o.a.s.c.o.ZkStateWriter going to update_collection /collections/testschemaapi/state.json version: 2
   [junit4]   2> 1732453 INFO  (zkCallback-2607-thread-1-processing-n:127.0.0.1:54079_solr) [n:127.0.0.1:54079_solr    ] o.a.s.c.c.ZkStateReader A cluster state change: [WatchedEvent state:SyncConnected type:NodeDataChanged path:/collections/testschemaapi/state.json] for collection [testschemaapi] has occurred - updating... (live nodes size: [2])
   [junit4]   2> 1732453 INFO  (zkCallback-2603-thread-3-processing-n:127.0.0.1:54074_solr) [n:127.0.0.1:54074_solr    ] o.a.s.c.c.ZkStateReader A cluster state change: [WatchedEvent state:SyncConnected type:NodeDataChanged path:/collections/testschemaapi/state.json] for collection [testschemaapi] has occurred - updating... (live nodes size: [2])
   [junit4]   2> 1732456 INFO  (zkCallback-2607-thread-1-processing-n:127.0.0.1:54079_solr) [n:127.0.0.1:54079_solr    ] o.a.s.c.c.ZkStateReader Updating data for [testschemaapi] from [2] to [3]
   [junit4]   2> 1732456 INFO  (zkCallback-2603-thread-3-processing-n:127.0.0.1:54074_solr) [n:127.0.0.1:54074_solr    ] o.a.s.c.c.ZkStateReader Updating data for [testschemaapi] from [2] to [3]
   [junit4]   2> 1733178 INFO  (qtp1145516899-13715) [n:127.0.0.1:54074_solr c:testschemaapi s:shard1 r:core_node2 x:testschemaapi_shard1_replica2] o.a.s.c.ZkController We are http://127.0.0.1:54074/solr/testschemaapi_shard1_replica2/ and leader is http://127.0.0.1:54079/solr/testschemaapi_shard1_replica1/
   [junit4]   2> 1733178 INFO  (qtp1145516899-13715) [n:127.0.0.1:54074_solr c:testschemaapi s:shard1 r:core_node2 x:testschemaapi_shard1_replica2] o.a.s.c.ZkController No LogReplay needed for core=testschemaapi_shard1_replica2 baseURL=http://127.0.0.1:54074/solr
   [junit4]   2> 1733178 INFO  (qtp1145516899-13715) [n:127.0.0.1:54074_solr c:testschemaapi s:shard1 r:core_node2 x:testschemaapi_shard1_replica2] o.a.s.c.ZkController Core needs to recover:testschemaapi_shard1_replica2
   [junit4]   2> 1733180 INFO  (updateExecutor-2600-thread-1-processing-x:testschemaapi_shard1_replica2 n:127.0.0.1:54074_solr r:core_node2 c:testschemaapi s:shard1) [n:127.0.0.1:54074_solr c:testschemaapi s:shard1 r:core_node2 x:testschemaapi_shard1_replica2] o.a.s.u.DefaultSolrCoreState Running recovery
   [junit4]   2> 1733181 INFO  (recoveryExecutor-2601-thread-1-processing-x:testschemaapi_shard1_replica2 n:127.0.0.1:54074_solr r:core_node2 c:testschemaapi s:shard1) [n:127.0.0.1:54074_solr c:testschemaapi s:shard1 r:core_node2 x:testschemaapi_shard1_replica2] o.a.s.c.RecoveryStrategy Starting recovery process. recoveringAfterStartup=true
   [junit4]   2> 1733181 INFO  (recoveryExecutor-2601-thread-1-proce

[...truncated too long message...]

dSchemaAPI.testAddFieldAndDocument(TestManagedSchemaAPI.java:101)
   [junit4]    > 	at org.apache.solr.schema.TestManagedSchemaAPI.test(TestManagedSchemaAPI.java:69)
   [junit4]    > 	at java.lang.Thread.run(Thread.java:745)
   [junit4]    > Caused by: org.apache.solr.client.solrj.impl.HttpSolrClient$RemoteSolrException: Error from server at http://127.0.0.1:54079/solr/testschemaapi_shard1_replica1: ERROR: [doc=2] unknown field 'myNewField1'
   [junit4]    > 	at org.apache.solr.client.solrj.impl.HttpSolrClient.executeMethod(HttpSolrClient.java:577)
   [junit4]    > 	at org.apache.solr.client.solrj.impl.HttpSolrClient.request(HttpSolrClient.java:241)
   [junit4]    > 	at org.apache.solr.client.solrj.impl.HttpSolrClient.request(HttpSolrClient.java:230)
   [junit4]    > 	at org.apache.solr.client.solrj.impl.LBHttpSolrClient.doRequest(LBHttpSolrClient.java:372)
   [junit4]    > 	at org.apache.solr.client.solrj.impl.LBHttpSolrClient.request(LBHttpSolrClient.java:325)
   [junit4]    > 	at org.apache.solr.client.solrj.impl.CloudSolrClient$2.call(CloudSolrClient.java:628)
   [junit4]    > 	at org.apache.solr.client.solrj.impl.CloudSolrClient$2.call(CloudSolrClient.java:625)
   [junit4]    > 	at java.util.concurrent.FutureTask.run(FutureTask.java:262)
   [junit4]    > 	at org.apache.solr.common.util.ExecutorUtil$MDCAwareThreadPoolExecutor$1.run(ExecutorUtil.java:231)
   [junit4]    > 	at java.util.concurrent.ThreadPoolExecutor.runWorker(ThreadPoolExecutor.java:1145)
   [junit4]    > 	at java.util.concurrent.ThreadPoolExecutor$Worker.run(ThreadPoolExecutor.java:615)
   [junit4]    > 	... 1 more
   [junit4]   2> 1742556 INFO  (SUITE-TestManagedSchemaAPI-seed#[1DA3DCBD0B585EF9]-worker) [    ] o.a.s.SolrTestCaseJ4 ###deleteCore
   [junit4]   2> NOTE: leaving temporary files on disk at: C:\Users\jenkins\workspace\Lucene-Solr-5.5-Windows\solr\build\solr-core\test\J1\temp\solr.schema.TestManagedSchemaAPI_1DA3DCBD0B585EF9-001
   [junit4]   2> Sep 08, 2016 10:38:37 AM com.carrotsearch.randomizedtesting.ThreadLeakControl checkThreadLeaks
   [junit4]   2> WARNING: Will linger awaiting termination of 4 leaked thread(s).
   [junit4]   2> 1742581 INFO  (Thread-4204) [n:127.0.0.1:54074_solr    ] o.a.s.c.SolrConfig Loaded SolrConfig: solrconfig.xml
   [junit4]   2> 1742581 ERROR (Thread-4204) [n:127.0.0.1:54074_solr    ] o.a.s.s.ManagedIndexSchemaFactory Error attempting to access /configs/conf1/managed-schema
   [junit4]   2> org.apache.zookeeper.KeeperException$SessionExpiredException: KeeperErrorCode = Session expired for /configs/conf1/managed-schema
   [junit4]   2> 	at org.apache.zookeeper.KeeperException.create(KeeperException.java:127)
   [junit4]   2> 	at org.apache.zookeeper.KeeperException.create(KeeperException.java:51)
   [junit4]   2> 	at org.apache.zookeeper.ZooKeeper.getData(ZooKeeper.java:1155)
   [junit4]   2> 	at org.apache.solr.common.cloud.SolrZkClient$7.execute(SolrZkClient.java:345)
   [junit4]   2> 	at org.apache.solr.common.cloud.SolrZkClient$7.execute(SolrZkClient.java:342)
   [junit4]   2> 	at org.apache.solr.common.cloud.ZkCmdExecutor.retryOperation(ZkCmdExecutor.java:60)
   [junit4]   2> 	at org.apache.solr.common.cloud.SolrZkClient.getData(SolrZkClient.java:342)
   [junit4]   2> 	at org.apache.solr.schema.ManagedIndexSchemaFactory.create(ManagedIndexSchemaFactory.java:128)
   [junit4]   2> 	at org.apache.solr.schema.ManagedIndexSchemaFactory.create(ManagedIndexSchemaFactory.java:47)
   [junit4]   2> 	at org.apache.solr.schema.IndexSchemaFactory.buildIndexSchema(IndexSchemaFactory.java:70)
   [junit4]   2> 	at org.apache.solr.core.ConfigSetService.createIndexSchema(ConfigSetService.java:108)
   [junit4]   2> 	at org.apache.solr.core.ConfigSetService.getConfig(ConfigSetService.java:79)
   [junit4]   2> 	at org.apache.solr.core.CoreContainer.reload(CoreContainer.java:920)
   [junit4]   2> 	at org.apache.solr.core.SolrCore$11.run(SolrCore.java:2623)
   [junit4]   2> 	at org.apache.solr.cloud.ZkController$5.run(ZkController.java:2480)
   [junit4]   2> 1742582 WARN  (Thread-4204) [n:127.0.0.1:54074_solr    ] o.a.s.c.SolrCores Tried to remove core testschemaapi_shard1_replica2 from pendingCoreOps and it wasn't there. 
   [junit4]   2> 1742582 WARN  (Thread-4204) [n:127.0.0.1:54074_solr    ] o.a.s.c.ZkController listener throws error
   [junit4]   2> org.apache.solr.common.SolrException: Unable to reload core [testschemaapi_shard1_replica2]
   [junit4]   2> 	at org.apache.solr.core.CoreContainer.reload(CoreContainer.java:927)
   [junit4]   2> 	at org.apache.solr.core.SolrCore$11.run(SolrCore.java:2623)
   [junit4]   2> 	at org.apache.solr.cloud.ZkController$5.run(ZkController.java:2480)
   [junit4]   2> Caused by: org.apache.solr.common.SolrException: Could not load conf for core testschemaapi_shard1_replica2: Error attempting to access /configs/conf1/managed-schema
   [junit4]   2> 	at org.apache.solr.core.ConfigSetService.getConfig(ConfigSetService.java:84)
   [junit4]   2> 	at org.apache.solr.core.CoreContainer.reload(CoreContainer.java:920)
   [junit4]   2> 	... 2 more
   [junit4]   2> Caused by: org.apache.solr.common.SolrException: Error attempting to access /configs/conf1/managed-schema
   [junit4]   2> 	at org.apache.solr.schema.ManagedIndexSchemaFactory.create(ManagedIndexSchemaFactory.java:143)
   [junit4]   2> 	at org.apache.solr.schema.ManagedIndexSchemaFactory.create(ManagedIndexSchemaFactory.java:47)
   [junit4]   2> 	at org.apache.solr.schema.IndexSchemaFactory.buildIndexSchema(IndexSchemaFactory.java:70)
   [junit4]   2> 	at org.apache.solr.core.ConfigSetService.createIndexSchema(ConfigSetService.java:108)
   [junit4]   2> 	at org.apache.solr.core.ConfigSetService.getConfig(ConfigSetService.java:79)
   [junit4]   2> 	... 3 more
   [junit4]   2> Caused by: org.apache.zookeeper.KeeperException$SessionExpiredException: KeeperErrorCode = Session expired for /configs/conf1/managed-schema
   [junit4]   2> 	at org.apache.zookeeper.KeeperException.create(KeeperException.java:127)
   [junit4]   2> 	at org.apache.zookeeper.KeeperException.create(KeeperException.java:51)
   [junit4]   2> 	at org.apache.zookeeper.ZooKeeper.getData(ZooKeeper.java:1155)
   [junit4]   2> 	at org.apache.solr.common.cloud.SolrZkClient$7.execute(SolrZkClient.java:345)
   [junit4]   2> 	at org.apache.solr.common.cloud.SolrZkClient$7.execute(SolrZkClient.java:342)
   [junit4]   2> 	at org.apache.solr.common.cloud.ZkCmdExecutor.retryOperation(ZkCmdExecutor.java:60)
   [junit4]   2> 	at org.apache.solr.common.cloud.SolrZkClient.getData(SolrZkClient.java:342)
   [junit4]   2> 	at org.apache.solr.schema.ManagedIndexSchemaFactory.create(ManagedIndexSchemaFactory.java:128)
   [junit4]   2> 	... 7 more
   [junit4]   2> NOTE: test params are: codec=Asserting(Lucene54): {myNewField=FSTOrd50, id=PostingsFormat(name=LuceneVarGapDocFreqInterval), _version_=FSTOrd50}, docValues:{}, sim=RandomSimilarity(queryNorm=false,coord=no): {}, locale=cs-CZ, timezone=Africa/Mogadishu
   [junit4]   2> NOTE: Windows 8.1 6.3 amd64/Oracle Corporation 1.7.0_80 (64-bit)/cpus=3,threads=1,free=165241784,total=450498560
   [junit4]   2> NOTE: All tests run in this JVM: [SearchHandlerTest, TestSolr4Spatial2, BlockJoinFacetSimpleTest, TestMiniSolrCloudCluster, FullSolrCloudDistribCmdsTest, DistributedFacetPivotLargeTest, StatsComponentTest, TestSchemaSimilarityResource, ChaosMonkeySafeLeaderTest, TestReversedWildcardFilterFactory, TestLMJelinekMercerSimilarityFactory, TestXmlQParser, TestFileDictionaryLookup, DebugComponentTest, DirectSolrConnectionTest, EnumFieldTest, CloudExitableDirectoryReaderTest, TestConfigReload, DateMathParserTest, TestSortByMinMaxFunction, TestCollationField, BadCopyFieldTest, CustomCollectionTest, FileBasedSpellCheckerTest, ParsingFieldUpdateProcessorsTest, TestMacros, ZkStateReaderTest, ZkNodePropsTest, VersionInfoTest, SuggesterTSTTest, CopyFieldTest, DistributedQueryComponentOptimizationTest, TestFieldCollectionResource, AddBlockUpdateTest, TestFuzzyAnalyzedSuggestions, DateFieldTest, AutoCommitTest, TestSimpleTrackingShardHandler, TestSolrQueryParser, NoCacheHeaderTest, BlockJoinFacetDistribTest, HdfsNNFailoverTest, TestMinMaxOnMultiValuedField, TestDistribIDF, TestRealTimeGet, HighlighterConfigTest, TestCollationFieldDocValues, TestCloudManagedSchemaConcurrent, CurrencyFieldOpenExchangeTest, DistributedTermsComponentTest, LeaderInitiatedRecoveryOnCommitTest, SecurityConfHandlerTest, TestPivotHelperCode, ShardSplitTest, TestTrie, DirectUpdateHandlerOptimizeTest, ShowFileRequestHandlerTest, TestConfigOverlay, HdfsUnloadDistributedZkTest, NotRequiredUniqueKeyTest, TestValueSourceCache, TestSystemIdResolver, BasicAuthIntegrationTest, TestSolr4Spatial, RequestLoggingTest, WordBreakSolrSpellCheckerTest, TestConfigSetsAPIExclusivity, TestRTimerTree, TestRandomFaceting, StressHdfsTest, TestCharFilters, TestIndexingPerformance, TestBadConfig, CoreAdminHandlerTest, SolrCloudExampleTest, TestTestInjection, SuggesterTest, TestSuggestSpellingConverter, LoggingHandlerTest, OverseerStatusTest, TestBinaryField, TestManagedResourceStorage, TestStressUserVersions, DistributedFacetPivotSmallAdvancedTest, TestCoreDiscovery, PeerSyncReplicationTest, CollectionStateFormat2Test, TestShortCircuitedRequests, TestRandomCollapseQParserPlugin, TestAddFieldRealTimeGet, TestSerializedLuceneMatchVersion, TestNamedUpdateProcessors, TestAuthenticationFramework, SolrIndexSplitterTest, DefaultValueUpdateProcessorTest, SparseHLLTest, AnalyticsMergeStrategyTest, TestCSVResponseWriter, NumericFieldsTest, TestSolrIndexConfig, TestQueryUtils, TestReqParamsAPI, SortByFunctionTest, ShardRoutingCustomTest, TestConfigSetProperties, DistributedIntervalFacetingTest, DeleteShardTest, HdfsSyncSliceTest, SolrCoreCheckLockOnStartupTest, TestShardHandlerFactory, RemoteQueryErrorTest, TestManagedSchemaAPI]
   [junit4] Completed [250/575 (1!)] on J1 in 13.68s, 1 test, 1 error <<< FAILURES!

[...truncated 57726 lines...]


Mime
View raw message