lucene-dev mailing list archives

Site index · List index
Message view « Date » · « Thread »
Top « Date » · « Thread »
From Policeman Jenkins Server <jenk...@thetaphi.de>
Subject [JENKINS] Lucene-Solr-master-Solaris (64bit/jdk1.8.0) - Build # 836 - Unstable!
Date Fri, 09 Sep 2016 05:35:08 GMT
Build: http://jenkins.thetaphi.de/job/Lucene-Solr-master-Solaris/836/
Java: 64bit/jdk1.8.0 -XX:+UseCompressedOops -XX:+UseG1GC

3 tests failed.
FAILED:  junit.framework.TestSuite.org.apache.solr.core.TestCoreDiscovery

Error Message:
ObjectTracker found 5 object(s) that were not released!!! [MockDirectoryWrapper, SolrCore, MDCAwareThreadPoolExecutor, MockDirectoryWrapper, MockDirectoryWrapper]

Stack Trace:
java.lang.AssertionError: ObjectTracker found 5 object(s) that were not released!!! [MockDirectoryWrapper, SolrCore, MDCAwareThreadPoolExecutor, MockDirectoryWrapper, MockDirectoryWrapper]
	at __randomizedtesting.SeedInfo.seed([1F4A980471D0D0E3]:0)
	at org.junit.Assert.fail(Assert.java:93)
	at org.junit.Assert.assertTrue(Assert.java:43)
	at org.junit.Assert.assertNull(Assert.java:551)
	at org.apache.solr.SolrTestCaseJ4.teardownTestCases(SolrTestCaseJ4.java:257)
	at sun.reflect.GeneratedMethodAccessor22.invoke(Unknown Source)
	at sun.reflect.DelegatingMethodAccessorImpl.invoke(DelegatingMethodAccessorImpl.java:43)
	at java.lang.reflect.Method.invoke(Method.java:498)
	at com.carrotsearch.randomizedtesting.RandomizedRunner.invoke(RandomizedRunner.java:1764)
	at com.carrotsearch.randomizedtesting.RandomizedRunner$7.evaluate(RandomizedRunner.java:834)
	at com.carrotsearch.randomizedtesting.rules.StatementAdapter.evaluate(StatementAdapter.java:36)
	at com.carrotsearch.randomizedtesting.rules.SystemPropertiesRestoreRule$1.evaluate(SystemPropertiesRestoreRule.java:57)
	at org.apache.lucene.util.AbstractBeforeAfterRule$1.evaluate(AbstractBeforeAfterRule.java:45)
	at com.carrotsearch.randomizedtesting.rules.StatementAdapter.evaluate(StatementAdapter.java:36)
	at org.apache.lucene.util.TestRuleStoreClassName$1.evaluate(TestRuleStoreClassName.java:41)
	at com.carrotsearch.randomizedtesting.rules.NoShadowingOrOverridesOnMethodsRule$1.evaluate(NoShadowingOrOverridesOnMethodsRule.java:40)
	at com.carrotsearch.randomizedtesting.rules.NoShadowingOrOverridesOnMethodsRule$1.evaluate(NoShadowingOrOverridesOnMethodsRule.java:40)
	at com.carrotsearch.randomizedtesting.rules.StatementAdapter.evaluate(StatementAdapter.java:36)
	at com.carrotsearch.randomizedtesting.rules.StatementAdapter.evaluate(StatementAdapter.java:36)
	at com.carrotsearch.randomizedtesting.rules.StatementAdapter.evaluate(StatementAdapter.java:36)
	at org.apache.lucene.util.TestRuleAssertionsRequired$1.evaluate(TestRuleAssertionsRequired.java:53)
	at org.apache.lucene.util.TestRuleMarkFailure$1.evaluate(TestRuleMarkFailure.java:47)
	at org.apache.lucene.util.TestRuleIgnoreAfterMaxFailures$1.evaluate(TestRuleIgnoreAfterMaxFailures.java:64)
	at org.apache.lucene.util.TestRuleIgnoreTestSuites$1.evaluate(TestRuleIgnoreTestSuites.java:54)
	at com.carrotsearch.randomizedtesting.rules.StatementAdapter.evaluate(StatementAdapter.java:36)
	at com.carrotsearch.randomizedtesting.ThreadLeakControl$StatementRunner.run(ThreadLeakControl.java:367)
	at java.lang.Thread.run(Thread.java:745)


FAILED:  junit.framework.TestSuite.org.apache.solr.core.TestCoreDiscovery

Error Message:
1 thread leaked from SUITE scope at org.apache.solr.core.TestCoreDiscovery:     1) Thread[id=10524, name=searcherExecutor-4839-thread-1, state=WAITING, group=TGRP-TestCoreDiscovery]         at sun.misc.Unsafe.park(Native Method)         at java.util.concurrent.locks.LockSupport.park(LockSupport.java:175)         at java.util.concurrent.locks.AbstractQueuedSynchronizer$ConditionObject.await(AbstractQueuedSynchronizer.java:2039)         at java.util.concurrent.LinkedBlockingQueue.take(LinkedBlockingQueue.java:442)         at java.util.concurrent.ThreadPoolExecutor.getTask(ThreadPoolExecutor.java:1067)         at java.util.concurrent.ThreadPoolExecutor.runWorker(ThreadPoolExecutor.java:1127)         at java.util.concurrent.ThreadPoolExecutor$Worker.run(ThreadPoolExecutor.java:617)         at java.lang.Thread.run(Thread.java:745)

Stack Trace:
com.carrotsearch.randomizedtesting.ThreadLeakError: 1 thread leaked from SUITE scope at org.apache.solr.core.TestCoreDiscovery: 
   1) Thread[id=10524, name=searcherExecutor-4839-thread-1, state=WAITING, group=TGRP-TestCoreDiscovery]
        at sun.misc.Unsafe.park(Native Method)
        at java.util.concurrent.locks.LockSupport.park(LockSupport.java:175)
        at java.util.concurrent.locks.AbstractQueuedSynchronizer$ConditionObject.await(AbstractQueuedSynchronizer.java:2039)
        at java.util.concurrent.LinkedBlockingQueue.take(LinkedBlockingQueue.java:442)
        at java.util.concurrent.ThreadPoolExecutor.getTask(ThreadPoolExecutor.java:1067)
        at java.util.concurrent.ThreadPoolExecutor.runWorker(ThreadPoolExecutor.java:1127)
        at java.util.concurrent.ThreadPoolExecutor$Worker.run(ThreadPoolExecutor.java:617)
        at java.lang.Thread.run(Thread.java:745)
	at __randomizedtesting.SeedInfo.seed([1F4A980471D0D0E3]:0)


FAILED:  junit.framework.TestSuite.org.apache.solr.core.TestCoreDiscovery

Error Message:
There are still zombie threads that couldn't be terminated:    1) Thread[id=10524, name=searcherExecutor-4839-thread-1, state=WAITING, group=TGRP-TestCoreDiscovery]         at sun.misc.Unsafe.park(Native Method)         at java.util.concurrent.locks.LockSupport.park(LockSupport.java:175)         at java.util.concurrent.locks.AbstractQueuedSynchronizer$ConditionObject.await(AbstractQueuedSynchronizer.java:2039)         at java.util.concurrent.LinkedBlockingQueue.take(LinkedBlockingQueue.java:442)         at java.util.concurrent.ThreadPoolExecutor.getTask(ThreadPoolExecutor.java:1067)         at java.util.concurrent.ThreadPoolExecutor.runWorker(ThreadPoolExecutor.java:1127)         at java.util.concurrent.ThreadPoolExecutor$Worker.run(ThreadPoolExecutor.java:617)         at java.lang.Thread.run(Thread.java:745)

Stack Trace:
com.carrotsearch.randomizedtesting.ThreadLeakError: There are still zombie threads that couldn't be terminated:
   1) Thread[id=10524, name=searcherExecutor-4839-thread-1, state=WAITING, group=TGRP-TestCoreDiscovery]
        at sun.misc.Unsafe.park(Native Method)
        at java.util.concurrent.locks.LockSupport.park(LockSupport.java:175)
        at java.util.concurrent.locks.AbstractQueuedSynchronizer$ConditionObject.await(AbstractQueuedSynchronizer.java:2039)
        at java.util.concurrent.LinkedBlockingQueue.take(LinkedBlockingQueue.java:442)
        at java.util.concurrent.ThreadPoolExecutor.getTask(ThreadPoolExecutor.java:1067)
        at java.util.concurrent.ThreadPoolExecutor.runWorker(ThreadPoolExecutor.java:1127)
        at java.util.concurrent.ThreadPoolExecutor$Worker.run(ThreadPoolExecutor.java:617)
        at java.lang.Thread.run(Thread.java:745)
	at __randomizedtesting.SeedInfo.seed([1F4A980471D0D0E3]:0)




Build Log:
[...truncated 11198 lines...]
   [junit4] Suite: org.apache.solr.core.TestCoreDiscovery
   [junit4]   2> Creating dataDir: /export/home/jenkins/workspace/Lucene-Solr-master-Solaris/solr/build/solr-core/test/J1/temp/solr.core.TestCoreDiscovery_1F4A980471D0D0E3-001/init-core-data-001
   [junit4]   2> 1094104 INFO  (SUITE-TestCoreDiscovery-seed#[1F4A980471D0D0E3]-worker) [    ] o.a.s.SolrTestCaseJ4 Randomized ssl (false) and clientAuth (true) via: @org.apache.solr.util.RandomizeSSL(reason=, value=NaN, ssl=NaN, clientAuth=NaN)
   [junit4]   2> 1094105 INFO  (SUITE-TestCoreDiscovery-seed#[1F4A980471D0D0E3]-worker) [    ] o.a.s.SolrTestCaseJ4 ####initCore
   [junit4]   2> 1094105 INFO  (SUITE-TestCoreDiscovery-seed#[1F4A980471D0D0E3]-worker) [    ] o.a.s.SolrTestCaseJ4 ####initCore end
   [junit4]   2> 1094106 INFO  (TEST-TestCoreDiscovery.testNoCoreDir-seed#[1F4A980471D0D0E3]) [    ] o.a.s.SolrTestCaseJ4 ###Starting testNoCoreDir
   [junit4]   2> 1094112 INFO  (TEST-TestCoreDiscovery.testNoCoreDir-seed#[1F4A980471D0D0E3]) [    ] o.a.s.c.SolrResourceLoader JNDI not configured for solr (NoInitialContextEx)
   [junit4]   2> 1094112 INFO  (TEST-TestCoreDiscovery.testNoCoreDir-seed#[1F4A980471D0D0E3]) [    ] o.a.s.c.SolrResourceLoader using system property solr.solr.home: /export/home/jenkins/workspace/Lucene-Solr-master-Solaris/solr/build/solr-core/test/J1/temp/solr.core.TestCoreDiscovery_1F4A980471D0D0E3-001/tempDir-001
   [junit4]   2> 1094112 INFO  (TEST-TestCoreDiscovery.testNoCoreDir-seed#[1F4A980471D0D0E3]) [    ] o.a.s.c.SolrResourceLoader new SolrResourceLoader for directory: '/export/home/jenkins/workspace/Lucene-Solr-master-Solaris/solr/build/solr-core/test/J1/temp/solr.core.TestCoreDiscovery_1F4A980471D0D0E3-001/tempDir-001'
   [junit4]   2> 1094112 INFO  (TEST-TestCoreDiscovery.testNoCoreDir-seed#[1F4A980471D0D0E3]) [    ] o.a.s.c.SolrResourceLoader JNDI not configured for solr (NoInitialContextEx)
   [junit4]   2> 1094112 INFO  (TEST-TestCoreDiscovery.testNoCoreDir-seed#[1F4A980471D0D0E3]) [    ] o.a.s.c.SolrResourceLoader using system property solr.solr.home: /export/home/jenkins/workspace/Lucene-Solr-master-Solaris/solr/build/solr-core/test/J1/temp/solr.core.TestCoreDiscovery_1F4A980471D0D0E3-001/tempDir-001
   [junit4]   2> 1094112 INFO  (TEST-TestCoreDiscovery.testNoCoreDir-seed#[1F4A980471D0D0E3]) [    ] o.a.s.c.SolrXmlConfig Loading container configuration from /export/home/jenkins/workspace/Lucene-Solr-master-Solaris/solr/build/solr-core/test/J1/temp/solr.core.TestCoreDiscovery_1F4A980471D0D0E3-001/tempDir-001/solr.xml
   [junit4]   2> 1094115 INFO  (TEST-TestCoreDiscovery.testNoCoreDir-seed#[1F4A980471D0D0E3]) [    ] o.a.s.c.CorePropertiesLocator Config-defined core root directory: /export/home/jenkins/workspace/Lucene-Solr-master-Solaris/solr/build/solr-core/test/J1/temp/solr.core.TestCoreDiscovery_1F4A980471D0D0E3-001/tempDir-002
   [junit4]   2> 1094116 INFO  (TEST-TestCoreDiscovery.testNoCoreDir-seed#[1F4A980471D0D0E3]) [    ] o.a.s.c.CoreContainer New CoreContainer 1937150157
   [junit4]   2> 1094116 INFO  (TEST-TestCoreDiscovery.testNoCoreDir-seed#[1F4A980471D0D0E3]) [    ] o.a.s.c.CoreContainer Loading cores into CoreContainer [instanceDir=/export/home/jenkins/workspace/Lucene-Solr-master-Solaris/solr/build/solr-core/test/J1/temp/solr.core.TestCoreDiscovery_1F4A980471D0D0E3-001/tempDir-001]
   [junit4]   2> 1094116 WARN  (TEST-TestCoreDiscovery.testNoCoreDir-seed#[1F4A980471D0D0E3]) [    ] o.a.s.c.CoreContainer Couldn't add files from /export/home/jenkins/workspace/Lucene-Solr-master-Solaris/solr/build/solr-core/test/J1/temp/solr.core.TestCoreDiscovery_1F4A980471D0D0E3-001/tempDir-001/lib to classpath: /export/home/jenkins/workspace/Lucene-Solr-master-Solaris/solr/build/solr-core/test/J1/temp/solr.core.TestCoreDiscovery_1F4A980471D0D0E3-001/tempDir-001/lib
   [junit4]   2> 1094116 INFO  (TEST-TestCoreDiscovery.testNoCoreDir-seed#[1F4A980471D0D0E3]) [    ] o.a.s.h.c.HttpShardHandlerFactory created with socketTimeout : 600000,connTimeout : 60000,maxConnectionsPerHost : 20,maxConnections : 10000,corePoolSize : 0,maximumPoolSize : 2147483647,maxThreadIdleTime : 5,sizeOfQueue : -1,fairnessPolicy : false,
   [junit4]   2> 1094119 INFO  (TEST-TestCoreDiscovery.testNoCoreDir-seed#[1F4A980471D0D0E3]) [    ] o.a.s.u.UpdateShardHandler Created UpdateShardHandler HTTP client with params: socketTimeout=600000&connTimeout=60000&maxConnections=100000&maxConnectionsPerHost=100000
   [junit4]   2> 1094119 INFO  (TEST-TestCoreDiscovery.testNoCoreDir-seed#[1F4A980471D0D0E3]) [    ] o.a.s.c.SolrCores Allocating transient cache for 2 transient cores
   [junit4]   2> 1094121 INFO  (TEST-TestCoreDiscovery.testNoCoreDir-seed#[1F4A980471D0D0E3]) [    ] o.a.s.l.LogWatcher SLF4J impl is org.slf4j.impl.Log4jLoggerFactory
   [junit4]   2> 1094121 INFO  (TEST-TestCoreDiscovery.testNoCoreDir-seed#[1F4A980471D0D0E3]) [    ] o.a.s.l.LogWatcher Registering Log Listener [Log4j (org.slf4j.impl.Log4jLoggerFactory)]
   [junit4]   2> 1094121 INFO  (TEST-TestCoreDiscovery.testNoCoreDir-seed#[1F4A980471D0D0E3]) [    ] o.a.s.c.CoreContainer Security conf doesn't exist. Skipping setup for authorization module.
   [junit4]   2> 1094121 INFO  (TEST-TestCoreDiscovery.testNoCoreDir-seed#[1F4A980471D0D0E3]) [    ] o.a.s.c.CoreContainer No authentication plugin used.
   [junit4]   2> 1094122 INFO  (TEST-TestCoreDiscovery.testNoCoreDir-seed#[1F4A980471D0D0E3]) [    ] o.a.s.c.CorePropertiesLocator Looking for core definitions underneath /export/home/jenkins/workspace/Lucene-Solr-master-Solaris/solr/build/solr-core/test/J1/temp/solr.core.TestCoreDiscovery_1F4A980471D0D0E3-001/tempDir-002
   [junit4]   2> 1094123 INFO  (TEST-TestCoreDiscovery.testNoCoreDir-seed#[1F4A980471D0D0E3]) [    ] o.a.s.c.CoreDescriptor Created CoreDescriptor: {name=core2, config=solrconfig-minimal.xml, loadOnStartup=false, schema=schema-tiny.xml, configSetProperties=configsetprops.json, transient=false, dataDir=stuffandnonsense}
   [junit4]   2> 1094123 INFO  (TEST-TestCoreDiscovery.testNoCoreDir-seed#[1F4A980471D0D0E3]) [    ] o.a.s.c.CorePropertiesLocator Found core core2 in /export/home/jenkins/workspace/Lucene-Solr-master-Solaris/solr/build/solr-core/test/J1/temp/solr.core.TestCoreDiscovery_1F4A980471D0D0E3-001/tempDir-002/core2
   [junit4]   2> 1094123 INFO  (TEST-TestCoreDiscovery.testNoCoreDir-seed#[1F4A980471D0D0E3]) [    ] o.a.s.c.CoreDescriptor Created CoreDescriptor: {name=core1, config=solrconfig-minimal.xml, loadOnStartup=true, schema=schema-tiny.xml, configSetProperties=configsetprops.json, transient=false, dataDir=stuffandnonsense}
   [junit4]   2> 1094123 INFO  (TEST-TestCoreDiscovery.testNoCoreDir-seed#[1F4A980471D0D0E3]) [    ] o.a.s.c.CorePropertiesLocator Found core core1 in /export/home/jenkins/workspace/Lucene-Solr-master-Solaris/solr/build/solr-core/test/J1/temp/solr.core.TestCoreDiscovery_1F4A980471D0D0E3-001/tempDir-002/core1
   [junit4]   2> 1094123 INFO  (TEST-TestCoreDiscovery.testNoCoreDir-seed#[1F4A980471D0D0E3]) [    ] o.a.s.c.CorePropertiesLocator Found 2 core definitions
   [junit4]   2> 1094123 INFO  (coreLoadExecutor-4730-thread-1) [    ] o.a.s.c.SolrResourceLoader new SolrResourceLoader for directory: '/export/home/jenkins/workspace/Lucene-Solr-master-Solaris/solr/build/solr-core/test/J1/temp/solr.core.TestCoreDiscovery_1F4A980471D0D0E3-001/tempDir-002/core1'
   [junit4]   2> 1094123 INFO  (coreLoadExecutor-4730-thread-1) [    ] o.a.s.c.SolrResourceLoader JNDI not configured for solr (NoInitialContextEx)
   [junit4]   2> 1094123 INFO  (coreLoadExecutor-4730-thread-1) [    ] o.a.s.c.SolrResourceLoader using system property solr.solr.home: /export/home/jenkins/workspace/Lucene-Solr-master-Solaris/solr/build/solr-core/test/J1/temp/solr.core.TestCoreDiscovery_1F4A980471D0D0E3-001/tempDir-001
   [junit4]   2> 1094129 INFO  (coreLoadExecutor-4730-thread-1) [    ] o.a.s.c.SolrConfig current version of requestparams : -1
   [junit4]   2> 1094131 WARN  (coreLoadExecutor-4730-thread-1) [    ] o.a.s.c.Config Beginning with Solr 5.5, <mergePolicy> is deprecated, use <mergePolicyFactory> instead.
   [junit4]   2> 1094131 INFO  (coreLoadExecutor-4730-thread-1) [    ] o.a.s.c.SolrConfig Using Lucene MatchVersion: 7.0.0
   [junit4]   2> 1094134 INFO  (coreLoadExecutor-4730-thread-1) [    ] o.a.s.c.SolrConfig Loaded SolrConfig: solrconfig-minimal.xml
   [junit4]   2> 1094136 INFO  (coreLoadExecutor-4730-thread-1) [    ] o.a.s.s.IndexSchema [core1] Schema name=tiny
   [junit4]   2> 1094138 INFO  (coreLoadExecutor-4730-thread-1) [    ] o.a.s.s.IndexSchema unique key field: id
   [junit4]   2> 1094140 INFO  (coreLoadExecutor-4730-thread-1) [    ] o.a.s.c.ConfigSetProperties Did not find ConfigSet properties, assuming default properties: Can't find resource 'configsetprops.json' in classpath or '/export/home/jenkins/workspace/Lucene-Solr-master-Solaris/solr/build/solr-core/test/J1/temp/solr.core.TestCoreDiscovery_1F4A980471D0D0E3-001/tempDir-002/core1'
   [junit4]   2> 1094140 INFO  (coreLoadExecutor-4730-thread-1) [    ] o.a.s.c.CoreContainer Creating SolrCore 'core1' using configuration from instancedir /export/home/jenkins/workspace/Lucene-Solr-master-Solaris/solr/build/solr-core/test/J1/temp/solr.core.TestCoreDiscovery_1F4A980471D0D0E3-001/tempDir-002/core1
   [junit4]   2> 1094140 INFO  (coreLoadExecutor-4730-thread-1) [    x:core1] o.a.s.c.SolrCore org.apache.solr.core.MockDirectoryFactory
   [junit4]   2> 1094140 INFO  (coreLoadExecutor-4730-thread-1) [    x:core1] o.a.s.c.SolrCore [[core1] ] Opening new SolrCore at [/export/home/jenkins/workspace/Lucene-Solr-master-Solaris/solr/build/solr-core/test/J1/temp/solr.core.TestCoreDiscovery_1F4A980471D0D0E3-001/tempDir-002/core1], dataDir=[/export/home/jenkins/workspace/Lucene-Solr-master-Solaris/solr/build/solr-core/test/J1/temp/solr.core.TestCoreDiscovery_1F4A980471D0D0E3-001/tempDir-002/core1/stuffandnonsense/]
   [junit4]   2> 1094141 INFO  (coreLoadExecutor-4730-thread-1) [    x:core1] o.a.s.c.SolrCore JMX monitoring not detected for core: core1
   [junit4]   2> 1094141 INFO  (coreLoadExecutor-4730-thread-1) [    x:core1] o.a.s.c.CachingDirectoryFactory return new directory for /export/home/jenkins/workspace/Lucene-Solr-master-Solaris/solr/build/solr-core/test/J1/temp/solr.core.TestCoreDiscovery_1F4A980471D0D0E3-001/tempDir-002/core1/stuffandnonsense/snapshot_metadata
   [junit4]   2> 1094141 INFO  (coreLoadExecutor-4730-thread-1) [    x:core1] o.a.s.c.s.SolrSnapshotMetaDataManager Loading from snapshot metadata file...
   [junit4]   2> 1094141 INFO  (coreLoadExecutor-4730-thread-1) [    x:core1] o.a.s.c.CachingDirectoryFactory return new directory for /export/home/jenkins/workspace/Lucene-Solr-master-Solaris/solr/build/solr-core/test/J1/temp/solr.core.TestCoreDiscovery_1F4A980471D0D0E3-001/tempDir-002/core1/stuffandnonsense
   [junit4]   2> 1094142 INFO  (coreLoadExecutor-4730-thread-1) [    x:core1] o.a.s.c.SolrCore New index directory detected: old=null new=/export/home/jenkins/workspace/Lucene-Solr-master-Solaris/solr/build/solr-core/test/J1/temp/solr.core.TestCoreDiscovery_1F4A980471D0D0E3-001/tempDir-002/core1/stuffandnonsense/index/
   [junit4]   2> 1094142 WARN  (coreLoadExecutor-4730-thread-1) [    x:core1] o.a.s.c.SolrCore [core1] Solr index directory '/export/home/jenkins/workspace/Lucene-Solr-master-Solaris/solr/build/solr-core/test/J1/temp/solr.core.TestCoreDiscovery_1F4A980471D0D0E3-001/tempDir-002/core1/stuffandnonsense/index' doesn't exist. Creating new index...
   [junit4]   2> 1094142 INFO  (coreLoadExecutor-4730-thread-1) [    x:core1] o.a.s.c.CachingDirectoryFactory return new directory for /export/home/jenkins/workspace/Lucene-Solr-master-Solaris/solr/build/solr-core/test/J1/temp/solr.core.TestCoreDiscovery_1F4A980471D0D0E3-001/tempDir-002/core1/stuffandnonsense/index
   [junit4]   2> 1094143 INFO  (coreLoadExecutor-4730-thread-1) [    x:core1] o.a.s.u.RandomMergePolicy RandomMergePolicy wrapping class org.apache.lucene.index.LogDocMergePolicy: [LogDocMergePolicy: minMergeSize=1000, mergeFactor=15, maxMergeSize=9223372036854775807, maxMergeSizeForForcedMerge=9223372036854775807, calibrateSizeByDeletes=true, maxMergeDocs=2147483647, maxCFSSegmentSizeMB=8.796093022207999E12, noCFSRatio=0.6147528674320415]
   [junit4]   2> 1094143 INFO  (coreLoadExecutor-4730-thread-1) [    x:core1] o.a.s.c.SolrDeletionPolicy SolrDeletionPolicy.onCommit: commits: num=1
   [junit4]   2> 	commit{dir=MockDirectoryWrapper(RAMDirectory@5cdd6fc9 lockFactory=org.apache.lucene.store.SingleInstanceLockFactory@171d933b),segFN=segments_1,generation=1}
   [junit4]   2> 1094143 INFO  (coreLoadExecutor-4730-thread-1) [    x:core1] o.a.s.c.SolrDeletionPolicy newest commit generation = 1
   [junit4]   2> 1094143 INFO  (OldIndexDirectoryCleanupThreadForCore-core1) [    x:core1] o.a.s.c.SolrCore Looking for old index directories to cleanup for core core1 in /export/home/jenkins/workspace/Lucene-Solr-master-Solaris/solr/build/solr-core/test/J1/temp/solr.core.TestCoreDiscovery_1F4A980471D0D0E3-001/tempDir-002/core1/stuffandnonsense/
   [junit4]   2> 1094143 WARN  (OldIndexDirectoryCleanupThreadForCore-core1) [    x:core1] o.a.s.c.DirectoryFactory /export/home/jenkins/workspace/Lucene-Solr-master-Solaris/solr/build/solr-core/test/J1/temp/solr.core.TestCoreDiscovery_1F4A980471D0D0E3-001/tempDir-002/core1/stuffandnonsense/ does not point to a valid data directory; skipping clean-up of old index directories.
   [junit4]   2> 1094145 INFO  (coreLoadExecutor-4730-thread-1) [    x:core1] o.a.s.c.SolrCore no updateRequestProcessorChain defined as default, creating implicit default
   [junit4]   2> 1094146 INFO  (coreLoadExecutor-4730-thread-1) [    x:core1] o.a.s.h.l.XMLLoader xsltCacheLifetimeSeconds=60
   [junit4]   2> 1094147 INFO  (coreLoadExecutor-4730-thread-1) [    x:core1] o.a.s.h.l.XMLLoader xsltCacheLifetimeSeconds=60
   [junit4]   2> 1094147 INFO  (coreLoadExecutor-4730-thread-1) [    x:core1] o.a.s.h.l.XMLLoader xsltCacheLifetimeSeconds=60
   [junit4]   2> 1094148 INFO  (coreLoadExecutor-4730-thread-1) [    x:core1] o.a.s.h.l.XMLLoader xsltCacheLifetimeSeconds=60
   [junit4]   2> 1094149 INFO  (coreLoadExecutor-4730-thread-1) [    x:core1] o.a.s.c.RequestHandlers Registered paths: /admin/mbeans,/update/json/docs,/admin/luke,/export,/get,/admin/properties,/update/json,/admin/threads,/update/csv,/sql,/graph,/select,/admin/segments,/admin/system,/replication,/config,/stream,/schema,/admin/plugins,/admin/logging,/admin/ping,/update,/admin/file,/terms
   [junit4]   2> 1094149 INFO  (coreLoadExecutor-4730-thread-1) [    x:core1] o.a.s.c.SolrCore Using default statsCache cache: org.apache.solr.search.stats.LocalStatsCache
   [junit4]   2> 1094149 INFO  (coreLoadExecutor-4730-thread-1) [    x:core1] o.a.s.u.CommitTracker Hard AutoCommit: disabled
   [junit4]   2> 1094150 INFO  (coreLoadExecutor-4730-thread-1) [    x:core1] o.a.s.u.CommitTracker Soft AutoCommit: disabled
   [junit4]   2> 1094150 INFO  (coreLoadExecutor-4730-thread-1) [    x:core1] o.a.s.u.RandomMergePolicy RandomMergePolicy wrapping class org.apache.lucene.index.TieredMergePolicy: [TieredMergePolicy: maxMergeAtOnce=16, maxMergeAtOnceExplicit=10, maxMergedSegmentMB=40.1298828125, floorSegmentMB=0.8740234375, forceMergeDeletesPctAllowed=26.50465237930048, segmentsPerTier=16.0, maxCFSSegmentSizeMB=8.796093022207999E12, noCFSRatio=1.0
   [junit4]   2> 1094150 INFO  (coreLoadExecutor-4730-thread-1) [    x:core1] o.a.s.c.SolrDeletionPolicy SolrDeletionPolicy.onInit: commits: num=1
   [junit4]   2> 	commit{dir=MockDirectoryWrapper(RAMDirectory@5cdd6fc9 lockFactory=org.apache.lucene.store.SingleInstanceLockFactory@171d933b),segFN=segments_1,generation=1}
   [junit4]   2> 1094150 INFO  (coreLoadExecutor-4730-thread-1) [    x:core1] o.a.s.c.SolrDeletionPolicy newest commit generation = 1
   [junit4]   2> 1094150 INFO  (coreLoadExecutor-4730-thread-1) [    x:core1] o.a.s.s.SolrIndexSearcher Opening [Searcher@62a8cb35[core1] main]
   [junit4]   2> 1094150 INFO  (coreLoadExecutor-4730-thread-1) [    x:core1] o.a.s.r.ManagedResourceStorage File-based storage initialized to use dir: /export/home/jenkins/workspace/Lucene-Solr-master-Solaris/solr/build/solr-core/test/J1/temp/solr.core.TestCoreDiscovery_1F4A980471D0D0E3-001/tempDir-002/core1/conf
   [junit4]   2> 1094150 INFO  (coreLoadExecutor-4730-thread-1) [    x:core1] o.a.s.r.RestManager Initializing RestManager with initArgs: {storageDir=/export/home/jenkins/workspace/Lucene-Solr-master-Solaris/solr/build/solr-core/test/J1/temp/solr.core.TestCoreDiscovery_1F4A980471D0D0E3-001/tempDir-002/core1/conf}
   [junit4]   2> 1094150 INFO  (coreLoadExecutor-4730-thread-1) [    x:core1] o.a.s.r.ManagedResourceStorage Reading _rest_managed.json using file:dir=/export/home/jenkins/workspace/Lucene-Solr-master-Solaris/solr/build/solr-core/test/J1/temp/solr.core.TestCoreDiscovery_1F4A980471D0D0E3-001/tempDir-002/core1/conf
   [junit4]   2> 1094150 INFO  (coreLoadExecutor-4730-thread-1) [    x:core1] o.a.s.r.RestManager Initializing 0 registered ManagedResources
   [junit4]   2> 1094150 INFO  (coreLoadExecutor-4730-thread-1) [    x:core1] o.a.s.h.ReplicationHandler Commits will be reserved for  10000
   [junit4]   2> 1094151 INFO  (coreLoadExecutor-4730-thread-1) [    x:core1] o.a.s.c.CoreContainer registering core: core1
   [junit4]   2> 1094151 INFO  (searcherExecutor-4731-thread-1-processing-x:core1) [    x:core1] o.a.s.c.SolrCore [core1] Registered new searcher Searcher@62a8cb35[core1] main{ExitableDirectoryReader(UninvertingDirectoryReader())}
   [junit4]   2> 1094151 INFO  (TEST-TestCoreDiscovery.testNoCoreDir-seed#[1F4A980471D0D0E3]) [    ] o.a.s.c.SolrResourceLoader new SolrResourceLoader for directory: '/export/home/jenkins/workspace/Lucene-Solr-master-Solaris/solr/build/solr-core/test/J1/temp/solr.core.TestCoreDiscovery_1F4A980471D0D0E3-001/tempDir-002/core2'
   [junit4]   2> 1094151 INFO  (TEST-TestCoreDiscovery.testNoCoreDir-seed#[1F4A980471D0D0E3]) [    ] o.a.s.c.SolrResourceLoader JNDI not configured for solr (NoInitialContextEx)
   [junit4]   2> 1094151 INFO  (TEST-TestCoreDiscovery.testNoCoreDir-seed#[1F4A980471D0D0E3]) [    ] o.a.s.c.SolrResourceLoader using system property solr.solr.home: /export/home/jenkins/workspace/Lucene-Solr-master-Solaris/solr/build/solr-core/test/J1/temp/solr.core.TestCoreDiscovery_1F4A980471D0D0E3-001/tempDir-001
   [junit4]   2> 1094157 INFO  (TEST-TestCoreDiscovery.testNoCoreDir-seed#[1F4A980471D0D0E3]) [    ] o.a.s.c.SolrConfig current version of requestparams : -1
   [junit4]   2> 1094158 WARN  (TEST-TestCoreDiscovery.testNoCoreDir-seed#[1F4A980471D0D0E3]) [    ] o.a.s.c.Config Beginning with Solr 5.5, <mergePolicy> is deprecated, use <mergePolicyFactory> instead.
   [junit4]   2> 1094158 INFO  (TEST-TestCoreDiscovery.testNoCoreDir-seed#[1F4A980471D0D0E3]) [    ] o.a.s.c.SolrConfig Using Lucene MatchVersion: 7.0.0
   [junit4]   2> 1094161 INFO  (TEST-TestCoreDiscovery.testNoCoreDir-seed#[1F4A980471D0D0E3]) [    ] o.a.s.c.SolrConfig Loaded SolrConfig: solrconfig-minimal.xml
   [junit4]   2> 1094163 INFO  (TEST-TestCoreDiscovery.testNoCoreDir-seed#[1F4A980471D0D0E3]) [    ] o.a.s.s.IndexSchema [core2] Schema name=tiny
   [junit4]   2> 1094165 INFO  (TEST-TestCoreDiscovery.testNoCoreDir-seed#[1F4A980471D0D0E3]) [    ] o.a.s.s.IndexSchema unique key field: id
   [junit4]   2> 1094166 INFO  (TEST-TestCoreDiscovery.testNoCoreDir-seed#[1F4A980471D0D0E3]) [    ] o.a.s.c.ConfigSetProperties Did not find ConfigSet properties, assuming default properties: Can't find resource 'configsetprops.json' in classpath or '/export/home/jenkins/workspace/Lucene-Solr-master-Solaris/solr/build/solr-core/test/J1/temp/solr.core.TestCoreDiscovery_1F4A980471D0D0E3-001/tempDir-002/core2'
   [junit4]   2> 1094166 INFO  (TEST-TestCoreDiscovery.testNoCoreDir-seed#[1F4A980471D0D0E3]) [    ] o.a.s.c.CoreContainer Creating SolrCore 'core2' using configuration from instancedir /export/home/jenkins/workspace/Lucene-Solr-master-Solaris/solr/build/solr-core/test/J1/temp/solr.core.TestCoreDiscovery_1F4A980471D0D0E3-001/tempDir-002/core2
   [junit4]   2> 1094166 INFO  (TEST-TestCoreDiscovery.testNoCoreDir-seed#[1F4A980471D0D0E3]) [    x:core2] o.a.s.c.SolrCore org.apache.solr.core.MockDirectoryFactory
   [junit4]   2> 1094166 INFO  (TEST-TestCoreDiscovery.testNoCoreDir-seed#[1F4A980471D0D0E3]) [    x:core2] o.a.s.c.SolrCore [[core2] ] Opening new SolrCore at [/export/home/jenkins/workspace/Lucene-Solr-master-Solaris/solr/build/solr-core/test/J1/temp/solr.core.TestCoreDiscovery_1F4A980471D0D0E3-001/tempDir-002/core2], dataDir=[/export/home/jenkins/workspace/Lucene-Solr-master-Solaris/solr/build/solr-core/test/J1/temp/solr.core.TestCoreDiscovery_1F4A980471D0D0E3-001/tempDir-002/core2/stuffandnonsense/]
   [junit4]   2> 1094166 INFO  (TEST-TestCoreDiscovery.testNoCoreDir-seed#[1F4A980471D0D0E3]) [    x:core2] o.a.s.c.SolrCore JMX monitoring not detected for core: core2
   [junit4]   2> 1094167 INFO  (TEST-TestCoreDiscovery.testNoCoreDir-seed#[1F4A980471D0D0E3]) [    x:core2] o.a.s.c.CachingDirectoryFactory return new directory for /export/home/jenkins/workspace/Lucene-Solr-master-Solaris/solr/build/solr-core/test/J1/temp/solr.core.TestCoreDiscovery_1F4A980471D0D0E3-001/tempDir-002/core2/stuffandnonsense/snapshot_metadata
   [junit4]   2> 1094167 INFO  (TEST-TestCoreDiscovery.testNoCoreDir-seed#[1F4A980471D0D0E3]) [    x:core2] o.a.s.c.s.SolrSnapshotMetaDataManager Loading from snapshot metadata file...
   [junit4]   2> 1094167 INFO  (TEST-TestCoreDiscovery.testNoCoreDir-seed#[1F4A980471D0D0E3]) [    x:core2] o.a.s.c.CachingDirectoryFactory return new directory for /export/home/jenkins/workspace/Lucene-Solr-master-Solaris/solr/build/solr-core/test/J1/temp/solr.core.TestCoreDiscovery_1F4A980471D0D0E3-001/tempDir-002/core2/stuffandnonsense
   [junit4]   2> 1094167 INFO  (TEST-TestCoreDiscovery.testNoCoreDir-seed#[1F4A980471D0D0E3]) [    x:core2] o.a.s.c.SolrCore New index directory detected: old=null new=/export/home/jenkins/workspace/Lucene-Solr-master-Solaris/solr/build/solr-core/test/J1/temp/solr.core.TestCoreDiscovery_1F4A980471D0D0E3-001/tempDir-002/core2/stuffandnonsense/index/
   [junit4]   2> 1094167 WARN  (TEST-TestCoreDiscovery.testNoCoreDir-seed#[1F4A980471D0D0E3]) [    x:core2] o.a.s.c.SolrCore [core2] Solr index directory '/export/home/jenkins/workspace/Lucene-Solr-master-Solaris/solr/build/solr-core/test/J1/temp/solr.core.TestCoreDiscovery_1F4A980471D0D0E3-001/tempDir-002/core2/stuffandnonsense/index' doesn't exist. Creating new index...
   [junit4]   2> 1094167 INFO  (TEST-TestCoreDiscovery.testNoCoreDir-seed#[1F4A980471D0D0E3]) [    x:core2] o.a.s.c.CachingDirectoryFactory return new directory for /export/home/jenkins/workspace/Lucene-Solr-master-Solaris/solr/build/solr-core/test/J1/temp/solr.core.TestCoreDiscovery_1F4A980471D0D0E3-001/tempDir-002/core2/stuffandnonsense/index
   [junit4]   2> 1094168 INFO  (TEST-TestCoreDiscovery.testNoCoreDir-seed#[1F4A980471D0D0E3]) [    x:core2] o.a.s.u.RandomMergePolicy RandomMergePolicy wrapping class org.apache.lucene.index.LogByteSizeMergePolicy: [LogByteSizeMergePolicy: minMergeSize=1677721, mergeFactor=13, maxMergeSize=2147483648, maxMergeSizeForForcedMerge=9223372036854775807, calibrateSizeByDeletes=true, maxMergeDocs=2147483647, maxCFSSegmentSizeMB=8.796093022207999E12, noCFSRatio=0.7295998012862256]
   [junit4]   2> 1094168 INFO  (TEST-TestCoreDiscovery.testNoCoreDir-seed#[1F4A980471D0D0E3]) [    x:core2] o.a.s.c.SolrDeletionPolicy SolrDeletionPolicy.onCommit: commits: num=1
   [junit4]   2> 	commit{dir=MockDirectoryWrapper(RAMDirectory@32a199b lockFactory=org.apache.lucene.store.SingleInstanceLockFactory@5f97124),segFN=segments_1,generation=1}
   [junit4]   2> 1094168 INFO  (TEST-TestCoreDiscovery.testNoCoreDir-seed#[1F4A980471D0D0E3]) [    x:core2] o.a.s.c.SolrDeletionPolicy newest commit generation = 1
   [junit4]   2> 1094168 INFO  (OldIndexDirectoryCleanupThreadForCore-core2) [    x:core2] o.a.s.c.SolrCore Looking for old index directories to cleanup for core core2 in /export/home/jenkins/workspace/Lucene-Solr-master-Solaris/solr/build/solr-core/test/J1/temp/solr.core.TestCoreDiscovery_1F4A980471D0D0E3-001/tempDir-002/core2/stuffandnonsense/
   [junit4]   2> 1094168 WARN  (OldIndexDirectoryCleanupThreadForCore-core2) [    x:core2] o.a.s.c.DirectoryFactory /export/home/jenkins/workspace/Lucene-Solr-master-Solaris/solr/build/solr-core/test/J1/temp/solr.core.TestCoreDiscovery_1F4A980471D0D0E3-001/tempDir-002/core2/stuffandnonsense/ does not point to a valid data directory; skipping clean-up of old index directories.
   [junit4]   2> 1094170 INFO  (TEST-TestCoreDiscovery.testNoCoreDir-seed#[1F4A980471D0D0E3]) [    x:core2] o.a.s.c.SolrCore no updateRequestProcessorChain defined as default, creating implicit default
   [junit4]   2> 1094170 INFO  (TEST-TestCoreDiscovery.testNoCoreDir-seed#[1F4A980471D0D0E3]) [    x:core2] o.a.s.h.l.XMLLoader xsltCacheLifetimeSeconds=60
   [junit4]   2> 1094171 INFO  (TEST-TestCoreDiscovery.testNoCoreDir-seed#[1F4A980471D0D0E3]) [    x:core2] o.a.s.h.l.XMLLoader xsltCacheLifetimeSeconds=60
   [junit4]   2> 1094172 INFO  (TEST-TestCoreDiscovery.testNoCoreDir-seed#[1F4A980471D0D0E3]) [    x:core2] o.a.s.h.l.XMLLoader xsltCacheLifetimeSeconds=60
   [junit4]   2> 1094172 INFO  (TEST-TestCoreDiscovery.testNoCoreDir-seed#[1F4A980471D0D0E3]) [    x:core2] o.a.s.h.l.XMLLoader xsltCacheLifetimeSeconds=60
   [junit4]   2> 1094174 INFO  (TEST-TestCoreDiscovery.testNoCoreDir-seed#[1F4A980471D0D0E3]) [    x:core2] o.a.s.c.RequestHandlers Registered paths: /admin/mbeans,/update/json/docs,/admin/luke,/export,/get,/admin/properties,/update/json,/admin/threads,/update/csv,/sql,/graph,/select,/admin/segments,/admin/system,/replication,/config,/stream,/schema,/admin/plugins,/admin/logging,/admin/ping,/update,/admin/file,/terms
   [junit4]   2> 1094174 INFO  (TEST-TestCoreDiscovery.testNoCoreDir-seed#[1F4A980471D0D0E3]) [    x:core2] o.a.s.c.SolrCore Using default statsCache cache: org.apache.solr.search.stats.LocalStatsCache
   [junit4]   2> 1094174 INFO  (TEST-TestCoreDiscovery.testNoCoreDir-seed#[1F4A980471D0D0E3]) [    x:core2] o.a.s.u.CommitTracker Hard AutoCommit: disabled
   [junit4]   2> 1094174 INFO  (TEST-TestCoreDiscovery.testNoCoreDir-seed#[1F4A980471D0D0E3]) [    x:core2] o.a.s.u.CommitTracker Soft AutoCommit: disabled
   [junit4]   2> 1094174 INFO  (TEST-TestCoreDiscovery.testNoCoreDir-seed#[1F4A980471D0D0E3]) [    x:core2] o.a.s.u.RandomMergePolicy RandomMergePolicy wrapping class org.apache.lucene.index.TieredMergePolicy: [TieredMergePolicy: maxMergeAtOnce=46, maxMergeAtOnceExplicit=49, maxMergedSegmentMB=7.8056640625, floorSegmentMB=1.2705078125, forceMergeDeletesPctAllowed=15.268481353393508, segmentsPerTier=19.0, maxCFSSegmentSizeMB=8.796093022207999E12, noCFSRatio=0.4112788201879194
   [junit4]   2> 1094174 INFO  (TEST-TestCoreDiscovery.testNoCoreDir-seed#[1F4A980471D0D0E3]) [    x:core2] o.a.s.c.SolrDeletionPolicy SolrDeletionPolicy.onInit: commits: num=1
   [junit4]   2> 	commit{dir=MockDirectoryWrapper(RAMDirectory@32a199b lockFactory=org.apache.lucene.store.SingleInstanceLockFactory@5f97124),segFN=segments_1,generation=1}
   [junit4]   2> 1094174 INFO  (TEST-TestCoreDiscovery.testNoCoreDir-seed#[1F4A980471D0D0E3]) [    x:core2] o.a.s.c.SolrDeletionPolicy newest commit generation = 1
   [junit4]   2> 1094174 INFO  (TEST-TestCoreDiscovery.testNoCoreDir-seed#[1F4A980471D0D0E3]) [    x:core2] o.a.s.s.SolrIndexSearcher Opening [Searcher@621e7afe[core2] main]
   [junit4]   2> 1094175 INFO  (TEST-TestCoreDiscovery.testNoCoreDir-seed#[1F4A980471D0D0E3]) [    x:core2] o.a.s.r.ManagedResourceStorage File-based storage initialized to use dir: /export/home/jenkins/workspace/Lucene-Solr-master-Solaris/solr/build/solr-core/test/J1/temp/solr.core.TestCoreDiscovery_1F4A980471D0D0E3-001/tempDir-002/core2/conf
   [junit4]   2> 1094175 INFO  (TEST-TestCoreDiscovery.testNoCoreDir-seed#[1F4A980471D0D0E3]) [    x:core2] o.a.s.r.RestManager Initializing RestManager with initArgs: {storageDir=/export/home/jenkins/workspace/Lucene-Solr-master-Solaris/solr/build/solr-core/test/J1/temp/solr.core.TestCoreDiscovery_1F4A980471D0D0E3-001/tempDir-002/core2/conf}
   [junit4]   2> 1094175 INFO  (TEST-TestCoreDiscovery.testNoCoreDir-seed#[1F4A980471D0D0E3]) [    x:core2] o.a.s.r.ManagedResourceStorage Reading _rest_managed.json using file:dir=/export/home/jenkins/workspace/Lucene-Solr-master-Solaris/solr/build/solr-core/test/J1/temp/solr.core.TestCoreDiscovery_1F4A980471D0D0E3-001/tempDir-002/core2/conf
   [junit4]   2> 1094175 INFO  (TEST-TestCoreDiscovery.testNoCoreDir-seed#[1F4A980471D0D0E3]) [    x:core2] o.a.s.r.RestManager Initializing 0 registered ManagedResources
   [junit4]   2> 1094175 INFO  (TEST-TestCoreDiscovery.testNoCoreDir-seed#[1F4A980471D0D0E3]) [    x:core2] o.a.s.h.ReplicationHandler Commits will be reserved for  10000
   [junit4]   2> 1094175 INFO  (searcherExecutor-4735-thread-1-processing-x:core2) [    x:core2] o.a.s.c.SolrCore [core2] Registered new searcher Searcher@621e7afe[core2] main{ExitableDirectoryReader(UninvertingDirectoryReader())}
   [junit4]   2> 1094175 INFO  (TEST-TestCoreDiscovery.testNoCoreDir-seed#[1F4A980471D0D0E3]) [    x:core2] o.a.s.c.CoreContainer registering core: core2
   [junit4]   2> 1094175 INFO  (TEST-TestCoreDiscovery.testNoCoreDir-seed#[1F4A980471D0D0E3]) [    x:core2] o.a.s.c.CoreContainer Shutting down CoreContainer instance=1937150157
   [junit4]   2> 1094176 INFO  (coreCloseExecutor-4739-thread-1-processing-x:core2) [    x:core1] o.a.s.c.SolrCore [core1]  CLOSING SolrCore org.apache.solr.core.SolrCore@3505cb71
   [junit4]   2> 1094176 INFO  (coreCloseExecutor-4739-thread-2-processing-x:core2) [    x:core2] o.a.s.c.SolrCore [core2]  CLOSING SolrCore org.apache.solr.core.SolrCore@6be12ce6
   [junit4]   2> 1094176 INFO  (coreCloseExecutor-4739-thread-1-processing-x:core2) [    x:core1] o.a.s.u.DirectUpdateHandler2 closing DirectUpdateHandler2{commits=0,autocommits=0,soft autocommits=0,optimizes=0,rollbacks=0,expungeDeletes=0,docsPending=0,adds=0,deletesById=0,deletesByQuery=0,errors=0,cumulative_adds=0,cumulative_deletesById=0,cumulative_deletesByQuery=0,cumulative_errors=0}
   [junit4]   2> 1094177 INFO  (coreCloseExecutor-4739-thread-2-processing-x:core2) [    x:core2] o.a.s.u.DirectUpdateHandler2 closing DirectUpdateHandler2{commits=0,autocommits=0,soft autocommits=0,optimizes=0,rollbacks=0,expungeDeletes=0,docsPending=0,adds=0,deletesById=0,deletesByQuery=0,errors=0,cumulative_adds=0,cumulative_deletesById=0,cumulative_deletesByQuery=0,cumulative_errors=0}
   [junit4]   2> 1094177 INFO  (coreCloseExecutor-4739-thread-2-processing-x:core2) [    x:core2] o.a.s.u.SolrCoreState Closing SolrCoreState
   [junit4]   2> 1094177 INFO  (coreCloseExecutor-4739-thread-1-processing-x:core2) [    x:core1] o.a.s.u.SolrCoreState Closing SolrCoreState
   [junit4]   2> 1094177 INFO  (coreCloseExecutor-4739-thread-2-processing-x:core2) [    x:core2] o.a.s.u.DefaultSolrCoreState SolrCoreState ref count has reached 0 - closing IndexWriter
   [junit4]   2> 1094177 INFO  (coreCloseExecutor-4739-thread-1-processing-x:core2) [    x:core1] o.a.s.u.DefaultSolrCoreState SolrCoreState ref count has reached 0 - closing IndexWriter
   [junit4]   2> 1094177 INFO  (coreCloseExecutor-4739-thread-2-processing-x:core2) [    x:core2] o.a.s.u.DefaultSolrCoreState closing IndexWriter with IndexWriterCloser
   [junit4]   2> 1094177 INFO  (coreCloseExecutor-4739-thread-1-processing-x:core2) [    x:core1] o.a.s.u.DefaultSolrCoreState closing IndexWriter with IndexWriterCloser
   [junit4]   2> 1094179 INFO  (coreCloseExecutor-4739-thread-2-processing-x:core2) [    x:core2] o.a.s.c.SolrCore [core2] Closing main searcher on request.
   [junit4]   2> 1094179 INFO  (coreCloseExecutor-4739-thread-1-processing-x:core2) [    x:core1] o.a.s.c.SolrCore [core1] Closing main searcher on request.
   [junit4]   2> 1094179 INFO  (coreCloseExecutor-4739-thread-1-processing-x:core2) [    x:core1] o.a.s.c.CachingDirectoryFactory Closing MockDirectoryFactory - 3 directories currently being tracked
   [junit4]   2> 1094179 INFO  (coreCloseExecutor-4739-thread-2-processing-x:core2) [    x:core2] o.a.s.c.CachingDirectoryFactory Closing MockDirectoryFactory - 3 directories currently being tracked
   [junit4]   2> 1094179 INFO  (coreCloseExecutor-4739-thread-2-processing-x:core2) [    x:core2] o.a.s.c.CachingDirectoryFactory looking to close /export/home/jenkins/workspace/Lucene-Solr-master-Solaris/solr/build/solr-core/test/J1/temp/solr.core.TestCoreDiscovery_1F4A980471D0D0E3-001/tempDir-002/core2/stuffandnonsense/snapshot_metadata [CachedDir<<refCount=0;path=/export/home/jenkins/workspace/Lucene-Solr-master-Solaris/solr/build/solr-core/test/J1/temp/solr.core.TestCoreDiscovery_1F4A980471D0D0E3-001/tempDir-002/core2/stuffandnonsense/snapshot_metadata;done=false>>]
   [junit4]   2> 1094179 INFO  (coreCloseExecutor-4739-thread-2-processing-x:core2) [    x:core2] o.a.s.c.CachingDirectoryFactory Closing directory, CoreContainer#isShutdown=true
   [junit4]   2> 1094179 INFO  (coreCloseExecutor-4739-thread-1-processing-x:core2) [    x:core1] o.a.s.c.CachingDirectoryFactory looking to close /export/home/jenkins/workspace/Lucene-Solr-master-Solaris/solr/build/solr-core/test/J1/temp/solr.core.TestCoreDiscovery_1F4A980471D0D0E3-001/tempDir-002/core1/stuffandnonsense [CachedDir<<refCount=0;path=/export/home/jenkins/workspace/Lucene-Solr-master-Solaris/solr/build/solr-core/test/J1/temp/solr.core.TestCoreDiscovery_1F4A980471D0D0E3-001/tempDir-002/core1/stuffandnonsense;done=false>>]
   [junit4]   2> 1094179 INFO  (coreCloseExecutor-4739-thread-2-processing-x:core2) [    x:core2] o.a.s.c.CachingDirectoryFactory Closing directory: /export/home/jenkins/workspace/Lucene-Solr-master-Solaris/solr/build/solr-core/test/J1/temp/solr.core.TestCoreDiscovery_1F4A980471D0D0E3-001/tempDir-002/core2/stuffandnonsense/snapshot_metadata
   [junit4]   2> 1094179 INFO  (coreCloseExecutor-4739-thread-1-processing-x:core2) [    x:core1] o.a.s.c.CachingDirectoryFactory Closing directory, CoreContainer#isShutdown=true
   [junit4]   2> 1094179 INFO  (coreCloseExecutor-4739-thread-2-processing-x:core2) [    x:core2] o.a.s.c.CachingDirectoryFactory looking to close /export/home/jenkins/workspace/Lucene-Solr-master-Solaris/solr/build/solr-core/test/J1/temp/solr.core.TestCoreDiscovery_1F4A980471D0D0E3-001/tempDir-002/core2/stuffandnonsense [CachedDir<<refCount=0;path=/export/home/jenkins/workspace/Lucene-Solr-master-Solaris/solr/build/solr-core/test/J1/temp/solr.core.TestCoreDiscovery_1F4A980471D0D0E3-001/tempDir-002/core2/stuffandnonsense;done=false>>]
   [junit4]   2> 1094179 INFO  (coreCloseExecutor-4739-thread-1-processing-x:core2) [    x:core1] o.a.s.c.CachingDirectoryFactory Closing directory: /export/home/jenkins/workspace/Lucene-Solr-master-Solaris/solr/build/solr-core/test/J1/temp/solr.core.TestCoreDiscovery_1F4A980471D0D0E3-001/tempDir-002/core1/stuffandnonsense
   [junit4]   2> 1094179 INFO  (coreCloseExecutor-4739-thread-2-processing-x:core2) [    x:core2] o.a.s.c.CachingDirectoryFactory Closing directory, CoreContainer#isShutdown=true
   [junit4]   2> 1094180 INFO  (coreCloseExecutor-4739-thread-1-processing-x:core2) [    x:core1] o.a.s.c.CachingDirectoryFactory looking to close /export/home/jenkins/workspace/Lucene-Solr-master-Solaris/solr/build/solr-core/test/J1/temp/solr.core.TestCoreDiscovery_1F4A980471D0D0E3-001/tempDir-002/core1/stuffandnonsense/snapshot_metadata [CachedDir<<refCount=0;path=/export/home/jenkins/workspace/Lucene-Solr-master-Solaris/solr/build/solr-core/test/J1/temp/solr.core.TestCoreDiscovery_1F4A980471D0D0E3-001/tempDir-002/core1/stuffandnonsense/snapshot_metadata;done=false>>]
   [junit4]   2> 1094180 INFO  (coreCloseExecutor-4739-thread-2-processing-x:core2) [    x:core2] o.a.s.c.CachingDirectoryFactory Closing directory: /export/home/jenkins/workspace/Lucene-Solr-master-Solaris/solr/build/solr-core/test/J1/temp/solr.core.TestCoreDiscovery_1F4A980471D0D0E3-001/tempDir-002/core2/stuffandnonsense
   [junit4]   2> 1094180 INFO  (coreCloseExecutor-4739-thread-1-processing-x:core2) [    x:core1] o.a.s.c.CachingDirectoryFactory Closing directory, CoreContainer#isShutdown=true
   [junit4]   2> 1094180 INFO  (coreCloseExecutor-4739-thread-2-processing-x:core2) [    x:core2] o.a.s.c.CachingDirectoryFactory looking to close /export/home/jenkins/workspace/Lucene-Solr-master-Solaris/solr/build/solr-core/test/J1/temp/solr.core.TestCoreDiscovery_1F4A980471D0D0E3-001/tempDir-002/core2/stuffandnonsense/index [CachedDir<<refCount=0;path=/export/home/jenkins/workspace/Lucene-Solr-master-Solaris/solr/build/solr-core/test/J1/temp/solr.core.TestCoreDiscovery_1F4A980471D0D0E3-001/tempDir-002/core2/stuffandnonsense/index;done=false>>]
   [junit4]   2> 1094180 INFO  (coreCloseExecutor-4739-thread-1-processing-x:core2) [    x:core1] o.a.s.c.CachingDirectoryFactory Closing directory: /export/home/jenkins/workspace/Lucene-Solr-master-Solaris/solr/build/solr-core/test/J1/temp/solr.core.TestCoreDiscovery_1F4A980471D0D0E3-001/tempDir-002/core1/stuffandnonsense/snapshot_metadata
   [junit4]   2> 1094180 INFO  (coreCloseExecutor-4739-thread-2-processing-x:core2) [    x:core2] o.a.s.c.CachingDirectoryFactory Closing directory, CoreContainer#isShutdown=true
   [junit4]   2> 1094180 INFO  (coreCloseExecutor-4739-thread-2-processing-x:core2) [    x:core2] o.a.s.c.CachingDirectoryFactory Closing directory: /export/home/jenkins/workspace/Lucene-Solr-master-Solaris/solr/build/solr-core/test/J1/temp/solr.core.TestCoreDiscovery_1F4A980471D0D0E3-001/tempDir-002/core2/stuffandnonsense/index
   [junit4]   2> 1094180 INFO  (coreCloseExecutor-4739-thread-1-processing-x:core2) [    x:core1] o.a.s.c.CachingDirectoryFactory looking to close /export/home/jenkins/workspace/Lucene-Solr-master-Solaris/solr/build/solr-core/test/J1/temp/solr.core.TestCoreDiscovery_1F4A980471D0D0E3-001/tempDir-002/core1/stuffandnonsense/index [CachedDir<<refCount=0;path=/export/home/jenkins/workspace/Lucene-Solr-master-Solaris/solr/build/solr-core/test/J1/temp/solr.core.TestCoreDiscovery_1F4A980471D0D0E3-001/tempDir-002/core1/stuffandnonsense/index;done=false>>]
   [junit4]   2> 1094180 INFO  (coreCloseExecutor-4739-thread-1-processing-x:core2) [    x:core1] o.a.s.c.CachingDirectoryFactory Closing directory, CoreContainer#isShutdown=true
   [junit4]   2> 1094180 INFO  (coreCloseExecutor-4739-thread-1-processing-x:core2) [    x:core1] o.a.s.c.CachingDirectoryFactory Closing directory: /export/home/jenkins/workspace/Lucene-Solr-master-Solaris/solr/build/solr-core/test/J1/temp/solr.core.TestCoreDiscovery_1F4A980471D0D0E3-001/tempDir-002/core1/stuffandnonsense/index
   [junit4]   2> 1094180 INFO  (TEST-TestCoreDiscovery.testNoCoreDir-seed#[1F4A980471D0D0E3]) [    x:core2] o.a.s.SolrTestCaseJ4 ###Ending testNoCoreDir
   [junit4]   2> 1094183 INFO  (TEST-TestCoreDiscovery.testSolrHomeDoesntExist-seed#[1F4A980471D0D0E3]) [    x:core2] o.a.s.SolrTestCaseJ4 ###Starting testSolrHomeDoesntExist
   [junit4]   2> 1094183 INFO  (TEST-TestCoreDiscovery.testSolrHomeDoesntExist-seed#[1F4A980471D0D0E3]) [    x:core2] o.a.s.c.SolrResourceLoader JNDI not configured for solr (NoInitialContextEx)
   [junit4]   2> 1094183 INFO  (TEST-TestCoreDiscovery.testSolrHomeDoesntExist-seed#[1F4A980471D0D0E3]) [    x:core2] o.a.s.c.SolrResourceLoader solr home defaulted to 'solr/' (could not find system property or JNDI)
   [junit4]   2> 1094183 INFO  (TEST-TestCoreDiscovery.testSolrHomeDoesntExist-seed#[1F4A980471D0D0E3]) [    x:core2] o.a.s.c.SolrResourceLoader new SolrResourceLoader for directory: '/export/home/jenkins/workspace/Lucene-Solr-master-Solaris/solr/build/solr-core/test/J1/solr'
   [junit4]   2> 1094183 INFO  (TEST-TestCoreDiscovery.testSolrHomeDoesntExist-seed#[1F4A980471D0D0E3]) [    x:core2] o.a.s.c.SolrResourceLoader JNDI not configured for solr (NoInitialContextEx)
   [junit4]   2> 1094183 INFO  (TEST-TestCoreDiscovery.testSolrHomeDoesntExist-seed#[1F4A980471D0D0E3]) [    x:core2] o.a.s.c.SolrResourceLoader solr home defaulted to 'solr/' (could not find system property or JNDI)
   [junit4]   2> 1094184 INFO  (TEST-TestCoreDiscovery.testSolrHomeDoesntExist-seed#[1F4A980471D0D0E3]) [    x:core2] o.a.s.c.SolrXmlConfig Loading container configuration from /export/home/jenkins/workspace/Lucene-Solr-master-Solaris/solr/build/solr-core/test/J1/solr/solr.xml
   [junit4]   2> 1094184 INFO  (TEST-TestCoreDiscovery.testSolrHomeDoesntExist-seed#[1F4A980471D0D0E3]) [    x:core2] o.a.s.SolrTestCaseJ4 ###Ending testSolrHomeDoesntExist
   [junit4]   2> 1094186 INFO  (TEST-TestCoreDiscovery.testNonCoreDirCantRead-seed#[1F4A980471D0D0E3]) [    x:core2] o.a.s.SolrTestCaseJ4 ###Starting testNonCoreDirCantRead
   [junit4]   2> 1094190 INFO  (TEST-TestCoreDiscovery.testNonCoreDirCantRead-seed#[1F4A980471D0D0E3]) [    x:core2] o.a.s.c.SolrResourceLoader JNDI not configured for solr (NoInitialContextEx)
   [junit4]   2> 1094190 INFO  (TEST-TestCoreDiscovery.testNonCoreDirCantRead-seed#[1F4A980471D0D0E3]) [    x:core2] o.a.s.c.SolrResourceLoader using system property solr.solr.home: /export/home/jenkins/workspace/Lucene-Solr-master-Solaris/solr/build/solr-core/test/J1/temp/solr.core.TestCoreDiscovery_1F4A980471D0D0E3-001/tempDir-003
   [junit4]   2> 1094190 INFO  (TEST-TestCoreDiscovery.testNonCoreDirCantRead-seed#[1F4A980471D0D0E3]) [    x:core2] o.a.s.c.SolrResourceLoader new SolrResourceLoader for directory: '/export/home/jenkins/workspace/Lucene-Solr-master-Solaris/solr/build/solr-core/test/J1/temp/solr.core.TestCoreDiscovery_1F4A980471D0D0E3-001/tempDir-003'
   [junit4]   2> 1094190 INFO  (TEST-TestCoreDiscovery.testNonCoreDirCantRead-seed#[1F4A980471D0D0E3]) [    x:core2] o.a.s.c.SolrResourceLoader JNDI not configured for solr (NoInitialContextEx)
   [junit4]   2> 1094190 INFO  (TEST-TestCoreDiscovery.testNonCoreDirCantRead-seed#[1F4A980471D0D0E3]) [    x:core2] o.a.s.c.SolrResourceLoader using system property solr.solr.home: /export/home/jenkins/workspace/Lucene-Solr-master-Solaris/solr/build/solr-core/test/J1/temp/solr.core.TestCoreDiscovery_1F4A980471D0D0E3-001/tempDir-003
   [junit4]   2> 1094190 INFO  (TEST-TestCoreDiscovery.testNonCoreDirCantRead-seed#[1F4A980471D0D0E3]) [    x:core2] o.a.s.c.SolrXmlConfig Loading container configuration from /export/home/jenkins/workspace/Lucene-Solr-master-Solaris/solr/build/solr-core/test/J1/temp/solr.core.TestCoreDiscovery_1F4A980471D0D0E3-001/tempDir-003/solr.xml
   [junit4]   2> 1094193 INFO  (TEST-TestCoreDiscovery.testNonCoreDirCantRead-seed#[1F4A980471D0D0E3]) [    x:core2] o.a.s.c.CorePropertiesLocator Config-defined core root directory: /export/home/jenkins/workspace/Lucene-Solr-master-Solaris/solr/build/solr-core/test/J1/temp/solr.core.TestCoreDiscovery_1F4A980471D0D0E3-001/tempDir-003
   [junit4]   2> 1094193 INFO  (TEST-TestCoreDiscovery.testNonCoreDirCantRead-seed#[1F4A980471D0D0E3]) [    x:core2] o.a.s.c.CoreContainer New CoreContainer 2071031081
   [junit4]   2> 1094193 INFO  (TEST-TestCoreDiscovery.testNonCoreDirCantRead-seed#[1F4A980471D0D0E3]) [    x:core2] o.a.s.c.CoreContainer Loading cores into CoreContainer [instanceDir=/export/home/jenkins/workspace/Lucene-Solr-master-Solaris/solr/build/solr-core/test/J1/temp/solr.core.TestCoreDiscovery_1F4A980471D0D0E3-001/tempDir-003]
   [junit4]   2> 1094193 WARN  (TEST-TestCoreDiscovery.testNonCoreDirCantRead-seed#[1F4A980471D0D0E3]) [    x:core2] o.a.s.c.CoreContainer Couldn't add files from /export/home/jenkins/workspace/Lucene-Solr-master-Solaris/solr/build/solr-core/test/J1/temp/solr.core.TestCoreDiscovery_1F4A980471D0D0E3-001/tempDir-003/lib to classpath: /export/home/jenkins/workspace/Lucene-Solr-master-Solaris/solr/build/solr-core/test/J1/temp/solr.core.TestCoreDiscovery_1F4A980471D0D0E3-001/tempDir-003/lib
   [junit4]   2> 1094193 INFO  (TEST-TestCoreDiscovery.testNonCoreDirCantRead-seed#[1F4A980471D0D0E3]) [    x:core2] o.a.s.h.c.HttpShardHandlerFactory created with socketTimeout : 600000,connTimeout : 60000,maxConnectionsPerHost : 20,maxConnections : 10000,corePoolSize : 0,maximumPoolSize : 2147483647,maxThreadIdleTime : 5,sizeOfQueue : -1,fairnessPolicy : false,
   [junit4]   2> 1094195 INFO  (TEST-TestCoreDiscovery.testNonCoreDirCantRead-seed#[1F4A980471D0D0E3]) [    x:core2] o.a.s.u.UpdateShardHandler Created UpdateShardHandler HTTP client with params: socketTimeout=600000&connTimeout=60000&maxConnections=100000&maxConnectionsPerHost=100000
   [junit4]   2> 1094195 INFO  (TEST-TestCoreDiscovery.testNonCoreDirCantRead-seed#[1F4A980471D0D0E3]) [    x:core2] o.a.s.c.SolrCores Allocating transient cache for 2 transient cores
   [junit4]   2> 1094195 INFO  (TEST-TestCoreDiscovery.testNonCoreDirCantRead-seed#[1F4A980471D0D0E3]) [    x:core2] o.a.s.l.LogWatcher SLF4J impl is org.slf4j.impl.Log4jLoggerFactory
   [junit4]   2> 1094195 INFO  (TEST-TestCoreDiscovery.testNonCoreDirCantRead-seed#[1F4A980471D0D0E3]) [    x:core2] o.a.s.l.LogWatcher Registering Log Listener [Log4j (org.slf4j.impl.Log4jLoggerFactory)]
   [junit4]   2> 1094195 INFO  (TEST-TestCoreDiscovery.testNonCoreDirCantRead-seed#[1F4A980471D0D0E3]) [    x:core2] o.a.s.c.CoreContainer Security conf doesn't exist. Skipping setup for authorization module.
   [junit4]   2> 1094195 INFO  (TEST-TestCoreDiscovery.testNonCoreDirCantRead-seed#[1F4A980471D0D0E3]) [    x:core2] o.a.s.c.CoreContainer No authentication plugin used.
   [junit4]   2> 1094196 INFO  (TEST-TestCoreDiscovery.testNonCoreDirCantRead-seed#[1F4A980471D0D0E3]) [    x:core2] o.a.s.c.CorePropertiesLocator Looking for core definitions underneath /export/home/jenkins/workspace/Lucene-Solr-master-Solaris/solr/build/solr-core/test/J1/temp/solr.core.TestCoreDiscovery_1F4A980471D0D0E3-001/tempDir-003
   [junit4]   2> 1094196 WARN  (TEST-TestCoreDiscovery.testNonCoreDirCantRead-seed#[1F4A980471D0D0E3]) [    x:core2] o.a.s.c.CorePropertiesLocator Error visiting /export/home/jenkins/workspace/Lucene-Solr-master-Solaris/solr/build/solr-core/test/J1/temp/solr.core.TestCoreDiscovery_1F4A980471D0D0E3-001/tempDir-003/cantReadDir: java.nio.file.AccessDeniedException: /export/home/jenkins/workspace/Lucene-Solr-master-Solaris/solr/build/solr-core/test/J1/temp/solr.core.TestCoreDiscovery_1F4A980471D0D0E3-001/tempDir-003/cantReadDir
   [junit4]   2> 1094197 INFO  (TEST-TestCoreDiscovery.testNonCoreDirCantRead-seed#[1F4A980471D0D0E3]) [    x:core2] o.a.s.c.CoreDescriptor Created CoreDescriptor: {name=core1, config=solrconfig-minimal.xml, loadOnStartup=true, schema=schema-tiny.xml, configSetProperties=configsetprops.json, transient=false, dataDir=stuffandnonsense}
   [junit4]   2> 1094197 INFO  (TEST-TestCoreDiscovery.testNonCoreDirCantRead-seed#[1F4A980471D0D0E3]) [    x:core2] o.a.s.c.CorePropertiesLocator Found core core1 in /export/home/jenkins/workspace/Lucene-Solr-master-Solaris/solr/build/solr-core/test/J1/temp/solr.core.TestCoreDiscovery_1F4A980471D0D0E3-001/tempDir-003/core1
   [junit4]   2> 1094197 INFO  (TEST-TestCoreDiscovery.testNonCoreDirCantRead-seed#[1F4A980471D0D0E3]) [    x:core2] o.a.s.c.CoreDescriptor Created CoreDescriptor: {name=core2, config=solrconfig-minimal.xml, loadOnStartup=false, schema=schema-tiny.xml, configSetProperties=configsetprops.json, transient=false, dataDir=core2}
   [junit4]   2> 1094197 INFO  (TEST-TestCoreDiscovery.testNonCoreDirCantRead-seed#[1F4A980471D0D0E3]) [    x:core2] o.a.s.c.CorePropertiesLocator Found core core2 in /export/home/jenkins/workspace/Lucene-Solr-master-Solaris/solr/build/solr-core/test/J1/temp/solr.core.TestCoreDiscovery_1F4A980471D0D0E3-001/tempDir-003/core2
   [junit4]   2> 1094197 INFO  (TEST-TestCoreDiscovery.testNonCoreDirCantRead-seed#[1F4A980471D0D0E3]) [    x:core2] o.a.s.c.CorePropertiesLocator Found 2 core definitions
   [junit4]   2> 1094198 INFO  (coreLoadExecutor-4746-thread-1-processing-x:core2) [    x:core2] o.a.s.c.SolrResourceLoader new SolrResourceLoader for directory: '/export/home/jenkins/workspace/Lucene-Solr-master-Solaris/solr/build/solr-core/test/J1/temp/solr.core.TestCoreDiscovery_1F4A980471D0D0E3-001/tempDir-003/core1'
   [junit4]   2> 1094198 INFO  (coreLoadExecutor-4746-thread-1-processing-x:core2) [    x:core2] o.a.s.c.SolrResourceLoader JNDI not configured for solr (NoInitialContextEx)
   [junit4]   2> 1094198 INFO  (coreLoadExecutor-4746-thread-1-processing-x:core2) [    x:core2] o.a.s.c.SolrResourceLoader using system property solr.solr.home: /export/home/jenkins/workspace/Lucene-Solr-master-Solaris/solr/build/solr-core/test/J1/temp/solr.core.TestCoreDiscovery_1F4A980471D0D0E3-001/tempDir-003
   [junit4]   2> 1094203 INFO  (coreLoadExecutor-4746-thread-1-processing-x:core2) [    x:core2] o.a.s.c.SolrConfig current version of requestparams : -1
   [junit4]   2> 1094204 WARN  (coreLoadExecutor-4746-thread-1-processing-x:core2) [    x:core2] o.a.s.c.Config Beginning with Solr 5.5, <mergePolicy> is deprecated, use <mergePolicyFactory> instead.
   [junit4]   2> 1094204 INFO  (coreLoadExecutor-4746-thread-1-processing-x:core2) [    x:core2] o.a.s.c.SolrConfig Using Lucene MatchVersion: 7.0.0
   [junit4]   2> 1094206 INFO  (coreLoadExecutor-4746-thread-1-processing-x:core2) [    x:core2] o.a.s.c.SolrConfig Loaded SolrConfig: solrconfig-minimal.xml
   [junit4]   2> 1094210 INFO  (coreLoadExecutor-4746-thread-1-processing-x:core2) [    x:core2] o.a.s.s.IndexSchema [core1] Schema name=tiny
   [junit4]   2> 1094211 INFO  (coreLoadExecutor-4746-thread-1-processing-x:core2) [    x:core2] o.a.s.s.IndexSchema unique key field: id
   [junit4]   2> 1094212 INFO  (coreLoadExecutor-4746-thread-1-processing-x:core2) [    x:core2] o.a.s.c.ConfigSetProperties Did not find ConfigSet properties, assuming default properties: Can't find resource 'configsetprops.json' in classpath or '/export/home/jenkins/workspace/Lucene-Solr-master-Solaris/solr/build/solr-core/test/J1/temp/solr.core.TestCoreDiscovery_1F4A980471D0D0E3-001/tempDir-003/core1'
   [junit4]   2> 1094212 INFO  (coreLoadExecutor-4746-thread-1-processing-x:core2) [    x:core2] o.a.s.c.CoreContainer Creating SolrCore 'core1' using configuration from instancedir /export/home/jenkins/workspace/Lucene-Solr-master-Solaris/solr/build/solr-core/test/J1/temp/solr.core.TestCoreDiscovery_1F4A980471D0D0E3-001/tempDir-003/core1
   [junit4]   2> 1094212 INFO  (coreLoadExecutor-4746-thread-1-processing-x:core2) [    x:core1] o.a.s.c.SolrCore org.apache.solr.core.MockDirectoryFactory
   [junit4]   2> 1094212 INFO  (coreLoadExecutor-4746-thread-1-processing-x:core2) [    x:core1] o.a.s.c.SolrCore [[core1] ] Opening new SolrCore at [/export/home/jenkins/workspace/Lucene-Solr-master-Solaris/solr/build/solr-core/test/J1/temp/solr.core.TestCoreDiscovery_1F4A980471D0D0E3-001/tempDir-003/core1], dataDir=[/export/home/jenkins/workspace/Lucene-Solr-master-Solaris/solr/build/solr-core/test/J1/temp/solr.core.TestCoreDiscovery_1F4A980471D0D0E3-001/tempDir-003/core1/stuffandnonsense/]
   [junit4]   2> 1094212 INFO  (coreLoadExecutor-4746-thread-1-processing-x:core2) [    x:core1] o.a.s.c.SolrCore JMX monitoring not detected for core: core1
   [junit4]   2> 1094213 INFO  (coreLoadExecutor-4746-thread-1-processing-x:core2) [    x:core1] o.a.s.c.CachingDirectoryFactory return new directory for /export/home/jenkins/workspace/Lucene-Solr-master-Solaris/solr/build/solr-core/test/J1/temp/solr.core.TestCoreDiscovery_1F4A980471D0D0E3-001/tempDir-003/core1/stuffandnonsense/snapshot_metadata
   [junit4]   2> 1094213 INFO  (coreLoadExecutor-4746-thread-1-processing-x:core2) [    x:core1] o.a.s.c.s.SolrSnapshotMetaDataManager Loading from snapshot metadata file...
   [junit4]   2> 1094213 INFO  (coreLoadExecutor-4746-thread-1-processing-x:core2) [    x:core1] o.a.s.c.CachingDirectoryFactory return new directory for /export/home/jenkins/workspace/Lucene-Solr-master-Solaris/solr/build/solr-core/test/J1/temp/solr.core.TestCoreDiscovery_1F4A980471D0D0E3-001/tempDir-003/core1/stuffandnonsense
   [junit4]   2> 1094214 INFO  (coreLoadExecutor-4746-thread-1-processing-x:core2) [    x:core1] o.a.s.c.SolrCore New index directory detected: old=null new=/export/home/jenkins/workspace/Lucene-Solr-master-Solaris/solr/build/solr-core/test/J1/temp/solr.core.TestCoreDiscovery_1F4A980471D0D0E3-001/tempDir-003/core1/stuffandnonsense/index/
   [junit4]   2> 1094214 WARN  (coreLoadExecutor-4746-thread-1-processing-x:core2) [    x:core1] o.a.s.c.SolrCore [core1] Solr index directory '/export/home/jenkins/workspace/Lucene-Solr-master-Solaris/solr/build/solr-core/test/J1/temp/solr.core.TestCoreDiscovery_1F4A980471D0D0E3-001/tempDir-003/core1/stuffandnonsense/index' doesn't exist. Creating new index...
   [junit4]   2> 1094214 INFO  (coreLoadExecutor-4746-thread-1-processing-x:core2) [    x:core1] o.a.s.c.CachingDirectoryFactory return new directory for /export/home/jenkins/workspace/Lucene-Solr-master-Solaris/solr/build/solr-core/test/J1/temp/solr.core.TestCoreDiscovery_1F4A980471D0D0E3-001/tempDir-003/core1/stuffandnonsense/index
   [junit4]   2> 1094214 INFO  (coreLoadExecutor-4746-thread-1-processing-x:core2) [    x:core1] o.a.s.u.RandomMergePolicy RandomMergePolicy wrapping class org.apache.lucene.index.LogDocMergePolicy: [LogDocMergePolicy: minMergeSize=1000, mergeFactor=15, maxMergeSize=9223372036854775807, maxMergeSizeForForcedMerge=9223372036854775807, calibrateSizeByDeletes=true, maxMergeDocs=2147483647, maxCFSSegmentSizeMB=8.796093022207999E12, noCFSRatio=0.6147528674320415]
   [junit4]   2> 1094214 INFO  (coreLoadExecutor-4746-thread-1-processing-x:core2) [    x:core1] o.a.s.c.SolrDeletionPolicy SolrDeletionPolicy.onCommit: commits: num=1
   [junit4]   2> 	commit{dir=MockDirectoryWrapper(RAMDirectory@28e2698 lockFactory=org.apache.lucene.store.SingleInstanceLockFactory@70eb2ec9),segFN=segments_1,generation=1}
   [junit4]   2> 1094214 INFO  (coreLoadExecutor-4746-thread-1-processing-x:core2) [    x:core1] o.a.s.c.SolrDeletionPolicy newest commit generation = 1
   [junit4]   2> 1094214 INFO  (OldIndexDirectoryCleanupThreadForCore-core1) [    x:core1] o.a.s.c.SolrCore Looking for old index directories to cleanup for core core1 in /export/home/jenkins/workspace/Lucene-Solr-master-Solaris/solr/build/solr-core/test/J1/temp/solr.core.TestCoreDiscovery_1F4A980471D0D0E3-001/tempDir-003/core1/stuffandnonsense/
   [junit4]   2> 1094215 WARN  (OldIndexDirectoryCleanupThreadForCore-core1) [    x:core1] o.a.s.c.DirectoryFactory /export/home/jenkins/workspace/Lucene-Solr-master-Solaris/solr/build/solr-core/test/J1/temp/solr.core.TestCoreDiscovery_1F4A980471D0D0E3-001/tempDir-003/core1/stuffandnonsense/ does not point to a valid data directory; skipping clean-up of old index directories.
   [junit4]   2> 1094216 INFO  (coreLoadExecutor-4746-thread-1-processing-x:core2) [    x:core1] o.a.s.c.SolrCore no updateRequestProcessorChain defined as default, creating implicit default
   [junit4]   2> 1094217 INFO  (coreLoadExecutor-4746-thread-1-processing-x:core2) [    x:core1] o.a.s.h.l.XMLLoader xsltCacheLifetimeSeconds=60
   [junit4]   2> 1094218 INFO  (coreLoadExecutor-4746-thread-1-processing-x:core2) [    x:core1] o.a.s.h.l.XMLLoader xsltCacheLifetimeSeconds=60
   [junit4]   2> 1094218 INFO  (coreLoadExecutor-4746-thread-1-processing-x:core2) [    x:core1] o.a.s.h.l.XMLLoader xsltCacheLifetimeSeconds=60
   [junit4]   2> 1094219 INFO  (coreLoadExecutor-4746-thread-1-processing-x:core2) [    x:core1] o.a.s.h.l.XMLLoader xsltCacheLifetimeSeconds=60
   [junit4]   2> 1094220 INFO  (coreLoadExecutor-4746-thread-1-processing-x:core2) [    x:core1] o.a.s.c.RequestHandlers Registered paths: /admin/mbeans,/update/json/docs,/admin/luke,/export,/get,/admin/properties,/update/json,/admin/threads,/update/csv,/sql,/graph,/select,/admin/segments,/admin/system,/replication,/config,/stream,/schema,/admin/plugins,/admin/logging,/admin/ping,/update,/admin/file,/terms
   [junit4]   2> 1094220 INFO  (coreLoadExecutor-4746-thread-1-processing-x:core2) [    x:core1] o.a.s.c.SolrCore Using default statsCache cache: org.apache.solr.search.stats.LocalStatsCache
   [junit4]   2> 1094220 INFO  (coreLoadExecutor-4746-thread-1-processing-x:core2) [    x:core1] o.a.s.u.CommitTracker Hard AutoCommit: disabled
   [junit4]   2> 1094220 INFO  (coreLoadExecutor-4746-thread-1-processing-x:core2) [    x:core1] o.a.s.u.CommitTracker Soft AutoCommit: disabled
   [junit4]   2> 1094220 INFO  (coreLoadExecutor-4746-thread-1-processing-x:core2) [    x:core1] o.a.s.u.RandomMergePolicy RandomMergePolicy wrapping class org.apache.lucene.index.TieredMergePolicy: [TieredMergePolicy: maxMergeAtOnce=16, maxMergeAtOnceExplicit=10, maxMergedSegmentMB=40.1298828125, floorSegmentMB=0.8740234375, forceMergeDeletesPctAllowed=26.50465237930048, segmentsPerTier=16.0, maxCFSSegmentSizeMB=8.796093022207999E12, noCFSRatio=1.0
   [junit4]   2> 1094221 INFO  (coreLoadExecutor-4746-thread-1-processing-x:core2) [    x:core1] o.a.s.c.SolrDeletionPolicy SolrDeletionPolicy.onInit: commits: num=1
   [junit4]   2> 	commit{dir=MockDirectoryWrapper(RAMDirectory@28e2698 lockFactory=org.apache.lucene.store.SingleInstanceLockFactory@70eb2ec9),segFN=segments_1,generation=1}
   [junit4]   2> 1094221 INFO  (coreLoadExecutor-4746-thread-1-processing-x:core2) [    x:core1] o.a.s.c.SolrDeletionPolicy newest commit generation = 1
   [junit4]   2> 1094221 INFO  (coreLoadExecutor-4746-thread-1-processing-x:core2) [    x:core1] o.a.s.s.SolrIndexSearcher Opening [Searcher@648f184f[core1] main]
   [junit4]   2> 1094221 INFO  (coreLoadExecutor-4746-thread-1-processing-x:core2) [    x:core1] o.a.s.r.ManagedResourceStorage File-based storage initialized to use dir: /export/home/jenkins/workspace/Lucene-Solr-master-Solaris/solr/build/solr-core/test/J1/temp/solr.core.TestCoreDiscovery_1F4A980471D0D0E3-001/tempDir-003/core1/conf
   [junit4]   2> 1094221 INFO  (coreLoadExecutor-4746-thread-1-processing-x:core2) [    x:core1] o.a.s.r.RestManager Initializing RestManager with initArgs: {storageDir=/export/home/jenkins/workspace/Lucene-Solr-master-Solaris/solr/build/solr-core/test/J1/temp/solr.core.TestCoreDiscovery_1F4A980471D0D0E3-001/tempDir-003/core1/conf}
   [junit4]   2> 1094221 INFO  (coreLoadExecutor-4746-thread-1-processing-x:core2) [    x:core1] o.a.s.r.ManagedResourceStorage Reading _rest_managed.json using file:dir=/export/home/jenkins/workspace/Lucene-Solr-master-Solaris/solr/build/solr-core/test/J1/temp/solr.core.TestCoreDiscovery_1F4A980471D0D0E3-001/tempDir-003/core1/conf
   [junit4]   2> 1094221 INFO  (coreLoadExecutor-4746-thread-1-processing-x:core2) [    x:core1] o.a.s.r.RestManager Initializing 0 registered ManagedResources
   [junit4]   2> 1094221 INFO  (coreLoadExecutor-4746-thread-1-processing-x:core2) [    x:core1] o.a.s.h.ReplicationHandler Commits will be reserved for  10000
   [junit4]   2> 1094221 INFO  (searcherExecutor-4747-thread-1-processing-x:core1) [    x:core1] o.a.s.c.SolrCore [core1] Registered new searcher Searcher@648f184f[core1] main{ExitableDirectoryReader(UninvertingDirectoryReader())}
   [junit4]   2> 1094221 INFO  (coreLoadExecutor-4746-thread-1-processing-x:core2) [    x:core1] o.a.s.c.CoreContainer registering core: core1
   [junit4]   2> 1094222 INFO  (TEST-TestCoreDiscovery.testNonCoreDirCantRead-seed#[1F4A980471D0D0E3]) [    x:core2] o.a.s.c.SolrResourceLoader new SolrResourceLoader for directory: '/export/home/jenkins/workspace/Lucene-Solr-master-Solaris/solr/build/solr-core/test/J1/temp/solr.core.TestCoreDiscovery_1F4A980471D0D0E3-001/tempDir-003/core2'
   [junit4]   2> 1094222 INFO  (TEST-TestCoreDiscovery.testNonCoreDirCantRead-seed#[1F4A980471D0D0E3]) [    x:core2] o.a.s.c.SolrResourceLoader JNDI not configured for solr (NoInitialContextEx)
   [junit4]   2> 1094222 INFO  (TEST-TestCoreDiscovery.testNonCoreDirCantRead-seed#[1F4A980471D0D0E3]) [    x:core2] o.a.s.c.SolrResourceLoader using system property solr.solr.home: /export/home/jenkins/workspace/Lucene-Solr-master-Solaris/solr/build/solr-core/test/J1/temp/solr.core.TestCoreDiscovery_1F4A980471D0D0E3-001/tempDir-003
   [junit4]   2> 1094227 INFO  (TEST-TestCoreDiscovery.testNonCoreDirCantRead-seed#[1F4A980471D0D0E3]) [    x:core2] o.a.s.c.SolrConfig current version of requestparams : -1
   [junit4]   2> 1094228 WARN  (TEST-TestCoreDiscovery.testNonCoreDirCantRead-seed#[1F4A980471D0D0E3]) [    x:core2] o.a.s.c.Config Beginning with Solr 5.5, <mergePolicy> is deprecated, use <mergePolicyFactory> instead.
   [junit4]   2> 1094229 INFO  (TEST-TestCoreDiscovery.testNonCoreDirCantRead-seed#[1F4A980471D0D0E3]) [    x:core2] o.a.s.c.SolrConfig Using Lucene MatchVersion: 7.0.0
   [junit4]   2> 1094232 INFO  (TEST-TestCoreDiscovery.testNonCoreDirCantRead-seed#[1F4A980471D0D0E3]) [    x:core2] o.a.s.c.SolrConfig Loaded SolrConfig: solrconfig-minimal.xml
   [junit4]   2> 1094234 INFO  (TEST-TestCoreDiscovery.testNonCoreDirCantRead-seed#[1F4A980471D0D0E3]) [    x:core2] o.a.s.s.IndexSchema [core2] Schema name=tiny
   [junit4]   2> 1094235 INFO  (TEST-TestCoreDiscovery.testNonCoreDirCantRead-seed#[1F4A980471D0D0E3]) [    x:core2] o.a.s.s.IndexSchema unique key field: id
   [junit4]   2> 1094237 INFO  (TEST-TestCoreDiscovery.testNonCoreDirCantRead-seed#[1F4A980471D0D0E3]) [    x:core2] o.a.s.c.ConfigSetProperties Did not find ConfigSet properties, assuming default properties: Can't find resource 'configsetprops.json' in classpath or '/export/home/jenkins/workspace/Lucene-Solr-master-Solaris/solr/build/solr-core/test/J1/temp/solr.core.TestCoreDiscovery_1F4A980471D0D0E3-001/tempDir-003/core2'
   [junit4]   2> 1094237 INFO  (TEST-TestCoreDiscovery.testNonCoreDirCantRead-seed#[1F4A980471D0D0E3]) [    x:core2] o.a.s.c.CoreContainer Creating SolrCore 'core2' using configuration from instancedir /export/home/jenkins/workspace/Lucene-Solr-master-Solaris/solr/build/solr-core/test/J1/temp/solr.core.TestCoreDiscovery_1F4A980471D0D0E3-001/tempDir-003/core2
   [junit4]   2> 1094237 INFO  (TEST-TestCoreDiscovery.testNonCoreDirCantRead-seed#[1F4A980471D0D0E3]) [    x:core2] o.a.s.c.SolrCore org.apache.solr.core.MockDirectoryFactory
   [junit4]   2> 1094237 INFO  (TEST-TestCoreDiscovery.testNonCoreDirCantRead-seed#[1F4A980471D0D0E3]) [    x:core2] o.a.s.c.SolrCore [[core2] ] Opening new SolrCore at [/export/home/jenkins/workspace/Lucene-Solr-master-Solaris/solr/build/solr-core/test/J1/temp/solr.core.TestCoreDiscovery_1F4A980471D0D0E3-001/tempDir-003/core2], dataDir=[/export/home/jenkins/workspace/Lucene-Solr-master-Solaris/solr/build/solr-core/test/J1/temp/solr.core.TestCoreDiscovery_1F4A980471D0D0E3-001/tempDir-003/core2/core2/]
   [junit4]   2> 1094237 INFO  (TEST-TestCoreDiscovery.testNonCoreDirCantRead-seed#[1F4A980471D0D0E3]) [    x:core2] o.a.s.c.SolrCore JMX monitoring not detected for core: core2
   [junit4]   2> 1094237 INFO  (TEST-TestCoreDiscovery.testNonCoreDirCantRead-seed#[1F4A980471D0D0E3]) [    x:core2] o.a.s.c.CachingDirectoryFactory return new directory for /export/home/jenkins/workspace/Lucene-Solr-master-Solaris/solr/build/solr-core/test/J1/temp/solr.core.TestCoreDiscovery_1F4A980471D0D0E3-001/tempDir-003/core2/core2/snapshot_metadata
   [junit4]   2> 1094238 INFO  (TEST-TestCoreDiscovery.testNonCoreDirCantRead-seed#[1F4A980471D0D0E3]) [    x:core2] o.a.s.c.s.SolrSnapshotMetaDataManager Loading from snapshot metadata file...
   [junit4]   2> 1094238 INFO  (TEST-TestCoreDiscovery.testNonCoreDirCantRead-seed#[1F4A980471D0D0E3]) [    x:core2] o.a.s.c.CachingDirectoryFactory return new directory for /export/home/jenkins/workspace/Lucene-Solr-master-Solaris/solr/build/solr-core/test/J1/temp/solr.core.TestCoreDiscovery_1F4A980471D0D0E3-001/tempDir-003/core2/core2
   [junit4]   2> 1094238 INFO  (TEST-TestCoreDiscovery.testNonCoreDirCantRead-seed#[1F4A980471D0D0E3]) [    x:core2] o.a.s.c.SolrCore New index directory detected: old=null new=/export/home/jenkins/workspace/Lucene-Solr-master-Solaris/solr/build/solr-core/test/J1/temp/solr.core.TestCoreDiscovery_1F4A980471D0D0E3-001/tempDir-003/core2/core2/index/
   [junit4]   2> 1094238 WARN  (TEST-TestCoreDiscovery.testNonCoreDirCantRead-seed#[1F4A980471D0D0E3]) [    x:core2] o.a.s.c.SolrCore [core2] Solr index directory '/export/home/jenkins/workspace/Lucene-Solr-master-Solaris/solr/build/solr-core/test/J1/temp/solr.core.TestCoreDiscovery_1F4A980471D0D0E3-001/tempDir-003/core2/core2/index' doesn't exist. Creating new index...
   [junit4]   2> 1094238 INFO  (TEST-TestCoreDiscovery.testNonCoreDirCantRead-seed#[1F4A980471D0D0E3]) [    x:core2] o.a.s.c.CachingDirectoryFactory return new directory for /export/home/jenkins/workspace/Lucene-Solr-master-Solaris/solr/build/solr-core/test/J1/temp/solr.core.TestCoreDiscovery_1F4A980471D0D0E3-001/tempDir-003/core2/core2/index
   [junit4]   2> 1094238 INFO  (TEST-TestCoreDiscovery.testNonCoreDirCantRead-seed#[1F4A980471D0D0E3]) [    x:core2] o.a.s.u.RandomMergePolicy RandomMergePolicy wrapping class org.apache.lucene.index.TieredMergePolicy: [TieredMergePolicy: maxMergeAtOnce=34, maxMergeAtOnceExplicit=15, maxMergedSegmentMB=49.134765625, floorSegmentMB=0.7451171875, forceMergeDeletesPctAllowed=23.960737730921775, segmentsPerTier=26.0, maxCFSSegmentSizeMB=8.796093022207999E12, noCFSRatio=0.7912438891824142
   [junit4]   2> 1094239 INFO  (TEST-TestCoreDiscovery.testNonCoreDirCantRead-seed#[1F4A980471D0D0E3]) [    x:core2] o.a.s.c.SolrDeletionPolicy SolrDeletionPolicy.onCommit: commits: num=1
   [junit4]   2> 	commit{dir=MockDirectoryWrapper(RAMDirectory@1697ec9f lockFactory=org.apache.lucene.store.SingleInstanceLockFactory@3362a064),segFN=segments_1,generation=1}
   [junit4]   2> 1094239 INFO  (TEST-TestCoreDiscovery.testNonCoreDirCantRead-seed#[1F4A980471D0D0E3]) [    x:core2] o.a.s.c.SolrDeletionPolicy newest commit generation = 1
   [junit4]   2> 1094239 INFO  (OldIndexDirectoryCleanupThreadForCore-core2) [    x:core2] o.a.s.c.SolrCore Looking for old index directories to cleanup for core core2 in /export/home/jenkins/workspace/Lucene-Solr-master-Solaris/solr/build/solr-core/test/J1/temp/solr.core.TestCoreDiscovery_1F4A980471D0D0E3-001/tempDir-003/core2/core2/
   [junit4]   2> 1094239 WARN  (OldIndexDirectoryCleanupThreadForCore-core2) [    x:core2] o.a.s.c.DirectoryFactory /export/home/jenkins/workspace/Lucene-Solr-master-Solaris/solr/build/solr-core/test/J1/temp/solr.core.TestCoreDiscovery_1F4A980471D0D0E3-001/tempDir-003/core2/core2/ does not point to a valid data directory; skipping clean-up of old index directories.
   [junit4]   2> 1094241 INFO  (TEST-TestCoreDiscovery.testNonCoreDirCantRead-seed#[1F4A980471D0D0E3]) [    x:core2] o.a.s.c.SolrCore no updateRequestProcessorChain defined as default, creating implicit default
   [junit4]   2> 1094242 INFO  (TEST-TestCoreDiscovery.testNonCoreDirCantRead-seed#[1F4A980471D0D0E3]) [    x:core2] o.a.s.h.l.XMLLoader xsltCacheLifetimeSeconds=60
   [junit4]   2> 1094243 INFO  (TEST-TestCoreDiscovery.testNonCoreDirCantRead-seed#[1F4A980471D0D0E3]) [    x:core2] o.a.s.h.l.XMLLoader xsltCacheLifetimeSeconds=60
   [junit4]   2> 1094243 INFO  (TEST-TestCoreDiscovery.testNonCoreDirCantRead-seed#[1F4A980471D0D0E3]) [    x:core2] o.a.s.h.l.XMLLoader xsltCacheLifetimeSeconds=60
   [junit4]   2> 1094244 INFO  (TEST-TestCoreDiscovery.testNonCoreDirCantRead-seed#[1F4A980471D0D0E3]) [    x:core2] o.a.s.h.l.XMLLoader xsltCacheLifetimeSeconds=60
   [junit4]   2> 1094245 INFO  (TEST-TestCoreDiscovery.testNonCoreDirCantRead-seed#[1F4A980471D0D0E3]) [    x:core2] o.a.s.c.RequestHandlers Registered paths: /admin/mbeans,/update/json/docs,/admin/luke,/export,/get,/admin/properties,/update/json,/admin/threads,/update/csv,/sql,/graph,/select,/admin/segments,/admin/system,/replication,/config,/stream,/schema,/admin/plugins,/admin/logging,/admin/ping,/update,/admin/file,/terms
   [junit4]   2> 1094245 INFO  (TEST-TestCoreDiscovery.testNonCoreDirCantRead-seed#[1F4A980471D0D0E3]) [    x:core2] o.a.s.c.SolrCore Using default statsCache cache: org.apache.solr.search.stats.LocalStatsCache
   [junit4]   2> 1094245 INFO  (TEST-TestCoreDiscovery.testNonCoreDirCantRead-seed#[1F4A980471D0D0E3]) [    x:core2] o.a.s.u.CommitTracker Hard AutoCommit: disabled
   [junit4]   2> 1094245 INFO  (TEST-TestCoreDiscovery.testNonCoreDirCantRead-seed#[1F4A980471D0D0E3]) [    x:core2] o.a.s.u.CommitTracker Soft AutoCommit: disabled
   [junit4]   2> 1094245 INFO  (TEST-TestCoreDiscovery.testNonCoreDirCantRead-seed#[1F4A980471D0D0E3]) [    x:core2] o.a.s.u.RandomMergePolicy RandomMergePolicy wrapping class org.apache.lucene.index.LogByteSizeMergePolicy: [LogByteSizeMergePolicy: minMergeSize=1677721, mergeFactor=38, maxMergeSize=2147483648, maxMergeSizeForForcedMerge=9223372036854775807, calibrateSizeByDeletes=false, maxMergeDocs=2147483647, maxCFSSegmentSizeMB=8.796093022207999E12, noCFSRatio=1.0]
   [junit4]   2> 1094246 INFO  (TEST-TestCoreDiscovery.testNonCoreDirCantRead-seed#[1F4A980471D0D0E3]) [    x:core2] o.a.s.c.SolrDeletionPolicy SolrDeletionPolicy.onInit: commits: num=1
   [junit4]   2> 	commit{dir=MockDirectoryWrapper(RAMDirectory@1697ec9f lockFactory=org.apache.lucene.store.SingleInstanceLockFactory@3362a064),segFN=segments_1,generation=1}
   [junit4]   2> 1094246 INFO  (TEST-TestCoreDiscovery.testNonCoreDirCantRead-seed#[1F4A980471D0D0E3]) [    x:core2] o.a.s.c.SolrDeletionPolicy newest commit generation = 1
   [junit4]   2> 1094246 INFO  (TEST-TestCoreDiscovery.testNonCoreDirCantRead-seed#[1F4A980471D0D0E3]) [    x:core2] o.a.s.s.SolrIndexSearcher Opening [Searcher@7d24679c[core2] main]
   [junit4]   2> 1094246 INFO  (TEST-TestCoreDiscovery.testNonCoreDirCantRead-seed#[1F4A980471D0D0E3]) [    x:core2] o.a.s.r.ManagedResourceStorage File-based storage initialized to use dir: /export/home/jenkins/workspace/Lucene-Solr-master-Solaris/solr/build/solr-core/test/J1/temp/solr.core.TestCoreDiscovery_1F4A980471D0D0E3-001/tempDir-003/core2/conf
   [junit4]   2> 1094246 INFO  (TEST-TestCoreDiscovery.testNonCoreDirCantRead-seed#[1F4A980471D0D0E3]) [    x:core2] o.a.s.r.RestManager Initializing RestManager with initArgs: {storageDir=/export/home/jenkins/workspace/Lucene-Solr-master-Solaris/solr/build/solr-core/test/J1/temp/solr.core.TestCoreDiscovery_1F4A980471D0D0E3-001/tempDir-003/core2/conf}
   [junit4]   2> 1094246 INFO  (TEST-TestCoreDiscovery.testNonCoreDirCantRead-seed#[1F4A980471D0D0E3]) [    x:core2] o.a.s.r.ManagedResourceStorage Reading _rest_managed.json using file:dir=/export/home/jenkins/workspace/Lucene-Solr-master-Solaris/solr/build/solr-core/test/J1/temp/solr.core.TestCoreDiscovery_1F4A980471D0D0E3-001/tempDir-003/core2/conf
   [junit4]   2> 1094246 INFO  (TEST-TestCoreDiscovery.testNonCoreDirCantRead-seed#[1F4A980471D0D0E3]) [    x:core2] o.a.s.r.RestManager Initializing 0 registered ManagedResources
   [junit4]   2> 1094246 INFO  (TEST-TestCoreDiscovery.testNonCoreDirCantRead-seed#[1F4A980471D0D0E3]) [    x:core2] o.a.s.h.ReplicationHandler Commits will be reserved for  10000
   [junit4]   2> 1094246 INFO  (searcherExecutor-4751-thread-1-processing-x:core2) [    x:core2] o.a.s.c.SolrCore [core2] Registered new searcher Searcher@7d24679c[core2] main{ExitableDirectoryReader(UninvertingDirectoryReader())}
   [junit4]   2> 1094246 INFO  (TEST-TestCoreDiscovery.testNonCoreDirCantRead-seed#[1F4A980471D0D0E3]) [    x:core2] o.a.s.c.CoreContainer registering core: core2
   [junit4]   2> 1094246 INFO  (TEST-TestCoreDiscovery.testNonCoreDirCantRead-seed#[1F4A980471D0D0E3]) [    x:core2] o.a.s.c.CoreContainer Shutting down CoreContainer instance=2071031081
   [junit4]   2> 1094248 INFO  (coreCloseExecutor-4755-thread-1-processing-x:core2) [    x:core1] o.a.s.c.SolrCore [core1]  CLOSING SolrCore org.apache.solr.core.SolrCore@cb87b99
   [junit4]   2> 1094248 INFO  (coreCloseExecutor-4755-thread-2-processing-x:core2) [    x:core2] o.a.s.c.SolrCore [core2]  CLOSING SolrCore org.apache.solr.core.SolrCore@10b8eb93
   [junit4]   2> 1094248 INFO  (coreCloseExecutor-4755-thread-1-processing-x:core2) [    x:core1] o.a.s.u.DirectUpdateHandler2 closing DirectUpdateHandler2{commits=0,autocommits=0,soft autocommits=0,optimizes=0,rollbacks=0,expungeDeletes=0,docsPending=0,adds=0,deletesById=0,deletesByQuery=0,errors=0,cumulative_adds=0,cumulative_deletesById=0,cumulative_deletesByQuery=0,cumulative_errors=0}
   [junit4]   2> 1094248 INFO  (coreCloseExecutor-4755-thread-2-processing-x:core2) [    x:core2] o.a.s.u.DirectUpdateHandler2 closing DirectUpdateHandler2{commits=0,autocommits=0,soft autocommits=0,optimizes=0,rollbacks=0,expungeDeletes=0,docsPending=0,adds=0,deletesById=0,deletesByQuery=0,errors=0,cumulative_adds=0,cumulative_deletesById=0,cumulative_deletesByQuery=0,cumulative_errors=0}
   [junit4]   2> 1094248 INFO  (coreCloseExecutor-4755-thread-1-processing-x:core2) [    x:core1] o.a.s.u.SolrCoreState Closing SolrCoreState
   [junit4]   2> 1094248 INFO  (coreCloseExecutor-4755-thread-2-processing-x:core2) [    x:core2] o.a.s.u.SolrCoreState Closing SolrCoreState
   [junit4]   2> 1094248 INFO  (coreCloseExecutor-4755-thread-1-processing-x:core2) [    x:core1] o.a.s.u.DefaultSolrCoreState SolrCoreState ref count has reached 0 - closing IndexWriter
   [junit4]   2> 1094248 INFO  (coreCloseExecutor-4755-thread-2-processing-x:core2) [    x:core2] o.a.s.u.DefaultSolrCoreState SolrCoreState ref count has reached 0 - closing IndexWriter
   [junit4]   2> 1094248 INFO  (coreCloseExecutor-4755-thread-1-processing-x:core2) [    x:core1] o.a.s.u.DefaultSolrCoreState closing IndexWriter with IndexWriterCloser
   [junit4]   2> 1094248 INFO  (coreCloseExecutor-4755-thread-2-processing-x:core2) [    x:core2] o.a.s.u.DefaultSolrCoreState closing IndexWriter with IndexWriterCloser
   [junit4]   2> 1094250 INFO  (coreCloseExecutor-4755-thread-1-processing-x:core2) [    x:core1] o.a.s.c.SolrCore [core1] Closing main searcher on request.
   [junit4]   2> 1094250 INFO  (coreCloseExecutor-4755-thread-1-processing-x:core2) [    x:core1] o.a.s.c.CachingDirectoryFactory Closing MockDirectoryFactory - 3 directories currently being tracked
   [junit4]   2> 1094250 INFO  (coreCloseExecutor-4755-thread-1-processing-x:core2) [    x:core1] o.a.s.c.CachingDirectoryFactory looking to close /export/home/jenkins/workspace/Lucene-Solr-master-Solaris/solr/build/solr-core/test/J1/temp/solr.core.TestCoreDiscovery_1F4A980471D0D0E3-001/tempDir-003/core1/stuffandnonsense [CachedDir<<refCount=0;path=/export/home/jenkins/workspace/Lucene-Solr-master-Solaris/solr/build/solr-core/test/J1/temp/solr.core.TestCoreDiscovery_1F4A980471D0D0E3-001/tempDir-003/core1/stuffandnonsense;done=false>>]
   [junit4]   2> 1094250 INFO  (coreCloseExecutor-4755-thread-2-processing-x:core2) [    x:core2] o.a.s.c.SolrCore [core2] Closing main searcher on request.
   [junit4]   2> 1094251 INFO  (coreCloseExecutor-4755-thread-2-processing-x:core2) [    x:core2] o.a.s.c.CachingDirectoryFactory Closing MockDirectoryFactory - 3 directories currently being tracked
   [junit4]   2> 1094251 INFO  (coreCloseExecutor-4755-thread-2-processing-x:core2) [    x:core2] o.a.s.c.CachingDirectoryFactory looking to close /export/home/jenkins/workspace/Lucene-Solr-master-Solaris/solr/build/solr-core/test/J1/temp/solr.core.TestCoreDiscovery_1F4A980471D0D0E3-001/tempDir-003/core2/core2/index [CachedDir<<refCount=0;path=/export/home/jenkins/workspace/Lucene-Solr-master-Solaris/solr/build/solr-core/test/J1/temp/solr.core.TestCoreDiscovery_1F4A980471D0D0E3-001/tempDir-003/core2/core2/index;done=false>>]
   [junit4]   2> 1094250 INFO  (coreCloseExecutor-4755-thread-1-processing-x:core2) [    x:core1] o.a.s.c.CachingDirectoryFactory Closing directory, CoreContainer#isShutdown=true
   [junit4]   2> 1094251 INFO  (coreCloseExecutor-4755-thread-2-processing-x:core2) [    x:core2] o.a.s.c.CachingDirectoryFactory Closing directory, CoreContainer#isShutdown=true
   [junit4]   2> 1094251 INFO  (coreCloseExecutor-4755-thread-1-processing-x:core2) [    x:core1] o.a.s.c.CachingDirectoryFactory Closing directory: /export/home/jenkins/workspace/Lucene-Solr-master-Solaris/solr/build/solr-core/test/J1/temp/solr.core.TestCoreDiscovery_1F4A980471D0D0E3-001/tempDir-003/core1/stuffandnonsense
   [junit4]   2> 1094251 INFO  (coreCloseExecutor-4755-thread-2-processing-x:core2) [    x:core2] o.a.s.c.CachingDirectoryFactory Closing directory: /export/home/jenkins/workspace/Lucene-Solr-master-Solaris/solr/build/solr-core/test/J1/temp/solr.core.TestCoreDiscovery_1F4A980471D0D0E3-001/tempDir-003/core2/core2/index
   [junit4]   2> 1094251 INFO  (coreCloseExecutor-4755-thread-1-processing-x:core2) [    x:core1] o.a.s.c.CachingDirectoryFactory looking to close /export/home/jenkins/workspace/Lucene-Solr-master-Solaris/solr/build/solr-core/test/J1/temp/solr.core.TestCoreDiscovery_1F4A980471D0D0E3-001/tempDir-003/core1/stuffandnonsense/snapshot_metadata [CachedDir<<refCount=0;path=/export/home/jenkins/workspace/Lucene-Solr-master-Solaris/solr/build/solr-core/test/J1/temp/solr.core.TestCoreDiscovery_1F4A980471D0D0E3-001/tempDir-003/core1/stuffandnonsense/snapshot_metadata;done=false>>]
   [junit4]   2> 1094251 INFO  (coreCloseExecutor-4755-thread-2-processing-x:core2) [    x:core2] o.a.s.c.CachingDirectoryFactory looking to close /export/home/jenkins/workspace/Lucene-Solr-master-Solaris/solr/build/solr-core/test/J1/temp/solr.core.TestCoreDiscovery_1F4A980471D0D0E3-001/tempDir-003/core2/core2 [CachedDir<<refCount=0;path=/export/home/jenkins/workspace/Lucene-Solr-master-Solaris/solr/build/solr-core/test/J1/temp/solr.core.TestCoreDiscovery_1F4A980471D0D0E3-001/tempDir-003/core2/core2;done=false>>]
   [junit4]   2> 1094251 INFO  (coreCloseExecutor-4755-thread-1-processing-x:core2) [    x:core1] o.a.s.c.CachingDirectoryFactory Closing directory, CoreContainer#isShutdown=true
   [junit4]   2> 1094251 INFO  (coreCloseExecutor-4755-thread-2-processing-x:core2) [    x:core2] o.a.s.c.CachingDirectoryFactory Closing directory, CoreContainer#isShutdown=true
   [junit4]   2> 1094251 INFO  (coreCloseExecutor-4755-thread-2-processing-x:core2) [    x:core2] o.a.s.c.CachingDirectoryFactory Closing directory: /export/home/jenkins/workspace/Lucene-Solr-master-Solaris/solr/build/solr-core/test/J1/temp/solr.core.TestCoreDiscovery_1F4A980471D0D0E3-001/tempDir-003/core2/core2
   [junit4]   2> 1094251 INFO  (coreCloseExecutor-4755-thread-2-processing-x:core2) [    x:core2] o.a.s.c.CachingDirectoryFactory looking to close /export/home/jenkins/workspace/Lucene-Solr-master-Solaris/solr/build/solr-core/test/J1/temp/solr.core.TestCoreDiscovery_1F4A980471D0D0E3-001/tempDir-003/core2/core2/snapshot_metadata [CachedDir<<refCount=0;path=/export/home/jenkins/workspace/Lucene-Solr-master-Solaris/solr/build/solr-core/test/J1/temp/solr.core.TestCoreDiscovery_1F4A980471D0D0E3-001/tempDir-003/core2/core2/snapshot_metadata;done=false>>]
   [junit4]   2> 1094251 INFO  (coreCloseExecutor-4755-thread-2-processing-x:core2) [    x:core2] o.a.s.c.CachingDirectoryFactory Closing directory, CoreContainer#isShutdown=true
   [junit4]   2> 1094251 INFO  (coreCloseExecutor-4755-thread-2-processing-x:core2) [    x:core2] o.a.s.c.CachingDirectoryFactory Closing directory: /export/home/jenkins/workspace/Lucene-Solr-master-Solaris/solr/build/solr-core/test/J1/temp/solr.core.TestCoreDiscovery_1F4A980471D0D0E3-001/tempDir-003/core2/core2/snapshot_metadata
   [junit4]   2> 1094251 INFO  (coreCloseExecutor-4755-thread-1-processing-x:core2) [    x:core1] o.a.s.c.CachingDirectoryFactory Closing directory: /export/home/jenkins/workspace/Lucene-Solr-master-Solaris/solr/build/solr-core/test/J1/temp/solr.core.TestCoreDiscovery_1F4A980471D0D0E3-001/tempDir-003/core1/stuffandnonsense/snapshot_metadata
   [junit4]   2> 1094252 INFO  (coreCloseExecutor-4755-thread-1-processing-x:core2) [    x:core1] o.a.s.c.CachingDirectoryFactory looking to close /export/home/jenkins/workspace/Lucene-Solr-master-Solaris/solr/build/solr-core/test/J1/temp/solr.core.TestCoreDiscovery_1F4A980471D0D0E3-001/tempDir-003/core1/stuffandnonsense/index [CachedDir<<refCount=0;path=/export/home/jenkins/workspace/Lucene-Solr-master-Solaris/solr/build/solr-core/test/J1/temp/solr.core.TestCoreDiscovery_1F4A980471D0D0E3-001/tempDir-003/core1/stuffandnonsense/index;done=false>>]
   [junit4]   2> 1094252 INFO  (coreCloseExecutor-4755-thread-1-processing-x:core2) [    x:core1] o.a.s.c.CachingDirectoryFactory Closing directory, CoreContainer#isShutdown=true
   [junit4]   2> 1094252 INFO  (coreCloseExecutor-4755-thread-1-processing-x:core2) [    x:core1] o.a.s.c.CachingDirectoryFactory Closing directory: /export/home/jenkins/workspace/Lucene-Solr-master-Solaris/solr/build/solr-core/test/J1/temp/solr.core.TestCoreDiscovery_1F4A980471D0D0E3-001/tempDir-003/core1/stuffandnonsense/index
   [junit4]   2> 1094253 INFO  (TEST-TestCoreDiscovery.testNonCoreDirCantRead-seed#[1F4A980471D0D0E3]) [    x:core2] o.a.s.SolrTestCaseJ4 ###Ending testNonCoreDirCantRead
   [junit4]   2> 1094256 INFO  (TEST-TestCoreDiscovery.testAlternateRelativeCoreDir-seed#[1F4A980471D0D0E3]) [    x:core2] o.a.s.SolrTestCaseJ4 ###Starting testAlternateRelativeCoreDir
   [junit4]   2> 1094262 INFO  (TEST-TestCoreDiscovery.testAlternateRelativeCoreDir-seed#[1F4A980471D0D0E3]) [    x:core2] o.a.s.c.SolrResourceLoader JNDI not configured for solr (NoInitialContextEx)
   [junit4]   2> 1094262 INFO  (TEST-TestCoreDiscovery.testAlternateRelativeCoreDir-seed#[1F4A980471D0D0E3]) [    x:core2] o.a.s.c.SolrResourceLoader using system property solr.solr.home: /export/home/jenkins/workspace/Lucene-Solr-master-Solaris/solr/build/solr-core/test/J1/temp/solr.core.TestCoreDiscovery_1F4A980471D0D0E3-001/tempDir-004
   [junit4]   2> 1094263 INFO  (TEST-TestCoreDiscovery.testAlternateRelativeCoreDir-seed#[1F4A980471D0D0E3]) [    x:core2] o.a.s.c.SolrResourceLoader new SolrResourceLoader for directory: '/export/home/jenkins/workspace/Lucene-Solr-master-Solaris/solr/build/solr-core/test/J1/temp/solr.core.TestCoreDiscovery_1F4A980471D0D0E3-001/tempDir-004'
   [junit4]   2> 1094263 INFO  (TEST-TestCoreDiscovery.testAlternateRelativeCoreDir-seed#[1F4A980471D0D0E3]) [    x:core2] o.a.s.c.SolrResourceLoader JNDI not configured for solr (NoInitialContextEx)
   [junit4]   2> 1094263 INFO  (TEST-TestCoreDiscovery.testAlternateRelativeCoreDir-seed#[1F4A980471D0D0E3]) [    x:core2] o.a.s.c.SolrResourceLoader using system property solr.solr.home: /export/home/jenkins/workspace/Lucene-Solr-master-Solaris/solr/build/solr-core/test/J1/temp/solr.core.TestCoreDiscovery_1F4A980471D0D0E3-001/tempDir-004
   [junit4]   2> 1094263 INFO  (TEST-TestCoreDiscovery.testAlternateRelativeCoreDir-seed#[1F4A980471D0D0E3]) [    x:core2] o.a.s.c.SolrXmlConfig Loading container configuration from /export/home/jenkins/workspace/Lucene-Solr-master-Solaris/solr/build/solr-core/test/J1/temp/solr.core.TestCoreDiscovery_1F4A980471D0D0E3-001/tempDir-004/solr.xml
   [junit4]   2> 1094267 INFO  (TEST-TestCoreDiscovery.testAlternateRelativeCoreDir-seed#[1F4A980471D0D0E3]) [    x:core2] o.a.s.c.CorePropertiesLocator Config-defined core root directory: /export/home/jenkins/workspace/Lucene-Solr-master-Solaris/solr/build/solr-core/test/J1/temp/solr.core.TestCoreDiscovery_1F4A980471D0D0E3-001/tempDir-004/relativeCoreDir
   [junit4]   2> 1094267 INFO  (TEST-TestCoreDiscovery.testAlternateRelati

[...truncated too long message...]

AfterMaxFailures$1.evaluate(TestRuleIgnoreAfterMaxFailures.java:64)
   [junit4]   2> 	at org.apache.lucene.util.TestRuleIgnoreTestSuites$1.evaluate(TestRuleIgnoreTestSuites.java:54)
   [junit4]   2> 	at com.carrotsearch.randomizedtesting.rules.StatementAdapter.evaluate(StatementAdapter.java:36)
   [junit4]   2> 	at com.carrotsearch.randomizedtesting.ThreadLeakControl$StatementRunner.run(ThreadLeakControl.java:367)
   [junit4]   2> 	at java.lang.Thread.run(Thread.java:745)
   [junit4]   2> 
   [junit4]   2> Sep 09, 2016 5:08:34 AM com.carrotsearch.randomizedtesting.ThreadLeakControl checkThreadLeaks
   [junit4]   2> WARNING: Will linger awaiting termination of 1 leaked thread(s).
   [junit4]   2> Sep 09, 2016 5:08:54 AM com.carrotsearch.randomizedtesting.ThreadLeakControl checkThreadLeaks
   [junit4]   2> SEVERE: 1 thread leaked from SUITE scope at org.apache.solr.core.TestCoreDiscovery: 
   [junit4]   2>    1) Thread[id=10524, name=searcherExecutor-4839-thread-1, state=WAITING, group=TGRP-TestCoreDiscovery]
   [junit4]   2>         at sun.misc.Unsafe.park(Native Method)
   [junit4]   2>         at java.util.concurrent.locks.LockSupport.park(LockSupport.java:175)
   [junit4]   2>         at java.util.concurrent.locks.AbstractQueuedSynchronizer$ConditionObject.await(AbstractQueuedSynchronizer.java:2039)
   [junit4]   2>         at java.util.concurrent.LinkedBlockingQueue.take(LinkedBlockingQueue.java:442)
   [junit4]   2>         at java.util.concurrent.ThreadPoolExecutor.getTask(ThreadPoolExecutor.java:1067)
   [junit4]   2>         at java.util.concurrent.ThreadPoolExecutor.runWorker(ThreadPoolExecutor.java:1127)
   [junit4]   2>         at java.util.concurrent.ThreadPoolExecutor$Worker.run(ThreadPoolExecutor.java:617)
   [junit4]   2>         at java.lang.Thread.run(Thread.java:745)
   [junit4]   2> Sep 09, 2016 5:08:54 AM com.carrotsearch.randomizedtesting.ThreadLeakControl tryToInterruptAll
   [junit4]   2> INFO: Starting to interrupt leaked threads:
   [junit4]   2>    1) Thread[id=10524, name=searcherExecutor-4839-thread-1, state=WAITING, group=TGRP-TestCoreDiscovery]
   [junit4]   2> Sep 09, 2016 5:08:57 AM com.carrotsearch.randomizedtesting.ThreadLeakControl tryToInterruptAll
   [junit4]   2> SEVERE: There are still zombie threads that couldn't be terminated:
   [junit4]   2>    1) Thread[id=10524, name=searcherExecutor-4839-thread-1, state=WAITING, group=TGRP-TestCoreDiscovery]
   [junit4]   2>         at sun.misc.Unsafe.park(Native Method)
   [junit4]   2>         at java.util.concurrent.locks.LockSupport.park(LockSupport.java:175)
   [junit4]   2>         at java.util.concurrent.locks.AbstractQueuedSynchronizer$ConditionObject.await(AbstractQueuedSynchronizer.java:2039)
   [junit4]   2>         at java.util.concurrent.LinkedBlockingQueue.take(LinkedBlockingQueue.java:442)
   [junit4]   2>         at java.util.concurrent.ThreadPoolExecutor.getTask(ThreadPoolExecutor.java:1067)
   [junit4]   2>         at java.util.concurrent.ThreadPoolExecutor.runWorker(ThreadPoolExecutor.java:1127)
   [junit4]   2>         at java.util.concurrent.ThreadPoolExecutor$Worker.run(ThreadPoolExecutor.java:617)
   [junit4]   2>         at java.lang.Thread.run(Thread.java:745)
   [junit4]   2> NOTE: test params are: codec=Asserting(Lucene62): {}, docValues:{}, maxPointsInLeafNode=1711, maxMBSortInHeap=5.393407023289744, sim=RandomSimilarity(queryNorm=false): {}, locale=es-HN, timezone=Australia/South
   [junit4]   2> NOTE: SunOS 5.11 amd64/Oracle Corporation 1.8.0_102 (64-bit)/cpus=3,threads=2,free=206229608,total=536870912
   [junit4]   2> NOTE: All tests run in this JVM: [TestCloudPseudoReturnFields, TestMiniSolrCloudCluster, TestDFRSimilarityFactory, TestManagedResourceStorage, TestNumericTerms64, HdfsTlogReplayBufferedWhileIndexingTest, RollingRestartTest, TestOmitPositions, OverriddenZkACLAndCredentialsProvidersTest, TestOrdValues, TestJmxMonitoredMap, SolrInfoMBeanTest, CoreAdminHandlerTest, ConnectionManagerTest, RemoteQueryErrorTest, LukeRequestHandlerTest, MultiThreadedOCPTest, TestDocSet, TestCloudSchemaless, TestAuthorizationFramework, TestSolrFieldCacheMBean, TestSSLRandomization, DateMathParserTest, DebugComponentTest, TestSolrCloudWithKerberosAlt, DirectUpdateHandlerOptimizeTest, TestReload, TestQueryUtils, TestQuerySenderNoQuery, TestExpandComponent, GraphQueryTest, DirectoryFactoryTest, SpellingQueryConverterTest, TestConfigReload, TestGraphMLResponseWriter, AddSchemaFieldsUpdateProcessorFactoryTest, OverseerModifyCollectionTest, DistributedFacetExistsSmallTest, TestFoldingMultitermQuery, CoreAdminCreateDiscoverTest, CachingDirectoryFactoryTest, TestIndexSearcher, TestTrie, TestConfigSetsAPIZkFailure, TestFastWriter, CurrencyFieldOpenExchangeTest, SolrCoreCheckLockOnStartupTest, PeerSyncReplicationTest, TestDocTermOrds, TestGraphTermsQParserPlugin, TestInitParams, BadCopyFieldTest, TestBadConfig, TestRebalanceLeaders, TestRawTransformer, FieldMutatingUpdateProcessorTest, TestSubQueryTransformer, TlogReplayBufferedWhileIndexingTest, CloudMLTQParserTest, TestConfigSetImmutable, TestSearcherReuse, TermVectorComponentTest, DistanceFunctionTest, AsyncCallRequestStatusResponseTest, TestBulkSchemaAPI, TestReversedWildcardFilterFactory, TestDocBasedVersionConstraints, DeleteReplicaTest, TestPHPSerializedResponseWriter, TestDistribIDF, BlockJoinFacetRandomTest, DistributedQueryComponentCustomSortTest, SortByFunctionTest, HdfsBasicDistributedZkTest, BasicAuthIntegrationTest, ClusterStateTest, UpdateParamsTest, DistributedDebugComponentTest, SuggestComponentTest, HdfsDirectoryFactoryTest, TestUseDocValuesAsStored2, FullHLLTest, SolrIndexConfigTest, LeaderInitiatedRecoveryOnShardRestartTest, SolrIndexSplitterTest, AddBlockUpdateTest, TestExclusionRuleCollectionAccess, CollectionsAPIAsyncDistributedZkTest, TestTrackingShardHandlerFactory, ChangedSchemaMergeTest, OpenCloseCoreStressTest, EchoParamsTest, CollectionStateFormat2Test, TestSmileRequest, TestSortingResponseWriter, UUIDUpdateProcessorFallbackTest, TestClusterStateMutator, ScriptEngineTest, UpdateRequestProcessorFactoryTest, TestClassicSimilarityFactory, TestLMJelinekMercerSimilarityFactory, UUIDFieldTest, TestLeaderElectionZkExpiry, StatsComponentTest, DeleteLastCustomShardedReplicaTest, TestExactStatsCache, TestSizeLimitedDistributedMap, TestSystemIdResolver, SharedFSAutoReplicaFailoverTest, TestDistributedMissingSort, TestMiniSolrCloudClusterSSL, TestSchemaSimilarityResource, TestSchemaNameResource, HighlighterConfigTest, TestSuggestSpellingConverter, TestLegacyFieldCache, TestRuleBasedAuthorizationPlugin, TestValueSourceCache, BasicDistributedZk2Test, HdfsWriteToMultipleCollectionsTest, TestSolrConfigHandler, SimpleCollectionCreateDeleteTest, MinimalSchemaTest, TestLMDirichletSimilarityFactory, TestRandomFlRTGCloud, TestSolrDeletionPolicy2, RegexBoostProcessorTest, TestJsonFacets, TestCoreDiscovery]
   [junit4]   2> NOTE: reproduce with: ant test  -Dtestcase=TestCoreDiscovery -Dtests.seed=1F4A980471D0D0E3 -Dtests.slow=true -Dtests.locale=es-HN -Dtests.timezone=Australia/South -Dtests.asserts=true -Dtests.file.encoding=UTF-8
   [junit4] ERROR   0.00s J1 | TestCoreDiscovery (suite) <<<
   [junit4]    > Throwable #1: java.lang.AssertionError: ObjectTracker found 5 object(s) that were not released!!! [MockDirectoryWrapper, SolrCore, MDCAwareThreadPoolExecutor, MockDirectoryWrapper, MockDirectoryWrapper]
   [junit4]    > 	at __randomizedtesting.SeedInfo.seed([1F4A980471D0D0E3]:0)
   [junit4]    > 	at org.apache.solr.SolrTestCaseJ4.teardownTestCases(SolrTestCaseJ4.java:257)
   [junit4]    > 	at java.lang.Thread.run(Thread.java:745)Throwable #2: com.carrotsearch.randomizedtesting.ThreadLeakError: 1 thread leaked from SUITE scope at org.apache.solr.core.TestCoreDiscovery: 
   [junit4]    >    1) Thread[id=10524, name=searcherExecutor-4839-thread-1, state=WAITING, group=TGRP-TestCoreDiscovery]
   [junit4]    >         at sun.misc.Unsafe.park(Native Method)
   [junit4]    >         at java.util.concurrent.locks.LockSupport.park(LockSupport.java:175)
   [junit4]    >         at java.util.concurrent.locks.AbstractQueuedSynchronizer$ConditionObject.await(AbstractQueuedSynchronizer.java:2039)
   [junit4]    >         at java.util.concurrent.LinkedBlockingQueue.take(LinkedBlockingQueue.java:442)
   [junit4]    >         at java.util.concurrent.ThreadPoolExecutor.getTask(ThreadPoolExecutor.java:1067)
   [junit4]    >         at java.util.concurrent.ThreadPoolExecutor.runWorker(ThreadPoolExecutor.java:1127)
   [junit4]    >         at java.util.concurrent.ThreadPoolExecutor$Worker.run(ThreadPoolExecutor.java:617)
   [junit4]    >         at java.lang.Thread.run(Thread.java:745)
   [junit4]    > 	at __randomizedtesting.SeedInfo.seed([1F4A980471D0D0E3]:0)Throwable #3: com.carrotsearch.randomizedtesting.ThreadLeakError: There are still zombie threads that couldn't be terminated:
   [junit4]    >    1) Thread[id=10524, name=searcherExecutor-4839-thread-1, state=WAITING, group=TGRP-TestCoreDiscovery]
   [junit4]    >         at sun.misc.Unsafe.park(Native Method)
   [junit4]    >         at java.util.concurrent.locks.LockSupport.park(LockSupport.java:175)
   [junit4]    >         at java.util.concurrent.locks.AbstractQueuedSynchronizer$ConditionObject.await(AbstractQueuedSynchronizer.java:2039)
   [junit4]    >         at java.util.concurrent.LinkedBlockingQueue.take(LinkedBlockingQueue.java:442)
   [junit4]    >         at java.util.concurrent.ThreadPoolExecutor.getTask(ThreadPoolExecutor.java:1067)
   [junit4]    >         at java.util.concurrent.ThreadPoolExecutor.runWorker(ThreadPoolExecutor.java:1127)
   [junit4]    >         at java.util.concurrent.ThreadPoolExecutor$Worker.run(ThreadPoolExecutor.java:617)
   [junit4]    >         at java.lang.Thread.run(Thread.java:745)
   [junit4]    > 	at __randomizedtesting.SeedInfo.seed([1F4A980471D0D0E3]:0)
   [junit4] Completed [238/631 (1!)] on J1 in 145.43s, 12 tests, 1 failure, 2 errors <<< FAILURES!

[...truncated 61452 lines...]


Mime
View raw message