lucene-dev mailing list archives

Site index · List index
Message view « Date » · « Thread »
Top « Date » · « Thread »
From Policeman Jenkins Server <jenk...@thetaphi.de>
Subject [JENKINS] Lucene-Solr-master-Windows (32bit/jdk1.8.0_102) - Build # 6123 - Still Unstable!
Date Sat, 17 Sep 2016 20:51:44 GMT
Build: http://jenkins.thetaphi.de/job/Lucene-Solr-master-Windows/6123/
Java: 32bit/jdk1.8.0_102 -client -XX:+UseSerialGC

1 tests failed.
FAILED:  org.apache.solr.cloud.TestSolrCloudWithDelegationTokens.testDelegationTokenCancelFail

Error Message:
expected:<200> but was:<404>

Stack Trace:
java.lang.AssertionError: expected:<200> but was:<404>
	at __randomizedtesting.SeedInfo.seed([7ED9EC9E3B1A767A:1666D9B4EB806496]:0)
	at org.junit.Assert.fail(Assert.java:93)
	at org.junit.Assert.failNotEquals(Assert.java:647)
	at org.junit.Assert.assertEquals(Assert.java:128)
	at org.junit.Assert.assertEquals(Assert.java:472)
	at org.junit.Assert.assertEquals(Assert.java:456)
	at org.apache.solr.cloud.TestSolrCloudWithDelegationTokens.cancelDelegationToken(TestSolrCloudWithDelegationTokens.java:137)
	at org.apache.solr.cloud.TestSolrCloudWithDelegationTokens.testDelegationTokenCancelFail(TestSolrCloudWithDelegationTokens.java:282)
	at sun.reflect.NativeMethodAccessorImpl.invoke0(Native Method)
	at sun.reflect.NativeMethodAccessorImpl.invoke(NativeMethodAccessorImpl.java:62)
	at sun.reflect.DelegatingMethodAccessorImpl.invoke(DelegatingMethodAccessorImpl.java:43)
	at java.lang.reflect.Method.invoke(Method.java:498)
	at com.carrotsearch.randomizedtesting.RandomizedRunner.invoke(RandomizedRunner.java:1764)
	at com.carrotsearch.randomizedtesting.RandomizedRunner$8.evaluate(RandomizedRunner.java:871)
	at com.carrotsearch.randomizedtesting.RandomizedRunner$9.evaluate(RandomizedRunner.java:907)
	at com.carrotsearch.randomizedtesting.RandomizedRunner$10.evaluate(RandomizedRunner.java:921)
	at com.carrotsearch.randomizedtesting.rules.SystemPropertiesRestoreRule$1.evaluate(SystemPropertiesRestoreRule.java:57)
	at org.apache.lucene.util.TestRuleSetupTeardownChained$1.evaluate(TestRuleSetupTeardownChained.java:49)
	at org.apache.lucene.util.AbstractBeforeAfterRule$1.evaluate(AbstractBeforeAfterRule.java:45)
	at org.apache.lucene.util.TestRuleThreadAndTestName$1.evaluate(TestRuleThreadAndTestName.java:48)
	at org.apache.lucene.util.TestRuleIgnoreAfterMaxFailures$1.evaluate(TestRuleIgnoreAfterMaxFailures.java:64)
	at org.apache.lucene.util.TestRuleMarkFailure$1.evaluate(TestRuleMarkFailure.java:47)
	at com.carrotsearch.randomizedtesting.rules.StatementAdapter.evaluate(StatementAdapter.java:36)
	at com.carrotsearch.randomizedtesting.ThreadLeakControl$StatementRunner.run(ThreadLeakControl.java:367)
	at com.carrotsearch.randomizedtesting.ThreadLeakControl.forkTimeoutingTask(ThreadLeakControl.java:809)
	at com.carrotsearch.randomizedtesting.ThreadLeakControl$3.evaluate(ThreadLeakControl.java:460)
	at com.carrotsearch.randomizedtesting.RandomizedRunner.runSingleTest(RandomizedRunner.java:880)
	at com.carrotsearch.randomizedtesting.RandomizedRunner$5.evaluate(RandomizedRunner.java:781)
	at com.carrotsearch.randomizedtesting.RandomizedRunner$6.evaluate(RandomizedRunner.java:816)
	at com.carrotsearch.randomizedtesting.RandomizedRunner$7.evaluate(RandomizedRunner.java:827)
	at com.carrotsearch.randomizedtesting.rules.StatementAdapter.evaluate(StatementAdapter.java:36)
	at com.carrotsearch.randomizedtesting.rules.SystemPropertiesRestoreRule$1.evaluate(SystemPropertiesRestoreRule.java:57)
	at org.apache.lucene.util.AbstractBeforeAfterRule$1.evaluate(AbstractBeforeAfterRule.java:45)
	at com.carrotsearch.randomizedtesting.rules.StatementAdapter.evaluate(StatementAdapter.java:36)
	at org.apache.lucene.util.TestRuleStoreClassName$1.evaluate(TestRuleStoreClassName.java:41)
	at com.carrotsearch.randomizedtesting.rules.NoShadowingOrOverridesOnMethodsRule$1.evaluate(NoShadowingOrOverridesOnMethodsRule.java:40)
	at com.carrotsearch.randomizedtesting.rules.NoShadowingOrOverridesOnMethodsRule$1.evaluate(NoShadowingOrOverridesOnMethodsRule.java:40)
	at com.carrotsearch.randomizedtesting.rules.StatementAdapter.evaluate(StatementAdapter.java:36)
	at com.carrotsearch.randomizedtesting.rules.StatementAdapter.evaluate(StatementAdapter.java:36)
	at com.carrotsearch.randomizedtesting.rules.StatementAdapter.evaluate(StatementAdapter.java:36)
	at org.apache.lucene.util.TestRuleAssertionsRequired$1.evaluate(TestRuleAssertionsRequired.java:53)
	at org.apache.lucene.util.TestRuleMarkFailure$1.evaluate(TestRuleMarkFailure.java:47)
	at org.apache.lucene.util.TestRuleIgnoreAfterMaxFailures$1.evaluate(TestRuleIgnoreAfterMaxFailures.java:64)
	at org.apache.lucene.util.TestRuleIgnoreTestSuites$1.evaluate(TestRuleIgnoreTestSuites.java:54)
	at com.carrotsearch.randomizedtesting.rules.StatementAdapter.evaluate(StatementAdapter.java:36)
	at com.carrotsearch.randomizedtesting.ThreadLeakControl$StatementRunner.run(ThreadLeakControl.java:367)
	at java.lang.Thread.run(Thread.java:745)




Build Log:
[...truncated 12077 lines...]
   [junit4] Suite: org.apache.solr.cloud.TestSolrCloudWithDelegationTokens
   [junit4]   2> Creating dataDir: C:\Users\jenkins\workspace\Lucene-Solr-master-Windows\solr\build\solr-core\test\J1\temp\solr.cloud.TestSolrCloudWithDelegationTokens_7ED9EC9E3B1A767A-001\init-core-data-001
   [junit4]   2> 3084787 INFO  (SUITE-TestSolrCloudWithDelegationTokens-seed#[7ED9EC9E3B1A767A]-worker) [    ] o.a.s.SolrTestCaseJ4 Randomized ssl (false) and clientAuth (false) via: @org.apache.solr.util.RandomizeSSL(reason=, value=NaN, ssl=NaN, clientAuth=NaN)
   [junit4]   2> 3084789 INFO  (SUITE-TestSolrCloudWithDelegationTokens-seed#[7ED9EC9E3B1A767A]-worker) [    ] o.a.s.c.ZkTestServer STARTING ZK TEST SERVER
   [junit4]   2> 3084790 INFO  (Thread-5424) [    ] o.a.s.c.ZkTestServer client port:0.0.0.0/0.0.0.0:0
   [junit4]   2> 3084790 INFO  (Thread-5424) [    ] o.a.s.c.ZkTestServer Starting server
   [junit4]   2> 3084891 INFO  (SUITE-TestSolrCloudWithDelegationTokens-seed#[7ED9EC9E3B1A767A]-worker) [    ] o.a.s.c.ZkTestServer start zk server on port:51307
   [junit4]   2> 3084891 INFO  (SUITE-TestSolrCloudWithDelegationTokens-seed#[7ED9EC9E3B1A767A]-worker) [    ] o.a.s.c.c.SolrZkClient Using default ZkCredentialsProvider
   [junit4]   2> 3084892 INFO  (SUITE-TestSolrCloudWithDelegationTokens-seed#[7ED9EC9E3B1A767A]-worker) [    ] o.a.s.c.c.ConnectionManager Waiting for client to connect to ZooKeeper
   [junit4]   2> 3084897 INFO  (zkCallback-3869-thread-1) [    ] o.a.s.c.c.ConnectionManager Watcher org.apache.solr.common.cloud.ConnectionManager@1b444bf name:ZooKeeperConnection Watcher:127.0.0.1:51307 got event WatchedEvent state:SyncConnected type:None path:null path:null type:None
   [junit4]   2> 3084897 INFO  (SUITE-TestSolrCloudWithDelegationTokens-seed#[7ED9EC9E3B1A767A]-worker) [    ] o.a.s.c.c.ConnectionManager Client is connected to ZooKeeper
   [junit4]   2> 3084897 INFO  (SUITE-TestSolrCloudWithDelegationTokens-seed#[7ED9EC9E3B1A767A]-worker) [    ] o.a.s.c.c.SolrZkClient Using default ZkACLProvider
   [junit4]   2> 3084897 INFO  (SUITE-TestSolrCloudWithDelegationTokens-seed#[7ED9EC9E3B1A767A]-worker) [    ] o.a.s.c.c.SolrZkClient makePath: /solr/solr.xml
   [junit4]   2> 3084903 INFO  (jetty-launcher-3868-thread-1) [    ] o.e.j.s.Server jetty-9.3.8.v20160314
   [junit4]   2> 3084904 INFO  (jetty-launcher-3868-thread-1) [    ] o.e.j.s.h.ContextHandler Started o.e.j.s.ServletContextHandler@57d191{/solr,null,AVAILABLE}
   [junit4]   2> 3084905 INFO  (jetty-launcher-3868-thread-2) [    ] o.e.j.s.Server jetty-9.3.8.v20160314
   [junit4]   2> 3084905 INFO  (jetty-launcher-3868-thread-2) [    ] o.e.j.s.h.ContextHandler Started o.e.j.s.ServletContextHandler@1ffb58a{/solr,null,AVAILABLE}
   [junit4]   2> 3084906 INFO  (jetty-launcher-3868-thread-1) [    ] o.e.j.s.ServerConnector Started ServerConnector@1827fbf{HTTP/1.1,[http/1.1]}{127.0.0.1:51311}
   [junit4]   2> 3084906 INFO  (jetty-launcher-3868-thread-1) [    ] o.e.j.s.Server Started @3088578ms
   [junit4]   2> 3084906 INFO  (jetty-launcher-3868-thread-1) [    ] o.a.s.c.s.e.JettySolrRunner Jetty properties: {hostContext=/solr, hostPort=51311}
   [junit4]   2> 3084906 INFO  (jetty-launcher-3868-thread-2) [    ] o.e.j.s.ServerConnector Started ServerConnector@686df4{HTTP/1.1,[http/1.1]}{127.0.0.1:51314}
   [junit4]   2> 3084906 INFO  (jetty-launcher-3868-thread-1) [    ] o.a.s.s.SolrDispatchFilter SolrDispatchFilter.init(): sun.misc.Launcher$AppClassLoader@1d16e93
   [junit4]   2> 3084906 INFO  (jetty-launcher-3868-thread-2) [    ] o.e.j.s.Server Started @3088579ms
   [junit4]   2> 3084906 INFO  (jetty-launcher-3868-thread-2) [    ] o.a.s.c.s.e.JettySolrRunner Jetty properties: {hostContext=/solr, hostPort=51314}
   [junit4]   2> 3084907 INFO  (jetty-launcher-3868-thread-1) [    ] o.a.s.c.SolrResourceLoader new SolrResourceLoader for directory: 'C:\Users\jenkins\workspace\Lucene-Solr-master-Windows\solr\build\solr-core\test\J1\temp\solr.cloud.TestSolrCloudWithDelegationTokens_7ED9EC9E3B1A767A-001\tempDir-001\node1'
   [junit4]   2> 3084907 INFO  (jetty-launcher-3868-thread-2) [    ] o.a.s.s.SolrDispatchFilter SolrDispatchFilter.init(): sun.misc.Launcher$AppClassLoader@1d16e93
   [junit4]   2> 3084907 INFO  (jetty-launcher-3868-thread-1) [    ] o.a.s.c.SolrResourceLoader JNDI not configured for solr (NoInitialContextEx)
   [junit4]   2> 3084907 INFO  (jetty-launcher-3868-thread-2) [    ] o.a.s.c.SolrResourceLoader new SolrResourceLoader for directory: 'C:\Users\jenkins\workspace\Lucene-Solr-master-Windows\solr\build\solr-core\test\J1\temp\solr.cloud.TestSolrCloudWithDelegationTokens_7ED9EC9E3B1A767A-001\tempDir-001\node2'
   [junit4]   2> 3084907 INFO  (jetty-launcher-3868-thread-1) [    ] o.a.s.c.SolrResourceLoader solr home defaulted to 'solr/' (could not find system property or JNDI)
   [junit4]   2> 3084907 INFO  (jetty-launcher-3868-thread-2) [    ] o.a.s.c.SolrResourceLoader JNDI not configured for solr (NoInitialContextEx)
   [junit4]   2> 3084907 INFO  (jetty-launcher-3868-thread-2) [    ] o.a.s.c.SolrResourceLoader solr home defaulted to 'solr/' (could not find system property or JNDI)
   [junit4]   2> 3084908 INFO  (jetty-launcher-3868-thread-1) [    ] o.a.s.c.c.SolrZkClient Using default ZkCredentialsProvider
   [junit4]   2> 3084908 INFO  (jetty-launcher-3868-thread-2) [    ] o.a.s.c.c.SolrZkClient Using default ZkCredentialsProvider
   [junit4]   2> 3084909 INFO  (jetty-launcher-3868-thread-1) [    ] o.a.s.c.c.ConnectionManager Waiting for client to connect to ZooKeeper
   [junit4]   2> 3084909 INFO  (jetty-launcher-3868-thread-2) [    ] o.a.s.c.c.ConnectionManager Waiting for client to connect to ZooKeeper
   [junit4]   2> 3084915 INFO  (zkCallback-3871-thread-1) [    ] o.a.s.c.c.ConnectionManager Watcher org.apache.solr.common.cloud.ConnectionManager@1f7d4d7 name:ZooKeeperConnection Watcher:127.0.0.1:51307/solr got event WatchedEvent state:SyncConnected type:None path:null path:null type:None
   [junit4]   2> 3084915 INFO  (jetty-launcher-3868-thread-2) [    ] o.a.s.c.c.ConnectionManager Client is connected to ZooKeeper
   [junit4]   2> 3084915 INFO  (zkCallback-3870-thread-1) [    ] o.a.s.c.c.ConnectionManager Watcher org.apache.solr.common.cloud.ConnectionManager@15573df name:ZooKeeperConnection Watcher:127.0.0.1:51307/solr got event WatchedEvent state:SyncConnected type:None path:null path:null type:None
   [junit4]   2> 3084915 INFO  (jetty-launcher-3868-thread-1) [    ] o.a.s.c.c.ConnectionManager Client is connected to ZooKeeper
   [junit4]   2> 3084915 INFO  (jetty-launcher-3868-thread-2) [    ] o.a.s.c.c.SolrZkClient Using default ZkACLProvider
   [junit4]   2> 3084916 INFO  (jetty-launcher-3868-thread-1) [    ] o.a.s.c.c.SolrZkClient Using default ZkACLProvider
   [junit4]   2> 3084916 INFO  (jetty-launcher-3868-thread-2) [    ] o.a.s.s.SolrDispatchFilter solr.xml found in ZooKeeper. Loading...
   [junit4]   2> 3084916 INFO  (jetty-launcher-3868-thread-1) [    ] o.a.s.s.SolrDispatchFilter solr.xml found in ZooKeeper. Loading...
   [junit4]   2> 3084940 WARN  (NIOServerCxn.Factory:0.0.0.0/0.0.0.0:0) [    ] o.a.z.s.NIOServerCnxn caught end of stream exception
   [junit4]   2> EndOfStreamException: Unable to read additional data from client sessionid 0x15739d10a970002, likely client has closed socket
   [junit4]   2> 	at org.apache.zookeeper.server.NIOServerCnxn.doIO(NIOServerCnxn.java:228)
   [junit4]   2> 	at org.apache.zookeeper.server.NIOServerCnxnFactory.run(NIOServerCnxnFactory.java:208)
   [junit4]   2> 	at java.lang.Thread.run(Thread.java:745)
   [junit4]   2> 3084940 INFO  (jetty-launcher-3868-thread-1) [    ] o.a.s.c.CorePropertiesLocator Config-defined core root directory: C:\Users\jenkins\workspace\Lucene-Solr-master-Windows\solr\build\solr-core\test\J1\temp\solr.cloud.TestSolrCloudWithDelegationTokens_7ED9EC9E3B1A767A-001\tempDir-001\node1\.
   [junit4]   2> 3084940 INFO  (jetty-launcher-3868-thread-1) [    ] o.a.s.c.CoreContainer New CoreContainer 12450767
   [junit4]   2> 3084941 INFO  (jetty-launcher-3868-thread-1) [    ] o.a.s.c.CoreContainer Loading cores into CoreContainer [instanceDir=C:\Users\jenkins\workspace\Lucene-Solr-master-Windows\solr\build\solr-core\test\J1\temp\solr.cloud.TestSolrCloudWithDelegationTokens_7ED9EC9E3B1A767A-001\tempDir-001\node1]
   [junit4]   2> 3084941 WARN  (jetty-launcher-3868-thread-1) [    ] o.a.s.c.CoreContainer Couldn't add files from C:\Users\jenkins\workspace\Lucene-Solr-master-Windows\solr\build\solr-core\test\J1\temp\solr.cloud.TestSolrCloudWithDelegationTokens_7ED9EC9E3B1A767A-001\tempDir-001\node1\lib to classpath: C:\Users\jenkins\workspace\Lucene-Solr-master-Windows\solr\build\solr-core\test\J1\temp\solr.cloud.TestSolrCloudWithDelegationTokens_7ED9EC9E3B1A767A-001\tempDir-001\node1\lib
   [junit4]   2> 3084941 INFO  (jetty-launcher-3868-thread-1) [    ] o.a.s.h.c.HttpShardHandlerFactory created with socketTimeout : 90000,urlScheme : ,connTimeout : 15000,maxConnectionsPerHost : 20,maxConnections : 10000,corePoolSize : 0,maximumPoolSize : 2147483647,maxThreadIdleTime : 5,sizeOfQueue : -1,fairnessPolicy : false,
   [junit4]   2> 3084942 INFO  (jetty-launcher-3868-thread-2) [    ] o.a.s.c.CorePropertiesLocator Config-defined core root directory: C:\Users\jenkins\workspace\Lucene-Solr-master-Windows\solr\build\solr-core\test\J1\temp\solr.cloud.TestSolrCloudWithDelegationTokens_7ED9EC9E3B1A767A-001\tempDir-001\node2\.
   [junit4]   2> 3084942 INFO  (jetty-launcher-3868-thread-2) [    ] o.a.s.c.CoreContainer New CoreContainer 19420120
   [junit4]   2> 3084942 INFO  (jetty-launcher-3868-thread-2) [    ] o.a.s.c.CoreContainer Loading cores into CoreContainer [instanceDir=C:\Users\jenkins\workspace\Lucene-Solr-master-Windows\solr\build\solr-core\test\J1\temp\solr.cloud.TestSolrCloudWithDelegationTokens_7ED9EC9E3B1A767A-001\tempDir-001\node2]
   [junit4]   2> 3084943 WARN  (jetty-launcher-3868-thread-2) [    ] o.a.s.c.CoreContainer Couldn't add files from C:\Users\jenkins\workspace\Lucene-Solr-master-Windows\solr\build\solr-core\test\J1\temp\solr.cloud.TestSolrCloudWithDelegationTokens_7ED9EC9E3B1A767A-001\tempDir-001\node2\lib to classpath: C:\Users\jenkins\workspace\Lucene-Solr-master-Windows\solr\build\solr-core\test\J1\temp\solr.cloud.TestSolrCloudWithDelegationTokens_7ED9EC9E3B1A767A-001\tempDir-001\node2\lib
   [junit4]   2> 3084943 INFO  (jetty-launcher-3868-thread-2) [    ] o.a.s.h.c.HttpShardHandlerFactory created with socketTimeout : 90000,urlScheme : ,connTimeout : 15000,maxConnectionsPerHost : 20,maxConnections : 10000,corePoolSize : 0,maximumPoolSize : 2147483647,maxThreadIdleTime : 5,sizeOfQueue : -1,fairnessPolicy : false,
   [junit4]   2> 3084947 INFO  (jetty-launcher-3868-thread-1) [    ] o.a.s.u.UpdateShardHandler Created UpdateShardHandler HTTP client with params: socketTimeout=340000&connTimeout=45000&maxConnections=100000&maxConnectionsPerHost=100000
   [junit4]   2> 3084947 INFO  (jetty-launcher-3868-thread-1) [    ] o.a.s.l.LogWatcher SLF4J impl is org.slf4j.impl.Log4jLoggerFactory
   [junit4]   2> 3084947 INFO  (jetty-launcher-3868-thread-2) [    ] o.a.s.u.UpdateShardHandler Created UpdateShardHandler HTTP client with params: socketTimeout=340000&connTimeout=45000&maxConnections=100000&maxConnectionsPerHost=100000
   [junit4]   2> 3084947 INFO  (jetty-launcher-3868-thread-2) [    ] o.a.s.l.LogWatcher SLF4J impl is org.slf4j.impl.Log4jLoggerFactory
   [junit4]   2> 3084947 INFO  (jetty-launcher-3868-thread-2) [    ] o.a.s.l.LogWatcher Registering Log Listener [Log4j (org.slf4j.impl.Log4jLoggerFactory)]
   [junit4]   2> 3084947 INFO  (jetty-launcher-3868-thread-2) [    ] o.a.s.c.ZkContainer Zookeeper client=127.0.0.1:51307/solr
   [junit4]   2> 3084947 INFO  (jetty-launcher-3868-thread-2) [    ] o.a.s.c.ZkController zkHost includes chroot
   [junit4]   2> 3084947 INFO  (jetty-launcher-3868-thread-1) [    ] o.a.s.l.LogWatcher Registering Log Listener [Log4j (org.slf4j.impl.Log4jLoggerFactory)]
   [junit4]   2> 3084948 INFO  (jetty-launcher-3868-thread-2) [    ] o.a.s.c.c.SolrZkClient Using default ZkCredentialsProvider
   [junit4]   2> 3084948 INFO  (jetty-launcher-3868-thread-1) [    ] o.a.s.c.ZkContainer Zookeeper client=127.0.0.1:51307/solr
   [junit4]   2> 3084948 INFO  (jetty-launcher-3868-thread-1) [    ] o.a.s.c.ZkController zkHost includes chroot
   [junit4]   2> 3084948 INFO  (jetty-launcher-3868-thread-1) [    ] o.a.s.c.c.SolrZkClient Using default ZkCredentialsProvider
   [junit4]   2> 3084949 INFO  (jetty-launcher-3868-thread-2) [    ] o.a.s.c.c.ConnectionManager Waiting for client to connect to ZooKeeper
   [junit4]   2> 3084949 INFO  (jetty-launcher-3868-thread-1) [    ] o.a.s.c.c.ConnectionManager Waiting for client to connect to ZooKeeper
   [junit4]   2> 3084951 INFO  (zkCallback-3876-thread-1) [    ] o.a.s.c.c.ConnectionManager Watcher org.apache.solr.common.cloud.ConnectionManager@1b9037a name:ZooKeeperConnection Watcher:127.0.0.1:51307 got event WatchedEvent state:SyncConnected type:None path:null path:null type:None
   [junit4]   2> 3084952 INFO  (zkCallback-3877-thread-1) [    ] o.a.s.c.c.ConnectionManager Watcher org.apache.solr.common.cloud.ConnectionManager@3a5c27 name:ZooKeeperConnection Watcher:127.0.0.1:51307 got event WatchedEvent state:SyncConnected type:None path:null path:null type:None
   [junit4]   2> 3084952 INFO  (jetty-launcher-3868-thread-1) [    ] o.a.s.c.c.ConnectionManager Client is connected to ZooKeeper
   [junit4]   2> 3084952 INFO  (jetty-launcher-3868-thread-2) [    ] o.a.s.c.c.ConnectionManager Client is connected to ZooKeeper
   [junit4]   2> 3084952 INFO  (jetty-launcher-3868-thread-1) [    ] o.a.s.c.c.SolrZkClient Using default ZkACLProvider
   [junit4]   2> 3084952 INFO  (jetty-launcher-3868-thread-2) [    ] o.a.s.c.c.SolrZkClient Using default ZkACLProvider
   [junit4]   2> 3084953 WARN  (NIOServerCxn.Factory:0.0.0.0/0.0.0.0:0) [    ] o.a.z.s.NIOServerCnxn caught end of stream exception
   [junit4]   2> EndOfStreamException: Unable to read additional data from client sessionid 0x15739d10a970003, likely client has closed socket
   [junit4]   2> 	at org.apache.zookeeper.server.NIOServerCnxn.doIO(NIOServerCnxn.java:228)
   [junit4]   2> 	at org.apache.zookeeper.server.NIOServerCnxnFactory.run(NIOServerCnxnFactory.java:208)
   [junit4]   2> 	at java.lang.Thread.run(Thread.java:745)
   [junit4]   2> 3084953 INFO  (jetty-launcher-3868-thread-2) [n:127.0.0.1:51314_solr    ] o.a.s.c.ZkController Added new OnReconnect listener org.apache.solr.cloud.ZkController$$Lambda$10/18808054@5a7273
   [junit4]   2> 3084953 INFO  (jetty-launcher-3868-thread-1) [n:127.0.0.1:51311_solr    ] o.a.s.c.ZkController Added new OnReconnect listener org.apache.solr.cloud.ZkController$$Lambda$10/18808054@a12838
   [junit4]   2> 3084954 INFO  (jetty-launcher-3868-thread-1) [n:127.0.0.1:51311_solr    ] o.a.s.c.c.ConnectionManager Waiting for client to connect to ZooKeeper
   [junit4]   2> 3084955 INFO  (jetty-launcher-3868-thread-2) [n:127.0.0.1:51314_solr    ] o.a.s.c.c.ConnectionManager Waiting for client to connect to ZooKeeper
   [junit4]   2> 3084957 INFO  (zkCallback-3878-thread-1-processing-n:127.0.0.1:51314_solr) [n:127.0.0.1:51314_solr    ] o.a.s.c.c.ConnectionManager Watcher org.apache.solr.common.cloud.ConnectionManager@14478fc name:ZooKeeperConnection Watcher:127.0.0.1:51307/solr got event WatchedEvent state:SyncConnected type:None path:null path:null type:None
   [junit4]   2> 3084957 INFO  (jetty-launcher-3868-thread-2) [n:127.0.0.1:51314_solr    ] o.a.s.c.c.ConnectionManager Client is connected to ZooKeeper
   [junit4]   2> 3084957 INFO  (zkCallback-3879-thread-1-processing-n:127.0.0.1:51311_solr) [n:127.0.0.1:51311_solr    ] o.a.s.c.c.ConnectionManager Watcher org.apache.solr.common.cloud.ConnectionManager@3de065 name:ZooKeeperConnection Watcher:127.0.0.1:51307/solr got event WatchedEvent state:SyncConnected type:None path:null path:null type:None
   [junit4]   2> 3084959 INFO  (jetty-launcher-3868-thread-1) [n:127.0.0.1:51311_solr    ] o.a.s.c.c.ConnectionManager Client is connected to ZooKeeper
   [junit4]   2> 3084959 INFO  (jetty-launcher-3868-thread-2) [n:127.0.0.1:51314_solr    ] o.a.s.c.c.SolrZkClient makePath: /overseer/queue
   [junit4]   2> 3084959 INFO  (jetty-launcher-3868-thread-1) [n:127.0.0.1:51311_solr    ] o.a.s.c.c.SolrZkClient makePath: /overseer/queue
   [junit4]   2> 3084962 INFO  (jetty-launcher-3868-thread-2) [n:127.0.0.1:51314_solr    ] o.a.s.c.c.SolrZkClient makePath: /overseer/collection-queue-work
   [junit4]   2> 3084962 INFO  (jetty-launcher-3868-thread-1) [n:127.0.0.1:51311_solr    ] o.a.s.c.c.SolrZkClient makePath: /overseer/collection-queue-work
   [junit4]   2> 3084967 INFO  (jetty-launcher-3868-thread-2) [n:127.0.0.1:51314_solr    ] o.a.s.c.c.SolrZkClient makePath: /overseer/collection-map-running
   [junit4]   2> 3084967 INFO  (jetty-launcher-3868-thread-1) [n:127.0.0.1:51311_solr    ] o.a.s.c.c.SolrZkClient makePath: /overseer/collection-map-running
   [junit4]   2> 3084969 INFO  (jetty-launcher-3868-thread-1) [n:127.0.0.1:51311_solr    ] o.a.s.c.c.SolrZkClient makePath: /overseer/collection-map-completed
   [junit4]   2> 3084969 INFO  (jetty-launcher-3868-thread-2) [n:127.0.0.1:51314_solr    ] o.a.s.c.c.SolrZkClient makePath: /overseer/collection-map-completed
   [junit4]   2> 3084971 INFO  (jetty-launcher-3868-thread-2) [n:127.0.0.1:51314_solr    ] o.a.s.c.c.SolrZkClient makePath: /overseer/collection-map-failure
   [junit4]   2> 3084971 INFO  (jetty-launcher-3868-thread-1) [n:127.0.0.1:51311_solr    ] o.a.s.c.c.SolrZkClient makePath: /overseer/collection-map-failure
   [junit4]   2> 3084974 INFO  (jetty-launcher-3868-thread-1) [n:127.0.0.1:51311_solr    ] o.a.s.c.c.SolrZkClient makePath: /live_nodes
   [junit4]   2> 3084974 INFO  (jetty-launcher-3868-thread-2) [n:127.0.0.1:51314_solr    ] o.a.s.c.c.SolrZkClient makePath: /live_nodes
   [junit4]   2> 3084975 INFO  (jetty-launcher-3868-thread-2) [n:127.0.0.1:51314_solr    ] o.a.s.c.c.SolrZkClient makePath: /collections
   [junit4]   2> 3084975 INFO  (jetty-launcher-3868-thread-1) [n:127.0.0.1:51311_solr    ] o.a.s.c.c.SolrZkClient makePath: /collections
   [junit4]   2> 3084977 INFO  (jetty-launcher-3868-thread-1) [n:127.0.0.1:51311_solr    ] o.a.s.c.c.SolrZkClient makePath: /aliases.json
   [junit4]   2> 3084977 INFO  (jetty-launcher-3868-thread-2) [n:127.0.0.1:51314_solr    ] o.a.s.c.c.SolrZkClient makePath: /aliases.json
   [junit4]   2> 3084979 INFO  (jetty-launcher-3868-thread-2) [n:127.0.0.1:51314_solr    ] o.a.s.c.c.SolrZkClient makePath: /clusterstate.json
   [junit4]   2> 3084979 INFO  (jetty-launcher-3868-thread-1) [n:127.0.0.1:51311_solr    ] o.a.s.c.c.SolrZkClient makePath: /clusterstate.json
   [junit4]   2> 3084981 INFO  (jetty-launcher-3868-thread-2) [n:127.0.0.1:51314_solr    ] o.a.s.c.c.SolrZkClient makePath: /security.json
   [junit4]   2> 3084981 INFO  (jetty-launcher-3868-thread-1) [n:127.0.0.1:51311_solr    ] o.a.s.c.c.SolrZkClient makePath: /security.json
   [junit4]   2> 3084982 INFO  (jetty-launcher-3868-thread-1) [n:127.0.0.1:51311_solr    ] o.a.s.c.c.ZkStateReader Updating cluster state from ZooKeeper... 
   [junit4]   2> 3084982 INFO  (jetty-launcher-3868-thread-2) [n:127.0.0.1:51314_solr    ] o.a.s.c.c.ZkStateReader Updating cluster state from ZooKeeper... 
   [junit4]   2> 3084983 INFO  (jetty-launcher-3868-thread-1) [n:127.0.0.1:51311_solr    ] o.a.s.c.c.ZkStateReader Loaded empty cluster properties
   [junit4]   2> 3084983 INFO  (jetty-launcher-3868-thread-2) [n:127.0.0.1:51314_solr    ] o.a.s.c.c.ZkStateReader Loaded empty cluster properties
   [junit4]   2> 3084983 INFO  (jetty-launcher-3868-thread-1) [n:127.0.0.1:51311_solr    ] o.a.s.c.c.ZkStateReader Updated live nodes from ZooKeeper... (0) -> (0)
   [junit4]   2> 3084983 INFO  (jetty-launcher-3868-thread-2) [n:127.0.0.1:51314_solr    ] o.a.s.c.c.ZkStateReader Updated live nodes from ZooKeeper... (0) -> (0)
   [junit4]   2> 3084987 INFO  (jetty-launcher-3868-thread-2) [n:127.0.0.1:51314_solr    ] o.a.s.c.c.SolrZkClient makePath: /overseer_elect
   [junit4]   2> 3084988 INFO  (jetty-launcher-3868-thread-1) [n:127.0.0.1:51311_solr    ] o.a.s.c.c.SolrZkClient makePath: /overseer_elect
   [junit4]   2> 3084989 INFO  (jetty-launcher-3868-thread-2) [n:127.0.0.1:51314_solr    ] o.a.s.c.c.SolrZkClient makePath: /overseer_elect/election
   [junit4]   2> 3084989 INFO  (jetty-launcher-3868-thread-1) [n:127.0.0.1:51311_solr    ] o.a.s.c.c.SolrZkClient makePath: /overseer_elect/election
   [junit4]   2> 3084991 INFO  (jetty-launcher-3868-thread-1) [n:127.0.0.1:51311_solr    ] o.a.s.c.Overseer Overseer (id=null) closing
   [junit4]   2> 3084991 INFO  (jetty-launcher-3868-thread-2) [n:127.0.0.1:51314_solr    ] o.a.s.c.Overseer Overseer (id=null) closing
   [junit4]   2> 3084991 INFO  (jetty-launcher-3868-thread-1) [n:127.0.0.1:51311_solr    ] o.a.s.c.LeaderElector Joined leadership election with path: /overseer_elect/election/96609487000371206-127.0.0.1:51311_solr-n_0000000000
   [junit4]   2> 3084991 INFO  (jetty-launcher-3868-thread-2) [n:127.0.0.1:51314_solr    ] o.a.s.c.LeaderElector Joined leadership election with path: /overseer_elect/election/96609487000371205-127.0.0.1:51314_solr-n_0000000001
   [junit4]   2> 3084992 INFO  (jetty-launcher-3868-thread-1) [n:127.0.0.1:51311_solr    ] o.a.s.c.OverseerElectionContext I am going to be the leader 127.0.0.1:51311_solr
   [junit4]   2> 3084992 INFO  (jetty-launcher-3868-thread-1) [n:127.0.0.1:51311_solr    ] o.a.s.c.c.SolrZkClient makePath: /overseer_elect/leader
   [junit4]   2> 3084993 INFO  (jetty-launcher-3868-thread-2) [n:127.0.0.1:51314_solr    ] o.a.s.c.LeaderElector Watching path /overseer_elect/election/96609487000371206-127.0.0.1:51311_solr-n_0000000000 to know if I could be the leader
   [junit4]   2> 3084993 INFO  (jetty-launcher-3868-thread-2) [n:127.0.0.1:51314_solr    ] o.a.s.c.ZkController Register node as live in ZooKeeper:/live_nodes/127.0.0.1:51314_solr
   [junit4]   2> 3084993 INFO  (jetty-launcher-3868-thread-2) [n:127.0.0.1:51314_solr    ] o.a.s.c.c.SolrZkClient makePath: /live_nodes/127.0.0.1:51314_solr
   [junit4]   2> 3084994 INFO  (jetty-launcher-3868-thread-1) [n:127.0.0.1:51311_solr    ] o.a.s.c.Overseer Overseer (id=96609487000371206-127.0.0.1:51311_solr-n_0000000000) starting
   [junit4]   2> 3084995 INFO  (zkCallback-3878-thread-1-processing-n:127.0.0.1:51314_solr) [n:127.0.0.1:51314_solr    ] o.a.s.c.c.ZkStateReader A live node change: [WatchedEvent state:SyncConnected type:NodeChildrenChanged path:/live_nodes], has occurred - updating... (live nodes size: [0])
   [junit4]   2> 3084995 INFO  (zkCallback-3879-thread-1-processing-n:127.0.0.1:51311_solr) [n:127.0.0.1:51311_solr    ] o.a.s.c.c.ZkStateReader A live node change: [WatchedEvent state:SyncConnected type:NodeChildrenChanged path:/live_nodes], has occurred - updating... (live nodes size: [0])
   [junit4]   2> 3084997 INFO  (zkCallback-3878-thread-1-processing-n:127.0.0.1:51314_solr) [n:127.0.0.1:51314_solr    ] o.a.s.c.c.ZkStateReader Updated live nodes from ZooKeeper... (0) -> (1)
   [junit4]   2> 3084997 INFO  (zkCallback-3879-thread-1-processing-n:127.0.0.1:51311_solr) [n:127.0.0.1:51311_solr    ] o.a.s.c.c.ZkStateReader Updated live nodes from ZooKeeper... (0) -> (1)
   [junit4]   2> 3084999 INFO  (jetty-launcher-3868-thread-1) [n:127.0.0.1:51311_solr    ] o.a.s.c.c.SolrZkClient makePath: /overseer/queue-work
   [junit4]   2> 3085007 INFO  (jetty-launcher-3868-thread-1) [n:127.0.0.1:51311_solr    ] o.a.s.c.OverseerAutoReplicaFailoverThread Starting OverseerAutoReplicaFailoverThread autoReplicaFailoverWorkLoopDelay=10000 autoReplicaFailoverWaitAfterExpiration=30000 autoReplicaFailoverBadNodeExpiration=60000
   [junit4]   2> 3085009 INFO  (jetty-launcher-3868-thread-1) [n:127.0.0.1:51311_solr    ] o.a.s.c.ZkController Publish node=127.0.0.1:51311_solr as DOWN
   [junit4]   2> 3085010 INFO  (jetty-launcher-3868-thread-1) [n:127.0.0.1:51311_solr    ] o.a.s.c.ZkController Register node as live in ZooKeeper:/live_nodes/127.0.0.1:51311_solr
   [junit4]   2> 3085010 INFO  (jetty-launcher-3868-thread-1) [n:127.0.0.1:51311_solr    ] o.a.s.c.c.SolrZkClient makePath: /live_nodes/127.0.0.1:51311_solr
   [junit4]   2> 3085012 INFO  (zkCallback-3878-thread-1-processing-n:127.0.0.1:51314_solr) [n:127.0.0.1:51314_solr    ] o.a.s.c.c.ZkStateReader A live node change: [WatchedEvent state:SyncConnected type:NodeChildrenChanged path:/live_nodes], has occurred - updating... (live nodes size: [1])
   [junit4]   2> 3085012 INFO  (zkCallback-3879-thread-1-processing-n:127.0.0.1:51311_solr) [n:127.0.0.1:51311_solr    ] o.a.s.c.c.ZkStateReader A live node change: [WatchedEvent state:SyncConnected type:NodeChildrenChanged path:/live_nodes], has occurred - updating... (live nodes size: [1])
   [junit4]   2> 3085013 INFO  (zkCallback-3878-thread-1-processing-n:127.0.0.1:51314_solr) [n:127.0.0.1:51314_solr    ] o.a.s.c.c.ZkStateReader Updated live nodes from ZooKeeper... (1) -> (2)
   [junit4]   2> 3085013 INFO  (zkCallback-3879-thread-1-processing-n:127.0.0.1:51311_solr) [n:127.0.0.1:51311_solr    ] o.a.s.c.c.ZkStateReader Updated live nodes from ZooKeeper... (1) -> (2)
   [junit4]   2> 3085013 INFO  (OverseerStateUpdate-96609487000371206-127.0.0.1:51311_solr-n_0000000000) [n:127.0.0.1:51311_solr    ] o.a.s.c.Overseer Starting to work on the main queue
   [junit4]   2> 3085015 INFO  (OverseerCollectionConfigSetProcessor-96609487000371206-127.0.0.1:51311_solr-n_0000000000) [n:127.0.0.1:51311_solr    ] o.a.s.c.OverseerTaskProcessor Process current queue of overseer operations
   [junit4]   2> 3085018 INFO  (jetty-launcher-3868-thread-2) [n:127.0.0.1:51314_solr    ] o.a.s.c.CoreContainer Security conf doesn't exist. Skipping setup for authorization module.
   [junit4]   2> 3085018 INFO  (jetty-launcher-3868-thread-2) [n:127.0.0.1:51314_solr    ] o.a.s.c.CoreContainer Authentication plugin class obtained from system property 'authenticationPlugin': org.apache.solr.security.HttpParamDelegationTokenPlugin
   [junit4]   2> 3085018 INFO  (OverseerStateUpdate-96609487000371206-127.0.0.1:51311_solr-n_0000000000) [n:127.0.0.1:51311_solr    ] o.a.s.c.c.ZkStateReader Updated live nodes from ZooKeeper... (2) -> (2)
   [junit4]   2> 3085019 INFO  (jetty-launcher-3868-thread-2) [n:127.0.0.1:51314_solr    ] o.a.s.s.KerberosPlugin Params: {token.valid=30, delegation-token.token-kind=solr-dt, cookie.domain=127.0.0.1, cookie.path=/, zk-dt-secret-manager.znodeWorkingPath=solr/security/zkdtsm, token.validity=36000, signer.secret.provider.zookeeper.path=/token, type=kerberos, zk-dt-secret-manager.enable=true, kerberos.name.rules=DEFAULT, signer.secret.provider=zookeeper}
   [junit4]   2> 3085021 INFO  (jetty-launcher-3868-thread-2) [n:127.0.0.1:51314_solr    ] o.a.c.f.i.CuratorFrameworkImpl Starting
   [junit4]   2> 3085023 INFO  (OverseerStateUpdate-96609487000371206-127.0.0.1:51311_solr-n_0000000000) [n:127.0.0.1:51311_solr    ] o.a.s.c.Overseer processMessage: queueSize: 0, message = {
   [junit4]   2>   "operation":"downnode",
   [junit4]   2>   "node_name":"127.0.0.1:51311_solr"} current state version: 0
   [junit4]   2> 3085023 INFO  (OverseerStateUpdate-96609487000371206-127.0.0.1:51311_solr-n_0000000000) [n:127.0.0.1:51311_solr    ] o.a.s.c.o.NodeMutator DownNode state invoked for node: 127.0.0.1:51311_solr
   [junit4]   2> 3085025 INFO  (jetty-launcher-3868-thread-2-EventThread) [n:127.0.0.1:51314_solr    ] o.a.c.f.s.ConnectionStateManager State change: CONNECTED
   [junit4]   2> 3085072 INFO  (jetty-launcher-3868-thread-1) [n:127.0.0.1:51311_solr    ] o.a.s.c.CoreContainer Security conf doesn't exist. Skipping setup for authorization module.
   [junit4]   2> 3085072 INFO  (jetty-launcher-3868-thread-1) [n:127.0.0.1:51311_solr    ] o.a.s.c.CoreContainer Authentication plugin class obtained from system property 'authenticationPlugin': org.apache.solr.security.HttpParamDelegationTokenPlugin
   [junit4]   2> 3085073 INFO  (jetty-launcher-3868-thread-1) [n:127.0.0.1:51311_solr    ] o.a.s.s.KerberosPlugin Params: {token.valid=30, delegation-token.token-kind=solr-dt, cookie.domain=127.0.0.1, cookie.path=/, zk-dt-secret-manager.znodeWorkingPath=solr/security/zkdtsm, token.validity=36000, signer.secret.provider.zookeeper.path=/token, type=kerberos, zk-dt-secret-manager.enable=true, kerberos.name.rules=DEFAULT, signer.secret.provider=zookeeper}
   [junit4]   2> 3085073 INFO  (jetty-launcher-3868-thread-1) [n:127.0.0.1:51311_solr    ] o.a.c.f.i.CuratorFrameworkImpl Starting
   [junit4]   2> 3085076 INFO  (jetty-launcher-3868-thread-1-EventThread) [n:127.0.0.1:51311_solr    ] o.a.c.f.s.ConnectionStateManager State change: CONNECTED
   [junit4]   2> 3085098 INFO  (jetty-launcher-3868-thread-1) [n:127.0.0.1:51311_solr    ] o.a.s.c.CoreContainer Reconfiguring HttpClient settings.
   [junit4]   2> 3085100 INFO  (jetty-launcher-3868-thread-1) [n:127.0.0.1:51311_solr    ] o.a.s.c.CorePropertiesLocator Looking for core definitions underneath C:\Users\jenkins\workspace\Lucene-Solr-master-Windows\solr\build\solr-core\test\J1\temp\solr.cloud.TestSolrCloudWithDelegationTokens_7ED9EC9E3B1A767A-001\tempDir-001\node1\.
   [junit4]   2> 3085101 INFO  (jetty-launcher-3868-thread-1) [n:127.0.0.1:51311_solr    ] o.a.s.c.CorePropertiesLocator Found 0 core definitions
   [junit4]   2> 3085102 INFO  (jetty-launcher-3868-thread-1) [n:127.0.0.1:51311_solr    ] o.a.s.s.SolrDispatchFilter user.dir=C:\Users\jenkins\workspace\Lucene-Solr-master-Windows\solr\build\solr-core\test\J1
   [junit4]   2> 3085102 INFO  (jetty-launcher-3868-thread-1) [n:127.0.0.1:51311_solr    ] o.a.s.s.SolrDispatchFilter SolrDispatchFilter.init() done
   [junit4]   2> 3086054 INFO  (jetty-launcher-3868-thread-2) [n:127.0.0.1:51314_solr    ] o.a.s.c.CoreContainer Reconfiguring HttpClient settings.
   [junit4]   2> 3086056 INFO  (jetty-launcher-3868-thread-2) [n:127.0.0.1:51314_solr    ] o.a.s.c.CorePropertiesLocator Looking for core definitions underneath C:\Users\jenkins\workspace\Lucene-Solr-master-Windows\solr\build\solr-core\test\J1\temp\solr.cloud.TestSolrCloudWithDelegationTokens_7ED9EC9E3B1A767A-001\tempDir-001\node2\.
   [junit4]   2> 3086057 INFO  (jetty-launcher-3868-thread-2) [n:127.0.0.1:51314_solr    ] o.a.s.c.CorePropertiesLocator Found 0 core definitions
   [junit4]   2> 3086060 INFO  (jetty-launcher-3868-thread-2) [n:127.0.0.1:51314_solr    ] o.a.s.s.SolrDispatchFilter user.dir=C:\Users\jenkins\workspace\Lucene-Solr-master-Windows\solr\build\solr-core\test\J1
   [junit4]   2> 3086060 INFO  (jetty-launcher-3868-thread-2) [n:127.0.0.1:51314_solr    ] o.a.s.s.SolrDispatchFilter SolrDispatchFilter.init() done
   [junit4]   2> 3086061 INFO  (SUITE-TestSolrCloudWithDelegationTokens-seed#[7ED9EC9E3B1A767A]-worker) [    ] o.a.s.c.c.SolrZkClient Using default ZkCredentialsProvider
   [junit4]   2> 3086062 INFO  (SUITE-TestSolrCloudWithDelegationTokens-seed#[7ED9EC9E3B1A767A]-worker) [    ] o.a.s.c.c.ConnectionManager Waiting for client to connect to ZooKeeper
   [junit4]   2> 3086065 INFO  (zkCallback-3882-thread-1) [    ] o.a.s.c.c.ConnectionManager Watcher org.apache.solr.common.cloud.ConnectionManager@4de152 name:ZooKeeperConnection Watcher:127.0.0.1:51307 got event WatchedEvent state:SyncConnected type:None path:null path:null type:None
   [junit4]   2> 3086066 INFO  (SUITE-TestSolrCloudWithDelegationTokens-seed#[7ED9EC9E3B1A767A]-worker) [    ] o.a.s.c.c.ConnectionManager Client is connected to ZooKeeper
   [junit4]   2> 3086066 INFO  (SUITE-TestSolrCloudWithDelegationTokens-seed#[7ED9EC9E3B1A767A]-worker) [    ] o.a.s.c.c.SolrZkClient Using default ZkACLProvider
   [junit4]   2> 3086104 INFO  (TEST-TestSolrCloudWithDelegationTokens.testDelegationTokenCancelFail-seed#[7ED9EC9E3B1A767A]) [    ] o.a.s.SolrTestCaseJ4 ###Starting testDelegationTokenCancelFail
   [junit4]   2> 3087818 INFO  (TEST-TestSolrCloudWithDelegationTokens.testDelegationTokenCancelFail-seed#[7ED9EC9E3B1A767A]) [    ] o.a.s.SolrTestCaseJ4 ###Ending testDelegationTokenCancelFail
   [junit4]   2> NOTE: reproduce with: ant test  -Dtestcase=TestSolrCloudWithDelegationTokens -Dtests.method=testDelegationTokenCancelFail -Dtests.seed=7ED9EC9E3B1A767A -Dtests.slow=true -Dtests.locale=es-PR -Dtests.timezone=US/Arizona -Dtests.asserts=true -Dtests.file.encoding=UTF-8
   [junit4] FAILURE 1.75s J1 | TestSolrCloudWithDelegationTokens.testDelegationTokenCancelFail <<<
   [junit4]    > Throwable #1: java.lang.AssertionError: expected:<200> but was:<404>
   [junit4]    > 	at __randomizedtesting.SeedInfo.seed([7ED9EC9E3B1A767A:1666D9B4EB806496]:0)
   [junit4]    > 	at org.apache.solr.cloud.TestSolrCloudWithDelegationTokens.cancelDelegationToken(TestSolrCloudWithDelegationTokens.java:137)
   [junit4]    > 	at org.apache.solr.cloud.TestSolrCloudWithDelegationTokens.testDelegationTokenCancelFail(TestSolrCloudWithDelegationTokens.java:282)
   [junit4]    > 	at java.lang.Thread.run(Thread.java:745)
   [junit4]   2> 3087843 INFO  (TEST-TestSolrCloudWithDelegationTokens.testDelegationTokenSolrClient-seed#[7ED9EC9E3B1A767A]) [    ] o.a.s.SolrTestCaseJ4 ###Starting testDelegationTokenSolrClient
   [junit4]   2> 3087871 INFO  (qtp25988145-23819) [n:127.0.0.1:51311_solr    ] o.a.s.h.a.CollectionsHandler Invoked Collection Action :list with params action=LIST&delegation=GgADYmFyA2JhcgCKAVc50RaBigFXXd2agQICFOGN1I3aPDPi02KnrQFkjiDXVsNPB3NvbHItZHQA&wt=javabin&version=2 and sendToOCPQueue=true
   [junit4]   2> 3087872 INFO  (qtp25988145-23819) [n:127.0.0.1:51311_solr    ] o.a.s.s.HttpSolrCall [admin] webapp=null path=/admin/collections params={action=LIST&delegation=GgADYmFyA2JhcgCKAVc50RaBigFXXd2agQICFOGN1I3aPDPi02KnrQFkjiDXVsNPB3NvbHItZHQA&wt=javabin&version=2} status=0 QTime=0
   [junit4]   2> 3087872 INFO  (TEST-TestSolrCloudWithDelegationTokens.testDelegationTokenSolrClient-seed#[7ED9EC9E3B1A767A]) [    ] o.a.s.SolrTestCaseJ4 ###Ending testDelegationTokenSolrClient
   [junit4]   2> 3087895 INFO  (TEST-TestSolrCloudWithDelegationTokens.testDelegationTokenCancel-seed#[7ED9EC9E3B1A767A]) [    ] o.a.s.SolrTestCaseJ4 ###Starting testDelegationTokenCancel
   [junit4]   2> 3087910 ERROR (qtp25988145-23822) [    ] o.a.h.s.t.d.ZKDelegationTokenSecretManager No node in path [/ZKDTSMTokensRoot/DT_3]
   [junit4]   2> 3087975 ERROR (qtp28991948-23826) [    ] o.a.h.s.t.d.ZKDelegationTokenSecretManager No node in path [/ZKDTSMTokensRoot/DT_4]
   [junit4]   2> 3087985 INFO  (TEST-TestSolrCloudWithDelegationTokens.testDelegationTokenCancel-seed#[7ED9EC9E3B1A767A]) [    ] o.a.s.SolrTestCaseJ4 ###Ending testDelegationTokenCancel
   [junit4]   2> 3088009 INFO  (TEST-TestSolrCloudWithDelegationTokens.testZNodePaths-seed#[7ED9EC9E3B1A767A]) [    ] o.a.s.SolrTestCaseJ4 ###Starting testZNodePaths
   [junit4]   2> 3088016 INFO  (TEST-TestSolrCloudWithDelegationTokens.testZNodePaths-seed#[7ED9EC9E3B1A767A]) [    ] o.a.s.c.c.SolrZkClient Using default ZkCredentialsProvider
   [junit4]   2> 3088017 INFO  (TEST-TestSolrCloudWithDelegationTokens.testZNodePaths-seed#[7ED9EC9E3B1A767A]) [    ] o.a.s.c.c.ConnectionManager Waiting for client to connect to ZooKeeper
   [junit4]   2> 3088023 INFO  (zkCallback-3884-thread-1) [    ] o.a.s.c.c.ConnectionManager Watcher org.apache.solr.common.cloud.ConnectionManager@d0d649 name:ZooKeeperConnection Watcher:127.0.0.1:51307/solr got event WatchedEvent state:SyncConnected type:None path:null path:null type:None
   [junit4]   2> 3088023 INFO  (TEST-TestSolrCloudWithDelegationTokens.testZNodePaths-seed#[7ED9EC9E3B1A767A]) [    ] o.a.s.c.c.ConnectionManager Client is connected to ZooKeeper
   [junit4]   2> 3088024 INFO  (TEST-TestSolrCloudWithDelegationTokens.testZNodePaths-seed#[7ED9EC9E3B1A767A]) [    ] o.a.s.c.c.SolrZkClient Using default ZkACLProvider
   [junit4]   2> 3088026 INFO  (TEST-TestSolrCloudWithDelegationTokens.testZNodePaths-seed#[7ED9EC9E3B1A767A]) [    ] o.a.s.SolrTestCaseJ4 ###Ending testZNodePaths
   [junit4]   2> 3088026 WARN  (NIOServerCxn.Factory:0.0.0.0/0.0.0.0:0) [    ] o.a.z.s.NIOServerCnxn caught end of stream exception
   [junit4]   2> EndOfStreamException: Unable to read additional data from client sessionid 0x15739d10a97000a, likely client has closed socket
   [junit4]   2> 	at org.apache.zookeeper.server.NIOServerCnxn.doIO(NIOServerCnxn.java:228)
   [junit4]   2> 	at org.apache.zookeeper.server.NIOServerCnxnFactory.run(NIOServerCnxnFactory.java:208)
   [junit4]   2> 	at java.lang.Thread.run(Thread.java:745)
   [junit4]   2> 3088047 INFO  (TEST-TestSolrCloudWithDelegationTokens.testDelegationTokenRenewFail-seed#[7ED9EC9E3B1A767A]) [    ] o.a.s.SolrTestCaseJ4 ###Starting testDelegationTokenRenewFail
   [junit4]   2> 3088060 WARN  (qtp25988145-23822) [    ] o.a.h.s.a.s.AuthenticationFilter Authentication exception: org.apache.hadoop.security.AccessControlException: foo tries to renew a token with renewer bar
   [junit4]   2> 3088061 WARN  (qtp25988145-23822) [    ] o.a.s.s.KerberosPlugin Could not find org.apache.solr.security.kerberosplugin.requestcontinues
   [junit4]   2> 3088062 WARN  (qtp28991948-23842) [    ] o.a.h.s.a.s.AuthenticationFilter Authentication exception: org.apache.hadoop.security.AccessControlException: foo tries to renew a token with renewer bar
   [junit4]   2> 3088062 WARN  (qtp28991948-23842) [    ] o.a.s.s.KerberosPlugin Could not find org.apache.solr.security.kerberosplugin.requestcontinues
   [junit4]   2> 3088069 WARN  (qtp25988145-23820) [    ] o.a.h.s.a.s.AuthenticationFilter Authentication exception: org.apache.hadoop.security.AccessControlException: notRenewUser tries to renew a token with renewer renewUser
   [junit4]   2> 3088070 WARN  (qtp25988145-23820) [    ] o.a.s.s.KerberosPlugin Could not find org.apache.solr.security.kerberosplugin.requestcontinues
   [junit4]   2> 3088071 WARN  (qtp28991948-23843) [    ] o.a.h.s.a.s.AuthenticationFilter Authentication exception: org.apache.hadoop.security.AccessControlException: notRenewUser tries to renew a token with renewer renewUser
   [junit4]   2> 3088071 WARN  (qtp28991948-23843) [    ] o.a.s.s.KerberosPlugin Could not find org.apache.solr.security.kerberosplugin.requestcontinues
   [junit4]   2> 3088072 INFO  (TEST-TestSolrCloudWithDelegationTokens.testDelegationTokenRenewFail-seed#[7ED9EC9E3B1A767A]) [    ] o.a.s.SolrTestCaseJ4 ###Ending testDelegationTokenRenewFail
   [junit4]   2> 3088092 INFO  (TEST-TestSolrCloudWithDelegationTokens.testDelegationTokenVerify-seed#[7ED9EC9E3B1A767A]) [    ] o.a.s.SolrTestCaseJ4 ###Starting testDelegationTokenVerify
   [junit4]   2> 3088103 INFO  (qtp25988145-23840) [n:127.0.0.1:51311_solr    ] o.a.s.h.a.CollectionsHandler Invoked Collection Action :list with params action=LIST&delegation=GgADYmFyA2JhcgCKAVc50Rd5igFXXd2beQgCFPTXQoiDczrg5w2KMVSHtoukIVMiB3NvbHItZHQA&wt=javabin&version=2 and sendToOCPQueue=true
   [junit4]   2> 3088103 INFO  (qtp25988145-23840) [n:127.0.0.1:51311_solr    ] o.a.s.s.HttpSolrCall [admin] webapp=null path=/admin/collections params={action=LIST&delegation=GgADYmFyA2JhcgCKAVc50Rd5igFXXd2beQgCFPTXQoiDczrg5w2KMVSHtoukIVMiB3NvbHItZHQA&wt=javabin&version=2} status=0 QTime=0
   [junit4]   2> 3088109 INFO  (qtp28991948-23827) [n:127.0.0.1:51314_solr    ] o.a.s.h.a.CollectionsHandler Invoked Collection Action :list with params action=LIST&delegation=GgADYmFyA2JhcgCKAVc50Rd5igFXXd2beQgCFPTXQoiDczrg5w2KMVSHtoukIVMiB3NvbHItZHQA&wt=javabin&version=2 and sendToOCPQueue=true
   [junit4]   2> 3088109 INFO  (qtp28991948-23827) [n:127.0.0.1:51314_solr    ] o.a.s.s.HttpSolrCall [admin] webapp=null path=/admin/collections params={action=LIST&delegation=GgADYmFyA2JhcgCKAVc50Rd5igFXXd2beQgCFPTXQoiDczrg5w2KMVSHtoukIVMiB3NvbHItZHQA&wt=javabin&version=2} status=0 QTime=0
   [junit4]   2> 3088113 INFO  (TEST-TestSolrCloudWithDelegationTokens.testDelegationTokenVerify-seed#[7ED9EC9E3B1A767A]) [    ] o.a.s.SolrTestCaseJ4 ###Ending testDelegationTokenVerify
   [junit4]   2> 3088133 INFO  (TEST-TestSolrCloudWithDelegationTokens.testDelegationOtherOp-seed#[7ED9EC9E3B1A767A]) [    ] o.a.s.SolrTestCaseJ4 ###Starting testDelegationOtherOp
   [junit4]   2> 3088137 INFO  (qtp25988145-23838) [n:127.0.0.1:51311_solr    ] o.a.s.h.a.CollectionsHandler Invoked Collection Action :list with params op=someSolrOperation&action=LIST&wt=javabin&version=2 and sendToOCPQueue=true
   [junit4]   2> 3088137 INFO  (qtp25988145-23838) [n:127.0.0.1:51311_solr    ] o.a.s.s.HttpSolrCall [admin] webapp=null path=/admin/collections params={op=someSolrOperation&action=LIST&wt=javabin&version=2} status=0 QTime=0
   [junit4]   2> 3088137 INFO  (TEST-TestSolrCloudWithDelegationTokens.testDelegationOtherOp-seed#[7ED9EC9E3B1A767A]) [    ] o.a.s.SolrTestCaseJ4 ###Ending testDelegationOtherOp
   [junit4]   2> 3088161 INFO  (TEST-TestSolrCloudWithDelegationTokens.testDelegationTokenRenew-seed#[7ED9EC9E3B1A767A]) [    ] o.a.s.SolrTestCaseJ4 ###Starting testDelegationTokenRenew
   [junit4]   2> 3088195 INFO  (qtp25988145-23819) [n:127.0.0.1:51311_solr    ] o.a.s.h.a.CollectionsHandler Invoked Collection Action :list with params action=LIST&delegation=GgADYmFyA2JhcgCKAVc50Re-igFXXd2bvgkCFEtwIdcTb8xKUTsXkDCLtv6VlRkaB3NvbHItZHQA&wt=javabin&version=2 and sendToOCPQueue=true
   [junit4]   2> 3088195 INFO  (qtp25988145-23819) [n:127.0.0.1:51311_solr    ] o.a.s.s.HttpSolrCall [admin] webapp=null path=/admin/collections params={action=LIST&delegation=GgADYmFyA2JhcgCKAVc50Re-igFXXd2bvgkCFEtwIdcTb8xKUTsXkDCLtv6VlRkaB3NvbHItZHQA&wt=javabin&version=2} status=0 QTime=0
   [junit4]   2> 3088202 INFO  (qtp28991948-23842) [n:127.0.0.1:51314_solr    ] o.a.s.h.a.CollectionsHandler Invoked Collection Action :list with params action=LIST&delegation=GgADYmFyA2JhcgCKAVc50Re-igFXXd2bvgkCFEtwIdcTb8xKUTsXkDCLtv6VlRkaB3NvbHItZHQA&wt=javabin&version=2 and sendToOCPQueue=true
   [junit4]   2> 3088202 INFO  (qtp28991948-23842) [n:127.0.0.1:51314_solr    ] o.a.s.s.HttpSolrCall [admin] webapp=null path=/admin/collections params={action=LIST&delegation=GgADYmFyA2JhcgCKAVc50Re-igFXXd2bvgkCFEtwIdcTb8xKUTsXkDCLtv6VlRkaB3NvbHItZHQA&wt=javabin&version=2} status=0 QTime=0
   [junit4]   2> 3088224 INFO  (qtp25988145-23823) [n:127.0.0.1:51311_solr    ] o.a.s.h.a.CollectionsHandler Invoked Collection Action :list with params action=LIST&delegation=GgADYmFyA2JhcgCKAVc50RfqigFXXd2b6goCFGG-fn1s3w8q-RAqaXZyGg9skAGzB3NvbHItZHQA&wt=javabin&version=2 and sendToOCPQueue=true
   [junit4]   2> 3088225 INFO  (qtp25988145-23823) [n:127.0.0.1:51311_solr    ] o.a.s.s.HttpSolrCall [admin] webapp=null path=/admin/collections params={action=LIST&delegation=GgADYmFyA2JhcgCKAVc50RfqigFXXd2b6goCFGG-fn1s3w8q-RAqaXZyGg9skAGzB3NvbHItZHQA&wt=javabin&version=2} status=0 QTime=0
   [junit4]   2> 3088231 INFO  (qtp28991948-23841) [n:127.0.0.1:51314_solr    ] o.a.s.h.a.CollectionsHandler Invoked Collection Action :list with params action=LIST&delegation=GgADYmFyA2JhcgCKAVc50RfqigFXXd2b6goCFGG-fn1s3w8q-RAqaXZyGg9skAGzB3NvbHItZHQA&wt=javabin&version=2 and sendToOCPQueue=true
   [junit4]   2> 3088232 INFO  (qtp28991948-23841) [n:127.0.0.1:51314_solr    ] o.a.s.s.HttpSolrCall [admin] webapp=null path=/admin/collections params={action=LIST&delegation=GgADYmFyA2JhcgCKAVc50RfqigFXXd2b6goCFGG-fn1s3w8q-RAqaXZyGg9skAGzB3NvbHItZHQA&wt=javabin&version=2} status=0 QTime=0
   [junit4]   2> 3088250 INFO  (qtp25988145-23821) [n:127.0.0.1:51311_solr    ] o.a.s.h.a.CollectionsHandler Invoked Collection Action :list with params action=LIST&delegation=GgADYmFyA2JhcgCKAVc50RgIigFXXd2cCAsCFKz4KokQbi7VXhIqDKbJxAKhqC8jB3NvbHItZHQA&wt=javabin&version=2 and sendToOCPQueue=true
   [junit4]   2> 3088250 INFO  (qtp25988145-23821) [n:127.0.0.1:51311_solr    ] o.a.s.s.HttpSolrCall [admin] webapp=null path=/admin/collections params={action=LIST&delegation=GgADYmFyA2JhcgCKAVc50RgIigFXXd2cCAsCFKz4KokQbi7VXhIqDKbJxAKhqC8jB3NvbHItZHQA&wt=javabin&version=2} status=0 QTime=0
   [junit4]   2> 3088256 INFO  (qtp28991948-23828) [n:127.0.0.1:51314_solr    ] o.a.s.h.a.CollectionsHandler Invoked Collection Action :list with params action=LIST&delegation=GgADYmFyA2JhcgCKAVc50RgIigFXXd2cCAsCFKz4KokQbi7VXhIqDKbJxAKhqC8jB3NvbHItZHQA&wt=javabin&version=2 and sendToOCPQueue=true
   [junit4]   2> 3088256 INFO  (qtp28991948-23828) [n:127.0.0.1:51314_solr    ] o.a.s.s.HttpSolrCall [admin] webapp=null path=/admin/collections params={action=LIST&delegation=GgADYmFyA2JhcgCKAVc50RgIigFXXd2cCAsCFKz4KokQbi7VXhIqDKbJxAKhqC8jB3NvbHItZHQA&wt=javabin&version=2} status=0 QTime=0
   [junit4]   2> 3088278 INFO  (qtp25988145-23839) [n:127.0.0.1:51311_solr    ] o.a.s.h.a.CollectionsHandler Invoked Collection Action :list with params action=LIST&delegation=GgADYmFyA2JhcgCKAVc50RggigFXXd2cIAwCFJ2jY1y8ii8L40A_SigmByEK2cTZB3NvbHItZHQA&wt=javabin&version=2 and sendToOCPQueue=true
   [junit4]   2> 3088278 INFO  (qtp25988145-23839) [n:127.0.0.1:51311_solr    ] o.a.s.s.HttpSolrCall [admin] webapp=null path=/admin/collections params={action=LIST&delegation=GgADYmFyA2JhcgCKAVc50RggigFXXd2cIAwCFJ2jY1y8ii8L40A_SigmByEK2cTZB3NvbHItZHQA&wt=javabin&version=2} status=0 QTime=0
   [junit4]   2> 3088285 INFO  (qtp28991948-23831) [n:127.0.0.1:51314_solr    ] o.a.s.h.a.CollectionsHandler Invoked Collection Action :list with params action=LIST&delegation=GgADYmFyA2JhcgCKAVc50RggigFXXd2cIAwCFJ2jY1y8ii8L40A_SigmByEK2cTZB3NvbHItZHQA&wt=javabin&version=2 and sendToOCPQueue=true
   [junit4]   2> 3088285 INFO  (qtp28991948-23831) [n:127.0.0.1:51314_solr    ] o.a.s.s.HttpSolrCall [admin] webapp=null path=/admin/collections params={action=LIST&delegation=GgADYmFyA2JhcgCKAVc50RggigFXXd2cIAwCFJ2jY1y8ii8L40A_SigmByEK2cTZB3NvbHItZHQA&wt=javabin&version=2} status=0 QTime=0
   [junit4]   2> 3088289 INFO  (TEST-TestSolrCloudWithDelegationTokens.testDelegationTokenRenew-seed#[7ED9EC9E3B1A767A]) [    ] o.a.s.SolrTestCaseJ4 ###Ending testDelegationTokenRenew
   [junit4]   2> 3088290 INFO  (jetty-launcher-3868-thread-2) [    ] o.e.j.s.ServerConnector Stopped ServerConnector@1827fbf{HTTP/1.1,[http/1.1]}{127.0.0.1:0}
   [junit4]   2> 3088293 INFO  (jetty-launcher-3868-thread-1) [    ] o.e.j.s.ServerConnector Stopped ServerConnector@686df4{HTTP/1.1,[http/1.1]}{127.0.0.1:0}
   [junit4]   2> 3088293 INFO  (jetty-launcher-3868-thread-2) [    ] o.a.s.c.CoreContainer Shutting down CoreContainer instance=12450767
   [junit4]   2> 3088293 INFO  (jetty-launcher-3868-thread-1) [    ] o.a.s.c.CoreContainer Shutting down CoreContainer instance=19420120
   [junit4]   2> 3088294 INFO  (jetty-launcher-3868-thread-2) [    ] o.a.s.c.ZkController Publish node=127.0.0.1:51311_solr as DOWN
   [junit4]   2> 3088294 INFO  (jetty-launcher-3868-thread-1) [    ] o.a.s.c.ZkController Publish node=127.0.0.1:51314_solr as DOWN
   [junit4]   2> 3088301 INFO  (jetty-launcher-3868-thread-2) [    ] o.a.s.c.Overseer Overseer (id=96609487000371206-127.0.0.1:51311_solr-n_0000000000) closing
   [junit4]   2> 3088302 INFO  (OverseerStateUpdate-96609487000371206-127.0.0.1:51311_solr-n_0000000000) [n:127.0.0.1:51311_solr    ] o.a.s.c.Overseer Overseer Loop exiting : 127.0.0.1:51311_solr
   [junit4]   2> 3088303 INFO  (zkCallback-3878-thread-1-processing-n:127.0.0.1:51314_solr) [n:127.0.0.1:51314_solr    ] o.a.s.c.c.ZkStateReader A live node change: [WatchedEvent state:SyncConnected type:NodeChildrenChanged path:/live_nodes], has occurred - updating... (live nodes size: [2])
   [junit4]   2> 3088303 WARN  (zkCallback-3878-thread-1-processing-n:127.0.0.1:51314_solr) [n:127.0.0.1:51314_solr    ] o.a.s.c.c.ZkStateReader ZooKeeper watch triggered, but Solr cannot talk to ZK: [KeeperErrorCode = Session expired for /live_nodes]
   [junit4]   2> 3088303 INFO  (zkCallback-3879-thread-1-processing-n:127.0.0.1:51311_solr) [n:127.0.0.1:51311_solr    ] o.a.s.c.c.ZkStateReader A live node change: [WatchedEvent state:SyncConnected type:NodeChildrenChanged path:/live_nodes], has occurred - updating... (live nodes size: [2])
   [junit4]   2> 3088303 WARN  (zkCallback-3879-thread-1-processing-n:127.0.0.1:51311_solr) [n:127.0.0.1:51311_solr    ] o.a.s.c.c.ZkStateReader ZooKeeper watch triggered, but Solr cannot talk to ZK: [KeeperErrorCode = Session expired for /live_nodes]
   [junit4]   2> 3088303 ERROR (Thread[Thread-5450,5,TGRP-TestSolrCloudWithDelegationTokens]) [n:127.0.0.1:51314_solr    ] o.a.h.s.t.d.AbstractDelegationTokenSecretManager ExpiredTokenRemover received java.lang.InterruptedException: sleep interrupted
   [junit4]   2> 3088304 ERROR (Thread[Thread-5447,5,TGRP-TestSolrCloudWithDelegationTokens]) [n:127.0.0.1:51311_solr    ] o.a.h.s.t.d.AbstractDelegationTokenSecretManager ExpiredTokenRemover received java.lang.InterruptedException: sleep interrupted
   [junit4]   2> 3088309 INFO  (jetty-launcher-3868-thread-1) [    ] o.e.j.s.h.ContextHandler Stopped o.e.j.s.ServletContextHandler@1ffb58a{/solr,null,UNAVAILABLE}
   [junit4]   2> 3088310 WARN  (NIOServerCxn.Factory:0.0.0.0/0.0.0.0:0) [    ] o.a.z.s.NIOServerCnxn caught end of stream exception
   [junit4]   2> EndOfStreamException: Unable to read additional data from client sessionid 0x15739d10a970008, likely client has closed socket
   [junit4]   2> 	at org.apache.zookeeper.server.NIOServerCnxn.doIO(NIOServerCnxn.java:228)
   [junit4]   2> 	at org.apache.zookeeper.server.NIOServerCnxnFactory.run(NIOServerCnxnFactory.java:208)
   [junit4]   2> 	at java.lang.Thread.run(Thread.java:745)
   [junit4]   2> 3088310 INFO  (jetty-launcher-3868-thread-2) [    ] o.e.j.s.h.ContextHandler Stopped o.e.j.s.ServletContextHandler@57d191{/solr,null,UNAVAILABLE}
   [junit4]   2> 3088314 INFO  (SUITE-TestSolrCloudWithDelegationTokens-seed#[7ED9EC9E3B1A767A]-worker) [    ] o.a.s.c.ZkTestServer connecting to 127.0.0.1:51307 51307
   [junit4]   2> 3088315 INFO  (Thread-5424) [    ] o.a.s.c.ZkTestServer connecting to 127.0.0.1:51307 51307
   [junit4]   2> 3088316 WARN  (Thread-5424) [    ] o.a.s.c.ZkTestServer Watch limit violations: 
   [junit4]   2> Maximum concurrent create/delete watches above limit:
   [junit4]   2> 
   [junit4]   2> 	2	/solr/aliases.json
   [junit4]   2> 	2	/solr/security.json
   [junit4]   2> 	2	/solr/clusterprops.json
   [junit4]   2> 
   [junit4]   2> Maximum concurrent data watches above limit:
   [junit4]   2> 
   [junit4]   2> 	2	/solr/security/zkdtsm/ZKDTSMRoot/ZKDTSMTokensRoot/DT_7
   [junit4]   2> 	2	/solr/security/zkdtsm/ZKDTSMRoot/ZKDTSMTokensRoot/DT_6
   [junit4]   2> 	2	/solr/security/zkdtsm/ZKDTSMRoot/ZKDTSMTokensRoot/DT_9
   [junit4]   2> 	2	/solr/security/zkdtsm/ZKDTSMRoot/ZKDTSMTokensRoot/DT_8
   [junit4]   2> 	2	/solr/security/zkdtsm/ZKDTSMRoot/ZKDTSMKeyIdRoot
   [junit4]   2> 	2	/solr/security/zkdtsm/ZKDTSMRoot/ZKDTSMMasterKeyRoot/DK_1
   [junit4]   2> 	2	/solr/security/zkdtsm/ZKDTSMRoot/ZKDTSMTokensRoot/DT_1
   [junit4]   2> 	2	/solr/security/zkdtsm/ZKDTSMRoot/ZKDTSMMasterKeyRoot/DK_3
   [junit4]   2> 	2	/solr/security/zkdtsm/ZKDTSMRoot/ZKDTSMTokensRoot/DT_3
   [junit4]   2> 	2	/solr/security/zkdtsm/ZKDTSMRoot/ZKDTSMMasterKeyRoot/DK_2
   [junit4]   2> 	2	/solr/security/zkdtsm/ZKDTSMRoot/ZKDTSMTokensRoot/DT_2
   [junit4]   2> 	2	/solr/clusterstate.json
   [junit4]   2> 	2	/solr/security/zkdtsm/ZKDTSMRoot/ZKDTSMTokensRoot/DT_5
   [junit4]   2> 	2	/solr/security/zkdtsm/ZKDTSMRoot/ZKDTSMMasterKeyRoot/DK_4
   [junit4]   2> 	2	/solr/security/zkdtsm/ZKDTSMRoot/ZKDTSMTokensRoot/DT_4
   [junit4]   2> 	2	/solr/security/zkdtsm/ZKDTSMRoot/ZKDTSMTokensRoot/DT_12
   [junit4]   2> 	2	/solr/security/zkdtsm/ZKDTSMRoot/ZKDTSMSeqNumRoot
   [junit4]   2> 	2	/solr/security/zkdtsm/ZKDTSMRoot/ZKDTSMTokensRoot/DT_11
   [junit4]   2> 	2	/solr/security/zkdtsm/ZKDTSMRoot/ZKDTSMTokensRoot/DT_10
   [junit4]   2> 
   [junit4]   2> Maximum concurrent children watches above limit:
   [junit4]   2> 
   [junit4]   2> 	3	/solr/overseer/queue
   [junit4]   2> 	3	/solr/overseer/collection-queue-work
   [junit4]   2> 	2	/solr/live_nodes
   [junit4]   2> 	2	/solr/collections
   [junit4]   2> 	2	/solr/security/zkdtsm/ZKDTSMRoot/ZKDTSMMasterKeyRoot
   [junit4]   2> 	2	/solr/overseer/queue-work
   [junit4]   2> 	2	/solr/security/zkdtsm/ZKDTSMRoot/ZKDTSMTokensRoot
   [junit4]   2> 
   [junit4]   2> 3088317 INFO  (SUITE-TestSolrCloudWithDelegationTokens-seed#[7ED9EC9E3B1A767A]-worker) [    ] o.a.s.SolrTestCaseJ4 ###deleteCore
   [junit4]   2> NOTE: leaving temporary files on disk at: C:\Users\jenkins\workspace\Lucene-Solr-master-Windows\solr\build\solr-core\test\J1\temp\solr.cloud.TestSolrCloudWithDelegationTokens_7ED9EC9E3B1A767A-001
   [junit4]   2> Sep 17, 2016 8:23:07 PM com.carrotsearch.randomizedtesting.ThreadLeakControl checkThreadLeaks
   [junit4]   2> WARNING: Will linger awaiting termination of 5 leaked thread(s).
   [junit4]   2> NOTE: test params are: codec=Lucene62, sim=ClassicSimilarity, locale=es-PR, timezone=US/Arizona
   [junit4]   2> NOTE: Windows 10 10.0 x86/Oracle Corporation 1.8.0_102 (32-bit)/cpus=3,threads=1,free=308654080,total=518979584
   [junit4]   2> NOTE: All tests run in this JVM: [TestTolerantUpdateProcessorCloud, BadCopyFieldTest, TestSchemaNameResource, TestFastWriter, OverriddenZkACLAndCredentialsProvidersTest, TestMergePolicyConfig, ResourceLoaderTest, BasicAuthIntegrationTest, TestUtils, TestSuggestSpellingConverter, CoreAdminHandlerTest, TestFiltering, TestFieldCacheReopen, CoreMergeIndexesAdminHandlerTest, UUIDFieldTest, CdcrReplicationDistributedZkTest, SpellCheckCollatorTest, VMParamsZkACLAndCredentialsProvidersTest, TestOmitPositions, EchoParamsTest, NoCacheHeaderTest, SuggestComponentTest, DistributedQueryComponentCustomSortTest, ShardRoutingCustomTest, BlockDirectoryTest, TestJsonFacets, MinimalSchemaTest, SuggesterTest, TestNonDefinedSimilarityFactory, TestManagedSchema, AddSchemaFieldsUpdateProcessorFactoryTest, TestRandomFaceting, ConnectionReuseTest, UpdateRequestProcessorFactoryTest, QueryParsingTest, TestRestoreCore, HdfsNNFailoverTest, DirectUpdateHandlerOptimizeTest, TermVectorComponentTest, DateMathParserTest, DistributedFacetPivotLongTailTest, BasicZkTest, TestCodecSupport, TestReload, TestLMJelinekMercerSimilarityFactory, TestDFRSimilarityFactory, TestConfig, TestInitParams, TestReplicationHandlerBackup, DistanceFunctionTest, ResponseHeaderTest, TestClassicSimilarityFactory, TestTrackingShardHandlerFactory, ChaosMonkeySafeLeaderTest, NotRequiredUniqueKeyTest, LeaderElectionIntegrationTest, TestSizeLimitedDistributedMap, TestRangeQuery, FullSolrCloudDistribCmdsTest, TestFieldSortValues, DeleteReplicaTest, CSVRequestHandlerTest, ClassificationUpdateProcessorFactoryTest, TestSSLRandomization, TestSearchPerf, CloudExitableDirectoryReaderTest, PeerSyncReplicationTest, TestWriterPerf, ShowFileRequestHandlerTest, OpenCloseCoreStressTest, TestDocSet, TestDocBasedVersionConstraints, BitVectorTest, TestSearcherReuse, SuggesterTSTTest, TestJmxMonitoredMap, BasicFunctionalityTest, TestRandomFlRTGCloud, DefaultValueUpdateProcessorTest, TestLocalFSCloudBackupRestore, DistributedFacetPivotSmallTest, FieldAnalysisRequestHandlerTest, SaslZkACLProviderTest, TestPHPSerializedResponseWriter, SortByFunctionTest, SearchHandlerTest, TestFuzzyAnalyzedSuggestions, TestNumericTerms64, WrapperMergePolicyFactoryTest, TestSolrQueryParserResource, LoggingHandlerTest, DistributedSuggestComponentTest, TestCloudSchemaless, CustomCollectionTest, TestSolrFieldCacheMBean, TestImplicitCoreProperties, AutoCommitTest, HdfsSyncSliceTest, SpellPossibilityIteratorTest, SolrCloudExampleTest, ClusterStateTest, TestRuleBasedAuthorizationPlugin, SuggesterWFSTTest, SliceStateTest, HdfsChaosMonkeySafeLeaderTest, BJQParserTest, TestMiniSolrCloudCluster, TestLeaderElectionZkExpiry, TestFoldingMultitermQuery, ConvertedLegacyTest, DistributedQueueTest, SpellingQueryConverterTest, CollectionsAPIAsyncDistributedZkTest, TestAnalyzeInfixSuggestions, TestSolrConfigHandlerCloud, TestSubQueryTransformer, TestGraphMLResponseWriter, UUIDUpdateProcessorFallbackTest, TestHighFrequencyDictionaryFactory, TestHdfsUpdateLog, TestExactStatsCache, SortSpecParsingTest, TermVectorComponentDistributedTest, RollingRestartTest, ForceLeaderTest, TestBackupRepositoryFactory, BinaryUpdateRequestHandlerTest, TestJoin, TestBulkSchemaAPI, TestNoOpRegenerator, TestSmileRequest, CollectionsAPIDistributedZkTest, HdfsTlogReplayBufferedWhileIndexingTest, TestConfigSetsAPIZkFailure, FullHLLTest, DeleteStatusTest, ConnectionManagerTest, TestSimpleTrackingShardHandler, TestLuceneMatchVersion, PreAnalyzedFieldTest, ParsingFieldUpdateProcessorsTest, SharedFSAutoReplicaFailoverTest, SecurityConfHandlerTest, TestScoreJoinQPScore, TestXmlQParser, IndexSchemaTest, TestRealTimeGet, LeaderFailoverAfterPartitionTest, TestSolrCloudWithKerberosAlt, TestConfigSetsAPI, CachingDirectoryFactoryTest, OverseerModifyCollectionTest, DocValuesMissingTest, BasicDistributedZkTest, BasicDistributedZk2Test, UnloadDistributedZkTest, SyncSliceTest, TestReplicationHandler, TestDistributedGrouping, TestHashPartitioner, TestSolr4Spatial, SpellCheckComponentTest, TestGroupingSearch, SolrCmdDistributorTest, BadIndexSchemaTest, TestBadConfig, HighlighterTest, DistributedQueryElevationComponentTest, AnalysisAfterCoreReloadTest, DocValuesTest, IndexBasedSpellCheckerTest, TestQueryUtils, StandardRequestHandlerTest, TestReversedWildcardFilterFactory, FileBasedSpellCheckerTest, DocumentBuilderTest, TestIndexingPerformance, TestSolrQueryParser, ReturnFieldsTest, JSONWriterTest, MBeansHandlerTest, JsonLoaderTest, HighlighterConfigTest, TestQuerySenderListener, UpdateParamsTest, TestQuerySenderNoQuery, CopyFieldTest, SolrIndexConfigTest, BadComponentTest, TestSolrDeletionPolicy2, MultiTermTest, ExternalFileFieldSortTest, TestSolrCoreProperties, DirectSolrConnectionTest, SynonymTokenizerTest, TestLMDirichletSimilarityFactory, TestIBSimilarityFactory, TestBM25SimilarityFactory, ScriptEngineTest, URLClassifyProcessorTest, PluginInfoTest, TestFastLRUCache, ChaosMonkeyNothingIsSafeTest, TestHighlightDedupGrouping, AsyncCallRequestStatusResponseTest, BaseCdcrDistributedZkTest, CdcrReplicationHandlerTest, CdcrRequestHandlerTest, CleanupOldIndexTest, CollectionsAPISolrJTest, DeleteLastCustomShardedReplicaTest, DeleteNodeTest, DistribDocExpirationUpdateProcessorTest, HttpPartitionTest, ReplaceNodeTest, SolrCLIZkUtilsTest, TestAuthenticationFramework, TestCloudPseudoReturnFields, TestCollectionAPI, TestLeaderInitiatedRecoveryThread, TestOnReconnectListenerSupport, TestReplicaProperties, TestRequestForwarding, TestShortCircuitedRequests, TestSolrCloudWithDelegationTokens]
   [junit4] Completed [487/631 (1!)] on J1 in 4.60s, 8 tests, 1 failure <<< FAILURES!

[...truncated 53008 lines...]


Mime
View raw message