lucene-dev mailing list archives

Site index · List index
Message view « Date » · « Thread »
Top « Date » · « Thread »
From Apache Jenkins Server <jenk...@builds.apache.org>
Subject [JENKINS] Lucene-Solr-Tests-6.x - Build # 447 - Still Unstable
Date Sun, 11 Sep 2016 15:37:27 GMT
Build: https://builds.apache.org/job/Lucene-Solr-Tests-6.x/447/

1 tests failed.
FAILED:  org.apache.solr.security.BasicAuthIntegrationTest.testBasicAuth

Error Message:
IOException occured when talking to server at: https://127.0.0.1:57982/solr

Stack Trace:
org.apache.solr.client.solrj.SolrServerException: IOException occured when talking to server at: https://127.0.0.1:57982/solr
	at __randomizedtesting.SeedInfo.seed([E2BD62B168305F97:5ED314A3CC63DCED]:0)
	at org.apache.solr.client.solrj.impl.HttpSolrClient.executeMethod(HttpSolrClient.java:606)
	at org.apache.solr.client.solrj.impl.HttpSolrClient.request(HttpSolrClient.java:261)
	at org.apache.solr.client.solrj.impl.HttpSolrClient.request(HttpSolrClient.java:250)
	at org.apache.solr.client.solrj.SolrClient.request(SolrClient.java:1219)
	at org.apache.solr.security.BasicAuthIntegrationTest.testBasicAuth(BasicAuthIntegrationTest.java:158)
	at sun.reflect.NativeMethodAccessorImpl.invoke0(Native Method)
	at sun.reflect.NativeMethodAccessorImpl.invoke(NativeMethodAccessorImpl.java:62)
	at sun.reflect.DelegatingMethodAccessorImpl.invoke(DelegatingMethodAccessorImpl.java:43)
	at java.lang.reflect.Method.invoke(Method.java:498)
	at com.carrotsearch.randomizedtesting.RandomizedRunner.invoke(RandomizedRunner.java:1764)
	at com.carrotsearch.randomizedtesting.RandomizedRunner$8.evaluate(RandomizedRunner.java:871)
	at com.carrotsearch.randomizedtesting.RandomizedRunner$9.evaluate(RandomizedRunner.java:907)
	at com.carrotsearch.randomizedtesting.RandomizedRunner$10.evaluate(RandomizedRunner.java:921)
	at com.carrotsearch.randomizedtesting.rules.SystemPropertiesRestoreRule$1.evaluate(SystemPropertiesRestoreRule.java:57)
	at org.apache.lucene.util.TestRuleSetupTeardownChained$1.evaluate(TestRuleSetupTeardownChained.java:49)
	at org.apache.lucene.util.AbstractBeforeAfterRule$1.evaluate(AbstractBeforeAfterRule.java:45)
	at org.apache.lucene.util.TestRuleThreadAndTestName$1.evaluate(TestRuleThreadAndTestName.java:48)
	at org.apache.lucene.util.TestRuleIgnoreAfterMaxFailures$1.evaluate(TestRuleIgnoreAfterMaxFailures.java:64)
	at org.apache.lucene.util.TestRuleMarkFailure$1.evaluate(TestRuleMarkFailure.java:47)
	at com.carrotsearch.randomizedtesting.rules.StatementAdapter.evaluate(StatementAdapter.java:36)
	at com.carrotsearch.randomizedtesting.ThreadLeakControl$StatementRunner.run(ThreadLeakControl.java:367)
	at com.carrotsearch.randomizedtesting.ThreadLeakControl.forkTimeoutingTask(ThreadLeakControl.java:809)
	at com.carrotsearch.randomizedtesting.ThreadLeakControl$3.evaluate(ThreadLeakControl.java:460)
	at com.carrotsearch.randomizedtesting.RandomizedRunner.runSingleTest(RandomizedRunner.java:880)
	at com.carrotsearch.randomizedtesting.RandomizedRunner$5.evaluate(RandomizedRunner.java:781)
	at com.carrotsearch.randomizedtesting.RandomizedRunner$6.evaluate(RandomizedRunner.java:816)
	at com.carrotsearch.randomizedtesting.RandomizedRunner$7.evaluate(RandomizedRunner.java:827)
	at com.carrotsearch.randomizedtesting.rules.StatementAdapter.evaluate(StatementAdapter.java:36)
	at com.carrotsearch.randomizedtesting.rules.SystemPropertiesRestoreRule$1.evaluate(SystemPropertiesRestoreRule.java:57)
	at org.apache.lucene.util.AbstractBeforeAfterRule$1.evaluate(AbstractBeforeAfterRule.java:45)
	at com.carrotsearch.randomizedtesting.rules.StatementAdapter.evaluate(StatementAdapter.java:36)
	at org.apache.lucene.util.TestRuleStoreClassName$1.evaluate(TestRuleStoreClassName.java:41)
	at com.carrotsearch.randomizedtesting.rules.NoShadowingOrOverridesOnMethodsRule$1.evaluate(NoShadowingOrOverridesOnMethodsRule.java:40)
	at com.carrotsearch.randomizedtesting.rules.NoShadowingOrOverridesOnMethodsRule$1.evaluate(NoShadowingOrOverridesOnMethodsRule.java:40)
	at com.carrotsearch.randomizedtesting.rules.StatementAdapter.evaluate(StatementAdapter.java:36)
	at com.carrotsearch.randomizedtesting.rules.StatementAdapter.evaluate(StatementAdapter.java:36)
	at com.carrotsearch.randomizedtesting.rules.StatementAdapter.evaluate(StatementAdapter.java:36)
	at org.apache.lucene.util.TestRuleAssertionsRequired$1.evaluate(TestRuleAssertionsRequired.java:53)
	at org.apache.lucene.util.TestRuleMarkFailure$1.evaluate(TestRuleMarkFailure.java:47)
	at org.apache.lucene.util.TestRuleIgnoreAfterMaxFailures$1.evaluate(TestRuleIgnoreAfterMaxFailures.java:64)
	at org.apache.lucene.util.TestRuleIgnoreTestSuites$1.evaluate(TestRuleIgnoreTestSuites.java:54)
	at com.carrotsearch.randomizedtesting.rules.StatementAdapter.evaluate(StatementAdapter.java:36)
	at com.carrotsearch.randomizedtesting.ThreadLeakControl$StatementRunner.run(ThreadLeakControl.java:367)
	at java.lang.Thread.run(Thread.java:745)
Caused by: javax.net.ssl.SSLHandshakeException: sun.security.validator.ValidatorException: PKIX path building failed: sun.security.provider.certpath.SunCertPathBuilderException: unable to find valid certification path to requested target
	at sun.security.ssl.Alerts.getSSLException(Alerts.java:192)
	at sun.security.ssl.SSLSocketImpl.fatal(SSLSocketImpl.java:1949)
	at sun.security.ssl.Handshaker.fatalSE(Handshaker.java:302)
	at sun.security.ssl.Handshaker.fatalSE(Handshaker.java:296)
	at sun.security.ssl.ClientHandshaker.serverCertificate(ClientHandshaker.java:1509)
	at sun.security.ssl.ClientHandshaker.processMessage(ClientHandshaker.java:216)
	at sun.security.ssl.Handshaker.processLoop(Handshaker.java:979)
	at sun.security.ssl.Handshaker.process_record(Handshaker.java:914)
	at sun.security.ssl.SSLSocketImpl.readRecord(SSLSocketImpl.java:1062)
	at sun.security.ssl.SSLSocketImpl.performInitialHandshake(SSLSocketImpl.java:1375)
	at sun.security.ssl.SSLSocketImpl.startHandshake(SSLSocketImpl.java:1403)
	at sun.security.ssl.SSLSocketImpl.startHandshake(SSLSocketImpl.java:1387)
	at org.apache.http.conn.ssl.SSLSocketFactory.connectSocket(SSLSocketFactory.java:543)
	at org.apache.http.conn.ssl.SSLSocketFactory.connectSocket(SSLSocketFactory.java:409)
	at org.apache.http.impl.conn.DefaultClientConnectionOperator.openConnection(DefaultClientConnectionOperator.java:177)
	at org.apache.http.impl.conn.ManagedClientConnectionImpl.open(ManagedClientConnectionImpl.java:304)
	at org.apache.http.impl.client.DefaultRequestDirector.tryConnect(DefaultRequestDirector.java:611)
	at org.apache.http.impl.client.DefaultRequestDirector.execute(DefaultRequestDirector.java:446)
	at org.apache.http.impl.client.AbstractHttpClient.doExecute(AbstractHttpClient.java:882)
	at org.apache.http.impl.client.CloseableHttpClient.execute(CloseableHttpClient.java:82)
	at org.apache.http.impl.client.CloseableHttpClient.execute(CloseableHttpClient.java:107)
	at org.apache.http.impl.client.CloseableHttpClient.execute(CloseableHttpClient.java:55)
	at org.apache.solr.client.solrj.impl.HttpSolrClient.executeMethod(HttpSolrClient.java:497)
	... 43 more
Caused by: sun.security.validator.ValidatorException: PKIX path building failed: sun.security.provider.certpath.SunCertPathBuilderException: unable to find valid certification path to requested target
	at sun.security.validator.PKIXValidator.doBuild(PKIXValidator.java:387)
	at sun.security.validator.PKIXValidator.engineValidate(PKIXValidator.java:292)
	at sun.security.validator.Validator.validate(Validator.java:260)
	at sun.security.ssl.X509TrustManagerImpl.validate(X509TrustManagerImpl.java:324)
	at sun.security.ssl.X509TrustManagerImpl.checkTrusted(X509TrustManagerImpl.java:229)
	at sun.security.ssl.X509TrustManagerImpl.checkServerTrusted(X509TrustManagerImpl.java:124)
	at sun.security.ssl.ClientHandshaker.serverCertificate(ClientHandshaker.java:1491)
	... 61 more
Caused by: sun.security.provider.certpath.SunCertPathBuilderException: unable to find valid certification path to requested target
	at sun.security.provider.certpath.SunCertPathBuilder.build(SunCertPathBuilder.java:141)
	at sun.security.provider.certpath.SunCertPathBuilder.engineBuild(SunCertPathBuilder.java:126)
	at java.security.cert.CertPathBuilder.build(CertPathBuilder.java:280)
	at sun.security.validator.PKIXValidator.doBuild(PKIXValidator.java:382)
	... 67 more




Build Log:
[...truncated 12539 lines...]
   [junit4] Suite: org.apache.solr.security.BasicAuthIntegrationTest
   [junit4]   2> Creating dataDir: /x1/jenkins/jenkins-slave/workspace/Lucene-Solr-Tests-6.x/solr/build/solr-core/test/J2/temp/solr.security.BasicAuthIntegrationTest_E2BD62B168305F97-001/init-core-data-001
   [junit4]   2> 3539168 INFO  (SUITE-BasicAuthIntegrationTest-seed#[E2BD62B168305F97]-worker) [    ] o.a.s.SolrTestCaseJ4 Randomized ssl (true) and clientAuth (false) via: @org.apache.solr.util.RandomizeSSL(reason=, ssl=NaN, value=NaN, clientAuth=NaN)
   [junit4]   2> 3539173 INFO  (SUITE-BasicAuthIntegrationTest-seed#[E2BD62B168305F97]-worker) [    ] o.a.s.c.ZkTestServer STARTING ZK TEST SERVER
   [junit4]   2> 3539176 INFO  (Thread-4959) [    ] o.a.s.c.ZkTestServer client port:0.0.0.0/0.0.0.0:0
   [junit4]   2> 3539176 INFO  (Thread-4959) [    ] o.a.s.c.ZkTestServer Starting server
   [junit4]   2> 3539280 INFO  (SUITE-BasicAuthIntegrationTest-seed#[E2BD62B168305F97]-worker) [    ] o.a.s.c.ZkTestServer start zk server on port:50532
   [junit4]   2> 3539280 INFO  (SUITE-BasicAuthIntegrationTest-seed#[E2BD62B168305F97]-worker) [    ] o.a.s.c.c.SolrZkClient Using default ZkCredentialsProvider
   [junit4]   2> 3539281 INFO  (SUITE-BasicAuthIntegrationTest-seed#[E2BD62B168305F97]-worker) [    ] o.a.s.c.c.ConnectionManager Waiting for client to connect to ZooKeeper
   [junit4]   2> 3539282 INFO  (zkCallback-4639-thread-1) [    ] o.a.s.c.c.ConnectionManager Watcher org.apache.solr.common.cloud.ConnectionManager@1451e062 name:ZooKeeperConnection Watcher:127.0.0.1:50532 got event WatchedEvent state:SyncConnected type:None path:null path:null type:None
   [junit4]   2> 3539282 INFO  (SUITE-BasicAuthIntegrationTest-seed#[E2BD62B168305F97]-worker) [    ] o.a.s.c.c.ConnectionManager Client is connected to ZooKeeper
   [junit4]   2> 3539283 INFO  (SUITE-BasicAuthIntegrationTest-seed#[E2BD62B168305F97]-worker) [    ] o.a.s.c.c.SolrZkClient Using default ZkACLProvider
   [junit4]   2> 3539283 INFO  (SUITE-BasicAuthIntegrationTest-seed#[E2BD62B168305F97]-worker) [    ] o.a.s.c.c.SolrZkClient makePath: /solr/solr.xml
   [junit4]   2> 3539292 INFO  (SUITE-BasicAuthIntegrationTest-seed#[E2BD62B168305F97]-worker) [    ] o.a.s.c.c.SolrZkClient makePath: /solr/clusterprops.json
   [junit4]   2> 3539305 INFO  (jetty-launcher-4638-thread-1) [    ] o.e.j.s.Server jetty-9.3.8.v20160314
   [junit4]   2> 3539307 INFO  (jetty-launcher-4638-thread-2) [    ] o.e.j.s.Server jetty-9.3.8.v20160314
   [junit4]   2> 3539313 INFO  (jetty-launcher-4638-thread-3) [    ] o.e.j.s.Server jetty-9.3.8.v20160314
   [junit4]   2> 3539336 INFO  (jetty-launcher-4638-thread-2) [    ] o.e.j.s.h.ContextHandler Started o.e.j.s.ServletContextHandler@4f723f55{/solr,null,AVAILABLE}
   [junit4]   2> 3539339 INFO  (jetty-launcher-4638-thread-2) [    ] o.e.j.s.ServerConnector Started ServerConnector@4ee09c9b{SSL,[ssl, http/1.1]}{127.0.0.1:48265}
   [junit4]   2> 3539339 INFO  (jetty-launcher-4638-thread-2) [    ] o.e.j.s.Server Started @3547579ms
   [junit4]   2> 3539339 INFO  (jetty-launcher-4638-thread-2) [    ] o.a.s.c.s.e.JettySolrRunner Jetty properties: {hostContext=/solr, hostPort=48265}
   [junit4]   2> 3539340 INFO  (jetty-launcher-4638-thread-2) [    ] o.a.s.s.SolrDispatchFilter SolrDispatchFilter.init(): sun.misc.Launcher$AppClassLoader@73d16e93
   [junit4]   2> 3539340 INFO  (jetty-launcher-4638-thread-2) [    ] o.a.s.c.SolrResourceLoader new SolrResourceLoader for directory: '/x1/jenkins/jenkins-slave/workspace/Lucene-Solr-Tests-6.x/solr/build/solr-core/test/J2/temp/solr.security.BasicAuthIntegrationTest_E2BD62B168305F97-001/tempDir-001/node2'
   [junit4]   2> 3539340 INFO  (jetty-launcher-4638-thread-2) [    ] o.a.s.c.SolrResourceLoader JNDI not configured for solr (NoInitialContextEx)
   [junit4]   2> 3539340 INFO  (jetty-launcher-4638-thread-2) [    ] o.a.s.c.SolrResourceLoader solr home defaulted to 'solr/' (could not find system property or JNDI)
   [junit4]   2> 3539340 INFO  (jetty-launcher-4638-thread-2) [    ] o.a.s.c.c.SolrZkClient Using default ZkCredentialsProvider
   [junit4]   2> 3539347 INFO  (jetty-launcher-4638-thread-1) [    ] o.e.j.s.h.ContextHandler Started o.e.j.s.ServletContextHandler@7fae98e3{/solr,null,AVAILABLE}
   [junit4]   2> 3539349 INFO  (jetty-launcher-4638-thread-1) [    ] o.e.j.s.ServerConnector Started ServerConnector@23b3f3f9{SSL,[ssl, http/1.1]}{127.0.0.1:40607}
   [junit4]   2> 3539349 INFO  (jetty-launcher-4638-thread-1) [    ] o.e.j.s.Server Started @3547588ms
   [junit4]   2> 3539349 INFO  (jetty-launcher-4638-thread-1) [    ] o.a.s.c.s.e.JettySolrRunner Jetty properties: {hostContext=/solr, hostPort=40607}
   [junit4]   2> 3539349 INFO  (jetty-launcher-4638-thread-1) [    ] o.a.s.s.SolrDispatchFilter SolrDispatchFilter.init(): sun.misc.Launcher$AppClassLoader@73d16e93
   [junit4]   2> 3539349 INFO  (jetty-launcher-4638-thread-1) [    ] o.a.s.c.SolrResourceLoader new SolrResourceLoader for directory: '/x1/jenkins/jenkins-slave/workspace/Lucene-Solr-Tests-6.x/solr/build/solr-core/test/J2/temp/solr.security.BasicAuthIntegrationTest_E2BD62B168305F97-001/tempDir-001/node1'
   [junit4]   2> 3539349 INFO  (jetty-launcher-4638-thread-1) [    ] o.a.s.c.SolrResourceLoader JNDI not configured for solr (NoInitialContextEx)
   [junit4]   2> 3539349 INFO  (jetty-launcher-4638-thread-1) [    ] o.a.s.c.SolrResourceLoader solr home defaulted to 'solr/' (could not find system property or JNDI)
   [junit4]   2> 3539350 INFO  (jetty-launcher-4638-thread-1) [    ] o.a.s.c.c.SolrZkClient Using default ZkCredentialsProvider
   [junit4]   2> 3539357 INFO  (jetty-launcher-4638-thread-1) [    ] o.a.s.c.c.ConnectionManager Waiting for client to connect to ZooKeeper
   [junit4]   2> 3539358 INFO  (zkCallback-4641-thread-1) [    ] o.a.s.c.c.ConnectionManager Watcher org.apache.solr.common.cloud.ConnectionManager@1fddd802 name:ZooKeeperConnection Watcher:127.0.0.1:50532/solr got event WatchedEvent state:SyncConnected type:None path:null path:null type:None
   [junit4]   2> 3539358 INFO  (jetty-launcher-4638-thread-1) [    ] o.a.s.c.c.ConnectionManager Client is connected to ZooKeeper
   [junit4]   2> 3539358 INFO  (jetty-launcher-4638-thread-1) [    ] o.a.s.c.c.SolrZkClient Using default ZkACLProvider
   [junit4]   2> 3539358 INFO  (jetty-launcher-4638-thread-1) [    ] o.a.s.s.SolrDispatchFilter solr.xml found in ZooKeeper. Loading...
   [junit4]   2> 3539377 INFO  (jetty-launcher-4638-thread-3) [    ] o.e.j.s.h.ContextHandler Started o.e.j.s.ServletContextHandler@5b333e5b{/solr,null,AVAILABLE}
   [junit4]   2> 3539378 INFO  (jetty-launcher-4638-thread-3) [    ] o.e.j.s.ServerConnector Started ServerConnector@2b4970eb{SSL,[ssl, http/1.1]}{127.0.0.1:57982}
   [junit4]   2> 3539378 INFO  (jetty-launcher-4638-thread-3) [    ] o.e.j.s.Server Started @3547618ms
   [junit4]   2> 3539378 INFO  (jetty-launcher-4638-thread-3) [    ] o.a.s.c.s.e.JettySolrRunner Jetty properties: {hostContext=/solr, hostPort=57982}
   [junit4]   2> 3539379 INFO  (jetty-launcher-4638-thread-3) [    ] o.a.s.s.SolrDispatchFilter SolrDispatchFilter.init(): sun.misc.Launcher$AppClassLoader@73d16e93
   [junit4]   2> 3539379 INFO  (jetty-launcher-4638-thread-3) [    ] o.a.s.c.SolrResourceLoader new SolrResourceLoader for directory: '/x1/jenkins/jenkins-slave/workspace/Lucene-Solr-Tests-6.x/solr/build/solr-core/test/J2/temp/solr.security.BasicAuthIntegrationTest_E2BD62B168305F97-001/tempDir-001/node3'
   [junit4]   2> 3539379 INFO  (jetty-launcher-4638-thread-3) [    ] o.a.s.c.SolrResourceLoader JNDI not configured for solr (NoInitialContextEx)
   [junit4]   2> 3539379 INFO  (jetty-launcher-4638-thread-3) [    ] o.a.s.c.SolrResourceLoader solr home defaulted to 'solr/' (could not find system property or JNDI)
   [junit4]   2> 3539379 INFO  (jetty-launcher-4638-thread-3) [    ] o.a.s.c.c.SolrZkClient Using default ZkCredentialsProvider
   [junit4]   2> 3539388 INFO  (jetty-launcher-4638-thread-3) [    ] o.a.s.c.c.ConnectionManager Waiting for client to connect to ZooKeeper
   [junit4]   2> 3539389 INFO  (jetty-launcher-4638-thread-2) [    ] o.a.s.c.c.ConnectionManager Waiting for client to connect to ZooKeeper
   [junit4]   2> 3539389 INFO  (jetty-launcher-4638-thread-1) [    ] o.a.s.c.CorePropertiesLocator Config-defined core root directory: /x1/jenkins/jenkins-slave/workspace/Lucene-Solr-Tests-6.x/solr/build/solr-core/test/J2/temp/solr.security.BasicAuthIntegrationTest_E2BD62B168305F97-001/tempDir-001/node1/.
   [junit4]   2> 3539389 INFO  (jetty-launcher-4638-thread-1) [    ] o.a.s.c.CoreContainer New CoreContainer 1086985245
   [junit4]   2> 3539389 INFO  (jetty-launcher-4638-thread-1) [    ] o.a.s.c.CoreContainer Loading cores into CoreContainer [instanceDir=/x1/jenkins/jenkins-slave/workspace/Lucene-Solr-Tests-6.x/solr/build/solr-core/test/J2/temp/solr.security.BasicAuthIntegrationTest_E2BD62B168305F97-001/tempDir-001/node1]
   [junit4]   2> 3539389 WARN  (jetty-launcher-4638-thread-1) [    ] o.a.s.c.CoreContainer Couldn't add files from /x1/jenkins/jenkins-slave/workspace/Lucene-Solr-Tests-6.x/solr/build/solr-core/test/J2/temp/solr.security.BasicAuthIntegrationTest_E2BD62B168305F97-001/tempDir-001/node1/lib to classpath: /x1/jenkins/jenkins-slave/workspace/Lucene-Solr-Tests-6.x/solr/build/solr-core/test/J2/temp/solr.security.BasicAuthIntegrationTest_E2BD62B168305F97-001/tempDir-001/node1/lib
   [junit4]   2> 3539390 INFO  (jetty-launcher-4638-thread-1) [    ] o.a.s.h.c.HttpShardHandlerFactory created with socketTimeout : 90000,urlScheme : https,connTimeout : 15000,maxConnectionsPerHost : 20,maxConnections : 10000,corePoolSize : 0,maximumPoolSize : 2147483647,maxThreadIdleTime : 5,sizeOfQueue : -1,fairnessPolicy : false,useRetries : false,connectionsEvictorSleepDelay : 5000,maxConnectionIdleTime : 40000,
   [junit4]   2> 3539391 INFO  (jetty-launcher-4638-thread-1) [    ] o.a.s.u.UpdateShardHandler Creating UpdateShardHandler HTTP client with params: socketTimeout=340000&connTimeout=45000&retry=true
   [junit4]   2> 3539391 INFO  (jetty-launcher-4638-thread-1) [    ] o.a.s.l.LogWatcher SLF4J impl is org.slf4j.impl.Log4jLoggerFactory
   [junit4]   2> 3539391 INFO  (jetty-launcher-4638-thread-1) [    ] o.a.s.l.LogWatcher Registering Log Listener [Log4j (org.slf4j.impl.Log4jLoggerFactory)]
   [junit4]   2> 3539392 INFO  (jetty-launcher-4638-thread-1) [    ] o.a.s.c.ZkContainer Zookeeper client=127.0.0.1:50532/solr
   [junit4]   2> 3539392 INFO  (jetty-launcher-4638-thread-1) [    ] o.a.s.c.ZkController zkHost includes chroot
   [junit4]   2> 3539392 INFO  (jetty-launcher-4638-thread-1) [    ] o.a.s.c.c.SolrZkClient Using default ZkCredentialsProvider
   [junit4]   2> 3539394 INFO  (zkCallback-4642-thread-1) [    ] o.a.s.c.c.ConnectionManager Watcher org.apache.solr.common.cloud.ConnectionManager@5bce128 name:ZooKeeperConnection Watcher:127.0.0.1:50532/solr got event WatchedEvent state:SyncConnected type:None path:null path:null type:None
   [junit4]   2> 3539431 INFO  (jetty-launcher-4638-thread-3) [    ] o.a.s.c.c.ConnectionManager Client is connected to ZooKeeper
   [junit4]   2> 3539431 INFO  (jetty-launcher-4638-thread-3) [    ] o.a.s.c.c.SolrZkClient Using default ZkACLProvider
   [junit4]   2> 3539431 INFO  (jetty-launcher-4638-thread-1) [    ] o.a.s.c.c.ConnectionManager Waiting for client to connect to ZooKeeper
   [junit4]   2> 3539436 INFO  (jetty-launcher-4638-thread-3) [    ] o.a.s.s.SolrDispatchFilter solr.xml found in ZooKeeper. Loading...
   [junit4]   2> 3539437 INFO  (zkCallback-4640-thread-1) [    ] o.a.s.c.c.ConnectionManager Watcher org.apache.solr.common.cloud.ConnectionManager@50f4a323 name:ZooKeeperConnection Watcher:127.0.0.1:50532/solr got event WatchedEvent state:SyncConnected type:None path:null path:null type:None
   [junit4]   2> 3539440 INFO  (jetty-launcher-4638-thread-2) [    ] o.a.s.c.c.ConnectionManager Client is connected to ZooKeeper
   [junit4]   2> 3539440 INFO  (jetty-launcher-4638-thread-2) [    ] o.a.s.c.c.SolrZkClient Using default ZkACLProvider
   [junit4]   2> 3539440 INFO  (jetty-launcher-4638-thread-2) [    ] o.a.s.s.SolrDispatchFilter solr.xml found in ZooKeeper. Loading...
   [junit4]   2> 3539646 INFO  (zkCallback-4645-thread-1) [    ] o.a.s.c.c.ConnectionManager Watcher org.apache.solr.common.cloud.ConnectionManager@6578f1d name:ZooKeeperConnection Watcher:127.0.0.1:50532 got event WatchedEvent state:SyncConnected type:None path:null path:null type:None
   [junit4]   2> 3539646 INFO  (jetty-launcher-4638-thread-3) [    ] o.a.s.c.CorePropertiesLocator Config-defined core root directory: /x1/jenkins/jenkins-slave/workspace/Lucene-Solr-Tests-6.x/solr/build/solr-core/test/J2/temp/solr.security.BasicAuthIntegrationTest_E2BD62B168305F97-001/tempDir-001/node3/.
   [junit4]   2> 3539646 INFO  (jetty-launcher-4638-thread-1) [    ] o.a.s.c.c.ConnectionManager Client is connected to ZooKeeper
   [junit4]   2> 3539646 INFO  (jetty-launcher-4638-thread-3) [    ] o.a.s.c.CoreContainer New CoreContainer 2082641281
   [junit4]   2> 3539646 INFO  (jetty-launcher-4638-thread-3) [    ] o.a.s.c.CoreContainer Loading cores into CoreContainer [instanceDir=/x1/jenkins/jenkins-slave/workspace/Lucene-Solr-Tests-6.x/solr/build/solr-core/test/J2/temp/solr.security.BasicAuthIntegrationTest_E2BD62B168305F97-001/tempDir-001/node3]
   [junit4]   2> 3539646 INFO  (jetty-launcher-4638-thread-1) [    ] o.a.s.c.c.SolrZkClient Using default ZkACLProvider
   [junit4]   2> 3539646 WARN  (jetty-launcher-4638-thread-3) [    ] o.a.s.c.CoreContainer Couldn't add files from /x1/jenkins/jenkins-slave/workspace/Lucene-Solr-Tests-6.x/solr/build/solr-core/test/J2/temp/solr.security.BasicAuthIntegrationTest_E2BD62B168305F97-001/tempDir-001/node3/lib to classpath: /x1/jenkins/jenkins-slave/workspace/Lucene-Solr-Tests-6.x/solr/build/solr-core/test/J2/temp/solr.security.BasicAuthIntegrationTest_E2BD62B168305F97-001/tempDir-001/node3/lib
   [junit4]   2> 3539647 INFO  (jetty-launcher-4638-thread-3) [    ] o.a.s.h.c.HttpShardHandlerFactory created with socketTimeout : 90000,urlScheme : https,connTimeout : 15000,maxConnectionsPerHost : 20,maxConnections : 10000,corePoolSize : 0,maximumPoolSize : 2147483647,maxThreadIdleTime : 5,sizeOfQueue : -1,fairnessPolicy : false,useRetries : false,connectionsEvictorSleepDelay : 5000,maxConnectionIdleTime : 40000,
   [junit4]   2> 3539647 INFO  (jetty-launcher-4638-thread-1) [n:127.0.0.1:40607_solr    ] o.a.s.c.ZkController Added new OnReconnect listener org.apache.solr.cloud.ZkController$$Lambda$104/120540199@69624f56
   [junit4]   2> 3539648 INFO  (jetty-launcher-4638-thread-3) [    ] o.a.s.u.UpdateShardHandler Creating UpdateShardHandler HTTP client with params: socketTimeout=340000&connTimeout=45000&retry=true
   [junit4]   2> 3539648 INFO  (jetty-launcher-4638-thread-2) [    ] o.a.s.c.CorePropertiesLocator Config-defined core root directory: /x1/jenkins/jenkins-slave/workspace/Lucene-Solr-Tests-6.x/solr/build/solr-core/test/J2/temp/solr.security.BasicAuthIntegrationTest_E2BD62B168305F97-001/tempDir-001/node2/.
   [junit4]   2> 3539648 INFO  (jetty-launcher-4638-thread-2) [    ] o.a.s.c.CoreContainer New CoreContainer 1754549001
   [junit4]   2> 3539648 INFO  (jetty-launcher-4638-thread-2) [    ] o.a.s.c.CoreContainer Loading cores into CoreContainer [instanceDir=/x1/jenkins/jenkins-slave/workspace/Lucene-Solr-Tests-6.x/solr/build/solr-core/test/J2/temp/solr.security.BasicAuthIntegrationTest_E2BD62B168305F97-001/tempDir-001/node2]
   [junit4]   2> 3539648 WARN  (jetty-launcher-4638-thread-2) [    ] o.a.s.c.CoreContainer Couldn't add files from /x1/jenkins/jenkins-slave/workspace/Lucene-Solr-Tests-6.x/solr/build/solr-core/test/J2/temp/solr.security.BasicAuthIntegrationTest_E2BD62B168305F97-001/tempDir-001/node2/lib to classpath: /x1/jenkins/jenkins-slave/workspace/Lucene-Solr-Tests-6.x/solr/build/solr-core/test/J2/temp/solr.security.BasicAuthIntegrationTest_E2BD62B168305F97-001/tempDir-001/node2/lib
   [junit4]   2> 3539648 INFO  (jetty-launcher-4638-thread-2) [    ] o.a.s.h.c.HttpShardHandlerFactory created with socketTimeout : 90000,urlScheme : https,connTimeout : 15000,maxConnectionsPerHost : 20,maxConnections : 10000,corePoolSize : 0,maximumPoolSize : 2147483647,maxThreadIdleTime : 5,sizeOfQueue : -1,fairnessPolicy : false,useRetries : false,connectionsEvictorSleepDelay : 5000,maxConnectionIdleTime : 40000,
   [junit4]   2> 3539649 INFO  (jetty-launcher-4638-thread-1) [n:127.0.0.1:40607_solr    ] o.a.s.c.c.ConnectionManager Waiting for client to connect to ZooKeeper
   [junit4]   2> 3539649 INFO  (jetty-launcher-4638-thread-3) [    ] o.a.s.l.LogWatcher SLF4J impl is org.slf4j.impl.Log4jLoggerFactory
   [junit4]   2> 3539649 INFO  (jetty-launcher-4638-thread-3) [    ] o.a.s.l.LogWatcher Registering Log Listener [Log4j (org.slf4j.impl.Log4jLoggerFactory)]
   [junit4]   2> 3539649 INFO  (jetty-launcher-4638-thread-3) [    ] o.a.s.c.ZkContainer Zookeeper client=127.0.0.1:50532/solr
   [junit4]   2> 3539649 INFO  (jetty-launcher-4638-thread-3) [    ] o.a.s.c.ZkController zkHost includes chroot
   [junit4]   2> 3539649 INFO  (jetty-launcher-4638-thread-3) [    ] o.a.s.c.c.SolrZkClient Using default ZkCredentialsProvider
   [junit4]   2> 3539651 INFO  (jetty-launcher-4638-thread-3) [    ] o.a.s.c.c.ConnectionManager Waiting for client to connect to ZooKeeper
   [junit4]   2> 3539651 INFO  (jetty-launcher-4638-thread-2) [    ] o.a.s.u.UpdateShardHandler Creating UpdateShardHandler HTTP client with params: socketTimeout=340000&connTimeout=45000&retry=true
   [junit4]   2> 3539654 INFO  (zkCallback-4649-thread-1) [    ] o.a.s.c.c.ConnectionManager Watcher org.apache.solr.common.cloud.ConnectionManager@3d432e39 name:ZooKeeperConnection Watcher:127.0.0.1:50532 got event WatchedEvent state:SyncConnected type:None path:null path:null type:None
   [junit4]   2> 3539654 INFO  (jetty-launcher-4638-thread-3) [    ] o.a.s.c.c.ConnectionManager Client is connected to ZooKeeper
   [junit4]   2> 3539654 INFO  (jetty-launcher-4638-thread-3) [    ] o.a.s.c.c.SolrZkClient Using default ZkACLProvider
   [junit4]   2> 3539655 INFO  (jetty-launcher-4638-thread-2) [    ] o.a.s.l.LogWatcher SLF4J impl is org.slf4j.impl.Log4jLoggerFactory
   [junit4]   2> 3539655 INFO  (jetty-launcher-4638-thread-2) [    ] o.a.s.l.LogWatcher Registering Log Listener [Log4j (org.slf4j.impl.Log4jLoggerFactory)]
   [junit4]   2> 3539655 INFO  (jetty-launcher-4638-thread-2) [    ] o.a.s.c.ZkContainer Zookeeper client=127.0.0.1:50532/solr
   [junit4]   2> 3539655 INFO  (zkCallback-4646-thread-1-processing-n:127.0.0.1:40607_solr) [n:127.0.0.1:40607_solr    ] o.a.s.c.c.ConnectionManager Watcher org.apache.solr.common.cloud.ConnectionManager@1de651e9 name:ZooKeeperConnection Watcher:127.0.0.1:50532/solr got event WatchedEvent state:SyncConnected type:None path:null path:null type:None
   [junit4]   2> 3539657 INFO  (jetty-launcher-4638-thread-3) [n:127.0.0.1:57982_solr    ] o.a.s.c.ZkController Added new OnReconnect listener org.apache.solr.cloud.ZkController$$Lambda$104/120540199@36fd15c8
   [junit4]   2> 3539655 INFO  (jetty-launcher-4638-thread-2) [    ] o.a.s.c.ZkController zkHost includes chroot
   [junit4]   2> 3539657 INFO  (jetty-launcher-4638-thread-2) [    ] o.a.s.c.c.SolrZkClient Using default ZkCredentialsProvider
   [junit4]   2> 3539657 INFO  (jetty-launcher-4638-thread-1) [n:127.0.0.1:40607_solr    ] o.a.s.c.c.ConnectionManager Client is connected to ZooKeeper
   [junit4]   2> 3539658 INFO  (jetty-launcher-4638-thread-1) [n:127.0.0.1:40607_solr    ] o.a.s.c.c.SolrZkClient makePath: /overseer/queue
   [junit4]   2> 3539660 INFO  (jetty-launcher-4638-thread-3) [n:127.0.0.1:57982_solr    ] o.a.s.c.c.ConnectionManager Waiting for client to connect to ZooKeeper
   [junit4]   2> 3539662 INFO  (jetty-launcher-4638-thread-2) [    ] o.a.s.c.c.ConnectionManager Waiting for client to connect to ZooKeeper
   [junit4]   2> 3539665 INFO  (jetty-launcher-4638-thread-1) [n:127.0.0.1:40607_solr    ] o.a.s.c.c.SolrZkClient makePath: /overseer/collection-queue-work
   [junit4]   2> 3539666 INFO  (zkCallback-4652-thread-1-processing-n:127.0.0.1:57982_solr) [n:127.0.0.1:57982_solr    ] o.a.s.c.c.ConnectionManager Watcher org.apache.solr.common.cloud.ConnectionManager@7bf582bc name:ZooKeeperConnection Watcher:127.0.0.1:50532/solr got event WatchedEvent state:SyncConnected type:None path:null path:null type:None
   [junit4]   2> 3539666 INFO  (jetty-launcher-4638-thread-3) [n:127.0.0.1:57982_solr    ] o.a.s.c.c.ConnectionManager Client is connected to ZooKeeper
   [junit4]   2> 3539667 INFO  (jetty-launcher-4638-thread-1) [n:127.0.0.1:40607_solr    ] o.a.s.c.c.SolrZkClient makePath: /overseer/collection-map-running
   [junit4]   2> 3539668 INFO  (zkCallback-4653-thread-1) [    ] o.a.s.c.c.ConnectionManager Watcher org.apache.solr.common.cloud.ConnectionManager@5f68ffae name:ZooKeeperConnection Watcher:127.0.0.1:50532 got event WatchedEvent state:SyncConnected type:None path:null path:null type:None
   [junit4]   2> 3539668 INFO  (jetty-launcher-4638-thread-2) [    ] o.a.s.c.c.ConnectionManager Client is connected to ZooKeeper
   [junit4]   2> 3539669 INFO  (jetty-launcher-4638-thread-2) [    ] o.a.s.c.c.SolrZkClient Using default ZkACLProvider
   [junit4]   2> 3539669 INFO  (jetty-launcher-4638-thread-1) [n:127.0.0.1:40607_solr    ] o.a.s.c.c.SolrZkClient makePath: /overseer/collection-map-completed
   [junit4]   2> 3539670 INFO  (jetty-launcher-4638-thread-2) [n:127.0.0.1:48265_solr    ] o.a.s.c.ZkController Added new OnReconnect listener org.apache.solr.cloud.ZkController$$Lambda$104/120540199@2ae49838
   [junit4]   2> 3539670 INFO  (jetty-launcher-4638-thread-3) [n:127.0.0.1:57982_solr    ] o.a.s.c.c.SolrZkClient makePath: /overseer/collection-map-completed
   [junit4]   2> 3539671 INFO  (jetty-launcher-4638-thread-1) [n:127.0.0.1:40607_solr    ] o.a.s.c.c.SolrZkClient makePath: /overseer/collection-map-failure
   [junit4]   2> 3539676 INFO  (jetty-launcher-4638-thread-2) [n:127.0.0.1:48265_solr    ] o.a.s.c.c.ConnectionManager Waiting for client to connect to ZooKeeper
   [junit4]   2> 3539700 INFO  (jetty-launcher-4638-thread-3) [n:127.0.0.1:57982_solr    ] o.a.s.c.c.SolrZkClient makePath: /overseer/collection-map-failure
   [junit4]   2> 3539701 INFO  (jetty-launcher-4638-thread-1) [n:127.0.0.1:40607_solr    ] o.a.s.c.c.SolrZkClient makePath: /live_nodes
   [junit4]   2> 3539702 INFO  (jetty-launcher-4638-thread-3) [n:127.0.0.1:57982_solr    ] o.a.s.c.c.SolrZkClient makePath: /live_nodes
   [junit4]   2> 3539703 INFO  (jetty-launcher-4638-thread-3) [n:127.0.0.1:57982_solr    ] o.a.s.c.c.SolrZkClient makePath: /collections
   [junit4]   2> 3539703 INFO  (jetty-launcher-4638-thread-1) [n:127.0.0.1:40607_solr    ] o.a.s.c.c.SolrZkClient makePath: /collections
   [junit4]   2> 3539705 INFO  (jetty-launcher-4638-thread-1) [n:127.0.0.1:40607_solr    ] o.a.s.c.c.SolrZkClient makePath: /aliases.json
   [junit4]   2> 3539705 INFO  (jetty-launcher-4638-thread-3) [n:127.0.0.1:57982_solr    ] o.a.s.c.c.SolrZkClient makePath: /aliases.json
   [junit4]   2> 3539706 INFO  (jetty-launcher-4638-thread-3) [n:127.0.0.1:57982_solr    ] o.a.s.c.c.SolrZkClient makePath: /clusterstate.json
   [junit4]   2> 3539706 INFO  (jetty-launcher-4638-thread-1) [n:127.0.0.1:40607_solr    ] o.a.s.c.c.SolrZkClient makePath: /clusterstate.json
   [junit4]   2> 3539708 INFO  (jetty-launcher-4638-thread-1) [n:127.0.0.1:40607_solr    ] o.a.s.c.c.SolrZkClient makePath: /security.json
   [junit4]   2> 3539708 INFO  (jetty-launcher-4638-thread-3) [n:127.0.0.1:57982_solr    ] o.a.s.c.c.SolrZkClient makePath: /security.json
   [junit4]   2> 3539709 INFO  (jetty-launcher-4638-thread-1) [n:127.0.0.1:40607_solr    ] o.a.s.c.c.ZkStateReader Updating cluster state from ZooKeeper... 
   [junit4]   2> 3539709 INFO  (jetty-launcher-4638-thread-3) [n:127.0.0.1:57982_solr    ] o.a.s.c.c.ZkStateReader Updating cluster state from ZooKeeper... 
   [junit4]   2> 3539710 INFO  (jetty-launcher-4638-thread-3) [n:127.0.0.1:57982_solr    ] o.a.s.c.c.ZkStateReader Loaded cluster properties: {urlScheme=https}
   [junit4]   2> 3539710 INFO  (jetty-launcher-4638-thread-1) [n:127.0.0.1:40607_solr    ] o.a.s.c.c.ZkStateReader Loaded cluster properties: {urlScheme=https}
   [junit4]   2> 3539711 INFO  (jetty-launcher-4638-thread-1) [n:127.0.0.1:40607_solr    ] o.a.s.c.c.ZkStateReader Updated live nodes from ZooKeeper... (0) -> (0)
   [junit4]   2> 3539711 INFO  (jetty-launcher-4638-thread-3) [n:127.0.0.1:57982_solr    ] o.a.s.c.c.ZkStateReader Updated live nodes from ZooKeeper... (0) -> (0)
   [junit4]   2> 3539711 INFO  (zkCallback-4654-thread-1-processing-n:127.0.0.1:48265_solr) [n:127.0.0.1:48265_solr    ] o.a.s.c.c.ConnectionManager Watcher org.apache.solr.common.cloud.ConnectionManager@15cc0f7f name:ZooKeeperConnection Watcher:127.0.0.1:50532/solr got event WatchedEvent state:SyncConnected type:None path:null path:null type:None
   [junit4]   2> 3539711 INFO  (jetty-launcher-4638-thread-2) [n:127.0.0.1:48265_solr    ] o.a.s.c.c.ConnectionManager Client is connected to ZooKeeper
   [junit4]   2> 3539714 INFO  (jetty-launcher-4638-thread-3) [n:127.0.0.1:57982_solr    ] o.a.s.c.c.SolrZkClient makePath: /overseer_elect
   [junit4]   2> 3539716 INFO  (jetty-launcher-4638-thread-3) [n:127.0.0.1:57982_solr    ] o.a.s.c.c.SolrZkClient makePath: /overseer_elect/election
   [junit4]   2> 3539717 INFO  (jetty-launcher-4638-thread-1) [n:127.0.0.1:40607_solr    ] o.a.s.c.c.SolrZkClient makePath: /overseer_elect/election
   [junit4]   2> 3539717 INFO  (jetty-launcher-4638-thread-2) [n:127.0.0.1:48265_solr    ] o.a.s.c.c.ZkStateReader Updating cluster state from ZooKeeper... 
   [junit4]   2> 3539718 INFO  (jetty-launcher-4638-thread-3) [n:127.0.0.1:57982_solr    ] o.a.s.c.Overseer Overseer (id=null) closing
   [junit4]   2> 3539718 INFO  (jetty-launcher-4638-thread-2) [n:127.0.0.1:48265_solr    ] o.a.s.c.c.ZkStateReader Loaded cluster properties: {urlScheme=https}
   [junit4]   2> 3539718 INFO  (jetty-launcher-4638-thread-1) [n:127.0.0.1:40607_solr    ] o.a.s.c.Overseer Overseer (id=null) closing
   [junit4]   2> 3539719 INFO  (jetty-launcher-4638-thread-3) [n:127.0.0.1:57982_solr    ] o.a.s.c.LeaderElector Joined leadership election with path: /overseer_elect/election/96574239040208903-127.0.0.1:57982_solr-n_0000000000
   [junit4]   2> 3539719 INFO  (jetty-launcher-4638-thread-2) [n:127.0.0.1:48265_solr    ] o.a.s.c.c.ZkStateReader Updated live nodes from ZooKeeper... (0) -> (0)
   [junit4]   2> 3539719 INFO  (jetty-launcher-4638-thread-1) [n:127.0.0.1:40607_solr    ] o.a.s.c.LeaderElector Joined leadership election with path: /overseer_elect/election/96574239040208901-127.0.0.1:40607_solr-n_0000000001
   [junit4]   2> 3539719 INFO  (jetty-launcher-4638-thread-3) [n:127.0.0.1:57982_solr    ] o.a.s.c.OverseerElectionContext I am going to be the leader 127.0.0.1:57982_solr
   [junit4]   2> 3539719 INFO  (jetty-launcher-4638-thread-3) [n:127.0.0.1:57982_solr    ] o.a.s.c.c.SolrZkClient makePath: /overseer_elect/leader
   [junit4]   2> 3539720 INFO  (jetty-launcher-4638-thread-1) [n:127.0.0.1:40607_solr    ] o.a.s.c.LeaderElector Watching path /overseer_elect/election/96574239040208903-127.0.0.1:57982_solr-n_0000000000 to know if I could be the leader
   [junit4]   2> 3539720 INFO  (jetty-launcher-4638-thread-1) [n:127.0.0.1:40607_solr    ] o.a.s.c.ZkController Register node as live in ZooKeeper:/live_nodes/127.0.0.1:40607_solr
   [junit4]   2> 3539720 INFO  (jetty-launcher-4638-thread-1) [n:127.0.0.1:40607_solr    ] o.a.s.c.c.SolrZkClient makePath: /live_nodes/127.0.0.1:40607_solr
   [junit4]   2> 3539721 INFO  (jetty-launcher-4638-thread-2) [n:127.0.0.1:48265_solr    ] o.a.s.c.Overseer Overseer (id=null) closing
   [junit4]   2> 3539721 INFO  (jetty-launcher-4638-thread-3) [n:127.0.0.1:57982_solr    ] o.a.s.c.Overseer Overseer (id=96574239040208903-127.0.0.1:57982_solr-n_0000000000) starting
   [junit4]   2> 3539722 INFO  (zkCallback-4652-thread-1-processing-n:127.0.0.1:57982_solr) [n:127.0.0.1:57982_solr    ] o.a.s.c.c.ZkStateReader A live node change: [WatchedEvent state:SyncConnected type:NodeChildrenChanged path:/live_nodes], has occurred - updating... (live nodes size: [0])
   [junit4]   2> 3539722 INFO  (jetty-launcher-4638-thread-2) [n:127.0.0.1:48265_solr    ] o.a.s.c.LeaderElector Joined leadership election with path: /overseer_elect/election/96574239040208905-127.0.0.1:48265_solr-n_0000000002
   [junit4]   2> 3539722 INFO  (zkCallback-4654-thread-1-processing-n:127.0.0.1:48265_solr) [n:127.0.0.1:48265_solr    ] o.a.s.c.c.ZkStateReader A live node change: [WatchedEvent state:SyncConnected type:NodeChildrenChanged path:/live_nodes], has occurred - updating... (live nodes size: [0])
   [junit4]   2> 3539722 INFO  (zkCallback-4646-thread-1-processing-n:127.0.0.1:40607_solr) [n:127.0.0.1:40607_solr    ] o.a.s.c.c.ZkStateReader A live node change: [WatchedEvent state:SyncConnected type:NodeChildrenChanged path:/live_nodes], has occurred - updating... (live nodes size: [0])
   [junit4]   2> 3539723 INFO  (zkCallback-4652-thread-1-processing-n:127.0.0.1:57982_solr) [n:127.0.0.1:57982_solr    ] o.a.s.c.c.ZkStateReader Updated live nodes from ZooKeeper... (0) -> (1)
   [junit4]   2> 3539723 INFO  (jetty-launcher-4638-thread-2) [n:127.0.0.1:48265_solr    ] o.a.s.c.LeaderElector Watching path /overseer_elect/election/96574239040208901-127.0.0.1:40607_solr-n_0000000001 to know if I could be the leader
   [junit4]   2> 3539723 INFO  (jetty-launcher-4638-thread-2) [n:127.0.0.1:48265_solr    ] o.a.s.c.ZkController Publish node=127.0.0.1:48265_solr as DOWN
   [junit4]   2> 3539724 INFO  (jetty-launcher-4638-thread-2) [n:127.0.0.1:48265_solr    ] o.a.s.c.ZkController Register node as live in ZooKeeper:/live_nodes/127.0.0.1:48265_solr
   [junit4]   2> 3539724 INFO  (jetty-launcher-4638-thread-2) [n:127.0.0.1:48265_solr    ] o.a.s.c.c.SolrZkClient makePath: /live_nodes/127.0.0.1:48265_solr
   [junit4]   2> 3539727 INFO  (zkCallback-4646-thread-1-processing-n:127.0.0.1:40607_solr) [n:127.0.0.1:40607_solr    ] o.a.s.c.c.ZkStateReader Updated live nodes from ZooKeeper... (0) -> (1)
   [junit4]   2> 3539727 INFO  (zkCallback-4654-thread-1-processing-n:127.0.0.1:48265_solr) [n:127.0.0.1:48265_solr    ] o.a.s.c.c.ZkStateReader Updated live nodes from ZooKeeper... (0) -> (1)
   [junit4]   2> 3539728 INFO  (zkCallback-4652-thread-1-processing-n:127.0.0.1:57982_solr) [n:127.0.0.1:57982_solr    ] o.a.s.c.c.ZkStateReader A live node change: [WatchedEvent state:SyncConnected type:NodeChildrenChanged path:/live_nodes], has occurred - updating... (live nodes size: [1])
   [junit4]   2> 3539728 INFO  (zkCallback-4646-thread-1-processing-n:127.0.0.1:40607_solr) [n:127.0.0.1:40607_solr    ] o.a.s.c.c.ZkStateReader A live node change: [WatchedEvent state:SyncConnected type:NodeChildrenChanged path:/live_nodes], has occurred - updating... (live nodes size: [1])
   [junit4]   2> 3539739 INFO  (zkCallback-4646-thread-1-processing-n:127.0.0.1:40607_solr) [n:127.0.0.1:40607_solr    ] o.a.s.c.c.ZkStateReader Updated live nodes from ZooKeeper... (1) -> (2)
   [junit4]   2> 3539740 INFO  (zkCallback-4652-thread-1-processing-n:127.0.0.1:57982_solr) [n:127.0.0.1:57982_solr    ] o.a.s.c.c.ZkStateReader Updated live nodes from ZooKeeper... (1) -> (2)
   [junit4]   2> 3539740 INFO  (jetty-launcher-4638-thread-3) [n:127.0.0.1:57982_solr    ] o.a.s.c.c.SolrZkClient makePath: /overseer/queue-work
   [junit4]   2> 3539744 INFO  (jetty-launcher-4638-thread-2) [n:127.0.0.1:48265_solr    ] o.a.s.c.CoreContainer Security conf doesn't exist. Skipping setup for authorization module.
   [junit4]   2> 3539744 INFO  (jetty-launcher-4638-thread-2) [n:127.0.0.1:48265_solr    ] o.a.s.c.CoreContainer No authentication plugin used.
   [junit4]   2> 3539745 INFO  (jetty-launcher-4638-thread-2) [n:127.0.0.1:48265_solr    ] o.a.s.c.CorePropertiesLocator Looking for core definitions underneath /x1/jenkins/jenkins-slave/workspace/Lucene-Solr-Tests-6.x/solr/build/solr-core/test/J2/temp/solr.security.BasicAuthIntegrationTest_E2BD62B168305F97-001/tempDir-001/node2/.
   [junit4]   2> 3539745 INFO  (jetty-launcher-4638-thread-2) [n:127.0.0.1:48265_solr    ] o.a.s.c.CorePropertiesLocator Found 0 core definitions
   [junit4]   2> 3539747 INFO  (zkCallback-4654-thread-2-processing-n:127.0.0.1:48265_solr) [n:127.0.0.1:48265_solr    ] o.a.s.c.c.ZkStateReader A live node change: [WatchedEvent state:SyncConnected type:NodeChildrenChanged path:/live_nodes], has occurred - updating... (live nodes size: [1])
   [junit4]   2> 3539748 INFO  (zkCallback-4654-thread-2-processing-n:127.0.0.1:48265_solr) [n:127.0.0.1:48265_solr    ] o.a.s.c.c.ZkStateReader Updated live nodes from ZooKeeper... (1) -> (2)
   [junit4]   2> 3539755 INFO  (jetty-launcher-4638-thread-1) [n:127.0.0.1:40607_solr    ] o.a.s.c.CoreContainer Security conf doesn't exist. Skipping setup for authorization module.
   [junit4]   2> 3539755 INFO  (jetty-launcher-4638-thread-1) [n:127.0.0.1:40607_solr    ] o.a.s.c.CoreContainer No authentication plugin used.
   [junit4]   2> 3539755 INFO  (jetty-launcher-4638-thread-1) [n:127.0.0.1:40607_solr    ] o.a.s.c.CorePropertiesLocator Looking for core definitions underneath /x1/jenkins/jenkins-slave/workspace/Lucene-Solr-Tests-6.x/solr/build/solr-core/test/J2/temp/solr.security.BasicAuthIntegrationTest_E2BD62B168305F97-001/tempDir-001/node1/.
   [junit4]   2> 3539755 INFO  (jetty-launcher-4638-thread-1) [n:127.0.0.1:40607_solr    ] o.a.s.c.CorePropertiesLocator Found 0 core definitions
   [junit4]   2> 3539756 INFO  (jetty-launcher-4638-thread-2) [n:127.0.0.1:48265_solr    ] o.a.s.s.SolrDispatchFilter user.dir=/x1/jenkins/jenkins-slave/workspace/Lucene-Solr-Tests-6.x/solr/build/solr-core/test/J2
   [junit4]   2> 3539756 INFO  (jetty-launcher-4638-thread-2) [n:127.0.0.1:48265_solr    ] o.a.s.s.SolrDispatchFilter SolrDispatchFilter.init() done
   [junit4]   2> 3539757 INFO  (jetty-launcher-4638-thread-1) [n:127.0.0.1:40607_solr    ] o.a.s.s.SolrDispatchFilter user.dir=/x1/jenkins/jenkins-slave/workspace/Lucene-Solr-Tests-6.x/solr/build/solr-core/test/J2
   [junit4]   2> 3539757 INFO  (jetty-launcher-4638-thread-1) [n:127.0.0.1:40607_solr    ] o.a.s.s.SolrDispatchFilter SolrDispatchFilter.init() done
   [junit4]   2> 3539759 INFO  (jetty-launcher-4638-thread-3) [n:127.0.0.1:57982_solr    ] o.a.s.c.OverseerAutoReplicaFailoverThread Starting OverseerAutoReplicaFailoverThread autoReplicaFailoverWorkLoopDelay=10000 autoReplicaFailoverWaitAfterExpiration=30000 autoReplicaFailoverBadNodeExpiration=60000
   [junit4]   2> 3539759 INFO  (OverseerStateUpdate-96574239040208903-127.0.0.1:57982_solr-n_0000000000) [n:127.0.0.1:57982_solr    ] o.a.s.c.Overseer Starting to work on the main queue
   [junit4]   2> 3539761 INFO  (OverseerStateUpdate-96574239040208903-127.0.0.1:57982_solr-n_0000000000) [n:127.0.0.1:57982_solr    ] o.a.s.c.c.ZkStateReader Updated live nodes from ZooKeeper... (2) -> (2)
   [junit4]   2> 3539762 INFO  (OverseerCollectionConfigSetProcessor-96574239040208903-127.0.0.1:57982_solr-n_0000000000) [n:127.0.0.1:57982_solr    ] o.a.s.c.OverseerTaskProcessor Process current queue of overseer operations
   [junit4]   2> 3539762 INFO  (jetty-launcher-4638-thread-3) [n:127.0.0.1:57982_solr    ] o.a.s.c.ZkController Publish node=127.0.0.1:57982_solr as DOWN
   [junit4]   2> 3539763 INFO  (OverseerStateUpdate-96574239040208903-127.0.0.1:57982_solr-n_0000000000) [n:127.0.0.1:57982_solr    ] o.a.s.c.Overseer processMessage: queueSize: 1, message = {
   [junit4]   2>   "operation":"downnode",
   [junit4]   2>   "node_name":"127.0.0.1:48265_solr"} current state version: 0
   [junit4]   2> 3539763 INFO  (jetty-launcher-4638-thread-3) [n:127.0.0.1:57982_solr    ] o.a.s.c.ZkController Register node as live in ZooKeeper:/live_nodes/127.0.0.1:57982_solr
   [junit4]   2> 3539764 INFO  (jetty-launcher-4638-thread-3) [n:127.0.0.1:57982_solr    ] o.a.s.c.c.SolrZkClient makePath: /live_nodes/127.0.0.1:57982_solr
   [junit4]   2> 3539764 INFO  (OverseerStateUpdate-96574239040208903-127.0.0.1:57982_solr-n_0000000000) [n:127.0.0.1:57982_solr    ] o.a.s.c.o.NodeMutator DownNode state invoked for node: 127.0.0.1:48265_solr
   [junit4]   2> 3539765 INFO  (zkCallback-4646-thread-1-processing-n:127.0.0.1:40607_solr) [n:127.0.0.1:40607_solr    ] o.a.s.c.c.ZkStateReader A live node change: [WatchedEvent state:SyncConnected type:NodeChildrenChanged path:/live_nodes], has occurred - updating... (live nodes size: [2])
   [junit4]   2> 3539765 INFO  (zkCallback-4654-thread-2-processing-n:127.0.0.1:48265_solr) [n:127.0.0.1:48265_solr    ] o.a.s.c.c.ZkStateReader A live node change: [WatchedEvent state:SyncConnected type:NodeChildrenChanged path:/live_nodes], has occurred - updating... (live nodes size: [2])
   [junit4]   2> 3539765 INFO  (zkCallback-4646-thread-1-processing-n:127.0.0.1:40607_solr) [n:127.0.0.1:40607_solr    ] o.a.s.c.c.ZkStateReader Updated live nodes from ZooKeeper... (2) -> (3)
   [junit4]   2> 3539765 INFO  (zkCallback-4654-thread-2-processing-n:127.0.0.1:48265_solr) [n:127.0.0.1:48265_solr    ] o.a.s.c.c.ZkStateReader Updated live nodes from ZooKeeper... (2) -> (3)
   [junit4]   2> 3539766 INFO  (zkCallback-4652-thread-1-processing-n:127.0.0.1:57982_solr) [n:127.0.0.1:57982_solr    ] o.a.s.c.c.ZkStateReader A live node change: [WatchedEvent state:SyncConnected type:NodeChildrenChanged path:/live_nodes], has occurred - updating... (live nodes size: [2])
   [junit4]   2> 3539766 INFO  (zkCallback-4652-thread-1-processing-n:127.0.0.1:57982_solr) [n:127.0.0.1:57982_solr    ] o.a.s.c.c.ZkStateReader Updated live nodes from ZooKeeper... (2) -> (3)
   [junit4]   2> 3539774 INFO  (jetty-launcher-4638-thread-3) [n:127.0.0.1:57982_solr    ] o.a.s.c.CoreContainer Security conf doesn't exist. Skipping setup for authorization module.
   [junit4]   2> 3539774 INFO  (jetty-launcher-4638-thread-3) [n:127.0.0.1:57982_solr    ] o.a.s.c.CoreContainer No authentication plugin used.
   [junit4]   2> 3539775 INFO  (jetty-launcher-4638-thread-3) [n:127.0.0.1:57982_solr    ] o.a.s.c.CorePropertiesLocator Looking for core definitions underneath /x1/jenkins/jenkins-slave/workspace/Lucene-Solr-Tests-6.x/solr/build/solr-core/test/J2/temp/solr.security.BasicAuthIntegrationTest_E2BD62B168305F97-001/tempDir-001/node3/.
   [junit4]   2> 3539775 INFO  (jetty-launcher-4638-thread-3) [n:127.0.0.1:57982_solr    ] o.a.s.c.CorePropertiesLocator Found 0 core definitions
   [junit4]   2> 3539775 INFO  (OverseerStateUpdate-96574239040208903-127.0.0.1:57982_solr-n_0000000000) [n:127.0.0.1:57982_solr    ] o.a.s.c.Overseer processMessage: queueSize: 2, message = {
   [junit4]   2>   "operation":"downnode",
   [junit4]   2>   "node_name":"127.0.0.1:57982_solr"} current state version: 0
   [junit4]   2> 3539776 INFO  (OverseerStateUpdate-96574239040208903-127.0.0.1:57982_solr-n_0000000000) [n:127.0.0.1:57982_solr    ] o.a.s.c.o.NodeMutator DownNode state invoked for node: 127.0.0.1:57982_solr
   [junit4]   2> 3539776 INFO  (jetty-launcher-4638-thread-3) [n:127.0.0.1:57982_solr    ] o.a.s.s.SolrDispatchFilter user.dir=/x1/jenkins/jenkins-slave/workspace/Lucene-Solr-Tests-6.x/solr/build/solr-core/test/J2
   [junit4]   2> 3539776 INFO  (jetty-launcher-4638-thread-3) [n:127.0.0.1:57982_solr    ] o.a.s.s.SolrDispatchFilter SolrDispatchFilter.init() done
   [junit4]   2> 3539780 INFO  (SUITE-BasicAuthIntegrationTest-seed#[E2BD62B168305F97]-worker) [    ] o.a.s.c.c.SolrZkClient Using default ZkCredentialsProvider
   [junit4]   2> 3539781 INFO  (SUITE-BasicAuthIntegrationTest-seed#[E2BD62B168305F97]-worker) [    ] o.a.s.c.c.ConnectionManager Waiting for client to connect to ZooKeeper
   [junit4]   2> 3539781 INFO  (zkCallback-4658-thread-1) [    ] o.a.s.c.c.ConnectionManager Watcher org.apache.solr.common.cloud.ConnectionManager@156f06a7 name:ZooKeeperConnection Watcher:127.0.0.1:50532 got event WatchedEvent state:SyncConnected type:None path:null path:null type:None
   [junit4]   2> 3539781 INFO  (SUITE-BasicAuthIntegrationTest-seed#[E2BD62B168305F97]-worker) [    ] o.a.s.c.c.ConnectionManager Client is connected to ZooKeeper
   [junit4]   2> 3539782 INFO  (SUITE-BasicAuthIntegrationTest-seed#[E2BD62B168305F97]-worker) [    ] o.a.s.c.c.SolrZkClient Using default ZkACLProvider
   [junit4]   2> 3539788 INFO  (SUITE-BasicAuthIntegrationTest-seed#[E2BD62B168305F97]-worker) [    ] o.a.s.c.c.SolrZkClient Using default ZkCredentialsProvider
   [junit4]   2> 3539793 INFO  (SUITE-BasicAuthIntegrationTest-seed#[E2BD62B168305F97]-worker) [    ] o.a.s.c.c.ConnectionManager Waiting for client to connect to ZooKeeper
   [junit4]   2> 3539793 INFO  (zkCallback-4661-thread-1) [    ] o.a.s.c.c.ConnectionManager Watcher org.apache.solr.common.cloud.ConnectionManager@73824a21 name:ZooKeeperConnection Watcher:127.0.0.1:50532/solr got event WatchedEvent state:SyncConnected type:None path:null path:null type:None
   [junit4]   2> 3539793 INFO  (SUITE-BasicAuthIntegrationTest-seed#[E2BD62B168305F97]-worker) [    ] o.a.s.c.c.ConnectionManager Client is connected to ZooKeeper
   [junit4]   2> 3539793 INFO  (SUITE-BasicAuthIntegrationTest-seed#[E2BD62B168305F97]-worker) [    ] o.a.s.c.c.SolrZkClient Using default ZkACLProvider
   [junit4]   2> 3539794 INFO  (SUITE-BasicAuthIntegrationTest-seed#[E2BD62B168305F97]-worker) [    ] o.a.s.c.c.ZkStateReader Updating cluster state from ZooKeeper... 
   [junit4]   2> 3539794 INFO  (SUITE-BasicAuthIntegrationTest-seed#[E2BD62B168305F97]-worker) [    ] o.a.s.c.c.ZkStateReader Loaded cluster properties: {urlScheme=https}
   [junit4]   2> 3539794 INFO  (SUITE-BasicAuthIntegrationTest-seed#[E2BD62B168305F97]-worker) [    ] o.a.s.c.c.ZkStateReader Updated live nodes from ZooKeeper... (0) -> (3)
   [junit4]   2> 3539796 INFO  (SUITE-BasicAuthIntegrationTest-seed#[E2BD62B168305F97]-worker) [    ] o.a.s.c.c.SolrZkClient makePath: /configs/conf/schema.xml
   [junit4]   2> 3539806 INFO  (SUITE-BasicAuthIntegrationTest-seed#[E2BD62B168305F97]-worker) [    ] o.a.s.c.c.SolrZkClient makePath: /configs/conf/solrconfig.xml
   [junit4]   2> 3539873 INFO  (qtp2043262125-22486) [n:127.0.0.1:40607_solr    ] o.a.s.h.a.CollectionsHandler Invoked Collection Action :create with params replicationFactor=1&collection.configName=conf&name=authCollection&action=CREATE&numShards=3&wt=javabin&version=2 and sendToOCPQueue=true
   [junit4]   2> 3539882 INFO  (OverseerCollectionConfigSetProcessor-96574239040208903-127.0.0.1:57982_solr-n_0000000000) [n:127.0.0.1:57982_solr    ] o.a.s.c.OverseerTaskProcessor Overseer Collection Message Handler: Get the message id:/overseer/collection-queue-work/qn-0000000000 message:{
   [junit4]   2>   "name":"authCollection",
   [junit4]   2>   "fromApi":"true",
   [junit4]   2>   "replicationFactor":"1",
   [junit4]   2>   "collection.configName":"conf",
   [junit4]   2>   "numShards":"3",
   [junit4]   2>   "stateFormat":"2",
   [junit4]   2>   "operation":"create"}
   [junit4]   2> 3539883 INFO  (OverseerThreadFactory-9335-thread-1-processing-n:127.0.0.1:57982_solr) [n:127.0.0.1:57982_solr    ] o.a.s.c.OverseerCollectionMessageHandler OverseerCollectionMessageHandler.processMessage : create , {
   [junit4]   2>   "name":"authCollection",
   [junit4]   2>   "fromApi":"true",
   [junit4]   2>   "replicationFactor":"1",
   [junit4]   2>   "collection.configName":"conf",
   [junit4]   2>   "numShards":"3",
   [junit4]   2>   "stateFormat":"2",
   [junit4]   2>   "operation":"create"}
   [junit4]   2> 3539883 INFO  (OverseerThreadFactory-9335-thread-1-processing-n:127.0.0.1:57982_solr) [n:127.0.0.1:57982_solr    ] o.a.s.c.CreateCollectionCmd Create collection authCollection
   [junit4]   2> 3539883 INFO  (OverseerThreadFactory-9335-thread-1-processing-n:127.0.0.1:57982_solr) [n:127.0.0.1:57982_solr    ] o.a.s.c.OverseerCollectionMessageHandler creating collections conf node /collections/authCollection 
   [junit4]   2> 3539884 INFO  (OverseerThreadFactory-9335-thread-1-processing-n:127.0.0.1:57982_solr) [n:127.0.0.1:57982_solr    ] o.a.s.c.c.SolrZkClient makePath: /collections/authCollection
   [junit4]   2> 3539885 INFO  (zkCallback-4654-thread-2-processing-n:127.0.0.1:48265_solr) [n:127.0.0.1:48265_solr    ] o.a.s.c.c.ZkStateReader A collections change: [WatchedEvent state:SyncConnected type:NodeChildrenChanged path:/collections], has occurred - updating...
   [junit4]   2> 3539886 INFO  (zkCallback-4646-thread-1-processing-n:127.0.0.1:40607_solr) [n:127.0.0.1:40607_solr    ] o.a.s.c.c.ZkStateReader A collections change: [WatchedEvent state:SyncConnected type:NodeChildrenChanged path:/collections], has occurred - updating...
   [junit4]   2> 3539886 INFO  (zkCallback-4652-thread-2-processing-n:127.0.0.1:57982_solr) [n:127.0.0.1:57982_solr    ] o.a.s.c.c.ZkStateReader A collections change: [WatchedEvent state:SyncConnected type:NodeChildrenChanged path:/collections], has occurred - updating...
   [junit4]   2> 3539887 INFO  (zkCallback-4661-thread-1) [    ] o.a.s.c.c.ZkStateReader A collections change: [WatchedEvent state:SyncConnected type:NodeChildrenChanged path:/collections], has occurred - updating...
   [junit4]   2> 3539893 INFO  (OverseerStateUpdate-96574239040208903-127.0.0.1:57982_solr-n_0000000000) [n:127.0.0.1:57982_solr    ] o.a.s.c.Overseer processMessage: queueSize: 1, message = {
   [junit4]   2>   "name":"authCollection",
   [junit4]   2>   "fromApi":"true",
   [junit4]   2>   "replicationFactor":"1",
   [junit4]   2>   "collection.configName":"conf",
   [junit4]   2>   "numShards":"3",
   [junit4]   2>   "stateFormat":"2",
   [junit4]   2>   "operation":"create"} current state version: 0
   [junit4]   2> 3539893 INFO  (OverseerStateUpdate-96574239040208903-127.0.0.1:57982_solr-n_0000000000) [n:127.0.0.1:57982_solr    ] o.a.s.c.o.ClusterStateMutator building a new cName: authCollection
   [junit4]   2> 3539894 INFO  (OverseerStateUpdate-96574239040208903-127.0.0.1:57982_solr-n_0000000000) [n:127.0.0.1:57982_solr    ] o.a.s.c.o.ZkStateWriter going to create_collection /collections/authCollection/state.json
   [junit4]   2> 3539995 INFO  (OverseerThreadFactory-9335-thread-1-processing-n:127.0.0.1:57982_solr) [n:127.0.0.1:57982_solr    ] o.a.s.c.CreateCollectionCmd Creating SolrCores for new collection authCollection, shardNames [shard1, shard2, shard3] , replicationFactor : 1
   [junit4]   2> 3539996 INFO  (OverseerThreadFactory-9335-thread-1-processing-n:127.0.0.1:57982_solr) [n:127.0.0.1:57982_solr    ] o.a.s.c.CreateCollectionCmd Creating core authCollection_shard3_replica1 as part of shard shard3 of collection authCollection on 127.0.0.1:40607_solr
   [junit4]   2> 3539996 INFO  (OverseerThreadFactory-9335-thread-1-processing-n:127.0.0.1:57982_solr) [n:127.0.0.1:57982_solr    ] o.a.s.c.CreateCollectionCmd Creating core authCollection_shard2_replica1 as part of shard shard2 of collection authCollection on 127.0.0.1:48265_solr
   [junit4]   2> 3539996 INFO  (OverseerThreadFactory-9335-thread-1-processing-n:127.0.0.1:57982_solr) [n:127.0.0.1:57982_solr    ] o.a.s.c.CreateCollectionCmd Creating core authCollection_shard1_replica1 as part of shard shard1 of collection authCollection on 127.0.0.1:57982_solr
   [junit4]   2> 3540048 INFO  (qtp2043262125-22481) [n:127.0.0.1:40607_solr    ] o.a.s.h.a.CoreAdminOperation core create command qt=/admin/cores&collection.configName=conf&name=authCollection_shard3_replica1&action=CREATE&numShards=3&collection=authCollection&shard=shard3&wt=javabin&version=2
   [junit4]   2> 3540048 INFO  (qtp2043262125-22481) [n:127.0.0.1:40607_solr    ] o.a.s.c.CoreDescriptor Created CoreDescriptor: {name=authCollection_shard3_replica1, collection.configName=conf, config=solrconfig.xml, transient=false, schema=schema.xml, loadOnStartup=true, configSetProperties=configsetprops.json, collection=authCollection, numShards=3, dataDir=data/, shard=shard3}
   [junit4]   2> 3540052 INFO  (qtp2043262125-22481) [n:127.0.0.1:40607_solr c:authCollection s:shard3  x:authCollection_shard3_replica1] o.a.s.c.ZkController publishing state=down
   [junit4]   2> 3540053 INFO  (OverseerStateUpdate-96574239040208903-127.0.0.1:57982_solr-n_0000000000) [n:127.0.0.1:57982_solr    ] o.a.s.c.Overseer processMessage: queueSize: 1, message = {
   [junit4]   2>   "core":"authCollection_shard3_replica1",
   [junit4]   2>   "roles":null,
   [junit4]   2>   "base_url":"https://127.0.0.1:40607/solr",
   [junit4]   2>   "node_name":"127.0.0.1:40607_solr",
   [junit4]   2>   "numShards":"3",
   [junit4]   2>   "state":"down",
   [junit4]   2>   "shard":"shard3",
   [junit4]   2>   "collection":"authCollection",
   [junit4]   2>   "operation":"state"} current state version: 0
   [junit4]   2> 3540053 INFO  (OverseerStateUpdate-96574239040208903-127.0.0.1:57982_solr-n_0000000000) [n:127.0.0.1:57982_solr    ] o.a.s.c.o.ReplicaMutator Update state numShards=3 message={
   [junit4]   2>   "core":"authCollection_shard3_replica1",
   [junit4]   2>   "roles":null,
   [junit4]   2>   "base_url":"https://127.0.0.1:40607/solr",
   [junit4]   2>   "node_name":"127.0.0.1:40607_solr",
   [junit4]   2>   "numShards":"3",
   [junit4]   2>   "state":"down",
   [junit4]   2>   "shard":"shard3",
   [junit4]   2>   "collection":"authCollection",
   [junit4]   2>   "operation":"state"}
   [junit4]   2> 3540065 INFO  (qtp2043262125-22481) [n:127.0.0.1:40607_solr c:authCollection s:shard3  x:authCollection_shard3_replica1] o.a.s.c.ZkController Registering watch for collection authCollection
   [junit4]   2> 3540066 INFO  (qtp2043262125-22481) [n:127.0.0.1:40607_solr c:authCollection s:shard3  x:authCollection_shard3_replica1] o.a.s.c.c.ZkStateReader Add data for [authCollection] ver [0]
   [junit4]   2> 3540069 INFO  (qtp2043262125-22481) [n:127.0.0.1:40607_solr c:authCollection s:shard3  x:authCollection_shard3_replica1] o.a.s.c.ZkController look for our core node name
   [junit4]   2> 3540094 INFO  (qtp1310325822-22498) [n:127.0.0.1:57982_solr    ] o.a.s.h.a.CoreAdminOperation core create command qt=/admin/cores&collection.configName=conf&name=authCollection_shard1_replica1&action=CREATE&numShards=3&collection=authCollection&shard=shard1&wt=javabin&version=2
   [junit4]   2> 3540095 INFO  (qtp1310325822-22498) [n:127.0.0.1:57982_solr    ] o.a.s.c.CoreDescriptor Created CoreDescriptor: {name=authCollection_shard1_replica1, collection.configName=conf, config=solrconfig.xml, transient=false, schema=schema.xml, loadOnStartup=true, configSetProperties=configsetprops.json, collection=authCollection, numShards=3, dataDir=data/, shard=shard1}
   [junit4]   2> 3540095 INFO  (qtp1310325822-22498) [n:127.0.0.1:57982_solr c:authCollection s:shard1  x:authCollection_shard1_replica1] o.a.s.c.ZkController publishing state=down
   [junit4]   2> 3540096 INFO  (qtp1310325822-22498) [n:127.0.0.1:57982_solr c:authCollection s:shard1  x:authCollection_shard1_replica1] o.a.s.c.ZkController Registering watch for collection authCollection
   [junit4]   2> 3540096 INFO  (qtp1310325822-22498) [n:127.0.0.1:57982_solr c:authCollection s:shard1  x:authCollection_shard1_replica1] o.a.s.c.c.ZkStateReader Add data for [authCollection] ver [0]
   [junit4]   2> 3540099 INFO  (OverseerStateUpdate-96574239040208903-127.0.0.1:57982_solr-n_0000000000) [n:127.0.0.1:57982_solr    ] o.a.s.c.Overseer processMessage: queueSize: 1, message = {
   [junit4]   2>   "core":"authCollection_shard1_replica1",
   [junit4]   2>   "roles":null,
   [junit4]   2>   "base_url":"https://127.0.0.1:57982/solr",
   [junit4]   2>   "node_name":"127.0.0.1:57982_solr",
   [junit4]   2>   "numShards":"3",
   [junit4]   2>   "state":"down",
   [junit4]   2>   "shard":"shard1",
   [junit4]   2>   "collection":"authCollection",
   [junit4]   2>   "operation":"state"} current state version: 0
   [junit4]   2> 3540099 INFO  (OverseerStateUpdate-96574239040208903-127.0.0.1:57982_solr-n_0000000000) [n:127.0.0.1:57982_solr    ] o.a.s.c.o.ReplicaMutator Update state numShards=3 message={
   [junit4]   2>   "core":"authCollection_shard1_replica1",
   [junit4]   2>   "roles":null,
   [junit4]   2>   "base_url":"https://127.0.0.1:57982/solr",
   [junit4]   2>   "node_name":"127.0.0.1:57982_solr",
   [junit4]   2>   "numShards":"3",
   [junit4]   2>   "state":"down",
   [junit4]   2>   "shard":"shard1",
   [junit4]   2>   "collection":"authCollection",
   [junit4]   2>   "operation":"state"}
   [junit4]   2> 3540102 INFO  (qtp1310325822-22498) [n:127.0.0.1:57982_solr c:authCollection s:shard1  x:authCollection_shard1_replica1] o.a.s.c.ZkController look for our core node name
   [junit4]   2> 3540115 INFO  (qtp1591475240-22476) [n:127.0.0.1:48265_solr    ] o.a.s.h.a.CoreAdminOperation core create command qt=/admin/cores&collection.configName=conf&name=authCollection_shard2_replica1&action=CREATE&numShards=3&collection=authCollection&shard=shard2&wt=javabin&version=2
   [junit4]   2> 3540115 INFO  (qtp1591475240-22476) [n:127.0.0.1:48265_solr    ] o.a.s.c.CoreDescriptor Created CoreDescriptor: {name=authCollection_shard2_replica1, collection.configName=conf, config=solrconfig.xml, transient=false, schema=schema.xml, loadOnStartup=true, configSetProperties=configsetprops.json, collection=authCollection, numShards=3, dataDir=data/, shard=shard2}
   [junit4]   2> 3540120 INFO  (qtp1591475240-22476) [n:127.0.0.1:48265_solr c:authCollection s:shard2  x:authCollection_shard2_replica1] o.a.s.c.ZkController publishing state=down
   [junit4]   2> 3540122 INFO  (OverseerStateUpdate-96574239040208903-127.0.0.1:57982_solr-n_0000000000) [n:127.0.0.1:57982_solr    ] o.a.s.c.Overseer processMessage: queueSize: 1, message = {
   [junit4]   2>   "core":"authCollection_shard2_replica1",
   [junit4]   2>   "roles":null,
   [junit4]   2>   "base_url":"https://127.0.0.1:48265/solr",
   [junit4]   2>   "node_name":"127.0.0.1:48265_solr",
   [junit4]   2>   "numShards":"3",
   [junit4]   2>   "state":"down",
   [junit4]   2>   "shard":"shard2",
   [junit4]   2>   "collection":"authCollection",
   [junit4]   2>   "operation":"state"} current state version: 0
   [junit4]   2> 3540122 INFO  (OverseerStateUpdate-96574239040208903-127.0.0.1:57982_solr-n_0000000000) [n:127.0.0.1:57982_solr    ] o.a.s.c.o.ReplicaMutator Update state numShards=3 message={
   [junit4]   2>   "core":"authCollection_shard2_replica1",
   [junit4]   2>   "roles":null,
   [junit4]   2>   "base_url":"https://127.0.0.1:48265/solr",
   [junit4]   2>   "node_name":"127.0.0.1:48265_solr",
   [junit4]   2>   "numShards":"3",
   [junit4]   2>   "state":"down",
   [junit4]   2>   "shard":"shard2",
   [junit4]   2>   "collection":"authCollection",
   [junit4]   2>   "operation":"state"}
   [junit4]   2> 3540122 INFO  (qtp1591475240-22476) [n:127.0.0.1:48265_solr c:authCollection s:shard2  x:authCollection_shard2_replica1] o.a.s.c.ZkController Registering watch for collection authCollection
   [junit4]   2> 3540123 INFO  (qtp1591475240-22476) [n:127.0.0.1:48265_solr c:authCollection s:shard2  x:authCollection_shard2_replica1] o.a.s.c.c.ZkStateReader Add data for [authCollection] ver [0]
   [junit4]   2> 3540129 INFO  (qtp1591475240-22476) [n:127.0.0.1:48265_solr c:authCollection s:shard2  x:authCollection_shard2_replica1] o.a.s.c.ZkController look for our core node name
   [junit4]   2> 3540224 INFO  (OverseerStateUpdate-96574239040208903-127.0.0.1:57982_solr-n_0000000000) [n:127.0.0.1:57982_solr    ] o.a.s.c.o.ZkStateWriter going to update_collection /collections/authCollection/state.json version: 0
   [junit4]   2> 3540225 INFO  (zkCallback-4654-thread-2-processing-n:127.0.0.1:48265_solr) [n:127.0.0.1:48265_solr    ] o.a.s.c.c.ZkStateReader A cluster state change: [WatchedEvent state:SyncConnected type:NodeDataChanged path:/collections/authCollection/state.json] for collection [authCollection] has occurred - updating... (live nodes size: [3])
   [junit4]   2> 3540225 INFO  (zkCallback-4646-thread-1-processing-n:127.0.0.1:40607_solr) [n:127.0.0.1:40607_solr    ] o.a.s.c.c.ZkStateReader A cluster state change: [WatchedEvent state:SyncConnected type:NodeDataChanged path:/collections/authCollection/state.json] for collection [authCollection] has occurred - updating... (live nodes size: [3])
   [junit4]   2> 3540225 INFO  (zkCallback-4646-thread-1-processing-n:127.0.0.1:40607_solr) [n:127.0.0.1:40607_solr    ] o.a.s.c.c.ZkStateReader Updating data for [authCollection] from [0] to [1]
   [junit4]   2> 3540226 INFO  (zkCallback-4654-thread-2-processing-n:127.0.0.1:48265_solr) [n:127.0.0.1:48265_solr    ] o.a.s.c.c.ZkStateReader Updating data for [authCollection] from [0] to [1]
   [junit4]   2> 3540226 INFO  (zkCallback-4652-thread-2-processing-n:127.0.0.1:57982_solr) [n:127.0.0.1:57982_solr    ] o.a.s.c.c.ZkStateReader A cluster state change: [WatchedEvent state:SyncConnected type:NodeDataChanged path:/collections/authCollection/state.json] for collection [authCollection] has occurred - updating... (live nodes size: [3])
   [junit4]   2> 3540226 INFO  (zkCallback-4652-thread-2-processing-n:127.0.0.1:57982_solr) [n:127.0.0.1:57982_solr    ] o.a.s.c.c.ZkStateReader Updating data for [authCollection] from [0] to [1]
   [junit4]   2> 3541072 INFO  (qtp2043262125-22481) [n:127.0.0.1:40607_solr c:authCollection s:shard3  x:authCollection_shard3_replica1] o.a.s.c.ZkController waiting to find shard id in clusterstate for authCollection_shard3_replica1
   [junit4]   2> 3541072 INFO  (qtp2043262125-22481) [n:127.0.0.1:40607_solr c:authCollection s:shard3  x:authCollection_shard3_replica1] o.a.s.c.ZkController Check for collection zkNode:authCollection
   [junit4]   2> 3541072 INFO  (qtp2043262125-22481) [n:127.0.0.1:40607_solr c:authCollection s:shard3  x:authCollection_shard3_replica1] o.a.s.c.ZkController Collection zkNode exists
   [junit4]   2> 3541072 INFO  (qtp2043262125-22481) [n:127.0.0.1:40607_solr c:authCollection s:shard3  x:authCollection_shard3_replica1] o.a.s.c.c.ZkStateReader Load collection config from: [/collections/authCollection]
   [junit4]   2> 3541073 INFO  (qtp2043262125-22481) [n:127.0.0.1:40607_solr c:authCollection s:shard3  x:authCollection_shard3_replica1] o.a.s.c.c.ZkStateReader path=[/collections/authCollection] [configName]=[conf] specified config exists in ZooKeeper
   [junit4]   2> 3541073 INFO  (qtp2043262125-22481) [n:127.0.0.1:40607_solr c:authCollection s:shard3  x:authCollection_shard3_replica1] o.a.s.c.SolrResourceLoader new SolrResourceLoader for directory: '/x1/jenkins/jenkins-slave/workspace/Lucene-Solr-Tests-6.x/solr/build/solr-core/test/J2/temp/solr.security.BasicAuthIntegrationTest_E2BD62B168305F97-001/tempDir-001/node1/authCollection_shard3_replica1'
   [junit4]   2> 3541073 INFO  (qtp2043262125-22481) [n:127.0.0.1:40607_solr c:authCollection s:shard3  x:authCollection_shard3_replica1] o.a.s.c.SolrResourceLoader JNDI not configured for solr (NoInitialContextEx)
   [junit4]   2> 3541073 INFO  (qtp2043262125-22481) [n:127.0.0.1:40607_solr c:authCollection s:shard3  x:authCollection_shard3_replica1] o.a.s.c.SolrResourceLoader solr home defaulted to 'solr/' (could not find system property or JNDI)
   [junit4]   2> 3541075 INFO  (qtp2043262125-22481) [n:127.0.0.1:40607_solr c:authCollection s:shard3  x:authCollection_shard3_replica1] o.a.s.c.Config loaded config solrconfig.xml with version 0 
   [junit4]   2> 3541078 INFO  (qtp2043262125-22481) [n:127.0.0.1:40607_solr c:authCollection s:shard3  x:authCollection_shard3_replica1] o.a.s.c.SolrConfig current version of requestparams : -1
   [junit4]   2> 3541080 INFO  (qtp2043262125-22481) [n:127.0.0.1:40607_solr c:authCollection s:shard3  x:authCollection_shard3_replica1] o.a.s.c.SolrConfig Using Lucene MatchVersion: 6.3.0
   [junit4]   2> 3541091 INFO  (qtp2043262125-22481) [n:127.0.0.1:40607_solr c:authCollection s:shard3  x:authCollection_shard3_replica1] o.a.s.c.SolrConfig Loaded SolrConfig: solrconfig.xml
   [junit4]   2> 3541095 INFO  (qtp2043262125-22481) [n:127.0.0.1:40607_solr c:authCollection s:shard3  x:authCollection_shard3_replica1] o.a.s.s.IndexSchema [authCollection_shard3_replica1] Schema name=minimal
   [junit4]   2> 3541101 INFO  (qtp2043262125-22481) [n:127.0.0.1:40607_solr c:authCollection s:shard3  x:authCollection_shard3_replica1] o.a.s.s.IndexSchema unique key field: id
   [junit4]   2> 3541103 INFO  (qtp2043262125-22481) [n:127.0.0.1:40607_solr c:authCollection s:shard3  x:authCollection_shard3_replica1] o.a.s.c.ConfigSetProperties Did not find ConfigSet properties, assuming default properties: Can't find resource 'configsetprops.json' in classpath or '/configs/conf', cwd=/x1/jenkins/jenkins-slave/workspace/Lucene-Solr-Tests-6.x/solr/build/solr-core/test/J2
   [junit4]   2> 3541103 INFO  (qtp2043262125-22481) [n:127.0.0.1:40607_solr c:authCollection s:shard3  x:authCollection_shard3_replica1] o.a.s.c.CoreContainer Creating SolrCore 'authCollection_shard3_replica1' using configuration from collection authCollection
   [junit4]   2> 3541103 INFO  (qtp2043262125-22481) [n:127.0.0.1:40607_solr c:authCollection s:shard3 r:core_node1 x:authCollection_shard3_replica1] o.a.s.c.SolrCore org.apache.solr.core.MockDirectoryFactory
   [junit4]   2> 3541104 INFO  (qtp2043262125-22481) [n:127.0.0.1:40607_solr c:authCollection s:shard3 r:core_node1 x:authCollection_shard3_replica1] o.a.s.c.SolrCore [[authCollection_shard3_replica1] ] Opening new SolrCore at [/x1/jenkins/jenkins-slave/workspace/Lucene-Solr-Tests-6.x/solr/build/solr-core/test/J2/temp/solr.security.BasicAuthIntegrationTest_E2BD62B168305F97-001/tempDir-001/node1/authCollection_shard3_replica1], dataDir=[/x1/jenkins/jenkins-slave/workspace/Lucene-Solr-Tests-6.x/solr/build/solr-core/test/J2/temp/solr.security.BasicAuthIntegrationTest_E2BD62B168305F97-001/tempDir-001/node1/./authCollection_shard3_replica1/data/]
   [junit4]   2> 3541104 INFO  (qtp2043262125-22481) [n:127.0.0.1:40607_solr c:authCollection s:shard3 r:core_node1 x:authCollection_shard3_replica1] o.a.s.c.SolrCore JMX monitoring not detected for core: authCollection_shard3_replica1
   [junit4]   2> 3541104 INFO  (qtp1310325822-22498) [n:127.0.0.1:57982_solr c:authCollection s:shard1  x:authCollection_shard1_replica1] o.a.s.c.ZkController waiting to find shard id in clusterstate for authCollection_shard1_replica1
   [junit4]   2> 3541104 INFO  (qtp1310325822-22498) [n:127.0.0.1:57982_solr c:authCollection s:shard1  x:authCollection_shard1_replica1] o.a.s.c.ZkController Check for collection zkNode:authCollection
   [junit4]   2> 3541104 INFO  (qtp2043262125-22481) [n:127.0.0.1:40607_solr c:authCollection s:shard3 r:core_node1 x:authCollection_shard3_replica1] o.a.s.c.CachingDirectoryFactory return new directory for /x1/jenkins/jenkins-slave/workspace/Lucene-Solr-Tests-6.x/solr/build/solr-core/test/J2/temp/solr.security.BasicAuthIntegrationTest_E2BD62B168305F97-001/tempDir-001/node1/./authCollection_shard3_replica1/data/snapshot_metadata
   [junit4]   2> 3541104 INFO  (qtp1310325822-22498) [n:127.0.0.1:57982_solr c:authCollection s:shard1  x:authCollection_shard1_replica1] o.a.s.c.ZkController Collection zkNode exists
   [junit4]   2> 3541104 INFO  (qtp2043262125-22481) [n:127.0.0.1:40607_solr c:authCollection s:shard3 r:core_node1 x:authCollection_shard3_replica1] o.a.s.c.s.SolrSnapshotMetaDataManager Loading from snapshot metadata file...
   [junit4]   2> 3541104 INFO  (qtp1310325822-22498) [n:127.0.0.1:57982_solr c:authCollection s:shard1  x:authCollection_shard1_replica1] o.a.s.c.c.ZkStateReader Load collection config from: [/collections/authCollection]
   [junit4]   2> 3541105 INFO  (qtp2043262125-22481) [n:127.0.0.1:40607_solr c:authCollection s:shard3 r:core_node1 x:authCollection_shard3_replica1] o.a.s.c.CachingDirectoryFactory return new directory for /x1/jenkins/jenkins-slave/workspace/Lucene-Solr-Tests-6.x/solr/build/solr-core/test/J2/temp/solr.security.BasicAuthIntegrationTest_E2BD62B168305F97-001/tempDir-001/node1/./authCollection_shard3_replica1/data
   [junit4]   2> 3541105 INFO  (qtp1310325822-22498) [n:127.0.0.1:57982_solr c:authCollection s:shard1  x:authCollection_shard1_replica1] o.a.s.c.c.ZkStateReader path=[/collections/authCollection] [configName]=[conf] specified config exists in ZooKeeper
   [junit4]   2> 3541105 INFO  (qtp1310325822-22498) [n:127.0.0.1:57982_solr c:authCollection s:shard1  x:authCollection_shard1_replica1] o.a.s.c.SolrResourceLoader new SolrResourceLoader for directory: '/x1/jenkins/jenkins-slave/workspace/Lucene-Solr-Tests-6.x/solr/build/solr-core/test/J2/temp/solr.security.BasicAuthIntegrationTest_E2BD62B168305F97-001/tempDir-001/node3/authCollection_shard1_replica1'
   [junit4]   2> 3541105 INFO  (qtp1310325822-22498) [n:127.0.0.1:57982_solr c:authCollection s:shard1  x:authCollection_shard1_replica1] o.a.s.c.SolrResourceLoader JNDI not configured for solr (NoInitialContextEx)
   [junit4]   2> 3541105 INFO  (qtp1310325822-22498) [n:127.0.0.1:57982_solr c:authCollection s:shard1  x:authCollection_shard1_replica1] o.a.s.c.SolrResourceLoader solr home defaulted to 'solr/' (could not find system property or JNDI)
   [junit4]   2> 3541109 INFO  (qtp1310325822-22498) [n:127.0.0.1:57982_solr c:authCollection s:shard1  x:authCollection_shard1_replica1] o.a.s.c.Config loaded config solrconfig.xml with version 0 
   [junit4]   2> 3541112 INFO  (qtp2043262125-22481) [n:127.0.0.1:40607_solr c:authCollection s:shard3 r:core_node1 x:authCollection_shard3_replica1] o.a.s.c.SolrCore New index directory detected: old=null new=/x1/jenkins/jenkins-slave/workspace/Lucene-Solr-Tests-6.x/solr/build/solr-core/test/J2/temp/solr.security.BasicAuthIntegrationTest_E2BD62B168305F97-001/tempDir-001/node1/./authCollection_shard3_replica1/data/index/
   [junit4]   2> 3541112 WARN  (qtp2043262125-22481) [n:127.0.0.1:40607_solr c:authCollection s:shard3 r:core_node1 x:authCollection_shard3_replica1] o.a.s.c.SolrCore [authCollection_shard3_replica1] Solr index directory '/x1/jenkins/jenkins-slave/workspace/Lucene-Solr-Tests-6.x/solr/build/solr-core/test/J2/temp/solr.security.BasicAuthIntegrationTest_E2BD62B168305F97-001/tempDir-001/node1/./authCollection_shard3_replica1/data/index' doesn't exist. Creating new index...
   [junit4]   2> 3541113 INFO  (qtp2043262125-22481) [n:127.0.0.1:40607_solr c:authCollection s:shard3 r:core_node1 x:authCollection_shard3_replica1] o.a.s.c.CachingDirectoryFactory return new directory for /x1/jenkins/jenkins-slave/workspace/Lucene-Solr-Tests-6.x/solr/build/solr-core/test/J2/temp/solr.security.BasicAuthIntegrationTest_E2BD62B168305F97-001/tempDir-001/node1/./authCollection_shard3_replica1/data/index
   [junit4]   2> 3541113 INFO  (qtp2043262125-22481) [n:127.0.0.1:40607_solr c:authCollection s:shard3 r:core_node1 x:authCollection_shard3_replica1] o.a.s.c.SolrDeletionPolicy SolrDeletionPolicy.onCommit: commits: num=1
   [junit4]   2> 	commit{dir=MockDirectoryWrapper(RAMDirectory@12aa10a0 lockFactory=org.apache.lucene.store.SingleInstanceLockFactory@682ed4e5),segFN=segments_1,generation=1}
   [junit4]   2> 3541113 INFO  (qtp2043262125-22481) [n:127.0.0.1:40607_solr c:authCollection s:shard3 r:core_node1 x:authCollection_shard3_replica1] o.a.s.c.SolrDeletionPolicy newest commit generation = 1
   [junit4]   2> 3541116 INFO  (qtp1310325822-22498) [n:127.0.0.1:57982_solr c:authCollection s:shard1  x:authCollection_shard1_replica1] o.a.s.c.SolrConfig current version of requestparams : -1
   [junit4]   2> 3541118 INFO  (qtp1310325822-22498) [n:127.0.0.1:57982_solr c:authCollection s:shard1  x:authCollection_shard1_replica1] o.a.s.c.SolrConfig Using Lucene MatchVersion: 6.3.0
   [junit4]   2> 3541127 INFO  (qtp1310325822-22498) [n:127.0.0.1:57982_solr c:authCollection s:shard1  x:authCollection_shard1_replica1] o.a.s.c.SolrConfig Loaded SolrConfig: solrconfig.xml
   [junit4]   2> 3541132 INFO  (qtp1591475240-22476) [n:127.0.0.1:48265_solr c:authCollection s:shard2  x:authCollection_shard2_replica1] o.a.s.c.ZkController waiting to find shard id in clusterstate for authCollection_shard2_replica1
   [junit4]   2> 3541132 INFO  (qtp1591475240-22476) [n:127.0.0.1:48265_solr c:authCollection s:shard2  x:authCollection_shard2_replica1] o.a.s.c.ZkController Check for collection zkNode:authCollection
   [junit4]   2> 3541134 INFO  (qtp1310325822-22498) [n:127.0.0.1:57982_solr c:authCollection s:shard1  x:authCollection_shard1_replica1] o.a.s.s.IndexSchema [authCollection_shard1_replica1] Schema name=minimal
   [junit4]   2> 3541137 INFO  (qtp1591475240-22476) [n:127.0.0.1:48265_solr c:authCollection s:shard2  x:authCollection_shard2_replica1] o.a.s.c.ZkController Collection zkNode exists
   [junit4]   2> 3541137 INFO  (qtp1591475240-22476) [n:127.0.0.1:48265_solr c:authCollection s:shard2  x:authCollection_shard2_replica1] o.a.s.c.c.ZkStateReader Load collection config from: [/collections/authCollection]
   [junit4]   2> 3541138 INFO  (qtp1591475240-22476) [n:127.0.0.1:48265_solr c:authCollection s:shard2  x:authCollection_shard2_replica1] o.a.s.c.c.ZkStateReader path=[/collections/authCollection] [configName]=[conf] specified config exists in ZooKeeper
   [junit4]   2> 3541138 INFO  (qtp1591475240-22476) [n:127.0.0.1:48265_solr c:authCollection s:shard2  x:authCollection_shard2_replica1] o.a.s.c.SolrResourceLoader new SolrResourceLoader for directory: '/x1/jenkins/jenkins-slave/workspace/Lucene-Solr-Tests-6.x/solr/build/solr-core/test/J2/temp/solr.security.BasicAuthIntegrationTest_E2BD62B168305F97-001/tempDir-001/node2/authCollection_shard2_replica1'
   [junit4]   2> 3541138 INFO  (qtp1591475240-22476) [n:127.0.0.1:48265_solr c:authCollection s:shard2  x:authCollection_shard2_replica1] o.a.s.c.SolrResourceLoader JNDI not configured for solr (NoInitialContextEx)
   [junit4]   2> 3541138 INFO  (qtp1591475240-22476) [n:127.0.0.1:48265_solr c:authCollection s:shard2  x:authCollection_shard2_replica1] o.a.s.c.SolrResourceLoader solr home defaulted to 'solr/' (could not find system property or JNDI)
   [junit4]   2> 3541140 INFO  (qtp1591475240-22476) [n:127.0.0.1:48265_solr c:authCollection s:shard2  x:authCollection_shard2_replica1] o.a.s.c.Config loaded config solrconfig.xml with version 0 
   [junit4]   2> 3541141 INFO  (qtp1310325822-22498) [n:127.0.0.1:57982_solr c:authCollection s:shard1  x:authCollection_shard1_replica1] o.a.s.s.IndexSchema unique key field: id
   [junit4]   2> 3541144 INFO  (qtp1591475240-22476) [n:127.0.0.1:48265_solr c:authCollection s:shard2  x:authCollection_shard2_replica1] o.a.s.c.SolrConfig current version of requestparams : -1
   [junit4]   2> 3541144 INFO  (qtp1310325822-22498) [n:127.0.0.1:57982_solr c:authCollection s:shard1  x:authCollection_shard1_replica1] o.a.s.c.ConfigSetProperties Did not find ConfigSet properties, assuming default properties: Can't find resource 'configsetprops.json' in classpath or '/configs/conf', cwd=/x1/jenkins/jenkins-slave/workspace/Lucene-Solr-Tests-6.x/solr/build/solr-core/test/J2
   [junit4]   2> 3541144 INFO  (qtp1310325822-22498) [n:127.0.0.1:57982_solr c:authCollection s:shard1  x:authCollection_shard1_replica1] o.a.s.c.CoreContainer Creating SolrCore 'authCollection_shard1_replica1' using configuration from collection authCollection
   [junit4]   2> 3541145 INFO  (qtp1310325822-22498) [n:127.0.0.1:57982_solr c:authCollection s:shard1 r:core_node2 x:authCollection_shard1_replica1] o.a.s.c.SolrCore org.apache.solr.core.MockDirectoryFactory
   [junit4]   2> 3541145 INFO  (qtp1310325822-22498) [n:127.0.0.1:57982_solr c:authCollection s:shard1 r:core_node2 x:authCollection_shard1_replica1] o.a.s.c.SolrCore [[authCollection_shard1_replica1] ] Opening new SolrCore at [/x1/jenkins/jenkins-slave/workspace/Lucene-Solr-Tests-6.x/solr/build/solr-core/test/J2/temp/solr.security.BasicAuthIntegrationTest_E2BD62B168305F97-001/tempDir-001/node3/authCollection_shard1_replica1], dataDir=[/x1/jenkins/jenkins-slave/workspace/Lucene-Solr-Tests-6.x/solr/build/solr-core/test/J2/temp/solr.security.BasicAuthIntegrationTest_E2BD62B168305F97-001/tempDir-001/node3/./authCollection_shard1_replica1/data/]
   [junit4]   2> 3541145 INFO  (qtp1310325822-22498) [n:127.0.0.1:57982_solr c:authCollection s:shard1 r:core_node2 x:authCollection_shard1_replica1] o.a.s.c.SolrCore JMX monitoring not detected for core: authCollection_shard1_replica1
   [junit4]   2> 3541145 INFO  (qtp1310325822-22498) [n:127.0.0.1:57982_solr c:authCollection s:shard1 r:core_node2 x:authCollection_shard1_replica1] o.a.s.c.CachingDirectoryFactory return new directory for /x1/jenkins/jenkins-slave/workspace/Lucene-Solr-Tests-6.x/solr/build/solr-core/test/J2/temp/solr.security.BasicAuthIntegrationTest_E2BD62B168305F97-001/tempDir-001/node3/./authCollection_shard1_replica1/data/snapshot_metadata
   [junit4]   2> 3541146 INFO  (qtp1310325822-22498) [n:127.0.0.1:57982_solr c:authCollection s:shard1 r:core_node2 x:authCollection_shard1_replica1] o.a.s.c.s.SolrSnapshotMetaDataManager Loading from snapshot metadata file...
   [junit4]   2> 3541146 INFO  (qtp1591475240-22476) [n:127.0.0.1:48265_solr c:authCollection s:shard2  x:authCollection_shard2_replica1] o.a.s.c.SolrConfig Using Lucene MatchVersion: 6.3.0
   [junit4]   2> 3541146 INFO  (qtp1310325822-22498) [n:127.0.0.1:57982_solr c:authCollection s:shard1 r:core_node2 x:authCollection_shard1_replica1] o.a.s.c.CachingDirectoryFactory return new directory for /x1/jenkins/jenkins-slave/workspace/Lucene-Solr-Tests-6.x/solr/build/solr-core/test/J2/temp/solr.security.BasicAuthIntegrationTest_E2BD62B168305F97-001/tempDir-001/node3/./authCollection_shard1_replica1/data
   [junit4]   2> 3541157 INFO  (qtp1591475240-22476) [n:127.0.0.1:48265_solr c:authCollection s:shard2  x:authCollection_shard2_replica1] o.a.s.c.SolrConfig Loaded SolrConfig: solrconfig.xml
   [junit4]   2> 3541158 INFO  (OldIndexDirectoryCleanupThreadForCore-authCollection_shard3_replica1) [n:127.0.0.1:40607_solr c:authCollection s:shard3 r:core_node1 x:authCollection_shard3_replica1] o.a.s.c.SolrCore Looking for old index directories to cleanup for core authCollection_shard3_replica1 in /x1/jenkins/jenkins-slave/workspace/Lucene-Solr-Tests-6.x/solr/build/solr-core/test/J2/temp/solr.security.BasicAuthIntegrationTest_E2BD62B168305F97-001/tempDir-001/node1/./authCollection_shard3_replica1/data/
   [junit4]   2> 3541158 WARN  (OldIndexDirectoryCleanupThreadForCore-authCollection_shard3_replica1) [n:127.0.0.1:40607_solr c:authCollection s:shard3 r:core_node1 x:authCollection_shard3_replica1] o.a.s.c.DirectoryFactory /x1/jenkins/jenkins-slave/workspace/Lucene-Solr-Tests-6.x/solr/build/solr-core/test/J2/temp/solr.security.BasicAuthIntegrationTest_E2BD62B168305F97-001/tempDir-001/node1/./authCollection_shard3_replica1/data/ does not point to a valid data directory; skipping clean-up of old index directories.
   [junit4]   2> 3541159 INFO  (qtp1310325822-22498) [n:127.0.0.1:57982_solr c:authCollection s:shard1 r:core_node2 x:authCollection_shard1_replica1] o.a.s.c.SolrCore New index directory detected: old=null new=/x1/jenkins/jenkins-slave/workspace/Lucene-Solr-Tests-6.x/solr/build/solr-core/test/J2/temp/solr.security.BasicAuthIntegrationTest_E2BD62B168305F97-001/tempDir-001/node3/./authCollection_shard1_replica1/data/index/
   [junit4]   2> 3541159 WARN  (qtp1310325822-22498) [n:127.0.0.1:57982_solr c:authCollection s:shard1 r:core_node2 x:authCollection_shard1_replica1] o.a.s.c.SolrCore [authCollection_shard1_replica1] Solr index directory '/x1/jenkins/jenkins-slave/workspace/Lucene-Solr-Tests-6.x/solr/build/solr-core/test/J2/temp/solr.security.BasicAuthIntegrationTest_E2BD62B168305F97-001/tempDir-001/node3/./authCollection_shard1_replica1/data/index' doesn't exist. Creating new index...
   [junit4]   2> 3541159 INFO  (qtp1310325822-22498) [n:127.0.0.1:57982_solr c:authCollection s:shard1 r:core_node2 x:authCollection_shard1_replica1] o.a.s.c.CachingDirectoryFactory return new directory for /x1/jenkins/jenkins-slave/workspace/Lucene-Solr-Tests-6.x/solr/build/solr-core/test/J2/temp/solr.security.BasicAuthIntegrationTest_E2BD62B168305F97-001/tempDir-001/node3/./authCollection_shard1_replica1/data/index
   [junit4]   2> 3541167 INFO  (qtp1591475240-22476) [n:127.0.0.1:48265_solr c:authCollection s:shard2  x:authCollection_shard2_replica1] o.a.s.s.IndexSchema [authCollection_shard2_replica1] Schema name=minimal
   [junit4]   2> 3541169 INFO  (qtp1591475240-22476) [n:127.0.0.1:48265_solr c:authCollection s:shard2  x:authCollection_shard2_replica1] o.a.s.s.IndexSchema unique key field: id
   [junit4]   2> 3541169 INFO  (qtp2043262125-22481) [n:127.0.0.1:40607_solr c:authCollection s:shard3 r:core_node1 x:authCollection_shard3_replica1] o.a.s.c.SolrCore no updateRequestProcessorChain defined as default, creating implicit default
   [junit4]   2> 3541171 INFO  (qtp2043262125-22481) [n:127.0.0.1:40607_solr c:authCollection s:shard3 r:core_node1 x:authCollection_shard3_replica1] o.a.s.h.l.XMLLoader xsltCacheLifetimeSeconds=60
   [junit4]   2> 3541172 INFO  (qtp1310325822-22498) [n:127.0.0.1:57982_solr c:authCollection s:shard1 r:core_node2 x:authCollection_shard1_replica1] o.a.s.c.SolrDeletionPolicy SolrDeletionPolicy.onCommit: commits: num=1
   [junit4]   2> 	commit{dir=MockDirectoryWrapper(RAMDirectory@4d81760a lockFactory=org.apache.lucene.store.SingleInstanceLockFactory@4e3b1c6b),segFN=segments_1,generation=1}
   [junit4]   2> 3541172 INFO  (qtp2043262125-22481) [n:127.0.0.1:40607_solr c:authCollection s:shard3 r:core_node1 x:authCollection_shard3_replica1] o.a.s.h.l.XMLLoader xsltCacheLifetimeSeconds=60
   [junit4]   2> 3541172 INFO  (qtp1310325822-22498) [n:127.0.0.1:57982_solr c:authCollection s:shard1 r:core_node2 x:authCollection_shard1_replica1] o.a.s.c.SolrDeletionPolicy newest commit generation = 1
   [junit4]   2> 3541174 INFO  (qtp1310325822-22498) [n:127.0.0.1:57982_solr c:authCollection s:shard1 r:core_node2 x:authCollection_shard1_replica1] o.a.s.c.SolrCore no updateRequestProcessorChain defined as default, creating implicit default
   [junit4]   2> 3541175 INFO  (qtp1310325822-22498) [n:127.0.0.1:57982_solr c:authCollection s:shard1 r:core_node2 x:authCollection_shard1_replica1] o.a.s.h.l.XMLLoader xsltCacheLifetimeSeconds=60
   [junit4]   2> 3541176 INFO  (qtp1310325822-22498) [n:127.0.0.1:57982_solr c:authCollection s:shard1 r:core_node2 x:authCollection_shard1_replica1] o.a.s.h.l.XMLLoader xsltCacheLifetimeSeconds=60
   [junit4]   2> 3541177 INFO  (qtp1310325822-22498) [n:127.0.0.1:57982_solr c:authCollection s:shard1 r:core_node2 x:authCollection_shard1_replica1] o.a.s.h.l.XMLLoader xsltCacheLifetimeSeconds=60
   [junit4]   2> 3541177 INFO  (qtp1310325822-22498) [n:127.0.0.1:57982_solr c:authCollection s:shard1 r:core_node2 x:authCollection_shard1_replica1] o.a.s.h.l.XMLLoader xsltCacheLifetimeSeconds=60
   [junit4]   2> 3541176 INFO  (OldIndexDirectoryCleanupThreadForCore-authCollection_shard1_replica1) [n:127.0.0.1:57982_solr c:authCollection s:shard1 r:core_node2 x:authCollection_shard1_replica1] o.a.s.c.SolrCore Looking for old index directories to cleanup for core authCollection_shard1_replica1 in /x1/jenkins/jenkins-slave/workspace/Lucene-Solr-Tests-6.x/solr/build/solr-core/test/J2/temp/solr.security.BasicAuthIntegrationTest_E2BD62B168305F97-001/tempDir-001/node3/./authCollection_shard1_replica1/data/
   [junit4]   2> 3541178 WARN  (OldIndexDirectoryCleanupThreadForCore-authCollection_shard1_replica1) [n:127.0.0.1:57982_solr c:authCollection s:shard1 r:core_node2 x:authCollection_shard1_replica1] o.a.s.c.DirectoryFactory /x1/jenkins/jenkins-slave/workspace/Lucene-Solr-Tests-6.x/solr/build/solr-core/test/J2/temp/solr.security.BasicAuthIntegrationTest_E2BD62B168305F97-001/tempDir-001/node3/./authCollection_shard1_replica1/data/ does not point to a valid data directory; skipping clean-up of old index directories.
   [junit4]   2> 3541179 INFO  (qtp1310325822-22498) [n:127.0.0.1:57982_solr c:authCollection s:shard1 r:core_node2 x:authCollection_shard1_replica1] o.a.s.c.RequestHandlers Registered paths: /admin/mbeans,/update/json/docs,/admin/luke,/export,/get,/admin/properties,/update/json,/admin/threads,/update/csv,/sql,/graph,/select,/admin/segments,/admin/system,/replication,/config,/stream,/schema,/admin/plugins,/admin/logging,/admin/ping,/update,/admin/file,/terms
   [junit4]   2> 3541179 INFO  (qtp1310325822-22498) [n:127.0.0.1:57982_solr c:authCollection s:shard1 r:core_node2 x:authCollection_shard1_replica1] o.a.s.c.SolrCore Using default statsCache cache: org.apache.solr.search.stats.LocalStatsCache
   [junit4]   2> 3541183 INFO  (qtp2043262125-22481) [n:127.0.0.1:40607_solr c:authCollection s:shard3 r:core_node1 x:authCollection_shard3_replica1] o.a.s.h.l.XMLLoader xsltCacheLifetimeSeconds=60
   [junit4]   2> 3541188 INFO  (qtp2043262125-22481) [n:127.0.0.1:40607_solr c:authCollection s:shard3 r:core_node1 x:authCollection_shard3_replica1] o.a.s.h.l.XMLLoader xsltCacheLifetimeSeconds=60
   [junit4]   2> 3541189 INFO  (qtp2043262125-22481) [n:127.0.0.1:40607_solr c:authCollection s:shard3 r:core_node1 x:authCollection_shard3_replica1] o.a.s.c.RequestHandlers Registered paths: /admin/mbeans,/update/json/docs,/admin/luke,/export,/get,/admin/properties,/update/json,/admin/threads,/update/csv,/sql,/graph,/select,/admin/segments,/admin/system,/replication,/config,/stream,/schema,/admin/plugins,/admin/logging,/admin/ping,/update,/admin/file,/terms
   [junit4]   2> 3541189 INFO  (qtp2043262125-22481) [n:127.0.0.1:40607_solr c:authCollection s:shard3 r:core_node1 x:authCollection_shard3_replica1] o.a.s.c.SolrCore Using default statsCache cache: org.apache.solr.search.stats.LocalStatsCache
   [junit4]   2> 3541191 INFO  (qtp1591475240-22476) [n:127.0.0.1:48265_solr c:authCollection s:shard2  x:authCollection_shard2_replica1] o.a.s.c.ConfigSetProperties Did not find ConfigSet properties, assuming default properties: Can't find resource 'configsetprops.json' in classpath or '/configs/conf', cwd=/x1/jenkins/jenkins-slave/workspac

[...truncated too long message...]

junit4]   2> 	at org.apache.solr.common.util.ExecutorUtil$MDCAwareThreadPoolExecutor.execute(ExecutorUtil.java:214)
   [junit4]   2> 	at java.util.concurrent.AbstractExecutorService.submit(AbstractExecutorService.java:112)
   [junit4]   2> 	at org.apache.solr.common.cloud.SolrZkClient$3.process(SolrZkClient.java:266)
   [junit4]   2> 	at org.apache.zookeeper.ClientCnxn$EventThread.processEvent(ClientCnxn.java:522)
   [junit4]   2> 	at org.apache.zookeeper.ClientCnxn$EventThread.run(ClientCnxn.java:498)
   [junit4]   2> 3546677 INFO  (jetty-launcher-4638-thread-1) [    ] o.e.j.s.h.ContextHandler Stopped o.e.j.s.ServletContextHandler@7fae98e3{/solr,null,UNAVAILABLE}
   [junit4]   2> 3546678 INFO  (zkCallback-4666-thread-2-processing-n:127.0.0.1:50614_solr) [n:127.0.0.1:50614_solr    ] o.a.s.c.LeaderElector Watching path /overseer_elect/election/96574239040208903-127.0.0.1:57982_solr-n_0000000000 to know if I could be the leader
   [junit4]   2> 3546679 INFO  (zkCallback-4652-thread-1-processing-n:127.0.0.1:57982_solr) [n:127.0.0.1:57982_solr    ] o.a.s.c.c.ZkStateReader Updated live nodes from ZooKeeper... (3) -> (2)
   [junit4]   2> 3546680 INFO  (zkCallback-4652-thread-1-processing-n:127.0.0.1:57982_solr) [n:127.0.0.1:57982_solr    ] o.a.s.c.c.ZkStateReader A live node change: [WatchedEvent state:SyncConnected type:NodeChildrenChanged path:/live_nodes], has occurred - updating... (live nodes size: [2])
   [junit4]   2> 3546680 INFO  (zkCallback-4666-thread-2-processing-n:127.0.0.1:50614_solr) [n:127.0.0.1:50614_solr    ] o.a.s.c.c.ZkStateReader A live node change: [WatchedEvent state:SyncConnected type:NodeChildrenChanged path:/live_nodes], has occurred - updating... (live nodes size: [2])
   [junit4]   2> 3546680 WARN  (zkCallback-4666-thread-2-processing-n:127.0.0.1:50614_solr) [n:127.0.0.1:50614_solr    ] o.a.s.c.c.ZkStateReader ZooKeeper watch triggered, but Solr cannot talk to ZK: [KeeperErrorCode = Session expired for /live_nodes]
   [junit4]   2> 3546681 WARN  (NIOServerCxn.Factory:0.0.0.0/0.0.0.0:0) [    ] o.a.z.s.NIOServerCnxn caught end of stream exception
   [junit4]   2> EndOfStreamException: Unable to read additional data from client sessionid 0x15719c23c720007, likely client has closed socket
   [junit4]   2> 	at org.apache.zookeeper.server.NIOServerCnxn.doIO(NIOServerCnxn.java:228)
   [junit4]   2> 	at org.apache.zookeeper.server.NIOServerCnxnFactory.run(NIOServerCnxnFactory.java:208)
   [junit4]   2> 	at java.lang.Thread.run(Thread.java:745)
   [junit4]   2> 3546682 INFO  (jetty-launcher-4638-thread-3) [    ] o.e.j.s.h.ContextHandler Stopped o.e.j.s.ServletContextHandler@459fa8dc{/solr,null,UNAVAILABLE}
   [junit4]   2> 3548180 WARN  (zkCallback-4652-thread-1-processing-n:127.0.0.1:57982_solr) [n:127.0.0.1:57982_solr    ] o.a.s.c.c.ZkStateReader ZooKeeper watch triggered, but Solr cannot talk to ZK: [KeeperErrorCode = Session expired for /live_nodes]
   [junit4]   2> 3548180 INFO  (jetty-launcher-4638-thread-2) [    ] o.e.j.s.h.ContextHandler Stopped o.e.j.s.ServletContextHandler@5b333e5b{/solr,null,UNAVAILABLE}
   [junit4]   2> 3548185 INFO  (SUITE-BasicAuthIntegrationTest-seed#[E2BD62B168305F97]-worker) [    ] o.a.s.c.ZkTestServer connecting to 127.0.0.1:50532 50532
   [junit4]   2> 3548289 INFO  (Thread-4959) [    ] o.a.s.c.ZkTestServer connecting to 127.0.0.1:50532 50532
   [junit4]   2> 3548289 WARN  (Thread-4959) [    ] o.a.s.c.ZkTestServer Watch limit violations: 
   [junit4]   2> Maximum concurrent create/delete watches above limit:
   [junit4]   2> 
   [junit4]   2> 	5	/solr/aliases.json
   [junit4]   2> 	4	/solr/security.json
   [junit4]   2> 	4	/solr/configs/conf
   [junit4]   2> 
   [junit4]   2> Maximum concurrent data watches above limit:
   [junit4]   2> 
   [junit4]   2> 	5	/solr/clusterstate.json
   [junit4]   2> 	5	/solr/clusterprops.json
   [junit4]   2> 	4	/solr/collections/authCollection/state.json
   [junit4]   2> 	2	/solr/overseer_elect/election/96574239040208903-127.0.0.1:57982_solr-n_0000000000
   [junit4]   2> 	2	/solr/overseer_elect/election/96574239040208901-127.0.0.1:40607_solr-n_0000000001
   [junit4]   2> 
   [junit4]   2> Maximum concurrent children watches above limit:
   [junit4]   2> 
   [junit4]   2> 	13	/solr/overseer/queue
   [junit4]   2> 	7	/solr/overseer/collection-queue-work
   [junit4]   2> 	5	/solr/collections
   [junit4]   2> 	4	/solr/live_nodes
   [junit4]   2> 	3	/solr/overseer/queue-work
   [junit4]   2> 
   [junit4]   2> 3548290 INFO  (SUITE-BasicAuthIntegrationTest-seed#[E2BD62B168305F97]-worker) [    ] o.a.s.SolrTestCaseJ4 ###deleteCore
   [junit4]   2> NOTE: leaving temporary files on disk at: /x1/jenkins/jenkins-slave/workspace/Lucene-Solr-Tests-6.x/solr/build/solr-core/test/J2/temp/solr.security.BasicAuthIntegrationTest_E2BD62B168305F97-001
   [junit4]   2> Sep 11, 2016 2:59:11 PM com.carrotsearch.randomizedtesting.ThreadLeakControl checkThreadLeaks
   [junit4]   2> WARNING: Will linger awaiting termination of 1 leaked thread(s).
   [junit4]   2> NOTE: test params are: codec=Asserting(Lucene62): {}, docValues:{}, maxPointsInLeafNode=1001, maxMBSortInHeap=6.663034698441542, sim=ClassicSimilarity, locale=el-GR, timezone=US/Indiana-Starke
   [junit4]   2> NOTE: Linux 3.13.0-85-generic amd64/Oracle Corporation 1.8.0_102 (64-bit)/cpus=4,threads=1,free=214259184,total=524812288
   [junit4]   2> NOTE: All tests run in this JVM: [TestSolrConfigHandler, TestAnalyzedSuggestions, TestNonDefinedSimilarityFactory, TestHdfsUpdateLog, TestWriterPerf, TestSolrConfigHandlerCloud, SuggesterTest, TestRestManager, TestDocTermOrds, TestDynamicFieldResource, TestJettySolrRunner, StressHdfsTest, TestImplicitCoreProperties, SimpleMLTQParserTest, SolrCoreCheckLockOnStartupTest, HdfsRestartWhileUpdatingTest, DistributedFacetPivotWhiteBoxTest, LeaderElectionTest, DateRangeFieldTest, TestXIncludeConfig, TestConfigSetProperties, HdfsNNFailoverTest, SharedFSAutoReplicaFailoverTest, DataDrivenBlockJoinTest, TestReload, RecoveryAfterSoftCommitTest, PluginInfoTest, TestSchemaResource, TestNRTOpen, UpdateParamsTest, PrimitiveFieldTypeTest, HLLUtilTest, DistributedSuggestComponentTest, FullSolrCloudDistribCmdsTest, TestGroupingSearch, DocValuesMultiTest, CdcrReplicationHandlerTest, TestConfig, DebugComponentTest, TestFieldCacheSanityChecker, CoreAdminRequestStatusTest, CollectionReloadTest, TestGeoJSONResponseWriter, TestChildDocTransformer, BigEndianAscendingWordDeserializerTest, PingRequestHandlerTest, TestLMJelinekMercerSimilarityFactory, SolrTestCaseJ4Test, BufferStoreTest, ZkStateWriterTest, TestRawTransformer, TestOverriddenPrefixQueryForCustomFieldType, TestCryptoKeys, DistribJoinFromCollectionTest, TestSolrQueryParser, BadIndexSchemaTest, TestSolrDeletionPolicy1, TestMergePolicyConfig, RecoveryZkTest, AddBlockUpdateTest, SpellPossibilityIteratorTest, DocExpirationUpdateProcessorFactoryTest, TestExactSharedStatsCache, LukeRequestHandlerTest, TestMacroExpander, SolrCLIZkUtilsTest, VMParamsZkACLAndCredentialsProvidersTest, SOLR749Test, TestSolrCoreSnapshots, TestSmileRequest, ResponseLogComponentTest, TestReversedWildcardFilterFactory, TestXmlQParser, FieldMutatingUpdateProcessorTest, BaseCdcrDistributedZkTest, TestAuthenticationFramework, SimpleFacetsTest, TestSort, TestExpandComponent, SolrPluginUtilsTest, TestExclusionRuleCollectionAccess, OpenExchangeRatesOrgProviderTest, TestFieldTypeCollectionResource, DOMUtilTest, TestCustomSort, CircularListTest, CurrencyFieldXmlFileTest, TestReloadDeadlock, NoCacheHeaderTest, SecurityConfHandlerTest, OverseerTest, TestSolrJ, TestMinMaxOnMultiValuedField, TestCollationField, WrapperMergePolicyFactoryTest, DeleteNodeTest, TestSerializedLuceneMatchVersion, TestSubQueryTransformerDistrib, TestManagedSchema, TestGraphTermsQParserPlugin, BasicDistributedZkTest, ChaosMonkeySafeLeaderTest, BasicDistributedZk2Test, UnloadDistributedZkTest, LeaderElectionIntegrationTest, BasicZkTest, TestReplicationHandler, TestRandomFaceting, TestZkChroot, ZkCLITest, ShardRoutingCustomTest, TestDistributedSearch, SolrCoreTest, DirectUpdateHandlerTest, HighlighterTest, ShowFileRequestHandlerTest, SignatureUpdateProcessorFactoryTest, TestExtendedDismaxParser, TestFoldingMultitermQuery, SuggesterTSTTest, TestStressLucene, TestTrie, SuggesterWFSTTest, WordBreakSolrSpellCheckerTest, TestWordDelimiterFilterFactory, TestRemoteStreaming, DistanceFunctionTest, SolrInfoMBeanTest, IndexBasedSpellCheckerTest, TestOmitPositions, XmlUpdateRequestHandlerTest, TermVectorComponentTest, MoreLikeThisHandlerTest, RequiredFieldsTest, FieldAnalysisRequestHandlerTest, LoggingHandlerTest, RegexBoostProcessorTest, JSONWriterTest, UniqFieldsUpdateProcessorFactoryTest, BinaryUpdateRequestHandlerTest, TestPartialUpdateDeduplication, CSVRequestHandlerTest, TestLFUCache, CollectionsAPISolrJTest, ForceLeaderTest, OutOfBoxZkACLAndCredentialsProvidersTest, OverriddenZkACLAndCredentialsProvidersTest, OverseerCollectionConfigSetProcessorTest, OverseerRolesTest, ReplaceNodeTest, SSLMigrationTest, ShardSplitTest, TestReplicaProperties, TestRequestStatusCollectionAPI, TestSolrCloudWithDelegationTokens, TestStressCloudBlindAtomicUpdates, TriLevelCompositeIdRoutingTest, BlobRepositoryCloudTest, QueryResultKeyTest, TestConfigSets, TestDynamicLoading, TestReqParamsAPI, TestSolrConfigHandlerConcurrent, DistributedExpandComponentTest, DistributedFacetExistsSmallTest, DistributedFacetPivotSmallAdvancedTest, DistributedFacetPivotSmallTest, SpatialHeatmapFacetsTest, TestCloudManagedSchema, AnalyticsMergeStrategyTest, AnalyticsQueryTest, CursorMarkTest, RankQueryTest, SortSpecParsingTest, TestCollapseQParserPlugin, TestMaxScoreQueryParser, TestQueryWrapperFilter, TestRandomCollapseQParserPlugin, TestSortByMinMaxFunction, BJQParserTest, BlockJoinFacetDistribTest, BlockJoinFacetSimpleTest, GraphQueryTest, TestScoreJoinQPScore, CloudMLTQParserTest, TestDistribIDF, BasicAuthIntegrationTest]
   [junit4] Completed [598/630 (1!)] on J2 in 9.67s, 1 test, 1 error <<< FAILURES!

[...truncated 60354 lines...]



Mime
View raw message