lucene-dev mailing list archives

Site index · List index
Message view « Date » · « Thread »
Top « Date » · « Thread »
From Policeman Jenkins Server <jenk...@thetaphi.de>
Subject [JENKINS] Lucene-Solr-6.x-Solaris (64bit/jdk1.8.0) - Build # 381 - Unstable!
Date Thu, 08 Sep 2016 18:46:41 GMT
Build: http://jenkins.thetaphi.de/job/Lucene-Solr-6.x-Solaris/381/
Java: 64bit/jdk1.8.0 -XX:-UseCompressedOops -XX:+UseParallelGC

1 tests failed.
FAILED:  org.apache.solr.security.BasicAuthIntegrationTest.testBasicAuth

Error Message:
IOException occured when talking to server at: https://127.0.0.1:44380/solr

Stack Trace:
org.apache.solr.client.solrj.SolrServerException: IOException occured when talking to server at: https://127.0.0.1:44380/solr
	at __randomizedtesting.SeedInfo.seed([FBA885795CD87371:47C6F36BF88BF00B]:0)
	at org.apache.solr.client.solrj.impl.HttpSolrClient.executeMethod(HttpSolrClient.java:606)
	at org.apache.solr.client.solrj.impl.HttpSolrClient.request(HttpSolrClient.java:261)
	at org.apache.solr.client.solrj.impl.HttpSolrClient.request(HttpSolrClient.java:250)
	at org.apache.solr.client.solrj.SolrClient.request(SolrClient.java:1219)
	at org.apache.solr.security.BasicAuthIntegrationTest.testBasicAuth(BasicAuthIntegrationTest.java:157)
	at sun.reflect.NativeMethodAccessorImpl.invoke0(Native Method)
	at sun.reflect.NativeMethodAccessorImpl.invoke(NativeMethodAccessorImpl.java:62)
	at sun.reflect.DelegatingMethodAccessorImpl.invoke(DelegatingMethodAccessorImpl.java:43)
	at java.lang.reflect.Method.invoke(Method.java:498)
	at com.carrotsearch.randomizedtesting.RandomizedRunner.invoke(RandomizedRunner.java:1764)
	at com.carrotsearch.randomizedtesting.RandomizedRunner$8.evaluate(RandomizedRunner.java:871)
	at com.carrotsearch.randomizedtesting.RandomizedRunner$9.evaluate(RandomizedRunner.java:907)
	at com.carrotsearch.randomizedtesting.RandomizedRunner$10.evaluate(RandomizedRunner.java:921)
	at com.carrotsearch.randomizedtesting.rules.SystemPropertiesRestoreRule$1.evaluate(SystemPropertiesRestoreRule.java:57)
	at org.apache.lucene.util.TestRuleSetupTeardownChained$1.evaluate(TestRuleSetupTeardownChained.java:49)
	at org.apache.lucene.util.AbstractBeforeAfterRule$1.evaluate(AbstractBeforeAfterRule.java:45)
	at org.apache.lucene.util.TestRuleThreadAndTestName$1.evaluate(TestRuleThreadAndTestName.java:48)
	at org.apache.lucene.util.TestRuleIgnoreAfterMaxFailures$1.evaluate(TestRuleIgnoreAfterMaxFailures.java:64)
	at org.apache.lucene.util.TestRuleMarkFailure$1.evaluate(TestRuleMarkFailure.java:47)
	at com.carrotsearch.randomizedtesting.rules.StatementAdapter.evaluate(StatementAdapter.java:36)
	at com.carrotsearch.randomizedtesting.ThreadLeakControl$StatementRunner.run(ThreadLeakControl.java:367)
	at com.carrotsearch.randomizedtesting.ThreadLeakControl.forkTimeoutingTask(ThreadLeakControl.java:809)
	at com.carrotsearch.randomizedtesting.ThreadLeakControl$3.evaluate(ThreadLeakControl.java:460)
	at com.carrotsearch.randomizedtesting.RandomizedRunner.runSingleTest(RandomizedRunner.java:880)
	at com.carrotsearch.randomizedtesting.RandomizedRunner$5.evaluate(RandomizedRunner.java:781)
	at com.carrotsearch.randomizedtesting.RandomizedRunner$6.evaluate(RandomizedRunner.java:816)
	at com.carrotsearch.randomizedtesting.RandomizedRunner$7.evaluate(RandomizedRunner.java:827)
	at com.carrotsearch.randomizedtesting.rules.StatementAdapter.evaluate(StatementAdapter.java:36)
	at com.carrotsearch.randomizedtesting.rules.SystemPropertiesRestoreRule$1.evaluate(SystemPropertiesRestoreRule.java:57)
	at org.apache.lucene.util.AbstractBeforeAfterRule$1.evaluate(AbstractBeforeAfterRule.java:45)
	at com.carrotsearch.randomizedtesting.rules.StatementAdapter.evaluate(StatementAdapter.java:36)
	at org.apache.lucene.util.TestRuleStoreClassName$1.evaluate(TestRuleStoreClassName.java:41)
	at com.carrotsearch.randomizedtesting.rules.NoShadowingOrOverridesOnMethodsRule$1.evaluate(NoShadowingOrOverridesOnMethodsRule.java:40)
	at com.carrotsearch.randomizedtesting.rules.NoShadowingOrOverridesOnMethodsRule$1.evaluate(NoShadowingOrOverridesOnMethodsRule.java:40)
	at com.carrotsearch.randomizedtesting.rules.StatementAdapter.evaluate(StatementAdapter.java:36)
	at com.carrotsearch.randomizedtesting.rules.StatementAdapter.evaluate(StatementAdapter.java:36)
	at com.carrotsearch.randomizedtesting.rules.StatementAdapter.evaluate(StatementAdapter.java:36)
	at org.apache.lucene.util.TestRuleAssertionsRequired$1.evaluate(TestRuleAssertionsRequired.java:53)
	at org.apache.lucene.util.TestRuleMarkFailure$1.evaluate(TestRuleMarkFailure.java:47)
	at org.apache.lucene.util.TestRuleIgnoreAfterMaxFailures$1.evaluate(TestRuleIgnoreAfterMaxFailures.java:64)
	at org.apache.lucene.util.TestRuleIgnoreTestSuites$1.evaluate(TestRuleIgnoreTestSuites.java:54)
	at com.carrotsearch.randomizedtesting.rules.StatementAdapter.evaluate(StatementAdapter.java:36)
	at com.carrotsearch.randomizedtesting.ThreadLeakControl$StatementRunner.run(ThreadLeakControl.java:367)
	at java.lang.Thread.run(Thread.java:745)
Caused by: javax.net.ssl.SSLHandshakeException: sun.security.validator.ValidatorException: PKIX path building failed: sun.security.provider.certpath.SunCertPathBuilderException: unable to find valid certification path to requested target
	at sun.security.ssl.Alerts.getSSLException(Alerts.java:192)
	at sun.security.ssl.SSLSocketImpl.fatal(SSLSocketImpl.java:1949)
	at sun.security.ssl.Handshaker.fatalSE(Handshaker.java:302)
	at sun.security.ssl.Handshaker.fatalSE(Handshaker.java:296)
	at sun.security.ssl.ClientHandshaker.serverCertificate(ClientHandshaker.java:1509)
	at sun.security.ssl.ClientHandshaker.processMessage(ClientHandshaker.java:216)
	at sun.security.ssl.Handshaker.processLoop(Handshaker.java:979)
	at sun.security.ssl.Handshaker.process_record(Handshaker.java:914)
	at sun.security.ssl.SSLSocketImpl.readRecord(SSLSocketImpl.java:1062)
	at sun.security.ssl.SSLSocketImpl.performInitialHandshake(SSLSocketImpl.java:1375)
	at sun.security.ssl.SSLSocketImpl.startHandshake(SSLSocketImpl.java:1403)
	at sun.security.ssl.SSLSocketImpl.startHandshake(SSLSocketImpl.java:1387)
	at org.apache.http.conn.ssl.SSLSocketFactory.connectSocket(SSLSocketFactory.java:543)
	at org.apache.http.conn.ssl.SSLSocketFactory.connectSocket(SSLSocketFactory.java:409)
	at org.apache.http.impl.conn.DefaultClientConnectionOperator.openConnection(DefaultClientConnectionOperator.java:177)
	at org.apache.http.impl.conn.ManagedClientConnectionImpl.open(ManagedClientConnectionImpl.java:304)
	at org.apache.http.impl.client.DefaultRequestDirector.tryConnect(DefaultRequestDirector.java:611)
	at org.apache.http.impl.client.DefaultRequestDirector.execute(DefaultRequestDirector.java:446)
	at org.apache.http.impl.client.AbstractHttpClient.doExecute(AbstractHttpClient.java:882)
	at org.apache.http.impl.client.CloseableHttpClient.execute(CloseableHttpClient.java:82)
	at org.apache.http.impl.client.CloseableHttpClient.execute(CloseableHttpClient.java:107)
	at org.apache.http.impl.client.CloseableHttpClient.execute(CloseableHttpClient.java:55)
	at org.apache.solr.client.solrj.impl.HttpSolrClient.executeMethod(HttpSolrClient.java:497)
	... 43 more
Caused by: sun.security.validator.ValidatorException: PKIX path building failed: sun.security.provider.certpath.SunCertPathBuilderException: unable to find valid certification path to requested target
	at sun.security.validator.PKIXValidator.doBuild(PKIXValidator.java:387)
	at sun.security.validator.PKIXValidator.engineValidate(PKIXValidator.java:292)
	at sun.security.validator.Validator.validate(Validator.java:260)
	at sun.security.ssl.X509TrustManagerImpl.validate(X509TrustManagerImpl.java:324)
	at sun.security.ssl.X509TrustManagerImpl.checkTrusted(X509TrustManagerImpl.java:229)
	at sun.security.ssl.X509TrustManagerImpl.checkServerTrusted(X509TrustManagerImpl.java:124)
	at sun.security.ssl.ClientHandshaker.serverCertificate(ClientHandshaker.java:1491)
	... 61 more
Caused by: sun.security.provider.certpath.SunCertPathBuilderException: unable to find valid certification path to requested target
	at sun.security.provider.certpath.SunCertPathBuilder.build(SunCertPathBuilder.java:141)
	at sun.security.provider.certpath.SunCertPathBuilder.engineBuild(SunCertPathBuilder.java:126)
	at java.security.cert.CertPathBuilder.build(CertPathBuilder.java:280)
	at sun.security.validator.PKIXValidator.doBuild(PKIXValidator.java:382)
	... 67 more




Build Log:
[...truncated 10738 lines...]
   [junit4] Suite: org.apache.solr.security.BasicAuthIntegrationTest
   [junit4]   2> Creating dataDir: /export/home/jenkins/workspace/Lucene-Solr-6.x-Solaris/solr/build/solr-core/test/J0/temp/solr.security.BasicAuthIntegrationTest_FBA885795CD87371-001/init-core-data-001
   [junit4]   2> 236996 INFO  (SUITE-BasicAuthIntegrationTest-seed#[FBA885795CD87371]-worker) [    ] o.a.s.SolrTestCaseJ4 Randomized ssl (true) and clientAuth (false) via: @org.apache.solr.util.RandomizeSSL(reason=, value=NaN, ssl=NaN, clientAuth=NaN)
   [junit4]   2> 236998 INFO  (SUITE-BasicAuthIntegrationTest-seed#[FBA885795CD87371]-worker) [    ] o.a.s.c.ZkTestServer STARTING ZK TEST SERVER
   [junit4]   2> 236998 INFO  (Thread-355) [    ] o.a.s.c.ZkTestServer client port:0.0.0.0/0.0.0.0:0
   [junit4]   2> 236998 INFO  (Thread-355) [    ] o.a.s.c.ZkTestServer Starting server
   [junit4]   2> 237098 INFO  (SUITE-BasicAuthIntegrationTest-seed#[FBA885795CD87371]-worker) [    ] o.a.s.c.ZkTestServer start zk server on port:57888
   [junit4]   2> 237098 INFO  (SUITE-BasicAuthIntegrationTest-seed#[FBA885795CD87371]-worker) [    ] o.a.s.c.c.SolrZkClient Using default ZkCredentialsProvider
   [junit4]   2> 237098 INFO  (SUITE-BasicAuthIntegrationTest-seed#[FBA885795CD87371]-worker) [    ] o.a.s.c.c.ConnectionManager Waiting for client to connect to ZooKeeper
   [junit4]   2> 237101 INFO  (zkCallback-283-thread-1) [    ] o.a.s.c.c.ConnectionManager Watcher org.apache.solr.common.cloud.ConnectionManager@601e3bf5 name:ZooKeeperConnection Watcher:127.0.0.1:57888 got event WatchedEvent state:SyncConnected type:None path:null path:null type:None
   [junit4]   2> 237102 INFO  (SUITE-BasicAuthIntegrationTest-seed#[FBA885795CD87371]-worker) [    ] o.a.s.c.c.ConnectionManager Client is connected to ZooKeeper
   [junit4]   2> 237102 INFO  (SUITE-BasicAuthIntegrationTest-seed#[FBA885795CD87371]-worker) [    ] o.a.s.c.c.SolrZkClient Using default ZkACLProvider
   [junit4]   2> 237102 INFO  (SUITE-BasicAuthIntegrationTest-seed#[FBA885795CD87371]-worker) [    ] o.a.s.c.c.SolrZkClient makePath: /solr/solr.xml
   [junit4]   2> 237106 INFO  (SUITE-BasicAuthIntegrationTest-seed#[FBA885795CD87371]-worker) [    ] o.a.s.c.c.SolrZkClient makePath: /solr/clusterprops.json
   [junit4]   2> 237131 INFO  (jetty-launcher-282-thread-1) [    ] o.e.j.s.Server jetty-9.3.8.v20160314
   [junit4]   2> 237132 INFO  (jetty-launcher-282-thread-1) [    ] o.e.j.s.h.ContextHandler Started o.e.j.s.ServletContextHandler@4046603{/solr,null,AVAILABLE}
   [junit4]   2> 237133 INFO  (jetty-launcher-282-thread-2) [    ] o.e.j.s.Server jetty-9.3.8.v20160314
   [junit4]   2> 237134 INFO  (jetty-launcher-282-thread-2) [    ] o.e.j.s.h.ContextHandler Started o.e.j.s.ServletContextHandler@31542d5c{/solr,null,AVAILABLE}
   [junit4]   2> 237139 INFO  (jetty-launcher-282-thread-3) [    ] o.e.j.s.Server jetty-9.3.8.v20160314
   [junit4]   2> 237144 INFO  (jetty-launcher-282-thread-3) [    ] o.e.j.s.h.ContextHandler Started o.e.j.s.ServletContextHandler@78fd267c{/solr,null,AVAILABLE}
   [junit4]   2> 237375 INFO  (jetty-launcher-282-thread-1) [    ] o.e.j.s.ServerConnector Started ServerConnector@4e139aee{SSL,[ssl, http/1.1]}{127.0.0.1:33037}
   [junit4]   2> 237376 INFO  (jetty-launcher-282-thread-1) [    ] o.e.j.s.Server Started @240202ms
   [junit4]   2> 237376 INFO  (jetty-launcher-282-thread-1) [    ] o.a.s.c.s.e.JettySolrRunner Jetty properties: {hostContext=/solr, hostPort=33037}
   [junit4]   2> 237376 INFO  (jetty-launcher-282-thread-1) [    ] o.a.s.s.SolrDispatchFilter SolrDispatchFilter.init(): sun.misc.Launcher$AppClassLoader@6d06d69c
   [junit4]   2> 237376 INFO  (jetty-launcher-282-thread-1) [    ] o.a.s.c.SolrResourceLoader new SolrResourceLoader for directory: '/export/home/jenkins/workspace/Lucene-Solr-6.x-Solaris/solr/build/solr-core/test/J0/temp/solr.security.BasicAuthIntegrationTest_FBA885795CD87371-001/tempDir-001/node1'
   [junit4]   2> 237377 INFO  (jetty-launcher-282-thread-1) [    ] o.a.s.c.SolrResourceLoader JNDI not configured for solr (NoInitialContextEx)
   [junit4]   2> 237377 INFO  (jetty-launcher-282-thread-1) [    ] o.a.s.c.SolrResourceLoader solr home defaulted to 'solr/' (could not find system property or JNDI)
   [junit4]   2> 237377 INFO  (jetty-launcher-282-thread-1) [    ] o.a.s.c.c.SolrZkClient Using default ZkCredentialsProvider
   [junit4]   2> 237378 INFO  (jetty-launcher-282-thread-1) [    ] o.a.s.c.c.ConnectionManager Waiting for client to connect to ZooKeeper
   [junit4]   2> 237383 INFO  (jetty-launcher-282-thread-3) [    ] o.e.j.s.ServerConnector Started ServerConnector@71653058{SSL,[ssl, http/1.1]}{127.0.0.1:44380}
   [junit4]   2> 237383 INFO  (jetty-launcher-282-thread-3) [    ] o.e.j.s.Server Started @240209ms
   [junit4]   2> 237383 INFO  (jetty-launcher-282-thread-3) [    ] o.a.s.c.s.e.JettySolrRunner Jetty properties: {hostContext=/solr, hostPort=44380}
   [junit4]   2> 237383 INFO  (jetty-launcher-282-thread-3) [    ] o.a.s.s.SolrDispatchFilter SolrDispatchFilter.init(): sun.misc.Launcher$AppClassLoader@6d06d69c
   [junit4]   2> 237383 INFO  (jetty-launcher-282-thread-3) [    ] o.a.s.c.SolrResourceLoader new SolrResourceLoader for directory: '/export/home/jenkins/workspace/Lucene-Solr-6.x-Solaris/solr/build/solr-core/test/J0/temp/solr.security.BasicAuthIntegrationTest_FBA885795CD87371-001/tempDir-001/node2'
   [junit4]   2> 237383 INFO  (jetty-launcher-282-thread-3) [    ] o.a.s.c.SolrResourceLoader JNDI not configured for solr (NoInitialContextEx)
   [junit4]   2> 237383 INFO  (jetty-launcher-282-thread-3) [    ] o.a.s.c.SolrResourceLoader solr home defaulted to 'solr/' (could not find system property or JNDI)
   [junit4]   2> 237384 INFO  (jetty-launcher-282-thread-3) [    ] o.a.s.c.c.SolrZkClient Using default ZkCredentialsProvider
   [junit4]   2> 237384 INFO  (jetty-launcher-282-thread-3) [    ] o.a.s.c.c.ConnectionManager Waiting for client to connect to ZooKeeper
   [junit4]   2> 237385 INFO  (zkCallback-284-thread-1) [    ] o.a.s.c.c.ConnectionManager Watcher org.apache.solr.common.cloud.ConnectionManager@6ede7418 name:ZooKeeperConnection Watcher:127.0.0.1:57888/solr got event WatchedEvent state:SyncConnected type:None path:null path:null type:None
   [junit4]   2> 237386 INFO  (jetty-launcher-282-thread-2) [    ] o.e.j.s.ServerConnector Started ServerConnector@32d7784b{SSL,[ssl, http/1.1]}{127.0.0.1:35524}
   [junit4]   2> 237386 INFO  (jetty-launcher-282-thread-2) [    ] o.e.j.s.Server Started @240212ms
   [junit4]   2> 237386 INFO  (jetty-launcher-282-thread-2) [    ] o.a.s.c.s.e.JettySolrRunner Jetty properties: {hostContext=/solr, hostPort=35524}
   [junit4]   2> 237386 INFO  (jetty-launcher-282-thread-2) [    ] o.a.s.s.SolrDispatchFilter SolrDispatchFilter.init(): sun.misc.Launcher$AppClassLoader@6d06d69c
   [junit4]   2> 237386 INFO  (jetty-launcher-282-thread-2) [    ] o.a.s.c.SolrResourceLoader new SolrResourceLoader for directory: '/export/home/jenkins/workspace/Lucene-Solr-6.x-Solaris/solr/build/solr-core/test/J0/temp/solr.security.BasicAuthIntegrationTest_FBA885795CD87371-001/tempDir-001/node3'
   [junit4]   2> 237386 INFO  (jetty-launcher-282-thread-2) [    ] o.a.s.c.SolrResourceLoader JNDI not configured for solr (NoInitialContextEx)
   [junit4]   2> 237386 INFO  (jetty-launcher-282-thread-2) [    ] o.a.s.c.SolrResourceLoader solr home defaulted to 'solr/' (could not find system property or JNDI)
   [junit4]   2> 237387 INFO  (jetty-launcher-282-thread-2) [    ] o.a.s.c.c.SolrZkClient Using default ZkCredentialsProvider
   [junit4]   2> 237387 INFO  (jetty-launcher-282-thread-2) [    ] o.a.s.c.c.ConnectionManager Waiting for client to connect to ZooKeeper
   [junit4]   2> 237387 INFO  (jetty-launcher-282-thread-1) [    ] o.a.s.c.c.ConnectionManager Client is connected to ZooKeeper
   [junit4]   2> 237387 INFO  (jetty-launcher-282-thread-1) [    ] o.a.s.c.c.SolrZkClient Using default ZkACLProvider
   [junit4]   2> 237390 INFO  (jetty-launcher-282-thread-1) [    ] o.a.s.s.SolrDispatchFilter solr.xml found in ZooKeeper. Loading...
   [junit4]   2> 237391 INFO  (zkCallback-286-thread-1) [    ] o.a.s.c.c.ConnectionManager Watcher org.apache.solr.common.cloud.ConnectionManager@292deb3d name:ZooKeeperConnection Watcher:127.0.0.1:57888/solr got event WatchedEvent state:SyncConnected type:None path:null path:null type:None
   [junit4]   2> 237391 INFO  (jetty-launcher-282-thread-2) [    ] o.a.s.c.c.ConnectionManager Client is connected to ZooKeeper
   [junit4]   2> 237391 INFO  (jetty-launcher-282-thread-2) [    ] o.a.s.c.c.SolrZkClient Using default ZkACLProvider
   [junit4]   2> 237392 INFO  (jetty-launcher-282-thread-2) [    ] o.a.s.s.SolrDispatchFilter solr.xml found in ZooKeeper. Loading...
   [junit4]   2> 237392 INFO  (zkCallback-285-thread-1) [    ] o.a.s.c.c.ConnectionManager Watcher org.apache.solr.common.cloud.ConnectionManager@12ad0a55 name:ZooKeeperConnection Watcher:127.0.0.1:57888/solr got event WatchedEvent state:SyncConnected type:None path:null path:null type:None
   [junit4]   2> 237396 INFO  (jetty-launcher-282-thread-3) [    ] o.a.s.c.c.ConnectionManager Client is connected to ZooKeeper
   [junit4]   2> 237396 INFO  (jetty-launcher-282-thread-3) [    ] o.a.s.c.c.SolrZkClient Using default ZkACLProvider
   [junit4]   2> 237397 INFO  (jetty-launcher-282-thread-3) [    ] o.a.s.s.SolrDispatchFilter solr.xml found in ZooKeeper. Loading...
   [junit4]   2> 237398 INFO  (jetty-launcher-282-thread-2) [    ] o.a.s.c.CorePropertiesLocator Config-defined core root directory: /export/home/jenkins/workspace/Lucene-Solr-6.x-Solaris/solr/build/solr-core/test/J0/temp/solr.security.BasicAuthIntegrationTest_FBA885795CD87371-001/tempDir-001/node3/.
   [junit4]   2> 237398 INFO  (jetty-launcher-282-thread-2) [    ] o.a.s.c.CoreContainer New CoreContainer 1918776795
   [junit4]   2> 237398 INFO  (jetty-launcher-282-thread-2) [    ] o.a.s.c.CoreContainer Loading cores into CoreContainer [instanceDir=/export/home/jenkins/workspace/Lucene-Solr-6.x-Solaris/solr/build/solr-core/test/J0/temp/solr.security.BasicAuthIntegrationTest_FBA885795CD87371-001/tempDir-001/node3]
   [junit4]   2> 237398 WARN  (jetty-launcher-282-thread-2) [    ] o.a.s.c.CoreContainer Couldn't add files from /export/home/jenkins/workspace/Lucene-Solr-6.x-Solaris/solr/build/solr-core/test/J0/temp/solr.security.BasicAuthIntegrationTest_FBA885795CD87371-001/tempDir-001/node3/lib to classpath: /export/home/jenkins/workspace/Lucene-Solr-6.x-Solaris/solr/build/solr-core/test/J0/temp/solr.security.BasicAuthIntegrationTest_FBA885795CD87371-001/tempDir-001/node3/lib
   [junit4]   2> 237399 INFO  (jetty-launcher-282-thread-2) [    ] o.a.s.h.c.HttpShardHandlerFactory created with socketTimeout : 90000,urlScheme : https,connTimeout : 15000,maxConnectionsPerHost : 20,maxConnections : 10000,corePoolSize : 0,maximumPoolSize : 2147483647,maxThreadIdleTime : 5,sizeOfQueue : -1,fairnessPolicy : false,useRetries : false,connectionsEvictorSleepDelay : 5000,maxConnectionIdleTime : 40000,
   [junit4]   2> 237400 INFO  (jetty-launcher-282-thread-1) [    ] o.a.s.c.CorePropertiesLocator Config-defined core root directory: /export/home/jenkins/workspace/Lucene-Solr-6.x-Solaris/solr/build/solr-core/test/J0/temp/solr.security.BasicAuthIntegrationTest_FBA885795CD87371-001/tempDir-001/node1/.
   [junit4]   2> 237400 INFO  (jetty-launcher-282-thread-1) [    ] o.a.s.c.CoreContainer New CoreContainer 999165954
   [junit4]   2> 237401 INFO  (jetty-launcher-282-thread-1) [    ] o.a.s.c.CoreContainer Loading cores into CoreContainer [instanceDir=/export/home/jenkins/workspace/Lucene-Solr-6.x-Solaris/solr/build/solr-core/test/J0/temp/solr.security.BasicAuthIntegrationTest_FBA885795CD87371-001/tempDir-001/node1]
   [junit4]   2> 237401 WARN  (jetty-launcher-282-thread-1) [    ] o.a.s.c.CoreContainer Couldn't add files from /export/home/jenkins/workspace/Lucene-Solr-6.x-Solaris/solr/build/solr-core/test/J0/temp/solr.security.BasicAuthIntegrationTest_FBA885795CD87371-001/tempDir-001/node1/lib to classpath: /export/home/jenkins/workspace/Lucene-Solr-6.x-Solaris/solr/build/solr-core/test/J0/temp/solr.security.BasicAuthIntegrationTest_FBA885795CD87371-001/tempDir-001/node1/lib
   [junit4]   2> 237401 INFO  (jetty-launcher-282-thread-1) [    ] o.a.s.h.c.HttpShardHandlerFactory created with socketTimeout : 90000,urlScheme : https,connTimeout : 15000,maxConnectionsPerHost : 20,maxConnections : 10000,corePoolSize : 0,maximumPoolSize : 2147483647,maxThreadIdleTime : 5,sizeOfQueue : -1,fairnessPolicy : false,useRetries : false,connectionsEvictorSleepDelay : 5000,maxConnectionIdleTime : 40000,
   [junit4]   2> 237402 INFO  (jetty-launcher-282-thread-1) [    ] o.a.s.u.UpdateShardHandler Creating UpdateShardHandler HTTP client with params: socketTimeout=340000&connTimeout=45000&retry=true
   [junit4]   2> 238153 INFO  (jetty-launcher-282-thread-1) [    ] o.a.s.l.LogWatcher SLF4J impl is org.slf4j.impl.Log4jLoggerFactory
   [junit4]   2> 238154 INFO  (jetty-launcher-282-thread-1) [    ] o.a.s.l.LogWatcher Registering Log Listener [Log4j (org.slf4j.impl.Log4jLoggerFactory)]
   [junit4]   2> 238154 INFO  (jetty-launcher-282-thread-1) [    ] o.a.s.c.ZkContainer Zookeeper client=127.0.0.1:57888/solr
   [junit4]   2> 238154 INFO  (jetty-launcher-282-thread-1) [    ] o.a.s.c.ZkController zkHost includes chroot
   [junit4]   2> 238154 INFO  (jetty-launcher-282-thread-1) [    ] o.a.s.c.c.SolrZkClient Using default ZkCredentialsProvider
   [junit4]   2> 238153 INFO  (jetty-launcher-282-thread-2) [    ] o.a.s.u.UpdateShardHandler Creating UpdateShardHandler HTTP client with params: socketTimeout=340000&connTimeout=45000&retry=true
   [junit4]   2> 238155 INFO  (jetty-launcher-282-thread-1) [    ] o.a.s.c.c.ConnectionManager Waiting for client to connect to ZooKeeper
   [junit4]   2> 238157 INFO  (jetty-launcher-282-thread-3) [    ] o.a.s.c.CorePropertiesLocator Config-defined core root directory: /export/home/jenkins/workspace/Lucene-Solr-6.x-Solaris/solr/build/solr-core/test/J0/temp/solr.security.BasicAuthIntegrationTest_FBA885795CD87371-001/tempDir-001/node2/.
   [junit4]   2> 238157 INFO  (jetty-launcher-282-thread-3) [    ] o.a.s.c.CoreContainer New CoreContainer 2058176292
   [junit4]   2> 238157 INFO  (jetty-launcher-282-thread-3) [    ] o.a.s.c.CoreContainer Loading cores into CoreContainer [instanceDir=/export/home/jenkins/workspace/Lucene-Solr-6.x-Solaris/solr/build/solr-core/test/J0/temp/solr.security.BasicAuthIntegrationTest_FBA885795CD87371-001/tempDir-001/node2]
   [junit4]   2> 238157 WARN  (jetty-launcher-282-thread-3) [    ] o.a.s.c.CoreContainer Couldn't add files from /export/home/jenkins/workspace/Lucene-Solr-6.x-Solaris/solr/build/solr-core/test/J0/temp/solr.security.BasicAuthIntegrationTest_FBA885795CD87371-001/tempDir-001/node2/lib to classpath: /export/home/jenkins/workspace/Lucene-Solr-6.x-Solaris/solr/build/solr-core/test/J0/temp/solr.security.BasicAuthIntegrationTest_FBA885795CD87371-001/tempDir-001/node2/lib
   [junit4]   2> 238158 INFO  (jetty-launcher-282-thread-2) [    ] o.a.s.l.LogWatcher SLF4J impl is org.slf4j.impl.Log4jLoggerFactory
   [junit4]   2> 238158 INFO  (jetty-launcher-282-thread-2) [    ] o.a.s.l.LogWatcher Registering Log Listener [Log4j (org.slf4j.impl.Log4jLoggerFactory)]
   [junit4]   2> 238158 INFO  (jetty-launcher-282-thread-2) [    ] o.a.s.c.ZkContainer Zookeeper client=127.0.0.1:57888/solr
   [junit4]   2> 238158 INFO  (jetty-launcher-282-thread-2) [    ] o.a.s.c.ZkController zkHost includes chroot
   [junit4]   2> 238158 INFO  (jetty-launcher-282-thread-2) [    ] o.a.s.c.c.SolrZkClient Using default ZkCredentialsProvider
   [junit4]   2> 238158 INFO  (jetty-launcher-282-thread-2) [    ] o.a.s.c.c.ConnectionManager Waiting for client to connect to ZooKeeper
   [junit4]   2> 238159 INFO  (jetty-launcher-282-thread-3) [    ] o.a.s.h.c.HttpShardHandlerFactory created with socketTimeout : 90000,urlScheme : https,connTimeout : 15000,maxConnectionsPerHost : 20,maxConnections : 10000,corePoolSize : 0,maximumPoolSize : 2147483647,maxThreadIdleTime : 5,sizeOfQueue : -1,fairnessPolicy : false,useRetries : false,connectionsEvictorSleepDelay : 5000,maxConnectionIdleTime : 40000,
   [junit4]   2> 238160 INFO  (zkCallback-291-thread-1) [    ] o.a.s.c.c.ConnectionManager Watcher org.apache.solr.common.cloud.ConnectionManager@b67eb8c name:ZooKeeperConnection Watcher:127.0.0.1:57888 got event WatchedEvent state:SyncConnected type:None path:null path:null type:None
   [junit4]   2> 238161 INFO  (jetty-launcher-282-thread-1) [    ] o.a.s.c.c.ConnectionManager Client is connected to ZooKeeper
   [junit4]   2> 238161 INFO  (jetty-launcher-282-thread-1) [    ] o.a.s.c.c.SolrZkClient Using default ZkACLProvider
   [junit4]   2> 238164 INFO  (jetty-launcher-282-thread-3) [    ] o.a.s.u.UpdateShardHandler Creating UpdateShardHandler HTTP client with params: socketTimeout=340000&connTimeout=45000&retry=true
   [junit4]   2> 238165 INFO  (jetty-launcher-282-thread-3) [    ] o.a.s.l.LogWatcher SLF4J impl is org.slf4j.impl.Log4jLoggerFactory
   [junit4]   2> 238165 INFO  (jetty-launcher-282-thread-3) [    ] o.a.s.l.LogWatcher Registering Log Listener [Log4j (org.slf4j.impl.Log4jLoggerFactory)]
   [junit4]   2> 238165 INFO  (jetty-launcher-282-thread-3) [    ] o.a.s.c.ZkContainer Zookeeper client=127.0.0.1:57888/solr
   [junit4]   2> 238165 INFO  (jetty-launcher-282-thread-3) [    ] o.a.s.c.ZkController zkHost includes chroot
   [junit4]   2> 238165 INFO  (jetty-launcher-282-thread-3) [    ] o.a.s.c.c.SolrZkClient Using default ZkCredentialsProvider
   [junit4]   2> 238166 INFO  (jetty-launcher-282-thread-3) [    ] o.a.s.c.c.ConnectionManager Waiting for client to connect to ZooKeeper
   [junit4]   2> 238168 INFO  (jetty-launcher-282-thread-1) [n:127.0.0.1:33037_solr    ] o.a.s.c.ZkController Added new OnReconnect listener org.apache.solr.cloud.ZkController$$Lambda$74/1459545139@53720f36
   [junit4]   2> 238168 INFO  (zkCallback-292-thread-1) [    ] o.a.s.c.c.ConnectionManager Watcher org.apache.solr.common.cloud.ConnectionManager@76c73f18 name:ZooKeeperConnection Watcher:127.0.0.1:57888 got event WatchedEvent state:SyncConnected type:None path:null path:null type:None
   [junit4]   2> 238169 INFO  (jetty-launcher-282-thread-2) [    ] o.a.s.c.c.ConnectionManager Client is connected to ZooKeeper
   [junit4]   2> 238169 INFO  (jetty-launcher-282-thread-2) [    ] o.a.s.c.c.SolrZkClient Using default ZkACLProvider
   [junit4]   2> 238169 INFO  (jetty-launcher-282-thread-1) [n:127.0.0.1:33037_solr    ] o.a.s.c.c.ConnectionManager Waiting for client to connect to ZooKeeper
   [junit4]   2> 238170 INFO  (zkCallback-295-thread-1) [    ] o.a.s.c.c.ConnectionManager Watcher org.apache.solr.common.cloud.ConnectionManager@11dcd6ad name:ZooKeeperConnection Watcher:127.0.0.1:57888 got event WatchedEvent state:SyncConnected type:None path:null path:null type:None
   [junit4]   2> 238170 INFO  (jetty-launcher-282-thread-3) [    ] o.a.s.c.c.ConnectionManager Client is connected to ZooKeeper
   [junit4]   2> 238170 INFO  (jetty-launcher-282-thread-3) [    ] o.a.s.c.c.SolrZkClient Using default ZkACLProvider
   [junit4]   2> 238172 INFO  (zkCallback-296-thread-1-processing-n:127.0.0.1:33037_solr) [n:127.0.0.1:33037_solr    ] o.a.s.c.c.ConnectionManager Watcher org.apache.solr.common.cloud.ConnectionManager@594fab9b name:ZooKeeperConnection Watcher:127.0.0.1:57888/solr got event WatchedEvent state:SyncConnected type:None path:null path:null type:None
   [junit4]   2> 238172 INFO  (jetty-launcher-282-thread-1) [n:127.0.0.1:33037_solr    ] o.a.s.c.c.ConnectionManager Client is connected to ZooKeeper
   [junit4]   2> 238172 INFO  (jetty-launcher-282-thread-3) [n:127.0.0.1:44380_solr    ] o.a.s.c.ZkController Added new OnReconnect listener org.apache.solr.cloud.ZkController$$Lambda$74/1459545139@fbe822b
   [junit4]   2> 238173 INFO  (jetty-launcher-282-thread-3) [n:127.0.0.1:44380_solr    ] o.a.s.c.c.ConnectionManager Waiting for client to connect to ZooKeeper
   [junit4]   2> 238175 INFO  (zkCallback-297-thread-1-processing-n:127.0.0.1:44380_solr) [n:127.0.0.1:44380_solr    ] o.a.s.c.c.ConnectionManager Watcher org.apache.solr.common.cloud.ConnectionManager@53cc6113 name:ZooKeeperConnection Watcher:127.0.0.1:57888/solr got event WatchedEvent state:SyncConnected type:None path:null path:null type:None
   [junit4]   2> 238175 INFO  (jetty-launcher-282-thread-3) [n:127.0.0.1:44380_solr    ] o.a.s.c.c.ConnectionManager Client is connected to ZooKeeper
   [junit4]   2> 238176 INFO  (jetty-launcher-282-thread-2) [n:127.0.0.1:35524_solr    ] o.a.s.c.ZkController Added new OnReconnect listener org.apache.solr.cloud.ZkController$$Lambda$74/1459545139@17c7748f
   [junit4]   2> 238177 INFO  (jetty-launcher-282-thread-2) [n:127.0.0.1:35524_solr    ] o.a.s.c.c.ConnectionManager Waiting for client to connect to ZooKeeper
   [junit4]   2> 238179 INFO  (jetty-launcher-282-thread-1) [n:127.0.0.1:33037_solr    ] o.a.s.c.c.SolrZkClient makePath: /overseer/queue
   [junit4]   2> 238180 INFO  (jetty-launcher-282-thread-3) [n:127.0.0.1:44380_solr    ] o.a.s.c.c.SolrZkClient makePath: /overseer/queue
   [junit4]   2> 238180 INFO  (zkCallback-298-thread-1-processing-n:127.0.0.1:35524_solr) [n:127.0.0.1:35524_solr    ] o.a.s.c.c.ConnectionManager Watcher org.apache.solr.common.cloud.ConnectionManager@58b3735 name:ZooKeeperConnection Watcher:127.0.0.1:57888/solr got event WatchedEvent state:SyncConnected type:None path:null path:null type:None
   [junit4]   2> 238180 INFO  (jetty-launcher-282-thread-2) [n:127.0.0.1:35524_solr    ] o.a.s.c.c.ConnectionManager Client is connected to ZooKeeper
   [junit4]   2> 238184 INFO  (jetty-launcher-282-thread-2) [n:127.0.0.1:35524_solr    ] o.a.s.c.c.SolrZkClient makePath: /overseer/collection-queue-work
   [junit4]   2> 238185 INFO  (jetty-launcher-282-thread-3) [n:127.0.0.1:44380_solr    ] o.a.s.c.c.SolrZkClient makePath: /overseer/collection-queue-work
   [junit4]   2> 238197 INFO  (jetty-launcher-282-thread-2) [n:127.0.0.1:35524_solr    ] o.a.s.c.c.SolrZkClient makePath: /overseer/collection-map-running
   [junit4]   2> 238199 INFO  (jetty-launcher-282-thread-2) [n:127.0.0.1:35524_solr    ] o.a.s.c.c.SolrZkClient makePath: /overseer/collection-map-completed
   [junit4]   2> 238200 INFO  (jetty-launcher-282-thread-2) [n:127.0.0.1:35524_solr    ] o.a.s.c.c.SolrZkClient makePath: /overseer/collection-map-failure
   [junit4]   2> 238205 INFO  (jetty-launcher-282-thread-2) [n:127.0.0.1:35524_solr    ] o.a.s.c.c.SolrZkClient makePath: /live_nodes
   [junit4]   2> 238207 INFO  (jetty-launcher-282-thread-2) [n:127.0.0.1:35524_solr    ] o.a.s.c.c.SolrZkClient makePath: /collections
   [junit4]   2> 238209 INFO  (jetty-launcher-282-thread-2) [n:127.0.0.1:35524_solr    ] o.a.s.c.c.SolrZkClient makePath: /aliases.json
   [junit4]   2> 238211 INFO  (jetty-launcher-282-thread-1) [n:127.0.0.1:33037_solr    ] o.a.s.c.c.SolrZkClient makePath: /clusterstate.json
   [junit4]   2> 238211 INFO  (jetty-launcher-282-thread-2) [n:127.0.0.1:35524_solr    ] o.a.s.c.c.SolrZkClient makePath: /clusterstate.json
   [junit4]   2> 238212 INFO  (jetty-launcher-282-thread-2) [n:127.0.0.1:35524_solr    ] o.a.s.c.c.SolrZkClient makePath: /security.json
   [junit4]   2> 238213 INFO  (jetty-launcher-282-thread-1) [n:127.0.0.1:33037_solr    ] o.a.s.c.c.SolrZkClient makePath: /security.json
   [junit4]   2> 238214 INFO  (jetty-launcher-282-thread-2) [n:127.0.0.1:35524_solr    ] o.a.s.c.c.ZkStateReader Updating cluster state from ZooKeeper... 
   [junit4]   2> 238214 INFO  (jetty-launcher-282-thread-3) [n:127.0.0.1:44380_solr    ] o.a.s.c.c.ZkStateReader Updating cluster state from ZooKeeper... 
   [junit4]   2> 238215 INFO  (jetty-launcher-282-thread-2) [n:127.0.0.1:35524_solr    ] o.a.s.c.c.ZkStateReader Loaded cluster properties: {urlScheme=https}
   [junit4]   2> 238215 INFO  (jetty-launcher-282-thread-1) [n:127.0.0.1:33037_solr    ] o.a.s.c.c.ZkStateReader Updating cluster state from ZooKeeper... 
   [junit4]   2> 238215 INFO  (jetty-launcher-282-thread-2) [n:127.0.0.1:35524_solr    ] o.a.s.c.c.ZkStateReader Updated live nodes from ZooKeeper... (0) -> (0)
   [junit4]   2> 238216 INFO  (jetty-launcher-282-thread-3) [n:127.0.0.1:44380_solr    ] o.a.s.c.c.ZkStateReader Loaded cluster properties: {urlScheme=https}
   [junit4]   2> 238217 INFO  (jetty-launcher-282-thread-1) [n:127.0.0.1:33037_solr    ] o.a.s.c.c.ZkStateReader Loaded cluster properties: {urlScheme=https}
   [junit4]   2> 238217 INFO  (jetty-launcher-282-thread-3) [n:127.0.0.1:44380_solr    ] o.a.s.c.c.ZkStateReader Updated live nodes from ZooKeeper... (0) -> (0)
   [junit4]   2> 238218 INFO  (jetty-launcher-282-thread-1) [n:127.0.0.1:33037_solr    ] o.a.s.c.c.ZkStateReader Updated live nodes from ZooKeeper... (0) -> (0)
   [junit4]   2> 238219 INFO  (jetty-launcher-282-thread-2) [n:127.0.0.1:35524_solr    ] o.a.s.c.c.SolrZkClient makePath: /overseer_elect
   [junit4]   2> 238220 INFO  (jetty-launcher-282-thread-2) [n:127.0.0.1:35524_solr    ] o.a.s.c.c.SolrZkClient makePath: /overseer_elect/election
   [junit4]   2> 238222 INFO  (jetty-launcher-282-thread-2) [n:127.0.0.1:35524_solr    ] o.a.s.c.Overseer Overseer (id=null) closing
   [junit4]   2> 238223 INFO  (jetty-launcher-282-thread-2) [n:127.0.0.1:35524_solr    ] o.a.s.c.LeaderElector Joined leadership election with path: /overseer_elect/election/96557851057061897-127.0.0.1:35524_solr-n_0000000000
   [junit4]   2> 238223 INFO  (jetty-launcher-282-thread-2) [n:127.0.0.1:35524_solr    ] o.a.s.c.OverseerElectionContext I am going to be the leader 127.0.0.1:35524_solr
   [junit4]   2> 238224 INFO  (jetty-launcher-282-thread-2) [n:127.0.0.1:35524_solr    ] o.a.s.c.c.SolrZkClient makePath: /overseer_elect/leader
   [junit4]   2> 238224 INFO  (jetty-launcher-282-thread-3) [n:127.0.0.1:44380_solr    ] o.a.s.c.Overseer Overseer (id=null) closing
   [junit4]   2> 238225 INFO  (jetty-launcher-282-thread-3) [n:127.0.0.1:44380_solr    ] o.a.s.c.LeaderElector Joined leadership election with path: /overseer_elect/election/96557851057061896-127.0.0.1:44380_solr-n_0000000001
   [junit4]   2> 238225 INFO  (jetty-launcher-282-thread-2) [n:127.0.0.1:35524_solr    ] o.a.s.c.Overseer Overseer (id=96557851057061897-127.0.0.1:35524_solr-n_0000000000) starting
   [junit4]   2> 238225 INFO  (jetty-launcher-282-thread-1) [n:127.0.0.1:33037_solr    ] o.a.s.c.Overseer Overseer (id=null) closing
   [junit4]   2> 238226 INFO  (jetty-launcher-282-thread-3) [n:127.0.0.1:44380_solr    ] o.a.s.c.LeaderElector Watching path /overseer_elect/election/96557851057061897-127.0.0.1:35524_solr-n_0000000000 to know if I could be the leader
   [junit4]   2> 238227 INFO  (jetty-launcher-282-thread-1) [n:127.0.0.1:33037_solr    ] o.a.s.c.LeaderElector Joined leadership election with path: /overseer_elect/election/96557851057061895-127.0.0.1:33037_solr-n_0000000002
   [junit4]   2> 238227 INFO  (jetty-launcher-282-thread-3) [n:127.0.0.1:44380_solr    ] o.a.s.c.ZkController Register node as live in ZooKeeper:/live_nodes/127.0.0.1:44380_solr
   [junit4]   2> 238227 INFO  (jetty-launcher-282-thread-3) [n:127.0.0.1:44380_solr    ] o.a.s.c.c.SolrZkClient makePath: /live_nodes/127.0.0.1:44380_solr
   [junit4]   2> 238227 INFO  (jetty-launcher-282-thread-2) [n:127.0.0.1:35524_solr    ] o.a.s.c.c.SolrZkClient makePath: /overseer/queue-work
   [junit4]   2> 238228 INFO  (jetty-launcher-282-thread-1) [n:127.0.0.1:33037_solr    ] o.a.s.c.LeaderElector Watching path /overseer_elect/election/96557851057061896-127.0.0.1:44380_solr-n_0000000001 to know if I could be the leader
   [junit4]   2> 238229 INFO  (jetty-launcher-282-thread-1) [n:127.0.0.1:33037_solr    ] o.a.s.c.ZkController Register node as live in ZooKeeper:/live_nodes/127.0.0.1:33037_solr
   [junit4]   2> 238229 INFO  (jetty-launcher-282-thread-1) [n:127.0.0.1:33037_solr    ] o.a.s.c.c.SolrZkClient makePath: /live_nodes/127.0.0.1:33037_solr
   [junit4]   2> 238233 INFO  (zkCallback-296-thread-1-processing-n:127.0.0.1:33037_solr) [n:127.0.0.1:33037_solr    ] o.a.s.c.c.ZkStateReader A live node change: [WatchedEvent state:SyncConnected type:NodeChildrenChanged path:/live_nodes], has occurred - updating... (live nodes size: [0])
   [junit4]   2> 238235 INFO  (jetty-launcher-282-thread-2) [n:127.0.0.1:35524_solr    ] o.a.s.c.OverseerAutoReplicaFailoverThread Starting OverseerAutoReplicaFailoverThread autoReplicaFailoverWorkLoopDelay=10000 autoReplicaFailoverWaitAfterExpiration=30000 autoReplicaFailoverBadNodeExpiration=60000
   [junit4]   2> 238235 INFO  (zkCallback-298-thread-1-processing-n:127.0.0.1:35524_solr) [n:127.0.0.1:35524_solr    ] o.a.s.c.c.ZkStateReader A live node change: [WatchedEvent state:SyncConnected type:NodeChildrenChanged path:/live_nodes], has occurred - updating... (live nodes size: [0])
   [junit4]   2> 238235 INFO  (jetty-launcher-282-thread-2) [n:127.0.0.1:35524_solr    ] o.a.s.c.ZkController Publish node=127.0.0.1:35524_solr as DOWN
   [junit4]   2> 238237 INFO  (jetty-launcher-282-thread-2) [n:127.0.0.1:35524_solr    ] o.a.s.c.ZkController Register node as live in ZooKeeper:/live_nodes/127.0.0.1:35524_solr
   [junit4]   2> 238237 INFO  (jetty-launcher-282-thread-2) [n:127.0.0.1:35524_solr    ] o.a.s.c.c.SolrZkClient makePath: /live_nodes/127.0.0.1:35524_solr
   [junit4]   2> 238239 INFO  (OverseerStateUpdate-96557851057061897-127.0.0.1:35524_solr-n_0000000000) [n:127.0.0.1:35524_solr    ] o.a.s.c.Overseer Starting to work on the main queue
   [junit4]   2> 238240 INFO  (zkCallback-297-thread-1-processing-n:127.0.0.1:44380_solr) [n:127.0.0.1:44380_solr    ] o.a.s.c.c.ZkStateReader A live node change: [WatchedEvent state:SyncConnected type:NodeChildrenChanged path:/live_nodes], has occurred - updating... (live nodes size: [0])
   [junit4]   2> 238242 INFO  (OverseerCollectionConfigSetProcessor-96557851057061897-127.0.0.1:35524_solr-n_0000000000) [n:127.0.0.1:35524_solr    ] o.a.s.c.OverseerTaskProcessor Process current queue of overseer operations
   [junit4]   2> 238243 INFO  (zkCallback-298-thread-2-processing-n:127.0.0.1:35524_solr) [n:127.0.0.1:35524_solr    ] o.a.s.c.c.ZkStateReader A live node change: [WatchedEvent state:SyncConnected type:NodeChildrenChanged path:/live_nodes], has occurred - updating... (live nodes size: [0])
   [junit4]   2> 238244 INFO  (zkCallback-298-thread-2-processing-n:127.0.0.1:35524_solr) [n:127.0.0.1:35524_solr    ] o.a.s.c.c.ZkStateReader Updated live nodes from ZooKeeper... (0) -> (3)
   [junit4]   2> 238245 INFO  (OverseerStateUpdate-96557851057061897-127.0.0.1:35524_solr-n_0000000000) [n:127.0.0.1:35524_solr    ] o.a.s.c.c.ZkStateReader Updated live nodes from ZooKeeper... (3) -> (3)
   [junit4]   2> 238246 INFO  (zkCallback-297-thread-1-processing-n:127.0.0.1:44380_solr) [n:127.0.0.1:44380_solr    ] o.a.s.c.c.ZkStateReader Updated live nodes from ZooKeeper... (0) -> (3)
   [junit4]   2> 238247 INFO  (OverseerStateUpdate-96557851057061897-127.0.0.1:35524_solr-n_0000000000) [n:127.0.0.1:35524_solr    ] o.a.s.c.Overseer processMessage: queueSize: 1, message = {
   [junit4]   2>   "operation":"downnode",
   [junit4]   2>   "node_name":"127.0.0.1:35524_solr"} current state version: 0
   [junit4]   2> 238247 INFO  (OverseerStateUpdate-96557851057061897-127.0.0.1:35524_solr-n_0000000000) [n:127.0.0.1:35524_solr    ] o.a.s.c.o.NodeMutator DownNode state invoked for node: 127.0.0.1:35524_solr
   [junit4]   2> 238248 INFO  (zkCallback-296-thread-1-processing-n:127.0.0.1:33037_solr) [n:127.0.0.1:33037_solr    ] o.a.s.c.c.ZkStateReader Updated live nodes from ZooKeeper... (0) -> (3)
   [junit4]   2> 238263 INFO  (jetty-launcher-282-thread-2) [n:127.0.0.1:35524_solr    ] o.a.s.c.CoreContainer Security conf doesn't exist. Skipping setup for authorization module.
   [junit4]   2> 238263 INFO  (jetty-launcher-282-thread-2) [n:127.0.0.1:35524_solr    ] o.a.s.c.CoreContainer No authentication plugin used.
   [junit4]   2> 238264 INFO  (jetty-launcher-282-thread-2) [n:127.0.0.1:35524_solr    ] o.a.s.c.CorePropertiesLocator Looking for core definitions underneath /export/home/jenkins/workspace/Lucene-Solr-6.x-Solaris/solr/build/solr-core/test/J0/temp/solr.security.BasicAuthIntegrationTest_FBA885795CD87371-001/tempDir-001/node3/.
   [junit4]   2> 238264 INFO  (jetty-launcher-282-thread-2) [n:127.0.0.1:35524_solr    ] o.a.s.c.CorePropertiesLocator Found 0 core definitions
   [junit4]   2> 238265 INFO  (jetty-launcher-282-thread-2) [n:127.0.0.1:35524_solr    ] o.a.s.s.SolrDispatchFilter user.dir=/export/home/jenkins/workspace/Lucene-Solr-6.x-Solaris/solr/build/solr-core/test/J0
   [junit4]   2> 238266 INFO  (jetty-launcher-282-thread-2) [n:127.0.0.1:35524_solr    ] o.a.s.s.SolrDispatchFilter SolrDispatchFilter.init() done
   [junit4]   2> 238274 INFO  (jetty-launcher-282-thread-1) [n:127.0.0.1:33037_solr    ] o.a.s.c.CoreContainer Security conf doesn't exist. Skipping setup for authorization module.
   [junit4]   2> 238275 INFO  (jetty-launcher-282-thread-1) [n:127.0.0.1:33037_solr    ] o.a.s.c.CoreContainer No authentication plugin used.
   [junit4]   2> 238275 INFO  (jetty-launcher-282-thread-1) [n:127.0.0.1:33037_solr    ] o.a.s.c.CorePropertiesLocator Looking for core definitions underneath /export/home/jenkins/workspace/Lucene-Solr-6.x-Solaris/solr/build/solr-core/test/J0/temp/solr.security.BasicAuthIntegrationTest_FBA885795CD87371-001/tempDir-001/node1/.
   [junit4]   2> 238276 INFO  (jetty-launcher-282-thread-1) [n:127.0.0.1:33037_solr    ] o.a.s.c.CorePropertiesLocator Found 0 core definitions
   [junit4]   2> 238277 INFO  (jetty-launcher-282-thread-1) [n:127.0.0.1:33037_solr    ] o.a.s.s.SolrDispatchFilter user.dir=/export/home/jenkins/workspace/Lucene-Solr-6.x-Solaris/solr/build/solr-core/test/J0
   [junit4]   2> 238277 INFO  (jetty-launcher-282-thread-1) [n:127.0.0.1:33037_solr    ] o.a.s.s.SolrDispatchFilter SolrDispatchFilter.init() done
   [junit4]   2> 238281 INFO  (jetty-launcher-282-thread-3) [n:127.0.0.1:44380_solr    ] o.a.s.c.CoreContainer Security conf doesn't exist. Skipping setup for authorization module.
   [junit4]   2> 238281 INFO  (jetty-launcher-282-thread-3) [n:127.0.0.1:44380_solr    ] o.a.s.c.CoreContainer No authentication plugin used.
   [junit4]   2> 238282 INFO  (jetty-launcher-282-thread-3) [n:127.0.0.1:44380_solr    ] o.a.s.c.CorePropertiesLocator Looking for core definitions underneath /export/home/jenkins/workspace/Lucene-Solr-6.x-Solaris/solr/build/solr-core/test/J0/temp/solr.security.BasicAuthIntegrationTest_FBA885795CD87371-001/tempDir-001/node2/.
   [junit4]   2> 238282 INFO  (jetty-launcher-282-thread-3) [n:127.0.0.1:44380_solr    ] o.a.s.c.CorePropertiesLocator Found 0 core definitions
   [junit4]   2> 238283 INFO  (jetty-launcher-282-thread-3) [n:127.0.0.1:44380_solr    ] o.a.s.s.SolrDispatchFilter user.dir=/export/home/jenkins/workspace/Lucene-Solr-6.x-Solaris/solr/build/solr-core/test/J0
   [junit4]   2> 238283 INFO  (jetty-launcher-282-thread-3) [n:127.0.0.1:44380_solr    ] o.a.s.s.SolrDispatchFilter SolrDispatchFilter.init() done
   [junit4]   2> 238284 INFO  (SUITE-BasicAuthIntegrationTest-seed#[FBA885795CD87371]-worker) [    ] o.a.s.c.c.SolrZkClient Using default ZkCredentialsProvider
   [junit4]   2> 238284 INFO  (SUITE-BasicAuthIntegrationTest-seed#[FBA885795CD87371]-worker) [    ] o.a.s.c.c.ConnectionManager Waiting for client to connect to ZooKeeper
   [junit4]   2> 238286 INFO  (zkCallback-302-thread-1) [    ] o.a.s.c.c.ConnectionManager Watcher org.apache.solr.common.cloud.ConnectionManager@50dc5563 name:ZooKeeperConnection Watcher:127.0.0.1:57888 got event WatchedEvent state:SyncConnected type:None path:null path:null type:None
   [junit4]   2> 238286 INFO  (SUITE-BasicAuthIntegrationTest-seed#[FBA885795CD87371]-worker) [    ] o.a.s.c.c.ConnectionManager Client is connected to ZooKeeper
   [junit4]   2> 238286 INFO  (SUITE-BasicAuthIntegrationTest-seed#[FBA885795CD87371]-worker) [    ] o.a.s.c.c.SolrZkClient Using default ZkACLProvider
   [junit4]   2> 238289 WARN  (NIOServerCxn.Factory:0.0.0.0/0.0.0.0:0) [    ] o.a.z.s.NIOServerCnxn caught end of stream exception
   [junit4]   2> EndOfStreamException: Unable to read additional data from client sessionid 0x1570ada9c88000a, likely client has closed socket
   [junit4]   2> 	at org.apache.zookeeper.server.NIOServerCnxn.doIO(NIOServerCnxn.java:228)
   [junit4]   2> 	at org.apache.zookeeper.server.NIOServerCnxnFactory.run(NIOServerCnxnFactory.java:208)
   [junit4]   2> 	at java.lang.Thread.run(Thread.java:745)
   [junit4]   2> 238289 INFO  (SUITE-BasicAuthIntegrationTest-seed#[FBA885795CD87371]-worker) [    ] o.a.s.c.c.SolrZkClient Using default ZkCredentialsProvider
   [junit4]   2> 238291 INFO  (SUITE-BasicAuthIntegrationTest-seed#[FBA885795CD87371]-worker) [    ] o.a.s.c.c.ConnectionManager Waiting for client to connect to ZooKeeper
   [junit4]   2> 238293 INFO  (zkCallback-305-thread-1) [    ] o.a.s.c.c.ConnectionManager Watcher org.apache.solr.common.cloud.ConnectionManager@d19dec7 name:ZooKeeperConnection Watcher:127.0.0.1:57888/solr got event WatchedEvent state:SyncConnected type:None path:null path:null type:None
   [junit4]   2> 238293 INFO  (SUITE-BasicAuthIntegrationTest-seed#[FBA885795CD87371]-worker) [    ] o.a.s.c.c.ConnectionManager Client is connected to ZooKeeper
   [junit4]   2> 238293 INFO  (SUITE-BasicAuthIntegrationTest-seed#[FBA885795CD87371]-worker) [    ] o.a.s.c.c.SolrZkClient Using default ZkACLProvider
   [junit4]   2> 238293 INFO  (SUITE-BasicAuthIntegrationTest-seed#[FBA885795CD87371]-worker) [    ] o.a.s.c.c.ZkStateReader Updating cluster state from ZooKeeper... 
   [junit4]   2> 238295 INFO  (SUITE-BasicAuthIntegrationTest-seed#[FBA885795CD87371]-worker) [    ] o.a.s.c.c.ZkStateReader Loaded cluster properties: {urlScheme=https}
   [junit4]   2> 238295 INFO  (SUITE-BasicAuthIntegrationTest-seed#[FBA885795CD87371]-worker) [    ] o.a.s.c.c.ZkStateReader Updated live nodes from ZooKeeper... (0) -> (3)
   [junit4]   2> 238297 INFO  (SUITE-BasicAuthIntegrationTest-seed#[FBA885795CD87371]-worker) [    ] o.a.s.c.c.SolrZkClient makePath: /configs/conf/schema.xml
   [junit4]   2> 238301 INFO  (SUITE-BasicAuthIntegrationTest-seed#[FBA885795CD87371]-worker) [    ] o.a.s.c.c.SolrZkClient makePath: /configs/conf/solrconfig.xml
   [junit4]   2> 238422 INFO  (qtp955950096-1790) [n:127.0.0.1:44380_solr    ] o.a.s.h.a.CollectionsHandler Invoked Collection Action :create with params replicationFactor=1&collection.configName=conf&name=authCollection&action=CREATE&numShards=3&wt=javabin&version=2 and sendToOCPQueue=true
   [junit4]   2> 238425 INFO  (OverseerCollectionConfigSetProcessor-96557851057061897-127.0.0.1:35524_solr-n_0000000000) [n:127.0.0.1:35524_solr    ] o.a.s.c.OverseerTaskProcessor Overseer Collection Message Handler: Get the message id:/overseer/collection-queue-work/qn-0000000000 message:{
   [junit4]   2>   "name":"authCollection",
   [junit4]   2>   "fromApi":"true",
   [junit4]   2>   "replicationFactor":"1",
   [junit4]   2>   "collection.configName":"conf",
   [junit4]   2>   "numShards":"3",
   [junit4]   2>   "stateFormat":"2",
   [junit4]   2>   "operation":"create"}
   [junit4]   2> 238426 INFO  (OverseerThreadFactory-801-thread-1-processing-n:127.0.0.1:35524_solr) [n:127.0.0.1:35524_solr    ] o.a.s.c.OverseerCollectionMessageHandler OverseerCollectionMessageHandler.processMessage : create , {
   [junit4]   2>   "name":"authCollection",
   [junit4]   2>   "fromApi":"true",
   [junit4]   2>   "replicationFactor":"1",
   [junit4]   2>   "collection.configName":"conf",
   [junit4]   2>   "numShards":"3",
   [junit4]   2>   "stateFormat":"2",
   [junit4]   2>   "operation":"create"}
   [junit4]   2> 238426 INFO  (OverseerThreadFactory-801-thread-1-processing-n:127.0.0.1:35524_solr) [n:127.0.0.1:35524_solr    ] o.a.s.c.CreateCollectionCmd Create collection authCollection
   [junit4]   2> 238427 INFO  (OverseerThreadFactory-801-thread-1-processing-n:127.0.0.1:35524_solr) [n:127.0.0.1:35524_solr    ] o.a.s.c.OverseerCollectionMessageHandler creating collections conf node /collections/authCollection 
   [junit4]   2> 238427 INFO  (OverseerThreadFactory-801-thread-1-processing-n:127.0.0.1:35524_solr) [n:127.0.0.1:35524_solr    ] o.a.s.c.c.SolrZkClient makePath: /collections/authCollection
   [junit4]   2> 238429 INFO  (zkCallback-305-thread-1) [    ] o.a.s.c.c.ZkStateReader A collections change: [WatchedEvent state:SyncConnected type:NodeChildrenChanged path:/collections], has occurred - updating...
   [junit4]   2> 238429 INFO  (zkCallback-296-thread-1-processing-n:127.0.0.1:33037_solr) [n:127.0.0.1:33037_solr    ] o.a.s.c.c.ZkStateReader A collections change: [WatchedEvent state:SyncConnected type:NodeChildrenChanged path:/collections], has occurred - updating...
   [junit4]   2> 238429 INFO  (zkCallback-297-thread-1-processing-n:127.0.0.1:44380_solr) [n:127.0.0.1:44380_solr    ] o.a.s.c.c.ZkStateReader A collections change: [WatchedEvent state:SyncConnected type:NodeChildrenChanged path:/collections], has occurred - updating...
   [junit4]   2> 238429 INFO  (zkCallback-298-thread-1-processing-n:127.0.0.1:35524_solr) [n:127.0.0.1:35524_solr    ] o.a.s.c.c.ZkStateReader A collections change: [WatchedEvent state:SyncConnected type:NodeChildrenChanged path:/collections], has occurred - updating...
   [junit4]   2> 238434 INFO  (OverseerStateUpdate-96557851057061897-127.0.0.1:35524_solr-n_0000000000) [n:127.0.0.1:35524_solr    ] o.a.s.c.Overseer processMessage: queueSize: 1, message = {
   [junit4]   2>   "name":"authCollection",
   [junit4]   2>   "fromApi":"true",
   [junit4]   2>   "replicationFactor":"1",
   [junit4]   2>   "collection.configName":"conf",
   [junit4]   2>   "numShards":"3",
   [junit4]   2>   "stateFormat":"2",
   [junit4]   2>   "operation":"create"} current state version: 0
   [junit4]   2> 238434 INFO  (OverseerStateUpdate-96557851057061897-127.0.0.1:35524_solr-n_0000000000) [n:127.0.0.1:35524_solr    ] o.a.s.c.o.ClusterStateMutator building a new cName: authCollection
   [junit4]   2> 238435 INFO  (OverseerStateUpdate-96557851057061897-127.0.0.1:35524_solr-n_0000000000) [n:127.0.0.1:35524_solr    ] o.a.s.c.o.ZkStateWriter going to create_collection /collections/authCollection/state.json
   [junit4]   2> 238533 INFO  (OverseerThreadFactory-801-thread-1-processing-n:127.0.0.1:35524_solr) [n:127.0.0.1:35524_solr    ] o.a.s.c.CreateCollectionCmd Creating SolrCores for new collection authCollection, shardNames [shard1, shard2, shard3] , replicationFactor : 1
   [junit4]   2> 238533 INFO  (OverseerThreadFactory-801-thread-1-processing-n:127.0.0.1:35524_solr) [n:127.0.0.1:35524_solr    ] o.a.s.c.CreateCollectionCmd Creating core authCollection_shard1_replica1 as part of shard shard1 of collection authCollection on 127.0.0.1:44380_solr
   [junit4]   2> 238534 INFO  (OverseerThreadFactory-801-thread-1-processing-n:127.0.0.1:35524_solr) [n:127.0.0.1:35524_solr    ] o.a.s.c.CreateCollectionCmd Creating core authCollection_shard2_replica1 as part of shard shard2 of collection authCollection on 127.0.0.1:35524_solr
   [junit4]   2> 238534 INFO  (OverseerThreadFactory-801-thread-1-processing-n:127.0.0.1:35524_solr) [n:127.0.0.1:35524_solr    ] o.a.s.c.CreateCollectionCmd Creating core authCollection_shard3_replica1 as part of shard shard3 of collection authCollection on 127.0.0.1:33037_solr
   [junit4]   2> 238573 INFO  (qtp955950096-1783) [n:127.0.0.1:44380_solr    ] o.a.s.h.a.CoreAdminOperation core create command qt=/admin/cores&collection.configName=conf&name=authCollection_shard1_replica1&action=CREATE&numShards=3&collection=authCollection&shard=shard1&wt=javabin&version=2
   [junit4]   2> 238573 INFO  (qtp955950096-1783) [n:127.0.0.1:44380_solr    ] o.a.s.c.CoreDescriptor Created CoreDescriptor: {name=authCollection_shard1_replica1, collection.configName=conf, config=solrconfig.xml, transient=false, schema=schema.xml, loadOnStartup=true, configSetProperties=configsetprops.json, collection=authCollection, numShards=3, dataDir=data/, shard=shard1}
   [junit4]   2> 238581 INFO  (qtp955950096-1783) [n:127.0.0.1:44380_solr c:authCollection s:shard1  x:authCollection_shard1_replica1] o.a.s.c.ZkController publishing state=down
   [junit4]   2> 238584 INFO  (qtp195510783-1763) [n:127.0.0.1:33037_solr    ] o.a.s.h.a.CoreAdminOperation core create command qt=/admin/cores&collection.configName=conf&name=authCollection_shard3_replica1&action=CREATE&numShards=3&collection=authCollection&shard=shard3&wt=javabin&version=2
   [junit4]   2> 238584 INFO  (qtp195510783-1763) [n:127.0.0.1:33037_solr    ] o.a.s.c.CoreDescriptor Created CoreDescriptor: {name=authCollection_shard3_replica1, collection.configName=conf, config=solrconfig.xml, transient=false, schema=schema.xml, loadOnStartup=true, configSetProperties=configsetprops.json, collection=authCollection, numShards=3, dataDir=data/, shard=shard3}
   [junit4]   2> 238585 INFO  (qtp195510783-1763) [n:127.0.0.1:33037_solr c:authCollection s:shard3  x:authCollection_shard3_replica1] o.a.s.c.ZkController publishing state=down
   [junit4]   2> 238591 INFO  (qtp955950096-1783) [n:127.0.0.1:44380_solr c:authCollection s:shard1  x:authCollection_shard1_replica1] o.a.s.c.ZkController Registering watch for collection authCollection
   [junit4]   2> 238597 INFO  (qtp955950096-1783) [n:127.0.0.1:44380_solr c:authCollection s:shard1  x:authCollection_shard1_replica1] o.a.s.c.c.ZkStateReader Add data for [authCollection] ver [0]
   [junit4]   2> 238597 INFO  (qtp195510783-1763) [n:127.0.0.1:33037_solr c:authCollection s:shard3  x:authCollection_shard3_replica1] o.a.s.c.ZkController Registering watch for collection authCollection
   [junit4]   2> 238597 INFO  (qtp955950096-1783) [n:127.0.0.1:44380_solr c:authCollection s:shard1  x:authCollection_shard1_replica1] o.a.s.c.ZkController look for our core node name
   [junit4]   2> 238603 INFO  (OverseerStateUpdate-96557851057061897-127.0.0.1:35524_solr-n_0000000000) [n:127.0.0.1:35524_solr    ] o.a.s.c.Overseer processMessage: queueSize: 2, message = {
   [junit4]   2>   "core":"authCollection_shard1_replica1",
   [junit4]   2>   "roles":null,
   [junit4]   2>   "base_url":"https://127.0.0.1:44380/solr",
   [junit4]   2>   "node_name":"127.0.0.1:44380_solr",
   [junit4]   2>   "numShards":"3",
   [junit4]   2>   "state":"down",
   [junit4]   2>   "shard":"shard1",
   [junit4]   2>   "collection":"authCollection",
   [junit4]   2>   "operation":"state"} current state version: 0
   [junit4]   2> 238603 INFO  (qtp195510783-1763) [n:127.0.0.1:33037_solr c:authCollection s:shard3  x:authCollection_shard3_replica1] o.a.s.c.c.ZkStateReader Add data for [authCollection] ver [0]
   [junit4]   2> 238604 INFO  (qtp195510783-1763) [n:127.0.0.1:33037_solr c:authCollection s:shard3  x:authCollection_shard3_replica1] o.a.s.c.ZkController look for our core node name
   [junit4]   2> 238604 INFO  (OverseerStateUpdate-96557851057061897-127.0.0.1:35524_solr-n_0000000000) [n:127.0.0.1:35524_solr    ] o.a.s.c.o.ReplicaMutator Update state numShards=3 message={
   [junit4]   2>   "core":"authCollection_shard1_replica1",
   [junit4]   2>   "roles":null,
   [junit4]   2>   "base_url":"https://127.0.0.1:44380/solr",
   [junit4]   2>   "node_name":"127.0.0.1:44380_solr",
   [junit4]   2>   "numShards":"3",
   [junit4]   2>   "state":"down",
   [junit4]   2>   "shard":"shard1",
   [junit4]   2>   "collection":"authCollection",
   [junit4]   2>   "operation":"state"}
   [junit4]   2> 238606 INFO  (OverseerStateUpdate-96557851057061897-127.0.0.1:35524_solr-n_0000000000) [n:127.0.0.1:35524_solr    ] o.a.s.c.Overseer processMessage: queueSize: 1, message = {
   [junit4]   2>   "core":"authCollection_shard3_replica1",
   [junit4]   2>   "roles":null,
   [junit4]   2>   "base_url":"https://127.0.0.1:33037/solr",
   [junit4]   2>   "node_name":"127.0.0.1:33037_solr",
   [junit4]   2>   "numShards":"3",
   [junit4]   2>   "state":"down",
   [junit4]   2>   "shard":"shard3",
   [junit4]   2>   "collection":"authCollection",
   [junit4]   2>   "operation":"state"} current state version: 0
   [junit4]   2> 238606 INFO  (OverseerStateUpdate-96557851057061897-127.0.0.1:35524_solr-n_0000000000) [n:127.0.0.1:35524_solr    ] o.a.s.c.o.ReplicaMutator Update state numShards=3 message={
   [junit4]   2>   "core":"authCollection_shard3_replica1",
   [junit4]   2>   "roles":null,
   [junit4]   2>   "base_url":"https://127.0.0.1:33037/solr",
   [junit4]   2>   "node_name":"127.0.0.1:33037_solr",
   [junit4]   2>   "numShards":"3",
   [junit4]   2>   "state":"down",
   [junit4]   2>   "shard":"shard3",
   [junit4]   2>   "collection":"authCollection",
   [junit4]   2>   "operation":"state"}
   [junit4]   2> 238610 INFO  (qtp1407263650-1780) [n:127.0.0.1:35524_solr    ] o.a.s.h.a.CoreAdminOperation core create command qt=/admin/cores&collection.configName=conf&name=authCollection_shard2_replica1&action=CREATE&numShards=3&collection=authCollection&shard=shard2&wt=javabin&version=2
   [junit4]   2> 238611 INFO  (qtp1407263650-1780) [n:127.0.0.1:35524_solr    ] o.a.s.c.CoreDescriptor Created CoreDescriptor: {name=authCollection_shard2_replica1, collection.configName=conf, config=solrconfig.xml, transient=false, schema=schema.xml, loadOnStartup=true, configSetProperties=configsetprops.json, collection=authCollection, numShards=3, dataDir=data/, shard=shard2}
   [junit4]   2> 238611 INFO  (qtp1407263650-1780) [n:127.0.0.1:35524_solr c:authCollection s:shard2  x:authCollection_shard2_replica1] o.a.s.c.ZkController publishing state=down
   [junit4]   2> 238613 INFO  (qtp1407263650-1780) [n:127.0.0.1:35524_solr c:authCollection s:shard2  x:authCollection_shard2_replica1] o.a.s.c.ZkController Registering watch for collection authCollection
   [junit4]   2> 238613 INFO  (qtp1407263650-1780) [n:127.0.0.1:35524_solr c:authCollection s:shard2  x:authCollection_shard2_replica1] o.a.s.c.c.ZkStateReader Add data for [authCollection] ver [0]
   [junit4]   2> 238613 INFO  (qtp1407263650-1780) [n:127.0.0.1:35524_solr c:authCollection s:shard2  x:authCollection_shard2_replica1] o.a.s.c.ZkController look for our core node name
   [junit4]   2> 238614 INFO  (OverseerStateUpdate-96557851057061897-127.0.0.1:35524_solr-n_0000000000) [n:127.0.0.1:35524_solr    ] o.a.s.c.Overseer processMessage: queueSize: 1, message = {
   [junit4]   2>   "core":"authCollection_shard2_replica1",
   [junit4]   2>   "roles":null,
   [junit4]   2>   "base_url":"https://127.0.0.1:35524/solr",
   [junit4]   2>   "node_name":"127.0.0.1:35524_solr",
   [junit4]   2>   "numShards":"3",
   [junit4]   2>   "state":"down",
   [junit4]   2>   "shard":"shard2",
   [junit4]   2>   "collection":"authCollection",
   [junit4]   2>   "operation":"state"} current state version: 0
   [junit4]   2> 238614 INFO  (OverseerStateUpdate-96557851057061897-127.0.0.1:35524_solr-n_0000000000) [n:127.0.0.1:35524_solr    ] o.a.s.c.o.ReplicaMutator Update state numShards=3 message={
   [junit4]   2>   "core":"authCollection_shard2_replica1",
   [junit4]   2>   "roles":null,
   [junit4]   2>   "base_url":"https://127.0.0.1:35524/solr",
   [junit4]   2>   "node_name":"127.0.0.1:35524_solr",
   [junit4]   2>   "numShards":"3",
   [junit4]   2>   "state":"down",
   [junit4]   2>   "shard":"shard2",
   [junit4]   2>   "collection":"authCollection",
   [junit4]   2>   "operation":"state"}
   [junit4]   2> 238721 INFO  (OverseerStateUpdate-96557851057061897-127.0.0.1:35524_solr-n_0000000000) [n:127.0.0.1:35524_solr    ] o.a.s.c.o.ZkStateWriter going to update_collection /collections/authCollection/state.json version: 0
   [junit4]   2> 238722 INFO  (zkCallback-297-thread-1-processing-n:127.0.0.1:44380_solr) [n:127.0.0.1:44380_solr    ] o.a.s.c.c.ZkStateReader A cluster state change: [WatchedEvent state:SyncConnected type:NodeDataChanged path:/collections/authCollection/state.json] for collection [authCollection] has occurred - updating... (live nodes size: [3])
   [junit4]   2> 238722 INFO  (zkCallback-296-thread-1-processing-n:127.0.0.1:33037_solr) [n:127.0.0.1:33037_solr    ] o.a.s.c.c.ZkStateReader A cluster state change: [WatchedEvent state:SyncConnected type:NodeDataChanged path:/collections/authCollection/state.json] for collection [authCollection] has occurred - updating... (live nodes size: [3])
   [junit4]   2> 238723 INFO  (zkCallback-298-thread-3-processing-n:127.0.0.1:35524_solr) [n:127.0.0.1:35524_solr    ] o.a.s.c.c.ZkStateReader A cluster state change: [WatchedEvent state:SyncConnected type:NodeDataChanged path:/collections/authCollection/state.json] for collection [authCollection] has occurred - updating... (live nodes size: [3])
   [junit4]   2> 238723 INFO  (zkCallback-297-thread-1-processing-n:127.0.0.1:44380_solr) [n:127.0.0.1:44380_solr    ] o.a.s.c.c.ZkStateReader Updating data for [authCollection] from [0] to [1]
   [junit4]   2> 238723 INFO  (zkCallback-296-thread-1-processing-n:127.0.0.1:33037_solr) [n:127.0.0.1:33037_solr    ] o.a.s.c.c.ZkStateReader Updating data for [authCollection] from [0] to [1]
   [junit4]   2> 238723 INFO  (zkCallback-298-thread-3-processing-n:127.0.0.1:35524_solr) [n:127.0.0.1:35524_solr    ] o.a.s.c.c.ZkStateReader Updating data for [authCollection] from [0] to [1]
   [junit4]   2> 239598 INFO  (qtp955950096-1783) [n:127.0.0.1:44380_solr c:authCollection s:shard1  x:authCollection_shard1_replica1] o.a.s.c.ZkController waiting to find shard id in clusterstate for authCollection_shard1_replica1
   [junit4]   2> 239598 INFO  (qtp955950096-1783) [n:127.0.0.1:44380_solr c:authCollection s:shard1  x:authCollection_shard1_replica1] o.a.s.c.ZkController Check for collection zkNode:authCollection
   [junit4]   2> 239599 INFO  (qtp955950096-1783) [n:127.0.0.1:44380_solr c:authCollection s:shard1  x:authCollection_shard1_replica1] o.a.s.c.ZkController Collection zkNode exists
   [junit4]   2> 239599 INFO  (qtp955950096-1783) [n:127.0.0.1:44380_solr c:authCollection s:shard1  x:authCollection_shard1_replica1] o.a.s.c.c.ZkStateReader Load collection config from: [/collections/authCollection]
   [junit4]   2> 239600 INFO  (qtp955950096-1783) [n:127.0.0.1:44380_solr c:authCollection s:shard1  x:authCollection_shard1_replica1] o.a.s.c.c.ZkStateReader path=[/collections/authCollection] [configName]=[conf] specified config exists in ZooKeeper
   [junit4]   2> 239601 INFO  (qtp955950096-1783) [n:127.0.0.1:44380_solr c:authCollection s:shard1  x:authCollection_shard1_replica1] o.a.s.c.SolrResourceLoader new SolrResourceLoader for directory: '/export/home/jenkins/workspace/Lucene-Solr-6.x-Solaris/solr/build/solr-core/test/J0/temp/solr.security.BasicAuthIntegrationTest_FBA885795CD87371-001/tempDir-001/node2/authCollection_shard1_replica1'
   [junit4]   2> 239601 INFO  (qtp955950096-1783) [n:127.0.0.1:44380_solr c:authCollection s:shard1  x:authCollection_shard1_replica1] o.a.s.c.SolrResourceLoader JNDI not configured for solr (NoInitialContextEx)
   [junit4]   2> 239601 INFO  (qtp955950096-1783) [n:127.0.0.1:44380_solr c:authCollection s:shard1  x:authCollection_shard1_replica1] o.a.s.c.SolrResourceLoader solr home defaulted to 'solr/' (could not find system property or JNDI)
   [junit4]   2> 239603 INFO  (qtp955950096-1783) [n:127.0.0.1:44380_solr c:authCollection s:shard1  x:authCollection_shard1_replica1] o.a.s.c.Config loaded config solrconfig.xml with version 0 
   [junit4]   2> 239605 INFO  (qtp195510783-1763) [n:127.0.0.1:33037_solr c:authCollection s:shard3  x:authCollection_shard3_replica1] o.a.s.c.ZkController waiting to find shard id in clusterstate for authCollection_shard3_replica1
   [junit4]   2> 239605 INFO  (qtp195510783-1763) [n:127.0.0.1:33037_solr c:authCollection s:shard3  x:authCollection_shard3_replica1] o.a.s.c.ZkController Check for collection zkNode:authCollection
   [junit4]   2> 239606 INFO  (qtp195510783-1763) [n:127.0.0.1:33037_solr c:authCollection s:shard3  x:authCollection_shard3_replica1] o.a.s.c.ZkController Collection zkNode exists
   [junit4]   2> 239606 INFO  (qtp195510783-1763) [n:127.0.0.1:33037_solr c:authCollection s:shard3  x:authCollection_shard3_replica1] o.a.s.c.c.ZkStateReader Load collection config from: [/collections/authCollection]
   [junit4]   2> 239610 INFO  (qtp195510783-1763) [n:127.0.0.1:33037_solr c:authCollection s:shard3  x:authCollection_shard3_replica1] o.a.s.c.c.ZkStateReader path=[/collections/authCollection] [configName]=[conf] specified config exists in ZooKeeper
   [junit4]   2> 239610 INFO  (qtp195510783-1763) [n:127.0.0.1:33037_solr c:authCollection s:shard3  x:authCollection_shard3_replica1] o.a.s.c.SolrResourceLoader new SolrResourceLoader for directory: '/export/home/jenkins/workspace/Lucene-Solr-6.x-Solaris/solr/build/solr-core/test/J0/temp/solr.security.BasicAuthIntegrationTest_FBA885795CD87371-001/tempDir-001/node1/authCollection_shard3_replica1'
   [junit4]   2> 239610 INFO  (qtp195510783-1763) [n:127.0.0.1:33037_solr c:authCollection s:shard3  x:authCollection_shard3_replica1] o.a.s.c.SolrResourceLoader JNDI not configured for solr (NoInitialContextEx)
   [junit4]   2> 239610 INFO  (qtp195510783-1763) [n:127.0.0.1:33037_solr c:authCollection s:shard3  x:authCollection_shard3_replica1] o.a.s.c.SolrResourceLoader solr home defaulted to 'solr/' (could not find system property or JNDI)
   [junit4]   2> 239612 INFO  (qtp955950096-1783) [n:127.0.0.1:44380_solr c:authCollection s:shard1  x:authCollection_shard1_replica1] o.a.s.c.SolrConfig current version of requestparams : -1
   [junit4]   2> 239614 INFO  (qtp195510783-1763) [n:127.0.0.1:33037_solr c:authCollection s:shard3  x:authCollection_shard3_replica1] o.a.s.c.Config loaded config solrconfig.xml with version 0 
   [junit4]   2> 239614 INFO  (qtp955950096-1783) [n:127.0.0.1:44380_solr c:authCollection s:shard1  x:authCollection_shard1_replica1] o.a.s.c.SolrConfig Using Lucene MatchVersion: 6.3.0
   [junit4]   2> 239614 INFO  (qtp1407263650-1780) [n:127.0.0.1:35524_solr c:authCollection s:shard2  x:authCollection_shard2_replica1] o.a.s.c.ZkController waiting to find shard id in clusterstate for authCollection_shard2_replica1
   [junit4]   2> 239615 INFO  (qtp1407263650-1780) [n:127.0.0.1:35524_solr c:authCollection s:shard2  x:authCollection_shard2_replica1] o.a.s.c.ZkController Check for collection zkNode:authCollection
   [junit4]   2> 239615 INFO  (qtp1407263650-1780) [n:127.0.0.1:35524_solr c:authCollection s:shard2  x:authCollection_shard2_replica1] o.a.s.c.ZkController Collection zkNode exists
   [junit4]   2> 239615 INFO  (qtp1407263650-1780) [n:127.0.0.1:35524_solr c:authCollection s:shard2  x:authCollection_shard2_replica1] o.a.s.c.c.ZkStateReader Load collection config from: [/collections/authCollection]
   [junit4]   2> 239616 INFO  (qtp1407263650-1780) [n:127.0.0.1:35524_solr c:authCollection s:shard2  x:authCollection_shard2_replica1] o.a.s.c.c.ZkStateReader path=[/collections/authCollection] [configName]=[conf] specified config exists in ZooKeeper
   [junit4]   2> 239616 INFO  (qtp1407263650-1780) [n:127.0.0.1:35524_solr c:authCollection s:shard2  x:authCollection_shard2_replica1] o.a.s.c.SolrResourceLoader new SolrResourceLoader for directory: '/export/home/jenkins/workspace/Lucene-Solr-6.x-Solaris/solr/build/solr-core/test/J0/temp/solr.security.BasicAuthIntegrationTest_FBA885795CD87371-001/tempDir-001/node3/authCollection_shard2_replica1'
   [junit4]   2> 239617 INFO  (qtp1407263650-1780) [n:127.0.0.1:35524_solr c:authCollection s:shard2  x:authCollection_shard2_replica1] o.a.s.c.SolrResourceLoader JNDI not configured for solr (NoInitialContextEx)
   [junit4]   2> 239617 INFO  (qtp1407263650-1780) [n:127.0.0.1:35524_solr c:authCollection s:shard2  x:authCollection_shard2_replica1] o.a.s.c.SolrResourceLoader solr home defaulted to 'solr/' (could not find system property or JNDI)
   [junit4]   2> 239622 INFO  (qtp1407263650-1780) [n:127.0.0.1:35524_solr c:authCollection s:shard2  x:authCollection_shard2_replica1] o.a.s.c.Config loaded config solrconfig.xml with version 0 
   [junit4]   2> 239622 INFO  (qtp955950096-1783) [n:127.0.0.1:44380_solr c:authCollection s:shard1  x:authCollection_shard1_replica1] o.a.s.c.SolrConfig Loaded SolrConfig: solrconfig.xml
   [junit4]   2> 239622 INFO  (qtp195510783-1763) [n:127.0.0.1:33037_solr c:authCollection s:shard3  x:authCollection_shard3_replica1] o.a.s.c.SolrConfig current version of requestparams : -1
   [junit4]   2> 239624 INFO  (qtp195510783-1763) [n:127.0.0.1:33037_solr c:authCollection s:shard3  x:authCollection_shard3_replica1] o.a.s.c.SolrConfig Using Lucene MatchVersion: 6.3.0
   [junit4]   2> 239628 INFO  (qtp1407263650-1780) [n:127.0.0.1:35524_solr c:authCollection s:shard2  x:authCollection_shard2_replica1] o.a.s.c.SolrConfig current version of requestparams : -1
   [junit4]   2> 239631 INFO  (qtp1407263650-1780) [n:127.0.0.1:35524_solr c:authCollection s:shard2  x:authCollection_shard2_replica1] o.a.s.c.SolrConfig Using Lucene MatchVersion: 6.3.0
   [junit4]   2> 239631 INFO  (qtp955950096-1783) [n:127.0.0.1:44380_solr c:authCollection s:shard1  x:authCollection_shard1_replica1] o.a.s.s.IndexSchema [authCollection_shard1_replica1] Schema name=minimal
   [junit4]   2> 239631 INFO  (qtp195510783-1763) [n:127.0.0.1:33037_solr c:authCollection s:shard3  x:authCollection_shard3_replica1] o.a.s.c.SolrConfig Loaded SolrConfig: solrconfig.xml
   [junit4]   2> 239645 INFO  (qtp955950096-1783) [n:127.0.0.1:44380_solr c:authCollection s:shard1  x:authCollection_shard1_replica1] o.a.s.s.IndexSchema unique key field: id
   [junit4]   2> 239646 INFO  (qtp1407263650-1780) [n:127.0.0.1:35524_solr c:authCollection s:shard2  x:authCollection_shard2_replica1] o.a.s.c.SolrConfig Loaded SolrConfig: solrconfig.xml
   [junit4]   2> 239646 INFO  (qtp195510783-1763) [n:127.0.0.1:33037_solr c:authCollection s:shard3  x:authCollection_shard3_replica1] o.a.s.s.IndexSchema [authCollection_shard3_replica1] Schema name=minimal
   [junit4]   2> 239647 INFO  (qtp955950096-1783) [n:127.0.0.1:44380_solr c:authCollection s:shard1  x:authCollection_shard1_replica1] o.a.s.c.ConfigSetProperties Did not find ConfigSet properties, assuming default properties: Can't find resource 'configsetprops.json' in classpath or '/configs/conf', cwd=/export/home/jenkins/workspace/Lucene-Solr-6.x-Solaris/solr/build/solr-core/test/J0
   [junit4]   2> 239648 INFO  (qtp955950096-1783) [n:127.0.0.1:44380_solr c:authCollection s:shard1  x:authCollection_shard1_replica1] o.a.s.c.CoreContainer Creating SolrCore 'authCollection_shard1_replica1' using configuration from collection authCollection
   [junit4]   2> 239648 INFO  (qtp955950096-1783) [n:127.0.0.1:44380_solr c:authCollection s:shard1 r:core_node1 x:authCollection_shard1_replica1] o.a.s.c.SolrCore org.apache.solr.core.MockDirectoryFactory
   [junit4]   2> 239648 INFO  (qtp955950096-1783) [n:127.0.0.1:44380_solr c:authCollection s:shard1 r:core_node1 x:authCollection_shard1_replica1] o.a.s.c.SolrCore [[authCollection_shard1_replica1] ] Opening new SolrCore at [/export/home/jenkins/workspace/Lucene-Solr-6.x-Solaris/solr/build/solr-core/test/J0/temp/solr.security.BasicAuthIntegrationTest_FBA885795CD87371-001/tempDir-001/node2/authCollection_shard1_replica1], dataDir=[/export/home/jenkins/workspace/Lucene-Solr-6.x-Solaris/solr/build/solr-core/test/J0/temp/solr.security.BasicAuthIntegrationTest_FBA885795CD87371-001/tempDir-001/node2/./authCollection_shard1_replica1/data/]
   [junit4]   2> 239648 INFO  (qtp955950096-1783) [n:127.0.0.1:44380_solr c:authCollection s:shard1 r:core_node1 x:authCollection_shard1_replica1] o.a.s.c.SolrCore JMX monitoring not detected for core: authCollection_shard1_replica1
   [junit4]   2> 239649 INFO  (qtp955950096-1783) [n:127.0.0.1:44380_solr c:authCollection s:shard1 r:core_node1 x:authCollection_shard1_replica1] o.a.s.c.CachingDirectoryFactory return new directory for /export/home/jenkins/workspace/Lucene-Solr-6.x-Solaris/solr/build/solr-core/test/J0/temp/solr.security.BasicAuthIntegrationTest_FBA885795CD87371-001/tempDir-001/node2/./authCollection_shard1_replica1/data/snapshot_metadata
   [junit4]   2> 239649 INFO  (qtp955950096-1783) [n:127.0.0.1:44380_solr c:authCollection s:shard1 r:core_node1 x:authCollection_shard1_replica1] o.a.s.c.s.SolrSnapshotMetaDataManager Loading from snapshot metadata file...
   [junit4]   2> 239649 INFO  (qtp195510783-1763) [n:127.0.0.1:33037_solr c:authCollection s:shard3  x:authCollection_shard3_replica1] o.a.s.s.IndexSchema unique key field: id
   [junit4]   2> 239649 INFO  (qtp955950096-1783) [n:127.0.0.1:44380_solr c:authCollection s:shard1 r:core_node1 x:authCollection_shard1_replica1] o.a.s.c.CachingDirectoryFactory return new directory for /export/home/jenkins/workspace/Lucene-Solr-6.x-Solaris/solr/build/solr-core/test/J0/temp/solr.security.BasicAuthIntegrationTest_FBA885795CD87371-001/tempDir-001/node2/./authCollection_shard1_replica1/data
   [junit4]   2> 239650 INFO  (qtp955950096-1783) [n:127.0.0.1:44380_solr c:authCollection s:shard1 r:core_node1 x:authCollection_shard1_replica1] o.a.s.c.SolrCore New index directory detected: old=null new=/export/home/jenkins/workspace/Lucene-Solr-6.x-Solaris/solr/build/solr-core/test/J0/temp/solr.security.BasicAuthIntegrationTest_FBA885795CD87371-001/tempDir-001/node2/./authCollection_shard1_replica1/data/index/
   [junit4]   2> 239650 WARN  (qtp955950096-1783) [n:127.0.0.1:44380_solr c:authCollection s:shard1 r:core_node1 x:authCollection_shard1_replica1] o.a.s.c.SolrCore [authCollection_shard1_replica1] Solr index directory '/export/home/jenkins/workspace/Lucene-Solr-6.x-Solaris/solr/build/solr-core/test/J0/temp/solr.security.BasicAuthIntegrationTest_FBA885795CD87371-001/tempDir-001/node2/./authCollection_shard1_replica1/data/index' doesn't exist. Creating new index...
   [junit4]   2> 239652 INFO  (qtp1407263650-1780) [n:127.0.0.1:35524_solr c:authCollection s:shard2  x:authCollection_shard2_replica1] o.a.s.s.IndexSchema [authCollection_shard2_replica1] Schema name=minimal
   [junit4]   2> 239652 INFO  (qtp955950096-1783) [n:127.0.0.1:44380_solr c:authCollection s:shard1 r:core_node1 x:authCollection_shard1_replica1] o.a.s.c.CachingDirectoryFactory return new directory for /export/home/jenkins/workspace/Lucene-Solr-6.x-Solaris/solr/build/solr-core/test/J0/temp/solr.security.BasicAuthIntegrationTest_FBA885795CD87371-001/tempDir-001/node2/./authCollection_shard1_replica1/data/index
   [junit4]   2> 239653 INFO  (qtp195510783-1763) [n:127.0.0.1:33037_solr c:authCollection s:shard3  x:authCollection_shard3_replica1] o.a.s.c.ConfigSetProperties Did not find ConfigSet properties, assuming default properties: Can't find resource 'configsetprops.json' in classpath or '/configs/conf', cwd=/export/home/jenkins/workspace/Lucene-Solr-6.x-Solaris/solr/build/solr-core/test/J0
   [junit4]   2> 239653 INFO  (qtp195510783-1763) [n:127.0.0.1:33037_solr c:authCollection s:shard3  x:authCollection_shard3_replica1] o.a.s.c.CoreContainer Creating SolrCore 'authCollection_shard3_replica1' using configuration from collection authCollection
   [junit4]   2> 239653 INFO  (qtp195510783-1763) [n:127.0.0.1:33037_solr c:authCollection s:shard3 r:core_node2 x:authCollection_shard3_replica1] o.a.s.c.SolrCore org.apache.solr.core.MockDirectoryFactory
   [junit4]   2> 239653 INFO  (qtp195510783-1763) [n:127.0.0.1:33037_solr c:authCollection s:shard3 r:core_node2 x:authCollection_shard3_replica1] o.a.s.c.SolrCore [[authCollection_shard3_replica1] ] Opening new SolrCore at [/export/home/jenkins/workspace/Lucene-Solr-6.x-Solaris/solr/build/solr-core/test/J0/temp/solr.security.BasicAuthIntegrationTest_FBA885795CD87371-001/tempDir-001/node1/authCollection_shard3_replica1], dataDir=[/export/home/jenkins/workspace/Lucene-Solr-6.x-Solaris/solr/build/solr-core/test/J0/temp/solr.security.BasicAuthIntegrationTest_FBA885795CD87371-001/tempDir-001/node1/./authCollection_shard3_replica1/data/]
   [junit4]   2> 239654 INFO  (qtp195510783-1763) [n:127.0.0.1:33037_solr c:authCollection s:shard3 r:core_node2 x:authCollection_shard3_replica1] o.a.s.c.SolrCore JMX monitoring not detected for core: authCollection_shard3_replica1
   [junit4]   2> 239654 INFO  (qtp195510783-1763) [n:127.0.0.1:33037_solr c:authCollection s:shard3 r:core_node2 x:authCollection_shard3_replica1] o.a.s.c.CachingDirectoryFactory return new directory for /export/home/jenkins/workspace/Lucene-Solr-6.x-Solaris/solr/build/solr-core/test/J0/temp/solr.security.BasicAuthIntegrationTest_FBA885795CD87371-001/tempDir-001/node1/./authCollection_shard3_replica1/data/snapshot_metadata
   [junit4]   2> 239654 INFO  (qtp195510783-1763) [n:127.0.0.1:33037_solr c:authCollection s:shard3 r:core_node2 x:authCollection_shard3_replica1] o.a.s.c.s.SolrSnapshotMetaDataManager Loading from snapshot metadata file...
   [junit4]   2> 239655 INFO  (qtp955950096-1783) [n:127.0.0.1:44380_solr c:authCollection s:shard1 r:core_node1 x:authCollection_shard1_replica1] o.a.s.c.SolrDeletionPolicy SolrDeletionPolicy.onCommit: commits: num=1
   [junit4]   2> 	commit{dir=MockDirectoryWrapper(RAMDirectory@64b12185 lockFactory=org.apache.lucene.store.SingleInstanceLockFactory@62cd1a4),segFN=segments_1,generation=1}
   [junit4]   2> 239655 INFO  (qtp955950096-1783) [n:127.0.0.1:44380_solr c:authCollection s:shard1 r:core_node1 x:authCollection_shard1_replica1] o.a.s.c.SolrDeletionPolicy newest commit generation = 1
   [junit4]   2> 239655 INFO  (qtp195510783-1763) [n:127.0.0.1:33037_solr c:authCollection s:shard3 r:core_node2 x:authCollection_shard3_replica1] o.a.s.c.CachingDirectoryFactory return new directory for /export/home/jenkins/workspace/Lucene-Solr-6.x-Solaris/solr/build/solr-core/test/J0/temp/solr.security.BasicAuthIntegrationTest_FBA885795CD87371-001/tempDir-001/node1/./authCollection_shard3_replica1/data
   [junit4]   2> 239655 INFO  (qtp195510783-1763) [n:127.0.0.1:33037_solr c:authCollection s:shard3 r:core_node2 x:authCollection_shard3_replica1] o.a.s.c.SolrCore New index directory detected: old=null new=/export/home/jenkins/workspace/Lucene-Solr-6.x-Solaris/solr/build/solr-core/test/J0/temp/solr.security.BasicAuthIntegrationTest_FBA885795CD87371-001/tempDir-001/node1/./authCollection_shard3_replica1/data/index/
   [junit4]   2> 239655 INFO  (qtp1407263650-1780) [n:127.0.0.1:35524_solr c:authCollection s:shard2  x:authCollection_shard2_replica1] o.a.s.s.IndexSchema unique key field: id
   [junit4]   2> 239655 WARN  (qtp195510783-1763) [n:127.0.0.1:33037_solr c:authCollection s:shard3 r:core_node2 x:authCollection_shard3_replica1] o.a.s.c.SolrCore [authCollection_shard3_replica1] Solr index directory '/export/home/jenkins/workspace/Lucene-Solr-6.x-Solaris/solr/build/solr-core/test/J0/temp/solr.security.BasicAuthIntegrationTest_FBA885795CD87371-001/tempDir-001/node1/./authCollection_shard3_replica1/data/index' doesn't exist. Creating new index...
   [junit4]   2> 239655 INFO  (qtp195510783-1763) [n:127.0.0.1:33037_solr c:authCollection s:shard3 r:core_node2 x:authCollection_shard3_replica1] o.a.s.c.CachingDirectoryFactory return new directory for /export/home/jenkins/workspace/Lucene-Solr-6.x-Solaris/solr/build/solr-core/test/J0/temp/solr.security.BasicAuthIntegrationTest_FBA885795CD87371-001/tempDir-001/node1/./authCollection_shard3_replica1/data/index
   [junit4]   2> 239656 INFO  (OldIndexDirectoryCleanupThreadForCore-authCollection_shard1_replica1) [n:127.0.0.1:44380_solr c:authCollection s:shard1 r:core_node1 x:authCollection_shard1_replica1] o.a.s.c.SolrCore Looking for old index directories to cleanup for core authCollection_shard1_replica1 in /export/home/jenkins/workspace/Lucene-Solr-6.x-Solaris/solr/build/solr-core/test/J0/temp/solr.security.BasicAuthIntegrationTest_FBA885795CD87371-001/tempDir-001/node2/./authCollection_shard1_replica1/data/
   [junit4]   2> 239656 WARN  (OldIndexDirectoryCleanupThreadForCore-authCollection_shard1_replica1) [n:127.0.0.1:44380_solr c:authCollection s:shard1 r:core_node1 x:authCollection_shard1_replica1] o.a.s.c.DirectoryFactory /export/home/jenkins/workspace/Lucene-Solr-6.x-Solaris/solr/build/solr-core/test/J0/temp/solr.security.BasicAuthIntegrationTest_FBA885795CD87371-001/tempDir-001/node2/./authCollection_shard1_replica1/data/ does not point to a valid data directory; skipping clean-up of old index directories.
   [junit4]   2> 239657 INFO  (qtp955950096-1783) [n:127.0.0.1:44380_solr c:authCollection s:shard1 r:core_node1 x:authCollection_shard1_replica1] o.a.s.c.SolrCore no updateRequestProcessorChain defined as default, creating implicit default
   [junit4]   2> 239657 INFO  (qtp195510783-1763) [n:127.0.0.1:33037_solr c:authCollection s:shard3 r:core_node2 x:authCollection_shard3_replica1] o.a.s.c.SolrDeletionPolicy SolrDeletionPolicy.onCommit: commits: num=1
   [junit4]   2> 	commit{dir=MockDirectoryWrapper(RAMDirectory@27978d88 lockFactory=org.apache.lucene.store.SingleInstanceLockFactory@689a0c23),segFN=segments_1,generation=1}
   [junit4]   2> 239657 INFO  (qtp195510783-1763) [n:127.0.0.1:33037_solr c:authCollection s:shard3 r:core_node2 x:authCollection_shard3_replica1] o.a.s.c.SolrDeletionPolicy newest commit generation = 1
   [junit4]   2> 239657 INFO  (OldIndexDirectoryCleanupThreadForCore-authCollection_shard3_replica1) [n:127.0.0.1:33037_solr c:authCollection s:shard3 r:core_node2 x:authCollection_shard3_replica1] o.a.s.c.SolrCore Looking for old index directories to cleanup for core authCollection_shard3_replica1 in /export/home/jenkins/workspace/Lucene-Solr-6.x-Solaris/solr/build/solr-core/test/J0/temp/solr.security.BasicAuthIntegrationTest_FBA885795CD87371-001/tempDir-001/node1/./authCollection_shard3_replica1/data/
   [junit4]   2> 239658 WARN  (OldIndexDirectoryCleanupThreadForCore-authCollection_shard3_replica1) [n:127.0.0.1:33037_solr c:authCollection s:shard3 r:core_node2 x:authCollection_shard3_replica1] o.a.s.c.DirectoryFactory /export/home/jenkins/workspace/Lucene-Solr-6.x-Solaris/solr/build/solr-core/test/J0/temp/solr.security.BasicAuthIntegrationTest_FBA885795CD87371-001/tempDir-001/node1/./authCollection_shard3_replica1/data/ does not point to a valid data directory; skipping clean-up of old index directories.
   [junit4]   2> 239659 INFO  (qtp1407263650-1780) [n:127.0.0.1:35524_solr c:authCollection s:shard2  x:authCollection_shard2_replica1] o.a.s.c.ConfigSetProperties Did not find ConfigSet properties, assuming default properties: Can't find resource 'configsetprops.json' in classpath or '/configs/conf', cwd=/export/home/jenkins/workspace/Lucene-Solr-6.x-Solaris/solr/build/solr-core/test/J0
   [junit4]   2> 239659 INFO  (qtp1407263650-1780) [n:127.0.0.1:35524_solr c:authCollection s:shard2  x:authCollection_shard2_replica1] o.a.s.c.CoreContainer Creating SolrCore 'authCollection_shard2_replica1' using configuration from collection authCollection
   [junit4]   2> 239659 INFO  (qtp1407263650-1780) [n:127.0.0.1:35524_solr c:authCollection s:shard2 r:core_node3 x:authCollection_shard2_replica1] o.a.s.c.SolrCore org.apache.solr.core.MockDirectoryFactory
   [junit4]   2> 239659 INFO  (qtp1407263650-1780) [n:127.0.0.1:35524_solr c:authCollection s:shard2 r:core_node3 x:authCollection_shard2_replica1] o.a.s.c.SolrCore [[authCollection_shard2_replica1] ] Opening new SolrCore at [/export/home/jenkins/workspace/Lucene-Solr-6.x-Solaris/solr/build/solr-core/test/J0/temp/solr.security.BasicAuthIntegrationTest_FBA885795CD87371-001/tempDir-001/node3/authCollection_shard2_replica1], dataDir=[/export/home/jenkins/workspace/Lucene-Solr-6.x-Solaris/solr/build/solr-core/test/J0/temp/solr.security.BasicAuthIntegrationTest_FBA885795CD87371-001/tempDir-001/node3/./authCollection_shard2_replica1/data/]
   [junit4]   2> 239659 INFO  (qtp1407263650-1780) [n:127.0.0.1:35524_solr c:authCollection s:shard2 r:core_node3 x:authCollection_shard2_replica1] o.a.s.c.SolrCore JMX monitoring not detected for core: authCollection_shard2_replica1
   [junit4]   2> 239659 INFO  (qtp195510783-1763) [n:127.0.0.1:33037_solr c:authCollection s:shard3 r:core_node2 x:authCollection_shard3_replica1] o.a.s.c.SolrCore no updateRequestProcessorChain defined as default, creating implicit default
   [junit4]   2> 239660 INFO  (qtp1407263650-1780) [n:127.0.0.1:35524_solr c:authCollection s:shard2 r:core_node3 x:authCollection_shard2_replica1] o.a.s.c.CachingDirectoryFactory return new directory for /export/home/jenkins/workspace/Lucene-Solr-6.x-Solaris/solr/build/solr-core/test/J0/temp/solr.security.BasicAuthIntegrationTest_FBA885795CD87371-001/tempDir-001/node3/./authCollection_shard2_replica1/data/snapshot_metadata
   [junit4]   2> 239660 INFO  (qtp1407263650-1780) [n:127.0.0.1:35524_solr c:authCollection s:shard2 r:core_node3 x:authCollection_shard2_replica1] o.a.s.c.s.SolrSnapshotMetaDataManager Loading from snapshot metadata file...
   [junit4]   2> 239660 INFO  (qtp1407263650-1780) [n:127.0.0.1:35524_solr c:authCollection s:shard2 r:core_node3 x:authCollection_shard2_replica1] o.a.s.c.CachingDirectoryFactory return new directory for /export/home/jenkins/workspace/Lucene-Solr-6.x-Solaris/solr/build/solr-core/test/J0/temp/solr.security.BasicAuthIntegrationTest_FBA885795CD87371-001/tempDir-001/node3/./authCollection_shard2_replica1/data
   [junit4]   2> 239661 INFO  (qtp1407263650-1780) [n:127.0.0.1:35524_solr c:authCollection s:shard2 r:core_node3 x:authCollection_shard2_replica1] o.a.s.c.SolrCore New index directory detected: old=null new=/export/home/jenkins/workspace/Lucene-Solr-6.x-Solaris/solr/build/solr-core/test/J0/temp/solr.security.BasicAuthIntegrationTest_FBA885795CD87371-001/tempDir-001/node3/./authCollection_shard2_replica1/data/index/
   [junit4]   2> 239661 WARN  (qtp1407263650-1780) [n:127.0.0.1:35524_solr c:authCollection s:shard2 r:core_node3 x:authCollection_shard2_replica1] o.a.s.c.SolrCore [authCollection_shard2_replica1] Solr index directory '/export/home/jenkins/workspace/Lucene-Solr-6.x-Solaris/solr/build/solr-core/test/J0/temp/solr.security.BasicAuthIntegrationTest_FBA885795CD87371-001/tempDir-001/node3/./authCollection_shard2_replica1/data/index' doesn't exist. Creating new index...
   [junit4]   2> 239661 INFO  (qtp955950096-1783) [n:127.0.0.1:44380_solr c:authCollection s:shard1 r:core_node1 x:authCollection_shard1_replica1] o.a.s.h.l.XMLLoader xsltCacheLifetimeSeconds=60
   [junit4]   2> 239661 INFO  (qtp1407263650-1780) [n:127.0.0.1:35524_solr c:authCollection s:shard2 r:core_node3 x:authCollection_shard2_replica1] o.a.s.c.CachingDirectoryFactory return new directory for /export/home/jenkins/workspace/Lucene-Solr-6.x-Solaris/solr/build/solr-core/test/J0/temp/solr.security.BasicAuthIntegrationTest_FBA885795CD87371-001/tempDir-001/node3/./authCollection_shard2_replica1/data/index
   [junit4]   2> 239661 INFO  (qtp195510783-1763) [n:127.0.0.1:33037_solr c:authCollection s:shard3 r:core_node2 x:authCollection_shard3_replica1] o.a.s.h.l.XMLLoader xsltCacheLifetimeSeconds=60
   [junit4]   2> 239662 INFO  (qtp1407263650-1780) [n:127.0.0.1:35524_solr c:authCollection s:shard2 r:core_node3 x:authCollection_shard2_replica1] o.a.s.c.SolrDeletionPolicy SolrDeletionPolicy.onCommit: commits: num=1
   [junit4]   2> 	commit{dir=MockDirectoryWrapper(RAMDirectory@56f003ed lockFactory=org.apache.lucene.store.SingleInstanceLockFactory@242a4fa9),segFN=segments_1,generation=1}
   [junit4]   2> 239662 INFO  (qtp1407263650-1780) [n:127.0.0.1:35524_solr c:authCollection s:shard2 r:core_node3 x:authCollection_shard2_replica1] o.a.s.c.SolrDeletionPolicy newest commit generation = 1
   [junit4]   2> 239662 INFO  (OldIndexDirectoryCleanupThreadForCore-authCollection_shard2_replica1) [n:127.0.0.1:35524_solr c:authCollection s:shard2 r:core_node3 x:authCollection_shard2_replica1] o.a.s.c.SolrCore Looking for old index directories to cleanup for core authCollection_shard2_replica1 in /export/home/jenkins/workspace/Lucene-Solr-6.x-Solaris/solr/build/solr-core/test/J0/temp/solr.security.BasicAuthIntegrationTest_FBA885795CD87371-001/tempDir-001/node3/./authCollection_shard2_replica1/data/
   [junit4]   2> 239662 WARN  (OldIndexDirectoryCleanupThreadForCore-authCollection_shard2_replica1) [n:127.0.0.1:35524_solr c:authCollection s:shard2 r:core_node3 x:authCollection_shard2_replica1] o.a.s.c.DirectoryFactory /export/home/jenkins/workspace/Lucene-Solr-6.x-Solaris/solr/build/solr-core/test/J0/temp/solr.security.BasicAuthIntegrationTest_FBA885795CD87371-001/tempDir-001/node3/./authCollection_shard2_replica1/data/ does not point to a valid data directory; skipping clean-up of old index directories.
   [junit4]   2> 239663 INFO  (qtp195510783-1763) [n:127.0.0.1:33037_solr c:authCollection s:shard3 r:core_node2 x:authCollection_shard3_replica1] o.a.s.h.l.XMLLoader xsltCacheLifetimeSeconds=60
   [junit4]   2> 239663 INFO  (qtp955950096-1783) [n:127.0.0.1:44380_solr c:authCollection s:shard1 r:core_node1 x:authCollection_shard1_replica1] o.a.s.h.l.XMLLoader xsltCacheLifetimeSeconds=60
   [junit4]   2> 239664 INFO  (qtp195510783-1763) [n:127.0.0.1:33037_solr c:authCollection s:shard3 r:core_node2 x:authCollection_shard3_replica1] o.a.s.h.l.XMLLoader xsltCacheLifetimeSeconds=60
   [junit4]   2> 239665 INFO  (qtp1407263650-1780) [n:127.0.0.1:35524_solr c:authCollection s:shard2 r:core_node3 x:authCollection_shard2_replica1] o.a.s.c.SolrCore no updateRequestProcessorChain defined as default, creating implicit default
   [junit4]   2> 239666 INFO  (qtp195510783-1763) [n:127.0.0.1:33037_solr c:authCollection s:shard3 r:core_node2 x:authCollection_shard3_replica1] o.a.s.h.l.XMLLoader xsltCacheLifetimeSeconds=60
   [junit4]   2> 239666 INFO  (qtp1407263650-1780) [n:127.0.0.1:35524_solr c:authCollection s:shard2 r:core_node3 x:authCollection_shard2_replica1] o.a.s.h.l.XMLLoader xsltCacheLifetimeSeconds=60
   [junit4]   2> 239668 INFO  (qtp1407263650-1780) [n:127.0.0.1:35524_solr c:authCollection s:shard2 r:core_node

[...truncated too long message...]

e: [WatchedEvent state:SyncConnected type:NodeChildrenChanged path:/live_nodes], has occurred - updating... (live nodes size: [3])
   [junit4]   2> 243655 INFO  (jetty-launcher-282-thread-2) [    ] o.e.j.s.h.ContextHandler Stopped o.e.j.s.ServletContextHandler@78fd267c{/solr,null,UNAVAILABLE}
   [junit4]   2> 243655 ERROR (jetty-launcher-282-thread-3-EventThread) [n:127.0.0.1:44380_solr    ] o.a.z.ClientCnxn Error while calling watcher 
   [junit4]   2> java.util.concurrent.RejectedExecutionException: Task org.apache.solr.common.util.ExecutorUtil$MDCAwareThreadPoolExecutor$$Lambda$49/304828500@7cae29e3 rejected from org.apache.solr.common.util.ExecutorUtil$MDCAwareThreadPoolExecutor@39acb812[Terminated, pool size = 0, active threads = 0, queued tasks = 0, completed tasks = 17]
   [junit4]   2> 	at java.util.concurrent.ThreadPoolExecutor$AbortPolicy.rejectedExecution(ThreadPoolExecutor.java:2047)
   [junit4]   2> 	at java.util.concurrent.ThreadPoolExecutor.reject(ThreadPoolExecutor.java:823)
   [junit4]   2> 	at java.util.concurrent.ThreadPoolExecutor.execute(ThreadPoolExecutor.java:1369)
   [junit4]   2> 	at org.apache.solr.common.util.ExecutorUtil$MDCAwareThreadPoolExecutor.execute(ExecutorUtil.java:214)
   [junit4]   2> 	at java.util.concurrent.AbstractExecutorService.submit(AbstractExecutorService.java:112)
   [junit4]   2> 	at org.apache.solr.common.cloud.SolrZkClient$3.process(SolrZkClient.java:266)
   [junit4]   2> 	at org.apache.zookeeper.ClientCnxn$EventThread.processEvent(ClientCnxn.java:522)
   [junit4]   2> 	at org.apache.zookeeper.ClientCnxn$EventThread.run(ClientCnxn.java:498)
   [junit4]   2> 243663 INFO  (zkCallback-298-thread-3-processing-n:127.0.0.1:35524_solr) [n:127.0.0.1:35524_solr    ] o.a.s.c.c.ZkStateReader Updated live nodes from ZooKeeper... (3) -> (2)
   [junit4]   2> 243669 INFO  (zkCallback-310-thread-1-processing-n:127.0.0.1:33037_solr) [n:127.0.0.1:33037_solr    ] o.a.s.c.c.ZkStateReader Updated live nodes from ZooKeeper... (3) -> (2)
   [junit4]   2> 243670 INFO  (zkCallback-310-thread-1-processing-n:127.0.0.1:33037_solr) [n:127.0.0.1:33037_solr    ] o.a.s.c.c.ZkStateReader A live node change: [WatchedEvent state:SyncConnected type:NodeChildrenChanged path:/live_nodes], has occurred - updating... (live nodes size: [2])
   [junit4]   2> 243670 INFO  (zkCallback-298-thread-3-processing-n:127.0.0.1:35524_solr) [n:127.0.0.1:35524_solr    ] o.a.s.c.c.ZkStateReader A live node change: [WatchedEvent state:SyncConnected type:NodeChildrenChanged path:/live_nodes], has occurred - updating... (live nodes size: [2])
   [junit4]   2> 243672 INFO  (jetty-launcher-282-thread-3) [    ] o.a.s.c.Overseer Overseer (id=96557851057061897-127.0.0.1:35524_solr-n_0000000000) closing
   [junit4]   2> 243673 INFO  (OverseerStateUpdate-96557851057061897-127.0.0.1:35524_solr-n_0000000000) [n:127.0.0.1:35524_solr    ] o.a.s.c.Overseer Overseer Loop exiting : 127.0.0.1:35524_solr
   [junit4]   2> 243675 INFO  (zkCallback-298-thread-3-processing-n:127.0.0.1:35524_solr) [n:127.0.0.1:35524_solr    ] o.a.s.c.c.ZkStateReader Updated live nodes from ZooKeeper... (2) -> (1)
   [junit4]   2> 243677 ERROR (jetty-launcher-282-thread-2-EventThread) [n:127.0.0.1:35524_solr    ] o.a.z.ClientCnxn Error while calling watcher 
   [junit4]   2> java.util.concurrent.RejectedExecutionException: Task org.apache.solr.common.util.ExecutorUtil$MDCAwareThreadPoolExecutor$$Lambda$49/304828500@23a4f26d rejected from org.apache.solr.common.util.ExecutorUtil$MDCAwareThreadPoolExecutor@3f3b86d7[Shutting down, pool size = 1, active threads = 0, queued tasks = 0, completed tasks = 97]
   [junit4]   2> 	at java.util.concurrent.ThreadPoolExecutor$AbortPolicy.rejectedExecution(ThreadPoolExecutor.java:2047)
   [junit4]   2> 	at java.util.concurrent.ThreadPoolExecutor.reject(ThreadPoolExecutor.java:823)
   [junit4]   2> 	at java.util.concurrent.ThreadPoolExecutor.execute(ThreadPoolExecutor.java:1369)
   [junit4]   2> 	at org.apache.solr.common.util.ExecutorUtil$MDCAwareThreadPoolExecutor.execute(ExecutorUtil.java:214)
   [junit4]   2> 	at java.util.concurrent.AbstractExecutorService.submit(AbstractExecutorService.java:112)
   [junit4]   2> 	at org.apache.solr.common.cloud.SolrZkClient$3.process(SolrZkClient.java:266)
   [junit4]   2> 	at org.apache.zookeeper.ClientCnxn$EventThread.processEvent(ClientCnxn.java:522)
   [junit4]   2> 	at org.apache.zookeeper.ClientCnxn$EventThread.run(ClientCnxn.java:498)
   [junit4]   2> 243679 INFO  (jetty-launcher-282-thread-3) [    ] o.e.j.s.h.ContextHandler Stopped o.e.j.s.ServletContextHandler@31542d5c{/solr,null,UNAVAILABLE}
   [junit4]   2> 245167 WARN  (zkCallback-310-thread-2-processing-n:127.0.0.1:33037_solr) [n:127.0.0.1:33037_solr    ] o.a.s.c.LeaderElector 
   [junit4]   2> org.apache.zookeeper.KeeperException$SessionExpiredException: KeeperErrorCode = Session expired for /overseer_elect/election/96557851057061897-127.0.0.1:35524_solr-n_0000000000
   [junit4]   2> 	at org.apache.zookeeper.KeeperException.create(KeeperException.java:127)
   [junit4]   2> 	at org.apache.zookeeper.KeeperException.create(KeeperException.java:51)
   [junit4]   2> 	at org.apache.zookeeper.ZooKeeper.getData(ZooKeeper.java:1155)
   [junit4]   2> 	at org.apache.solr.common.cloud.SolrZkClient$7.execute(SolrZkClient.java:348)
   [junit4]   2> 	at org.apache.solr.common.cloud.SolrZkClient$7.execute(SolrZkClient.java:345)
   [junit4]   2> 	at org.apache.solr.common.cloud.ZkCmdExecutor.retryOperation(ZkCmdExecutor.java:60)
   [junit4]   2> 	at org.apache.solr.common.cloud.SolrZkClient.getData(SolrZkClient.java:345)
   [junit4]   2> 	at org.apache.solr.cloud.LeaderElector.checkIfIamLeader(LeaderElector.java:152)
   [junit4]   2> 	at org.apache.solr.cloud.LeaderElector.access$200(LeaderElector.java:56)
   [junit4]   2> 	at org.apache.solr.cloud.LeaderElector$ElectionWatcher.process(LeaderElector.java:348)
   [junit4]   2> 	at org.apache.solr.common.cloud.SolrZkClient$3.lambda$process$0(SolrZkClient.java:266)
   [junit4]   2> 	at java.util.concurrent.Executors$RunnableAdapter.call(Executors.java:511)
   [junit4]   2> 	at java.util.concurrent.FutureTask.run(FutureTask.java:266)
   [junit4]   2> 	at org.apache.solr.common.util.ExecutorUtil$MDCAwareThreadPoolExecutor.lambda$execute$0(ExecutorUtil.java:229)
   [junit4]   2> 	at java.util.concurrent.ThreadPoolExecutor.runWorker(ThreadPoolExecutor.java:1142)
   [junit4]   2> 	at java.util.concurrent.ThreadPoolExecutor$Worker.run(ThreadPoolExecutor.java:617)
   [junit4]   2> 	at java.lang.Thread.run(Thread.java:745)
   [junit4]   2> 245172 WARN  (zkCallback-310-thread-1-processing-n:127.0.0.1:33037_solr) [n:127.0.0.1:33037_solr    ] o.a.s.c.c.ZkStateReader ZooKeeper watch triggered, but Solr cannot talk to ZK: [KeeperErrorCode = Session expired for /live_nodes]
   [junit4]   2> 245173 INFO  (jetty-launcher-282-thread-1) [    ] o.e.j.s.h.ContextHandler Stopped o.e.j.s.ServletContextHandler@30251de5{/solr,null,UNAVAILABLE}
   [junit4]   2> 245177 INFO  (SUITE-BasicAuthIntegrationTest-seed#[FBA885795CD87371]-worker) [    ] o.a.s.c.ZkTestServer connecting to 127.0.0.1:57888 57888
   [junit4]   2> 245222 INFO  (Thread-355) [    ] o.a.s.c.ZkTestServer connecting to 127.0.0.1:57888 57888
   [junit4]   2> 245224 WARN  (Thread-355) [    ] o.a.s.c.ZkTestServer Watch limit violations: 
   [junit4]   2> Maximum concurrent create/delete watches above limit:
   [junit4]   2> 
   [junit4]   2> 	5	/solr/aliases.json
   [junit4]   2> 	4	/solr/security.json
   [junit4]   2> 	4	/solr/configs/conf
   [junit4]   2> 
   [junit4]   2> Maximum concurrent data watches above limit:
   [junit4]   2> 
   [junit4]   2> 	5	/solr/clusterstate.json
   [junit4]   2> 	5	/solr/clusterprops.json
   [junit4]   2> 	4	/solr/collections/authCollection/state.json
   [junit4]   2> 	2	/solr/overseer_elect/election/96557851057061896-127.0.0.1:44380_solr-n_0000000001
   [junit4]   2> 
   [junit4]   2> Maximum concurrent children watches above limit:
   [junit4]   2> 
   [junit4]   2> 	16	/solr/overseer/queue
   [junit4]   2> 	5	/solr/collections
   [junit4]   2> 	5	/solr/overseer/collection-queue-work
   [junit4]   2> 	4	/solr/live_nodes
   [junit4]   2> 	4	/solr/overseer/queue-work
   [junit4]   2> 
   [junit4]   2> 245225 INFO  (SUITE-BasicAuthIntegrationTest-seed#[FBA885795CD87371]-worker) [    ] o.a.s.SolrTestCaseJ4 ###deleteCore
   [junit4]   2> NOTE: leaving temporary files on disk at: /export/home/jenkins/workspace/Lucene-Solr-6.x-Solaris/solr/build/solr-core/test/J0/temp/solr.security.BasicAuthIntegrationTest_FBA885795CD87371-001
   [junit4]   2> Sep 08, 2016 5:31:29 PM com.carrotsearch.randomizedtesting.ThreadLeakControl checkThreadLeaks
   [junit4]   2> WARNING: Will linger awaiting termination of 1 leaked thread(s).
   [junit4]   2> NOTE: test params are: codec=HighCompressionCompressingStoredFields(storedFieldsFormat=CompressingStoredFieldsFormat(compressionMode=HIGH_COMPRESSION, chunkSize=20709, maxDocsPerChunk=731, blockSize=1), termVectorsFormat=CompressingTermVectorsFormat(compressionMode=HIGH_COMPRESSION, chunkSize=20709, blockSize=1)), sim=RandomSimilarity(queryNorm=false,coord=no): {}, locale=pt-BR, timezone=America/Santiago
   [junit4]   2> NOTE: SunOS 5.11 amd64/Oracle Corporation 1.8.0_102 (64-bit)/cpus=3,threads=1,free=225776808,total=444596224
   [junit4]   2> NOTE: All tests run in this JVM: [TestCollationField, CoreAdminCreateDiscoverTest, TestXIncludeConfig, DistributedSuggestComponentTest, DirectoryFactoryTest, CreateCollectionCleanupTest, CdcrUpdateLogTest, TestSweetSpotSimilarityFactory, XsltUpdateRequestHandlerTest, TestCloudSchemaless, PrimitiveFieldTypeTest, TestGraphMLResponseWriter, ZkCLITest, SolrCoreTest, OutOfBoxZkACLAndCredentialsProvidersTest, BasicDistributedZkTest, RecoveryAfterSoftCommitTest, HardAutoCommitTest, StatelessScriptUpdateProcessorFactoryTest, BasicAuthIntegrationTest]
   [junit4] Completed [55/630 (1!)] on J0 in 8.50s, 1 test, 1 error <<< FAILURES!

[...truncated 62093 lines...]


Mime
View raw message