lucene-dev mailing list archives

Site index · List index
Message view « Date » · « Thread »
Top « Date » · « Thread »
From Policeman Jenkins Server <jenk...@thetaphi.de>
Subject [JENKINS] Lucene-Solr-6.x-Linux (32bit/jdk1.8.0_102) - Build # 1688 - Still Unstable!
Date Fri, 09 Sep 2016 01:09:01 GMT
Build: http://jenkins.thetaphi.de/job/Lucene-Solr-6.x-Linux/1688/
Java: 32bit/jdk1.8.0_102 -server -XX:+UseG1GC

1 tests failed.
FAILED:  org.apache.solr.security.BasicAuthIntegrationTest.testBasicAuth

Error Message:
IOException occured when talking to server at: https://127.0.0.1:39846/solr

Stack Trace:
org.apache.solr.client.solrj.SolrServerException: IOException occured when talking to server at: https://127.0.0.1:39846/solr
	at __randomizedtesting.SeedInfo.seed([AE293A8BA186279C:12474C9905D5A4E6]:0)
	at org.apache.solr.client.solrj.impl.HttpSolrClient.executeMethod(HttpSolrClient.java:606)
	at org.apache.solr.client.solrj.impl.HttpSolrClient.request(HttpSolrClient.java:261)
	at org.apache.solr.client.solrj.impl.HttpSolrClient.request(HttpSolrClient.java:250)
	at org.apache.solr.client.solrj.SolrClient.request(SolrClient.java:1219)
	at org.apache.solr.security.BasicAuthIntegrationTest.testBasicAuth(BasicAuthIntegrationTest.java:157)
	at sun.reflect.NativeMethodAccessorImpl.invoke0(Native Method)
	at sun.reflect.NativeMethodAccessorImpl.invoke(NativeMethodAccessorImpl.java:62)
	at sun.reflect.DelegatingMethodAccessorImpl.invoke(DelegatingMethodAccessorImpl.java:43)
	at java.lang.reflect.Method.invoke(Method.java:498)
	at com.carrotsearch.randomizedtesting.RandomizedRunner.invoke(RandomizedRunner.java:1764)
	at com.carrotsearch.randomizedtesting.RandomizedRunner$8.evaluate(RandomizedRunner.java:871)
	at com.carrotsearch.randomizedtesting.RandomizedRunner$9.evaluate(RandomizedRunner.java:907)
	at com.carrotsearch.randomizedtesting.RandomizedRunner$10.evaluate(RandomizedRunner.java:921)
	at com.carrotsearch.randomizedtesting.rules.SystemPropertiesRestoreRule$1.evaluate(SystemPropertiesRestoreRule.java:57)
	at org.apache.lucene.util.TestRuleSetupTeardownChained$1.evaluate(TestRuleSetupTeardownChained.java:49)
	at org.apache.lucene.util.AbstractBeforeAfterRule$1.evaluate(AbstractBeforeAfterRule.java:45)
	at org.apache.lucene.util.TestRuleThreadAndTestName$1.evaluate(TestRuleThreadAndTestName.java:48)
	at org.apache.lucene.util.TestRuleIgnoreAfterMaxFailures$1.evaluate(TestRuleIgnoreAfterMaxFailures.java:64)
	at org.apache.lucene.util.TestRuleMarkFailure$1.evaluate(TestRuleMarkFailure.java:47)
	at com.carrotsearch.randomizedtesting.rules.StatementAdapter.evaluate(StatementAdapter.java:36)
	at com.carrotsearch.randomizedtesting.ThreadLeakControl$StatementRunner.run(ThreadLeakControl.java:367)
	at com.carrotsearch.randomizedtesting.ThreadLeakControl.forkTimeoutingTask(ThreadLeakControl.java:809)
	at com.carrotsearch.randomizedtesting.ThreadLeakControl$3.evaluate(ThreadLeakControl.java:460)
	at com.carrotsearch.randomizedtesting.RandomizedRunner.runSingleTest(RandomizedRunner.java:880)
	at com.carrotsearch.randomizedtesting.RandomizedRunner$5.evaluate(RandomizedRunner.java:781)
	at com.carrotsearch.randomizedtesting.RandomizedRunner$6.evaluate(RandomizedRunner.java:816)
	at com.carrotsearch.randomizedtesting.RandomizedRunner$7.evaluate(RandomizedRunner.java:827)
	at com.carrotsearch.randomizedtesting.rules.StatementAdapter.evaluate(StatementAdapter.java:36)
	at com.carrotsearch.randomizedtesting.rules.SystemPropertiesRestoreRule$1.evaluate(SystemPropertiesRestoreRule.java:57)
	at org.apache.lucene.util.AbstractBeforeAfterRule$1.evaluate(AbstractBeforeAfterRule.java:45)
	at com.carrotsearch.randomizedtesting.rules.StatementAdapter.evaluate(StatementAdapter.java:36)
	at org.apache.lucene.util.TestRuleStoreClassName$1.evaluate(TestRuleStoreClassName.java:41)
	at com.carrotsearch.randomizedtesting.rules.NoShadowingOrOverridesOnMethodsRule$1.evaluate(NoShadowingOrOverridesOnMethodsRule.java:40)
	at com.carrotsearch.randomizedtesting.rules.NoShadowingOrOverridesOnMethodsRule$1.evaluate(NoShadowingOrOverridesOnMethodsRule.java:40)
	at com.carrotsearch.randomizedtesting.rules.StatementAdapter.evaluate(StatementAdapter.java:36)
	at com.carrotsearch.randomizedtesting.rules.StatementAdapter.evaluate(StatementAdapter.java:36)
	at com.carrotsearch.randomizedtesting.rules.StatementAdapter.evaluate(StatementAdapter.java:36)
	at org.apache.lucene.util.TestRuleAssertionsRequired$1.evaluate(TestRuleAssertionsRequired.java:53)
	at org.apache.lucene.util.TestRuleMarkFailure$1.evaluate(TestRuleMarkFailure.java:47)
	at org.apache.lucene.util.TestRuleIgnoreAfterMaxFailures$1.evaluate(TestRuleIgnoreAfterMaxFailures.java:64)
	at org.apache.lucene.util.TestRuleIgnoreTestSuites$1.evaluate(TestRuleIgnoreTestSuites.java:54)
	at com.carrotsearch.randomizedtesting.rules.StatementAdapter.evaluate(StatementAdapter.java:36)
	at com.carrotsearch.randomizedtesting.ThreadLeakControl$StatementRunner.run(ThreadLeakControl.java:367)
	at java.lang.Thread.run(Thread.java:745)
Caused by: javax.net.ssl.SSLHandshakeException: sun.security.validator.ValidatorException: PKIX path building failed: sun.security.provider.certpath.SunCertPathBuilderException: unable to find valid certification path to requested target
	at sun.security.ssl.Alerts.getSSLException(Alerts.java:192)
	at sun.security.ssl.SSLSocketImpl.fatal(SSLSocketImpl.java:1949)
	at sun.security.ssl.Handshaker.fatalSE(Handshaker.java:302)
	at sun.security.ssl.Handshaker.fatalSE(Handshaker.java:296)
	at sun.security.ssl.ClientHandshaker.serverCertificate(ClientHandshaker.java:1509)
	at sun.security.ssl.ClientHandshaker.processMessage(ClientHandshaker.java:216)
	at sun.security.ssl.Handshaker.processLoop(Handshaker.java:979)
	at sun.security.ssl.Handshaker.process_record(Handshaker.java:914)
	at sun.security.ssl.SSLSocketImpl.readRecord(SSLSocketImpl.java:1062)
	at sun.security.ssl.SSLSocketImpl.performInitialHandshake(SSLSocketImpl.java:1375)
	at sun.security.ssl.SSLSocketImpl.startHandshake(SSLSocketImpl.java:1403)
	at sun.security.ssl.SSLSocketImpl.startHandshake(SSLSocketImpl.java:1387)
	at org.apache.http.conn.ssl.SSLSocketFactory.connectSocket(SSLSocketFactory.java:543)
	at org.apache.http.conn.ssl.SSLSocketFactory.connectSocket(SSLSocketFactory.java:409)
	at org.apache.http.impl.conn.DefaultClientConnectionOperator.openConnection(DefaultClientConnectionOperator.java:177)
	at org.apache.http.impl.conn.ManagedClientConnectionImpl.open(ManagedClientConnectionImpl.java:304)
	at org.apache.http.impl.client.DefaultRequestDirector.tryConnect(DefaultRequestDirector.java:611)
	at org.apache.http.impl.client.DefaultRequestDirector.execute(DefaultRequestDirector.java:446)
	at org.apache.http.impl.client.AbstractHttpClient.doExecute(AbstractHttpClient.java:882)
	at org.apache.http.impl.client.CloseableHttpClient.execute(CloseableHttpClient.java:82)
	at org.apache.http.impl.client.CloseableHttpClient.execute(CloseableHttpClient.java:107)
	at org.apache.http.impl.client.CloseableHttpClient.execute(CloseableHttpClient.java:55)
	at org.apache.solr.client.solrj.impl.HttpSolrClient.executeMethod(HttpSolrClient.java:497)
	... 43 more
Caused by: sun.security.validator.ValidatorException: PKIX path building failed: sun.security.provider.certpath.SunCertPathBuilderException: unable to find valid certification path to requested target
	at sun.security.validator.PKIXValidator.doBuild(PKIXValidator.java:387)
	at sun.security.validator.PKIXValidator.engineValidate(PKIXValidator.java:292)
	at sun.security.validator.Validator.validate(Validator.java:260)
	at sun.security.ssl.X509TrustManagerImpl.validate(X509TrustManagerImpl.java:324)
	at sun.security.ssl.X509TrustManagerImpl.checkTrusted(X509TrustManagerImpl.java:229)
	at sun.security.ssl.X509TrustManagerImpl.checkServerTrusted(X509TrustManagerImpl.java:124)
	at sun.security.ssl.ClientHandshaker.serverCertificate(ClientHandshaker.java:1491)
	... 61 more
Caused by: sun.security.provider.certpath.SunCertPathBuilderException: unable to find valid certification path to requested target
	at sun.security.provider.certpath.SunCertPathBuilder.build(SunCertPathBuilder.java:141)
	at sun.security.provider.certpath.SunCertPathBuilder.engineBuild(SunCertPathBuilder.java:126)
	at java.security.cert.CertPathBuilder.build(CertPathBuilder.java:280)
	at sun.security.validator.PKIXValidator.doBuild(PKIXValidator.java:382)
	... 67 more




Build Log:
[...truncated 10970 lines...]
   [junit4] Suite: org.apache.solr.security.BasicAuthIntegrationTest
   [junit4]   2> Creating dataDir: /home/jenkins/workspace/Lucene-Solr-6.x-Linux/solr/build/solr-core/test/J2/temp/solr.security.BasicAuthIntegrationTest_AE293A8BA186279C-001/init-core-data-001
   [junit4]   2> 356903 INFO  (SUITE-BasicAuthIntegrationTest-seed#[AE293A8BA186279C]-worker) [    ] o.a.s.SolrTestCaseJ4 Randomized ssl (true) and clientAuth (true) via: @org.apache.solr.util.RandomizeSSL(reason=, ssl=NaN, value=NaN, clientAuth=NaN)
   [junit4]   2> 356905 INFO  (SUITE-BasicAuthIntegrationTest-seed#[AE293A8BA186279C]-worker) [    ] o.a.s.c.ZkTestServer STARTING ZK TEST SERVER
   [junit4]   2> 356906 INFO  (Thread-618) [    ] o.a.s.c.ZkTestServer client port:0.0.0.0/0.0.0.0:0
   [junit4]   2> 356906 INFO  (Thread-618) [    ] o.a.s.c.ZkTestServer Starting server
   [junit4]   2> 357006 INFO  (SUITE-BasicAuthIntegrationTest-seed#[AE293A8BA186279C]-worker) [    ] o.a.s.c.ZkTestServer start zk server on port:44692
   [junit4]   2> 357006 INFO  (SUITE-BasicAuthIntegrationTest-seed#[AE293A8BA186279C]-worker) [    ] o.a.s.c.c.SolrZkClient Using default ZkCredentialsProvider
   [junit4]   2> 357006 INFO  (SUITE-BasicAuthIntegrationTest-seed#[AE293A8BA186279C]-worker) [    ] o.a.s.c.c.ConnectionManager Waiting for client to connect to ZooKeeper
   [junit4]   2> 357013 INFO  (zkCallback-482-thread-1) [    ] o.a.s.c.c.ConnectionManager Watcher org.apache.solr.common.cloud.ConnectionManager@15ac417 name:ZooKeeperConnection Watcher:127.0.0.1:44692 got event WatchedEvent state:SyncConnected type:None path:null path:null type:None
   [junit4]   2> 357013 INFO  (SUITE-BasicAuthIntegrationTest-seed#[AE293A8BA186279C]-worker) [    ] o.a.s.c.c.ConnectionManager Client is connected to ZooKeeper
   [junit4]   2> 357013 INFO  (SUITE-BasicAuthIntegrationTest-seed#[AE293A8BA186279C]-worker) [    ] o.a.s.c.c.SolrZkClient Using default ZkACLProvider
   [junit4]   2> 357013 INFO  (SUITE-BasicAuthIntegrationTest-seed#[AE293A8BA186279C]-worker) [    ] o.a.s.c.c.SolrZkClient makePath: /solr/solr.xml
   [junit4]   2> 357015 INFO  (SUITE-BasicAuthIntegrationTest-seed#[AE293A8BA186279C]-worker) [    ] o.a.s.c.c.SolrZkClient makePath: /solr/clusterprops.json
   [junit4]   2> 357018 INFO  (jetty-launcher-481-thread-1) [    ] o.e.j.s.Server jetty-9.3.8.v20160314
   [junit4]   2> 357018 INFO  (jetty-launcher-481-thread-1) [    ] o.e.j.s.h.ContextHandler Started o.e.j.s.ServletContextHandler@159af0d{/solr,null,AVAILABLE}
   [junit4]   2> 357019 INFO  (jetty-launcher-481-thread-2) [    ] o.e.j.s.Server jetty-9.3.8.v20160314
   [junit4]   2> 357019 INFO  (jetty-launcher-481-thread-3) [    ] o.e.j.s.Server jetty-9.3.8.v20160314
   [junit4]   2> 357020 INFO  (jetty-launcher-481-thread-2) [    ] o.e.j.s.h.ContextHandler Started o.e.j.s.ServletContextHandler@16a0cb2{/solr,null,AVAILABLE}
   [junit4]   2> 357020 INFO  (jetty-launcher-481-thread-3) [    ] o.e.j.s.h.ContextHandler Started o.e.j.s.ServletContextHandler@f2cdba{/solr,null,AVAILABLE}
   [junit4]   2> 357020 INFO  (jetty-launcher-481-thread-1) [    ] o.e.j.s.ServerConnector Started ServerConnector@1c722a{SSL,[ssl, http/1.1]}{127.0.0.1:40609}
   [junit4]   2> 357021 INFO  (jetty-launcher-481-thread-1) [    ] o.e.j.s.Server Started @359558ms
   [junit4]   2> 357021 INFO  (jetty-launcher-481-thread-1) [    ] o.a.s.c.s.e.JettySolrRunner Jetty properties: {hostContext=/solr, hostPort=40609}
   [junit4]   2> 357021 INFO  (jetty-launcher-481-thread-1) [    ] o.a.s.s.SolrDispatchFilter SolrDispatchFilter.init(): sun.misc.Launcher$AppClassLoader@1d16e93
   [junit4]   2> 357021 INFO  (jetty-launcher-481-thread-1) [    ] o.a.s.c.SolrResourceLoader new SolrResourceLoader for directory: '/home/jenkins/workspace/Lucene-Solr-6.x-Linux/solr/build/solr-core/test/J2/temp/solr.security.BasicAuthIntegrationTest_AE293A8BA186279C-001/tempDir-001/node1'
   [junit4]   2> 357021 INFO  (jetty-launcher-481-thread-1) [    ] o.a.s.c.SolrResourceLoader JNDI not configured for solr (NoInitialContextEx)
   [junit4]   2> 357021 INFO  (jetty-launcher-481-thread-1) [    ] o.a.s.c.SolrResourceLoader solr home defaulted to 'solr/' (could not find system property or JNDI)
   [junit4]   2> 357021 INFO  (jetty-launcher-481-thread-1) [    ] o.a.s.c.c.SolrZkClient Using default ZkCredentialsProvider
   [junit4]   2> 357022 INFO  (jetty-launcher-481-thread-1) [    ] o.a.s.c.c.ConnectionManager Waiting for client to connect to ZooKeeper
   [junit4]   2> 357022 INFO  (jetty-launcher-481-thread-3) [    ] o.e.j.s.ServerConnector Started ServerConnector@23266e{SSL,[ssl, http/1.1]}{127.0.0.1:39509}
   [junit4]   2> 357023 INFO  (zkCallback-483-thread-1) [    ] o.a.s.c.c.ConnectionManager Watcher org.apache.solr.common.cloud.ConnectionManager@400d1a name:ZooKeeperConnection Watcher:127.0.0.1:44692/solr got event WatchedEvent state:SyncConnected type:None path:null path:null type:None
   [junit4]   2> 357023 INFO  (jetty-launcher-481-thread-2) [    ] o.e.j.s.ServerConnector Started ServerConnector@1bcdd88{SSL,[ssl, http/1.1]}{127.0.0.1:39846}
   [junit4]   2> 357026 INFO  (jetty-launcher-481-thread-1) [    ] o.a.s.c.c.ConnectionManager Client is connected to ZooKeeper
   [junit4]   2> 357026 INFO  (jetty-launcher-481-thread-2) [    ] o.e.j.s.Server Started @359564ms
   [junit4]   2> 357025 INFO  (jetty-launcher-481-thread-3) [    ] o.e.j.s.Server Started @359563ms
   [junit4]   2> 357026 INFO  (jetty-launcher-481-thread-2) [    ] o.a.s.c.s.e.JettySolrRunner Jetty properties: {hostContext=/solr, hostPort=39846}
   [junit4]   2> 357026 INFO  (jetty-launcher-481-thread-3) [    ] o.a.s.c.s.e.JettySolrRunner Jetty properties: {hostContext=/solr, hostPort=39509}
   [junit4]   2> 357026 INFO  (jetty-launcher-481-thread-1) [    ] o.a.s.c.c.SolrZkClient Using default ZkACLProvider
   [junit4]   2> 357026 INFO  (jetty-launcher-481-thread-2) [    ] o.a.s.s.SolrDispatchFilter SolrDispatchFilter.init(): sun.misc.Launcher$AppClassLoader@1d16e93
   [junit4]   2> 357026 INFO  (jetty-launcher-481-thread-3) [    ] o.a.s.s.SolrDispatchFilter SolrDispatchFilter.init(): sun.misc.Launcher$AppClassLoader@1d16e93
   [junit4]   2> 357027 INFO  (jetty-launcher-481-thread-2) [    ] o.a.s.c.SolrResourceLoader new SolrResourceLoader for directory: '/home/jenkins/workspace/Lucene-Solr-6.x-Linux/solr/build/solr-core/test/J2/temp/solr.security.BasicAuthIntegrationTest_AE293A8BA186279C-001/tempDir-001/node2'
   [junit4]   2> 357027 INFO  (jetty-launcher-481-thread-3) [    ] o.a.s.c.SolrResourceLoader new SolrResourceLoader for directory: '/home/jenkins/workspace/Lucene-Solr-6.x-Linux/solr/build/solr-core/test/J2/temp/solr.security.BasicAuthIntegrationTest_AE293A8BA186279C-001/tempDir-001/node3'
   [junit4]   2> 357027 INFO  (jetty-launcher-481-thread-1) [    ] o.a.s.s.SolrDispatchFilter solr.xml found in ZooKeeper. Loading...
   [junit4]   2> 357027 INFO  (jetty-launcher-481-thread-2) [    ] o.a.s.c.SolrResourceLoader JNDI not configured for solr (NoInitialContextEx)
   [junit4]   2> 357027 INFO  (jetty-launcher-481-thread-3) [    ] o.a.s.c.SolrResourceLoader JNDI not configured for solr (NoInitialContextEx)
   [junit4]   2> 357027 INFO  (jetty-launcher-481-thread-2) [    ] o.a.s.c.SolrResourceLoader solr home defaulted to 'solr/' (could not find system property or JNDI)
   [junit4]   2> 357027 INFO  (jetty-launcher-481-thread-3) [    ] o.a.s.c.SolrResourceLoader solr home defaulted to 'solr/' (could not find system property or JNDI)
   [junit4]   2> 357027 INFO  (jetty-launcher-481-thread-2) [    ] o.a.s.c.c.SolrZkClient Using default ZkCredentialsProvider
   [junit4]   2> 357027 INFO  (jetty-launcher-481-thread-3) [    ] o.a.s.c.c.SolrZkClient Using default ZkCredentialsProvider
   [junit4]   2> 357027 INFO  (jetty-launcher-481-thread-2) [    ] o.a.s.c.c.ConnectionManager Waiting for client to connect to ZooKeeper
   [junit4]   2> 357028 INFO  (jetty-launcher-481-thread-3) [    ] o.a.s.c.c.ConnectionManager Waiting for client to connect to ZooKeeper
   [junit4]   2> 357028 INFO  (zkCallback-484-thread-1) [    ] o.a.s.c.c.ConnectionManager Watcher org.apache.solr.common.cloud.ConnectionManager@1682c5b name:ZooKeeperConnection Watcher:127.0.0.1:44692/solr got event WatchedEvent state:SyncConnected type:None path:null path:null type:None
   [junit4]   2> 357028 INFO  (jetty-launcher-481-thread-2) [    ] o.a.s.c.c.ConnectionManager Client is connected to ZooKeeper
   [junit4]   2> 357029 INFO  (jetty-launcher-481-thread-2) [    ] o.a.s.c.c.SolrZkClient Using default ZkACLProvider
   [junit4]   2> 357029 INFO  (zkCallback-485-thread-1) [    ] o.a.s.c.c.ConnectionManager Watcher org.apache.solr.common.cloud.ConnectionManager@11bf3db name:ZooKeeperConnection Watcher:127.0.0.1:44692/solr got event WatchedEvent state:SyncConnected type:None path:null path:null type:None
   [junit4]   2> 357030 INFO  (jetty-launcher-481-thread-3) [    ] o.a.s.c.c.ConnectionManager Client is connected to ZooKeeper
   [junit4]   2> 357030 INFO  (jetty-launcher-481-thread-3) [    ] o.a.s.c.c.SolrZkClient Using default ZkACLProvider
   [junit4]   2> 357030 INFO  (jetty-launcher-481-thread-3) [    ] o.a.s.s.SolrDispatchFilter solr.xml found in ZooKeeper. Loading...
   [junit4]   2> 357031 INFO  (jetty-launcher-481-thread-2) [    ] o.a.s.s.SolrDispatchFilter solr.xml found in ZooKeeper. Loading...
   [junit4]   2> 357048 INFO  (jetty-launcher-481-thread-3) [    ] o.a.s.c.CorePropertiesLocator Config-defined core root directory: /home/jenkins/workspace/Lucene-Solr-6.x-Linux/solr/build/solr-core/test/J2/temp/solr.security.BasicAuthIntegrationTest_AE293A8BA186279C-001/tempDir-001/node3/.
   [junit4]   2> 357048 INFO  (jetty-launcher-481-thread-1) [    ] o.a.s.c.CorePropertiesLocator Config-defined core root directory: /home/jenkins/workspace/Lucene-Solr-6.x-Linux/solr/build/solr-core/test/J2/temp/solr.security.BasicAuthIntegrationTest_AE293A8BA186279C-001/tempDir-001/node1/.
   [junit4]   2> 357048 INFO  (jetty-launcher-481-thread-2) [    ] o.a.s.c.CorePropertiesLocator Config-defined core root directory: /home/jenkins/workspace/Lucene-Solr-6.x-Linux/solr/build/solr-core/test/J2/temp/solr.security.BasicAuthIntegrationTest_AE293A8BA186279C-001/tempDir-001/node2/.
   [junit4]   2> 357048 INFO  (jetty-launcher-481-thread-1) [    ] o.a.s.c.CoreContainer New CoreContainer 32679368
   [junit4]   2> 357048 WARN  (NIOServerCxn.Factory:0.0.0.0/0.0.0.0:0) [    ] o.a.z.s.NIOServerCnxn caught end of stream exception
   [junit4]   2> EndOfStreamException: Unable to read additional data from client sessionid 0x1570c531e220003, likely client has closed socket
   [junit4]   2> 	at org.apache.zookeeper.server.NIOServerCnxn.doIO(NIOServerCnxn.java:228)
   [junit4]   2> 	at org.apache.zookeeper.server.NIOServerCnxnFactory.run(NIOServerCnxnFactory.java:208)
   [junit4]   2> 	at java.lang.Thread.run(Thread.java:745)
   [junit4]   2> 357048 INFO  (jetty-launcher-481-thread-2) [    ] o.a.s.c.CoreContainer New CoreContainer 27040623
   [junit4]   2> 357048 INFO  (jetty-launcher-481-thread-1) [    ] o.a.s.c.CoreContainer Loading cores into CoreContainer [instanceDir=/home/jenkins/workspace/Lucene-Solr-6.x-Linux/solr/build/solr-core/test/J2/temp/solr.security.BasicAuthIntegrationTest_AE293A8BA186279C-001/tempDir-001/node1]
   [junit4]   2> 357049 INFO  (jetty-launcher-481-thread-2) [    ] o.a.s.c.CoreContainer Loading cores into CoreContainer [instanceDir=/home/jenkins/workspace/Lucene-Solr-6.x-Linux/solr/build/solr-core/test/J2/temp/solr.security.BasicAuthIntegrationTest_AE293A8BA186279C-001/tempDir-001/node2]
   [junit4]   2> 357048 INFO  (jetty-launcher-481-thread-3) [    ] o.a.s.c.CoreContainer New CoreContainer 18655756
   [junit4]   2> 357049 INFO  (jetty-launcher-481-thread-3) [    ] o.a.s.c.CoreContainer Loading cores into CoreContainer [instanceDir=/home/jenkins/workspace/Lucene-Solr-6.x-Linux/solr/build/solr-core/test/J2/temp/solr.security.BasicAuthIntegrationTest_AE293A8BA186279C-001/tempDir-001/node3]
   [junit4]   2> 357049 WARN  (jetty-launcher-481-thread-1) [    ] o.a.s.c.CoreContainer Couldn't add files from /home/jenkins/workspace/Lucene-Solr-6.x-Linux/solr/build/solr-core/test/J2/temp/solr.security.BasicAuthIntegrationTest_AE293A8BA186279C-001/tempDir-001/node1/lib to classpath: /home/jenkins/workspace/Lucene-Solr-6.x-Linux/solr/build/solr-core/test/J2/temp/solr.security.BasicAuthIntegrationTest_AE293A8BA186279C-001/tempDir-001/node1/lib
   [junit4]   2> 357049 WARN  (jetty-launcher-481-thread-2) [    ] o.a.s.c.CoreContainer Couldn't add files from /home/jenkins/workspace/Lucene-Solr-6.x-Linux/solr/build/solr-core/test/J2/temp/solr.security.BasicAuthIntegrationTest_AE293A8BA186279C-001/tempDir-001/node2/lib to classpath: /home/jenkins/workspace/Lucene-Solr-6.x-Linux/solr/build/solr-core/test/J2/temp/solr.security.BasicAuthIntegrationTest_AE293A8BA186279C-001/tempDir-001/node2/lib
   [junit4]   2> 357049 WARN  (jetty-launcher-481-thread-3) [    ] o.a.s.c.CoreContainer Couldn't add files from /home/jenkins/workspace/Lucene-Solr-6.x-Linux/solr/build/solr-core/test/J2/temp/solr.security.BasicAuthIntegrationTest_AE293A8BA186279C-001/tempDir-001/node3/lib to classpath: /home/jenkins/workspace/Lucene-Solr-6.x-Linux/solr/build/solr-core/test/J2/temp/solr.security.BasicAuthIntegrationTest_AE293A8BA186279C-001/tempDir-001/node3/lib
   [junit4]   2> 357049 INFO  (jetty-launcher-481-thread-1) [    ] o.a.s.h.c.HttpShardHandlerFactory created with socketTimeout : 90000,urlScheme : https,connTimeout : 15000,maxConnectionsPerHost : 20,maxConnections : 10000,corePoolSize : 0,maximumPoolSize : 2147483647,maxThreadIdleTime : 5,sizeOfQueue : -1,fairnessPolicy : false,useRetries : false,connectionsEvictorSleepDelay : 5000,maxConnectionIdleTime : 40000,
   [junit4]   2> 357049 INFO  (jetty-launcher-481-thread-2) [    ] o.a.s.h.c.HttpShardHandlerFactory created with socketTimeout : 90000,urlScheme : https,connTimeout : 15000,maxConnectionsPerHost : 20,maxConnections : 10000,corePoolSize : 0,maximumPoolSize : 2147483647,maxThreadIdleTime : 5,sizeOfQueue : -1,fairnessPolicy : false,useRetries : false,connectionsEvictorSleepDelay : 5000,maxConnectionIdleTime : 40000,
   [junit4]   2> 357049 INFO  (jetty-launcher-481-thread-3) [    ] o.a.s.h.c.HttpShardHandlerFactory created with socketTimeout : 90000,urlScheme : https,connTimeout : 15000,maxConnectionsPerHost : 20,maxConnections : 10000,corePoolSize : 0,maximumPoolSize : 2147483647,maxThreadIdleTime : 5,sizeOfQueue : -1,fairnessPolicy : false,useRetries : false,connectionsEvictorSleepDelay : 5000,maxConnectionIdleTime : 40000,
   [junit4]   2> 357050 INFO  (jetty-launcher-481-thread-2) [    ] o.a.s.u.UpdateShardHandler Creating UpdateShardHandler HTTP client with params: socketTimeout=340000&connTimeout=45000&retry=true
   [junit4]   2> 357050 INFO  (jetty-launcher-481-thread-3) [    ] o.a.s.u.UpdateShardHandler Creating UpdateShardHandler HTTP client with params: socketTimeout=340000&connTimeout=45000&retry=true
   [junit4]   2> 357050 INFO  (jetty-launcher-481-thread-1) [    ] o.a.s.u.UpdateShardHandler Creating UpdateShardHandler HTTP client with params: socketTimeout=340000&connTimeout=45000&retry=true
   [junit4]   2> 357050 INFO  (jetty-launcher-481-thread-2) [    ] o.a.s.l.LogWatcher SLF4J impl is org.slf4j.impl.Log4jLoggerFactory
   [junit4]   2> 357050 INFO  (jetty-launcher-481-thread-2) [    ] o.a.s.l.LogWatcher Registering Log Listener [Log4j (org.slf4j.impl.Log4jLoggerFactory)]
   [junit4]   2> 357050 INFO  (jetty-launcher-481-thread-1) [    ] o.a.s.l.LogWatcher SLF4J impl is org.slf4j.impl.Log4jLoggerFactory
   [junit4]   2> 357050 INFO  (jetty-launcher-481-thread-1) [    ] o.a.s.l.LogWatcher Registering Log Listener [Log4j (org.slf4j.impl.Log4jLoggerFactory)]
   [junit4]   2> 357050 INFO  (jetty-launcher-481-thread-2) [    ] o.a.s.c.ZkContainer Zookeeper client=127.0.0.1:44692/solr
   [junit4]   2> 357051 INFO  (jetty-launcher-481-thread-2) [    ] o.a.s.c.ZkController zkHost includes chroot
   [junit4]   2> 357051 INFO  (jetty-launcher-481-thread-1) [    ] o.a.s.c.ZkContainer Zookeeper client=127.0.0.1:44692/solr
   [junit4]   2> 357051 INFO  (jetty-launcher-481-thread-3) [    ] o.a.s.l.LogWatcher SLF4J impl is org.slf4j.impl.Log4jLoggerFactory
   [junit4]   2> 357051 INFO  (jetty-launcher-481-thread-1) [    ] o.a.s.c.ZkController zkHost includes chroot
   [junit4]   2> 357051 INFO  (jetty-launcher-481-thread-3) [    ] o.a.s.l.LogWatcher Registering Log Listener [Log4j (org.slf4j.impl.Log4jLoggerFactory)]
   [junit4]   2> 357051 INFO  (jetty-launcher-481-thread-1) [    ] o.a.s.c.c.SolrZkClient Using default ZkCredentialsProvider
   [junit4]   2> 357051 INFO  (jetty-launcher-481-thread-2) [    ] o.a.s.c.c.SolrZkClient Using default ZkCredentialsProvider
   [junit4]   2> 357051 INFO  (jetty-launcher-481-thread-3) [    ] o.a.s.c.ZkContainer Zookeeper client=127.0.0.1:44692/solr
   [junit4]   2> 357052 INFO  (jetty-launcher-481-thread-3) [    ] o.a.s.c.ZkController zkHost includes chroot
   [junit4]   2> 357052 INFO  (jetty-launcher-481-thread-3) [    ] o.a.s.c.c.SolrZkClient Using default ZkCredentialsProvider
   [junit4]   2> 357052 INFO  (jetty-launcher-481-thread-2) [    ] o.a.s.c.c.ConnectionManager Waiting for client to connect to ZooKeeper
   [junit4]   2> 357052 INFO  (jetty-launcher-481-thread-1) [    ] o.a.s.c.c.ConnectionManager Waiting for client to connect to ZooKeeper
   [junit4]   2> 357052 INFO  (jetty-launcher-481-thread-3) [    ] o.a.s.c.c.ConnectionManager Waiting for client to connect to ZooKeeper
   [junit4]   2> 357064 INFO  (zkCallback-492-thread-1) [    ] o.a.s.c.c.ConnectionManager Watcher org.apache.solr.common.cloud.ConnectionManager@fae071 name:ZooKeeperConnection Watcher:127.0.0.1:44692 got event WatchedEvent state:SyncConnected type:None path:null path:null type:None
   [junit4]   2> 357064 INFO  (zkCallback-493-thread-1) [    ] o.a.s.c.c.ConnectionManager Watcher org.apache.solr.common.cloud.ConnectionManager@1b88e1e name:ZooKeeperConnection Watcher:127.0.0.1:44692 got event WatchedEvent state:SyncConnected type:None path:null path:null type:None
   [junit4]   2> 357064 INFO  (jetty-launcher-481-thread-2) [    ] o.a.s.c.c.ConnectionManager Client is connected to ZooKeeper
   [junit4]   2> 357064 INFO  (jetty-launcher-481-thread-1) [    ] o.a.s.c.c.ConnectionManager Client is connected to ZooKeeper
   [junit4]   2> 357064 INFO  (jetty-launcher-481-thread-1) [    ] o.a.s.c.c.SolrZkClient Using default ZkACLProvider
   [junit4]   2> 357064 INFO  (jetty-launcher-481-thread-2) [    ] o.a.s.c.c.SolrZkClient Using default ZkACLProvider
   [junit4]   2> 357064 INFO  (zkCallback-494-thread-1) [    ] o.a.s.c.c.ConnectionManager Watcher org.apache.solr.common.cloud.ConnectionManager@28743e name:ZooKeeperConnection Watcher:127.0.0.1:44692 got event WatchedEvent state:SyncConnected type:None path:null path:null type:None
   [junit4]   2> 357064 INFO  (jetty-launcher-481-thread-3) [    ] o.a.s.c.c.ConnectionManager Client is connected to ZooKeeper
   [junit4]   2> 357064 INFO  (jetty-launcher-481-thread-3) [    ] o.a.s.c.c.SolrZkClient Using default ZkACLProvider
   [junit4]   2> 357065 INFO  (jetty-launcher-481-thread-1) [n:127.0.0.1:40609_solr    ] o.a.s.c.ZkController Added new OnReconnect listener org.apache.solr.cloud.ZkController$$Lambda$68/2860414@f7bbe
   [junit4]   2> 357065 WARN  (NIOServerCxn.Factory:0.0.0.0/0.0.0.0:0) [    ] o.a.z.s.NIOServerCnxn caught end of stream exception
   [junit4]   2> EndOfStreamException: Unable to read additional data from client sessionid 0x1570c531e220005, likely client has closed socket
   [junit4]   2> 	at org.apache.zookeeper.server.NIOServerCnxn.doIO(NIOServerCnxn.java:228)
   [junit4]   2> 	at org.apache.zookeeper.server.NIOServerCnxnFactory.run(NIOServerCnxnFactory.java:208)
   [junit4]   2> 	at java.lang.Thread.run(Thread.java:745)
   [junit4]   2> 357065 INFO  (jetty-launcher-481-thread-2) [n:127.0.0.1:39846_solr    ] o.a.s.c.ZkController Added new OnReconnect listener org.apache.solr.cloud.ZkController$$Lambda$68/2860414@5139aa
   [junit4]   2> 357065 INFO  (jetty-launcher-481-thread-1) [n:127.0.0.1:40609_solr    ] o.a.s.c.c.ConnectionManager Waiting for client to connect to ZooKeeper
   [junit4]   2> 357066 WARN  (NIOServerCxn.Factory:0.0.0.0/0.0.0.0:0) [    ] o.a.z.s.NIOServerCnxn caught end of stream exception
   [junit4]   2> EndOfStreamException: Unable to read additional data from client sessionid 0x1570c531e220004, likely client has closed socket
   [junit4]   2> 	at org.apache.zookeeper.server.NIOServerCnxn.doIO(NIOServerCnxn.java:228)
   [junit4]   2> 	at org.apache.zookeeper.server.NIOServerCnxnFactory.run(NIOServerCnxnFactory.java:208)
   [junit4]   2> 	at java.lang.Thread.run(Thread.java:745)
   [junit4]   2> 357066 INFO  (jetty-launcher-481-thread-2) [n:127.0.0.1:39846_solr    ] o.a.s.c.c.ConnectionManager Waiting for client to connect to ZooKeeper
   [junit4]   2> 357066 INFO  (jetty-launcher-481-thread-3) [n:127.0.0.1:39509_solr    ] o.a.s.c.ZkController Added new OnReconnect listener org.apache.solr.cloud.ZkController$$Lambda$68/2860414@1ebb2d
   [junit4]   2> 357067 INFO  (jetty-launcher-481-thread-3) [n:127.0.0.1:39509_solr    ] o.a.s.c.c.ConnectionManager Waiting for client to connect to ZooKeeper
   [junit4]   2> 357067 INFO  (zkCallback-495-thread-1-processing-n:127.0.0.1:40609_solr) [n:127.0.0.1:40609_solr    ] o.a.s.c.c.ConnectionManager Watcher org.apache.solr.common.cloud.ConnectionManager@1dce9ab name:ZooKeeperConnection Watcher:127.0.0.1:44692/solr got event WatchedEvent state:SyncConnected type:None path:null path:null type:None
   [junit4]   2> 357067 INFO  (jetty-launcher-481-thread-1) [n:127.0.0.1:40609_solr    ] o.a.s.c.c.ConnectionManager Client is connected to ZooKeeper
   [junit4]   2> 357070 INFO  (zkCallback-496-thread-1-processing-n:127.0.0.1:39846_solr) [n:127.0.0.1:39846_solr    ] o.a.s.c.c.ConnectionManager Watcher org.apache.solr.common.cloud.ConnectionManager@120e5d3 name:ZooKeeperConnection Watcher:127.0.0.1:44692/solr got event WatchedEvent state:SyncConnected type:None path:null path:null type:None
   [junit4]   2> 357070 INFO  (jetty-launcher-481-thread-2) [n:127.0.0.1:39846_solr    ] o.a.s.c.c.ConnectionManager Client is connected to ZooKeeper
   [junit4]   2> 357070 INFO  (jetty-launcher-481-thread-1) [n:127.0.0.1:40609_solr    ] o.a.s.c.c.SolrZkClient makePath: /overseer/queue
   [junit4]   2> 357070 INFO  (zkCallback-497-thread-1-processing-n:127.0.0.1:39509_solr) [n:127.0.0.1:39509_solr    ] o.a.s.c.c.ConnectionManager Watcher org.apache.solr.common.cloud.ConnectionManager@16ca219 name:ZooKeeperConnection Watcher:127.0.0.1:44692/solr got event WatchedEvent state:SyncConnected type:None path:null path:null type:None
   [junit4]   2> 357070 INFO  (jetty-launcher-481-thread-3) [n:127.0.0.1:39509_solr    ] o.a.s.c.c.ConnectionManager Client is connected to ZooKeeper
   [junit4]   2> 357071 INFO  (jetty-launcher-481-thread-2) [n:127.0.0.1:39846_solr    ] o.a.s.c.c.SolrZkClient makePath: /overseer/collection-queue-work
   [junit4]   2> 357071 INFO  (jetty-launcher-481-thread-3) [n:127.0.0.1:39509_solr    ] o.a.s.c.c.SolrZkClient makePath: /overseer/collection-queue-work
   [junit4]   2> 357071 INFO  (jetty-launcher-481-thread-1) [n:127.0.0.1:40609_solr    ] o.a.s.c.c.SolrZkClient makePath: /overseer/collection-queue-work
   [junit4]   2> 357078 INFO  (jetty-launcher-481-thread-1) [n:127.0.0.1:40609_solr    ] o.a.s.c.c.SolrZkClient makePath: /overseer/collection-map-running
   [junit4]   2> 357078 INFO  (jetty-launcher-481-thread-2) [n:127.0.0.1:39846_solr    ] o.a.s.c.c.SolrZkClient makePath: /overseer/collection-map-running
   [junit4]   2> 357078 INFO  (jetty-launcher-481-thread-3) [n:127.0.0.1:39509_solr    ] o.a.s.c.c.SolrZkClient makePath: /overseer/collection-map-running
   [junit4]   2> 357079 INFO  (jetty-launcher-481-thread-2) [n:127.0.0.1:39846_solr    ] o.a.s.c.c.SolrZkClient makePath: /overseer/collection-map-completed
   [junit4]   2> 357079 INFO  (jetty-launcher-481-thread-1) [n:127.0.0.1:40609_solr    ] o.a.s.c.c.SolrZkClient makePath: /overseer/collection-map-completed
   [junit4]   2> 357079 INFO  (jetty-launcher-481-thread-3) [n:127.0.0.1:39509_solr    ] o.a.s.c.c.SolrZkClient makePath: /overseer/collection-map-completed
   [junit4]   2> 357079 INFO  (jetty-launcher-481-thread-1) [n:127.0.0.1:40609_solr    ] o.a.s.c.c.SolrZkClient makePath: /overseer/collection-map-failure
   [junit4]   2> 357079 INFO  (jetty-launcher-481-thread-2) [n:127.0.0.1:39846_solr    ] o.a.s.c.c.SolrZkClient makePath: /overseer/collection-map-failure
   [junit4]   2> 357079 INFO  (jetty-launcher-481-thread-3) [n:127.0.0.1:39509_solr    ] o.a.s.c.c.SolrZkClient makePath: /overseer/collection-map-failure
   [junit4]   2> 357080 INFO  (jetty-launcher-481-thread-2) [n:127.0.0.1:39846_solr    ] o.a.s.c.c.SolrZkClient makePath: /live_nodes
   [junit4]   2> 357080 INFO  (jetty-launcher-481-thread-1) [n:127.0.0.1:40609_solr    ] o.a.s.c.c.SolrZkClient makePath: /live_nodes
   [junit4]   2> 357080 INFO  (jetty-launcher-481-thread-3) [n:127.0.0.1:39509_solr    ] o.a.s.c.c.SolrZkClient makePath: /live_nodes
   [junit4]   2> 357080 INFO  (jetty-launcher-481-thread-1) [n:127.0.0.1:40609_solr    ] o.a.s.c.c.SolrZkClient makePath: /collections
   [junit4]   2> 357080 INFO  (jetty-launcher-481-thread-3) [n:127.0.0.1:39509_solr    ] o.a.s.c.c.SolrZkClient makePath: /collections
   [junit4]   2> 357080 INFO  (jetty-launcher-481-thread-2) [n:127.0.0.1:39846_solr    ] o.a.s.c.c.SolrZkClient makePath: /collections
   [junit4]   2> 357081 INFO  (jetty-launcher-481-thread-3) [n:127.0.0.1:39509_solr    ] o.a.s.c.c.SolrZkClient makePath: /aliases.json
   [junit4]   2> 357081 INFO  (jetty-launcher-481-thread-1) [n:127.0.0.1:40609_solr    ] o.a.s.c.c.SolrZkClient makePath: /aliases.json
   [junit4]   2> 357081 INFO  (jetty-launcher-481-thread-2) [n:127.0.0.1:39846_solr    ] o.a.s.c.c.SolrZkClient makePath: /aliases.json
   [junit4]   2> 357081 INFO  (jetty-launcher-481-thread-1) [n:127.0.0.1:40609_solr    ] o.a.s.c.c.SolrZkClient makePath: /clusterstate.json
   [junit4]   2> 357081 INFO  (jetty-launcher-481-thread-2) [n:127.0.0.1:39846_solr    ] o.a.s.c.c.SolrZkClient makePath: /clusterstate.json
   [junit4]   2> 357081 INFO  (jetty-launcher-481-thread-3) [n:127.0.0.1:39509_solr    ] o.a.s.c.c.SolrZkClient makePath: /clusterstate.json
   [junit4]   2> 357082 INFO  (jetty-launcher-481-thread-1) [n:127.0.0.1:40609_solr    ] o.a.s.c.c.SolrZkClient makePath: /security.json
   [junit4]   2> 357082 INFO  (jetty-launcher-481-thread-2) [n:127.0.0.1:39846_solr    ] o.a.s.c.c.SolrZkClient makePath: /security.json
   [junit4]   2> 357082 INFO  (jetty-launcher-481-thread-3) [n:127.0.0.1:39509_solr    ] o.a.s.c.c.SolrZkClient makePath: /security.json
   [junit4]   2> 357082 INFO  (jetty-launcher-481-thread-2) [n:127.0.0.1:39846_solr    ] o.a.s.c.c.ZkStateReader Updating cluster state from ZooKeeper... 
   [junit4]   2> 357082 INFO  (jetty-launcher-481-thread-1) [n:127.0.0.1:40609_solr    ] o.a.s.c.c.ZkStateReader Updating cluster state from ZooKeeper... 
   [junit4]   2> 357082 INFO  (jetty-launcher-481-thread-3) [n:127.0.0.1:39509_solr    ] o.a.s.c.c.ZkStateReader Updating cluster state from ZooKeeper... 
   [junit4]   2> 357082 INFO  (jetty-launcher-481-thread-2) [n:127.0.0.1:39846_solr    ] o.a.s.c.c.ZkStateReader Loaded cluster properties: {urlScheme=https}
   [junit4]   2> 357082 INFO  (jetty-launcher-481-thread-3) [n:127.0.0.1:39509_solr    ] o.a.s.c.c.ZkStateReader Loaded cluster properties: {urlScheme=https}
   [junit4]   2> 357082 INFO  (jetty-launcher-481-thread-1) [n:127.0.0.1:40609_solr    ] o.a.s.c.c.ZkStateReader Loaded cluster properties: {urlScheme=https}
   [junit4]   2> 357082 INFO  (jetty-launcher-481-thread-2) [n:127.0.0.1:39846_solr    ] o.a.s.c.c.ZkStateReader Updated live nodes from ZooKeeper... (0) -> (0)
   [junit4]   2> 357082 INFO  (jetty-launcher-481-thread-3) [n:127.0.0.1:39509_solr    ] o.a.s.c.c.ZkStateReader Updated live nodes from ZooKeeper... (0) -> (0)
   [junit4]   2> 357082 INFO  (jetty-launcher-481-thread-1) [n:127.0.0.1:40609_solr    ] o.a.s.c.c.ZkStateReader Updated live nodes from ZooKeeper... (0) -> (0)
   [junit4]   2> 357083 INFO  (jetty-launcher-481-thread-3) [n:127.0.0.1:39509_solr    ] o.a.s.c.c.SolrZkClient makePath: /overseer_elect
   [junit4]   2> 357083 INFO  (jetty-launcher-481-thread-1) [n:127.0.0.1:40609_solr    ] o.a.s.c.c.SolrZkClient makePath: /overseer_elect
   [junit4]   2> 357083 INFO  (jetty-launcher-481-thread-2) [n:127.0.0.1:39846_solr    ] o.a.s.c.c.SolrZkClient makePath: /overseer_elect
   [junit4]   2> 357084 INFO  (jetty-launcher-481-thread-3) [n:127.0.0.1:39509_solr    ] o.a.s.c.c.SolrZkClient makePath: /overseer_elect/election
   [junit4]   2> 357084 INFO  (jetty-launcher-481-thread-1) [n:127.0.0.1:40609_solr    ] o.a.s.c.c.SolrZkClient makePath: /overseer_elect/election
   [junit4]   2> 357084 INFO  (jetty-launcher-481-thread-2) [n:127.0.0.1:39846_solr    ] o.a.s.c.c.SolrZkClient makePath: /overseer_elect/election
   [junit4]   2> 357084 INFO  (jetty-launcher-481-thread-1) [n:127.0.0.1:40609_solr    ] o.a.s.c.Overseer Overseer (id=null) closing
   [junit4]   2> 357084 INFO  (jetty-launcher-481-thread-2) [n:127.0.0.1:39846_solr    ] o.a.s.c.Overseer Overseer (id=null) closing
   [junit4]   2> 357084 INFO  (jetty-launcher-481-thread-3) [n:127.0.0.1:39509_solr    ] o.a.s.c.Overseer Overseer (id=null) closing
   [junit4]   2> 357084 INFO  (jetty-launcher-481-thread-1) [n:127.0.0.1:40609_solr    ] o.a.s.c.LeaderElector Joined leadership election with path: /overseer_elect/election/96559468139118599-127.0.0.1:40609_solr-n_0000000000
   [junit4]   2> 357084 INFO  (jetty-launcher-481-thread-2) [n:127.0.0.1:39846_solr    ] o.a.s.c.LeaderElector Joined leadership election with path: /overseer_elect/election/96559468139118600-127.0.0.1:39846_solr-n_0000000001
   [junit4]   2> 357085 INFO  (jetty-launcher-481-thread-3) [n:127.0.0.1:39509_solr    ] o.a.s.c.LeaderElector Joined leadership election with path: /overseer_elect/election/96559468139118601-127.0.0.1:39509_solr-n_0000000002
   [junit4]   2> 357085 INFO  (jetty-launcher-481-thread-1) [n:127.0.0.1:40609_solr    ] o.a.s.c.OverseerElectionContext I am going to be the leader 127.0.0.1:40609_solr
   [junit4]   2> 357085 INFO  (jetty-launcher-481-thread-1) [n:127.0.0.1:40609_solr    ] o.a.s.c.c.SolrZkClient makePath: /overseer_elect/leader
   [junit4]   2> 357085 INFO  (jetty-launcher-481-thread-2) [n:127.0.0.1:39846_solr    ] o.a.s.c.LeaderElector Watching path /overseer_elect/election/96559468139118599-127.0.0.1:40609_solr-n_0000000000 to know if I could be the leader
   [junit4]   2> 357085 INFO  (jetty-launcher-481-thread-3) [n:127.0.0.1:39509_solr    ] o.a.s.c.LeaderElector Watching path /overseer_elect/election/96559468139118600-127.0.0.1:39846_solr-n_0000000001 to know if I could be the leader
   [junit4]   2> 357085 INFO  (jetty-launcher-481-thread-2) [n:127.0.0.1:39846_solr    ] o.a.s.c.ZkController Register node as live in ZooKeeper:/live_nodes/127.0.0.1:39846_solr
   [junit4]   2> 357085 INFO  (jetty-launcher-481-thread-2) [n:127.0.0.1:39846_solr    ] o.a.s.c.c.SolrZkClient makePath: /live_nodes/127.0.0.1:39846_solr
   [junit4]   2> 357085 INFO  (jetty-launcher-481-thread-3) [n:127.0.0.1:39509_solr    ] o.a.s.c.ZkController Register node as live in ZooKeeper:/live_nodes/127.0.0.1:39509_solr
   [junit4]   2> 357085 INFO  (jetty-launcher-481-thread-3) [n:127.0.0.1:39509_solr    ] o.a.s.c.c.SolrZkClient makePath: /live_nodes/127.0.0.1:39509_solr
   [junit4]   2> 357085 INFO  (jetty-launcher-481-thread-1) [n:127.0.0.1:40609_solr    ] o.a.s.c.Overseer Overseer (id=96559468139118599-127.0.0.1:40609_solr-n_0000000000) starting
   [junit4]   2> 357085 INFO  (zkCallback-497-thread-1-processing-n:127.0.0.1:39509_solr) [n:127.0.0.1:39509_solr    ] o.a.s.c.c.ZkStateReader A live node change: [WatchedEvent state:SyncConnected type:NodeChildrenChanged path:/live_nodes], has occurred - updating... (live nodes size: [0])
   [junit4]   2> 357085 INFO  (zkCallback-495-thread-1-processing-n:127.0.0.1:40609_solr) [n:127.0.0.1:40609_solr    ] o.a.s.c.c.ZkStateReader A live node change: [WatchedEvent state:SyncConnected type:NodeChildrenChanged path:/live_nodes], has occurred - updating... (live nodes size: [0])
   [junit4]   2> 357085 INFO  (zkCallback-496-thread-1-processing-n:127.0.0.1:39846_solr) [n:127.0.0.1:39846_solr    ] o.a.s.c.c.ZkStateReader A live node change: [WatchedEvent state:SyncConnected type:NodeChildrenChanged path:/live_nodes], has occurred - updating... (live nodes size: [0])
   [junit4]   2> 357090 INFO  (zkCallback-497-thread-1-processing-n:127.0.0.1:39509_solr) [n:127.0.0.1:39509_solr    ] o.a.s.c.c.ZkStateReader Updated live nodes from ZooKeeper... (0) -> (2)
   [junit4]   2> 357090 INFO  (zkCallback-496-thread-1-processing-n:127.0.0.1:39846_solr) [n:127.0.0.1:39846_solr    ] o.a.s.c.c.ZkStateReader Updated live nodes from ZooKeeper... (0) -> (2)
   [junit4]   2> 357091 INFO  (zkCallback-495-thread-1-processing-n:127.0.0.1:40609_solr) [n:127.0.0.1:40609_solr    ] o.a.s.c.c.ZkStateReader Updated live nodes from ZooKeeper... (0) -> (2)
   [junit4]   2> 357092 INFO  (jetty-launcher-481-thread-1) [n:127.0.0.1:40609_solr    ] o.a.s.c.c.SolrZkClient makePath: /overseer/queue-work
   [junit4]   2> 357095 INFO  (jetty-launcher-481-thread-1) [n:127.0.0.1:40609_solr    ] o.a.s.c.OverseerAutoReplicaFailoverThread Starting OverseerAutoReplicaFailoverThread autoReplicaFailoverWorkLoopDelay=10000 autoReplicaFailoverWaitAfterExpiration=30000 autoReplicaFailoverBadNodeExpiration=60000
   [junit4]   2> 357095 INFO  (OverseerCollectionConfigSetProcessor-96559468139118599-127.0.0.1:40609_solr-n_0000000000) [n:127.0.0.1:40609_solr    ] o.a.s.c.OverseerTaskProcessor Process current queue of overseer operations
   [junit4]   2> 357095 INFO  (jetty-launcher-481-thread-1) [n:127.0.0.1:40609_solr    ] o.a.s.c.ZkController Publish node=127.0.0.1:40609_solr as DOWN
   [junit4]   2> 357095 INFO  (OverseerStateUpdate-96559468139118599-127.0.0.1:40609_solr-n_0000000000) [n:127.0.0.1:40609_solr    ] o.a.s.c.Overseer Starting to work on the main queue
   [junit4]   2> 357097 INFO  (jetty-launcher-481-thread-1) [n:127.0.0.1:40609_solr    ] o.a.s.c.ZkController Register node as live in ZooKeeper:/live_nodes/127.0.0.1:40609_solr
   [junit4]   2> 357097 INFO  (OverseerStateUpdate-96559468139118599-127.0.0.1:40609_solr-n_0000000000) [n:127.0.0.1:40609_solr    ] o.a.s.c.c.ZkStateReader Updated live nodes from ZooKeeper... (2) -> (2)
   [junit4]   2> 357097 INFO  (jetty-launcher-481-thread-1) [n:127.0.0.1:40609_solr    ] o.a.s.c.c.SolrZkClient makePath: /live_nodes/127.0.0.1:40609_solr
   [junit4]   2> 357102 INFO  (jetty-launcher-481-thread-2) [n:127.0.0.1:39846_solr    ] o.a.s.c.CoreContainer Security conf doesn't exist. Skipping setup for authorization module.
   [junit4]   2> 357103 INFO  (jetty-launcher-481-thread-2) [n:127.0.0.1:39846_solr    ] o.a.s.c.CoreContainer No authentication plugin used.
   [junit4]   2> 357103 INFO  (jetty-launcher-481-thread-2) [n:127.0.0.1:39846_solr    ] o.a.s.c.CorePropertiesLocator Looking for core definitions underneath /home/jenkins/workspace/Lucene-Solr-6.x-Linux/solr/build/solr-core/test/J2/temp/solr.security.BasicAuthIntegrationTest_AE293A8BA186279C-001/tempDir-001/node2/.
   [junit4]   2> 357122 INFO  (jetty-launcher-481-thread-2) [n:127.0.0.1:39846_solr    ] o.a.s.c.CorePropertiesLocator Found 0 core definitions
   [junit4]   2> 357122 INFO  (zkCallback-495-thread-1-processing-n:127.0.0.1:40609_solr) [n:127.0.0.1:40609_solr    ] o.a.s.c.c.ZkStateReader A live node change: [WatchedEvent state:SyncConnected type:NodeChildrenChanged path:/live_nodes], has occurred - updating... (live nodes size: [2])
   [junit4]   2> 357122 INFO  (zkCallback-496-thread-1-processing-n:127.0.0.1:39846_solr) [n:127.0.0.1:39846_solr    ] o.a.s.c.c.ZkStateReader A live node change: [WatchedEvent state:SyncConnected type:NodeChildrenChanged path:/live_nodes], has occurred - updating... (live nodes size: [2])
   [junit4]   2> 357122 INFO  (zkCallback-497-thread-1-processing-n:127.0.0.1:39509_solr) [n:127.0.0.1:39509_solr    ] o.a.s.c.c.ZkStateReader A live node change: [WatchedEvent state:SyncConnected type:NodeChildrenChanged path:/live_nodes], has occurred - updating... (live nodes size: [2])
   [junit4]   2> 357122 INFO  (OverseerStateUpdate-96559468139118599-127.0.0.1:40609_solr-n_0000000000) [n:127.0.0.1:40609_solr    ] o.a.s.c.Overseer processMessage: queueSize: 1, message = {
   [junit4]   2>   "operation":"downnode",
   [junit4]   2>   "node_name":"127.0.0.1:40609_solr"} current state version: 0
   [junit4]   2> 357122 INFO  (OverseerStateUpdate-96559468139118599-127.0.0.1:40609_solr-n_0000000000) [n:127.0.0.1:40609_solr    ] o.a.s.c.o.NodeMutator DownNode state invoked for node: 127.0.0.1:40609_solr
   [junit4]   2> 357122 INFO  (zkCallback-495-thread-1-processing-n:127.0.0.1:40609_solr) [n:127.0.0.1:40609_solr    ] o.a.s.c.c.ZkStateReader Updated live nodes from ZooKeeper... (2) -> (3)
   [junit4]   2> 357122 INFO  (zkCallback-497-thread-1-processing-n:127.0.0.1:39509_solr) [n:127.0.0.1:39509_solr    ] o.a.s.c.c.ZkStateReader Updated live nodes from ZooKeeper... (2) -> (3)
   [junit4]   2> 357123 INFO  (jetty-launcher-481-thread-2) [n:127.0.0.1:39846_solr    ] o.a.s.s.SolrDispatchFilter user.dir=/home/jenkins/workspace/Lucene-Solr-6.x-Linux/solr/build/solr-core/test/J2
   [junit4]   2> 357123 INFO  (zkCallback-496-thread-1-processing-n:127.0.0.1:39846_solr) [n:127.0.0.1:39846_solr    ] o.a.s.c.c.ZkStateReader Updated live nodes from ZooKeeper... (2) -> (3)
   [junit4]   2> 357123 INFO  (jetty-launcher-481-thread-2) [n:127.0.0.1:39846_solr    ] o.a.s.s.SolrDispatchFilter SolrDispatchFilter.init() done
   [junit4]   2> 357126 INFO  (jetty-launcher-481-thread-3) [n:127.0.0.1:39509_solr    ] o.a.s.c.CoreContainer Security conf doesn't exist. Skipping setup for authorization module.
   [junit4]   2> 357126 INFO  (jetty-launcher-481-thread-3) [n:127.0.0.1:39509_solr    ] o.a.s.c.CoreContainer No authentication plugin used.
   [junit4]   2> 357127 INFO  (jetty-launcher-481-thread-3) [n:127.0.0.1:39509_solr    ] o.a.s.c.CorePropertiesLocator Looking for core definitions underneath /home/jenkins/workspace/Lucene-Solr-6.x-Linux/solr/build/solr-core/test/J2/temp/solr.security.BasicAuthIntegrationTest_AE293A8BA186279C-001/tempDir-001/node3/.
   [junit4]   2> 357127 INFO  (jetty-launcher-481-thread-3) [n:127.0.0.1:39509_solr    ] o.a.s.c.CorePropertiesLocator Found 0 core definitions
   [junit4]   2> 357127 INFO  (jetty-launcher-481-thread-3) [n:127.0.0.1:39509_solr    ] o.a.s.s.SolrDispatchFilter user.dir=/home/jenkins/workspace/Lucene-Solr-6.x-Linux/solr/build/solr-core/test/J2
   [junit4]   2> 357127 INFO  (jetty-launcher-481-thread-3) [n:127.0.0.1:39509_solr    ] o.a.s.s.SolrDispatchFilter SolrDispatchFilter.init() done
   [junit4]   2> 357135 INFO  (jetty-launcher-481-thread-1) [n:127.0.0.1:40609_solr    ] o.a.s.c.CoreContainer Security conf doesn't exist. Skipping setup for authorization module.
   [junit4]   2> 357135 INFO  (jetty-launcher-481-thread-1) [n:127.0.0.1:40609_solr    ] o.a.s.c.CoreContainer No authentication plugin used.
   [junit4]   2> 357135 INFO  (jetty-launcher-481-thread-1) [n:127.0.0.1:40609_solr    ] o.a.s.c.CorePropertiesLocator Looking for core definitions underneath /home/jenkins/workspace/Lucene-Solr-6.x-Linux/solr/build/solr-core/test/J2/temp/solr.security.BasicAuthIntegrationTest_AE293A8BA186279C-001/tempDir-001/node1/.
   [junit4]   2> 357136 INFO  (jetty-launcher-481-thread-1) [n:127.0.0.1:40609_solr    ] o.a.s.c.CorePropertiesLocator Found 0 core definitions
   [junit4]   2> 357136 INFO  (jetty-launcher-481-thread-1) [n:127.0.0.1:40609_solr    ] o.a.s.s.SolrDispatchFilter user.dir=/home/jenkins/workspace/Lucene-Solr-6.x-Linux/solr/build/solr-core/test/J2
   [junit4]   2> 357136 INFO  (jetty-launcher-481-thread-1) [n:127.0.0.1:40609_solr    ] o.a.s.s.SolrDispatchFilter SolrDispatchFilter.init() done
   [junit4]   2> 357136 INFO  (SUITE-BasicAuthIntegrationTest-seed#[AE293A8BA186279C]-worker) [    ] o.a.s.c.c.SolrZkClient Using default ZkCredentialsProvider
   [junit4]   2> 357136 INFO  (SUITE-BasicAuthIntegrationTest-seed#[AE293A8BA186279C]-worker) [    ] o.a.s.c.c.ConnectionManager Waiting for client to connect to ZooKeeper
   [junit4]   2> 357138 INFO  (zkCallback-501-thread-1) [    ] o.a.s.c.c.ConnectionManager Watcher org.apache.solr.common.cloud.ConnectionManager@7162ad name:ZooKeeperConnection Watcher:127.0.0.1:44692 got event WatchedEvent state:SyncConnected type:None path:null path:null type:None
   [junit4]   2> 357138 INFO  (SUITE-BasicAuthIntegrationTest-seed#[AE293A8BA186279C]-worker) [    ] o.a.s.c.c.ConnectionManager Client is connected to ZooKeeper
   [junit4]   2> 357138 INFO  (SUITE-BasicAuthIntegrationTest-seed#[AE293A8BA186279C]-worker) [    ] o.a.s.c.c.SolrZkClient Using default ZkACLProvider
   [junit4]   2> 357169 INFO  (SUITE-BasicAuthIntegrationTest-seed#[AE293A8BA186279C]-worker) [    ] o.a.s.c.c.SolrZkClient Using default ZkCredentialsProvider
   [junit4]   2> 357169 INFO  (SUITE-BasicAuthIntegrationTest-seed#[AE293A8BA186279C]-worker) [    ] o.a.s.c.c.ConnectionManager Waiting for client to connect to ZooKeeper
   [junit4]   2> 357170 INFO  (zkCallback-504-thread-1) [    ] o.a.s.c.c.ConnectionManager Watcher org.apache.solr.common.cloud.ConnectionManager@3abd38 name:ZooKeeperConnection Watcher:127.0.0.1:44692/solr got event WatchedEvent state:SyncConnected type:None path:null path:null type:None
   [junit4]   2> 357170 INFO  (SUITE-BasicAuthIntegrationTest-seed#[AE293A8BA186279C]-worker) [    ] o.a.s.c.c.ConnectionManager Client is connected to ZooKeeper
   [junit4]   2> 357170 INFO  (SUITE-BasicAuthIntegrationTest-seed#[AE293A8BA186279C]-worker) [    ] o.a.s.c.c.SolrZkClient Using default ZkACLProvider
   [junit4]   2> 357170 INFO  (SUITE-BasicAuthIntegrationTest-seed#[AE293A8BA186279C]-worker) [    ] o.a.s.c.c.ZkStateReader Updating cluster state from ZooKeeper... 
   [junit4]   2> 357170 INFO  (SUITE-BasicAuthIntegrationTest-seed#[AE293A8BA186279C]-worker) [    ] o.a.s.c.c.ZkStateReader Loaded cluster properties: {urlScheme=https}
   [junit4]   2> 357171 INFO  (SUITE-BasicAuthIntegrationTest-seed#[AE293A8BA186279C]-worker) [    ] o.a.s.c.c.ZkStateReader Updated live nodes from ZooKeeper... (0) -> (3)
   [junit4]   2> 357171 INFO  (SUITE-BasicAuthIntegrationTest-seed#[AE293A8BA186279C]-worker) [    ] o.a.s.c.c.SolrZkClient makePath: /configs/conf/solrconfig.xml
   [junit4]   2> 357172 INFO  (SUITE-BasicAuthIntegrationTest-seed#[AE293A8BA186279C]-worker) [    ] o.a.s.c.c.SolrZkClient makePath: /configs/conf/schema.xml
   [junit4]   2> 357248 INFO  (qtp19212712-2916) [n:127.0.0.1:39509_solr    ] o.a.s.h.a.CollectionsHandler Invoked Collection Action :create with params replicationFactor=1&collection.configName=conf&name=authCollection&action=CREATE&numShards=3&wt=javabin&version=2 and sendToOCPQueue=true
   [junit4]   2> 357249 INFO  (OverseerCollectionConfigSetProcessor-96559468139118599-127.0.0.1:40609_solr-n_0000000000) [n:127.0.0.1:40609_solr    ] o.a.s.c.OverseerTaskProcessor Overseer Collection Message Handler: Get the message id:/overseer/collection-queue-work/qn-0000000000 message:{
   [junit4]   2>   "name":"authCollection",
   [junit4]   2>   "fromApi":"true",
   [junit4]   2>   "replicationFactor":"1",
   [junit4]   2>   "collection.configName":"conf",
   [junit4]   2>   "numShards":"3",
   [junit4]   2>   "stateFormat":"2",
   [junit4]   2>   "operation":"create"}
   [junit4]   2> 357250 INFO  (OverseerThreadFactory-1688-thread-1-processing-n:127.0.0.1:40609_solr) [n:127.0.0.1:40609_solr    ] o.a.s.c.OverseerCollectionMessageHandler OverseerCollectionMessageHandler.processMessage : create , {
   [junit4]   2>   "name":"authCollection",
   [junit4]   2>   "fromApi":"true",
   [junit4]   2>   "replicationFactor":"1",
   [junit4]   2>   "collection.configName":"conf",
   [junit4]   2>   "numShards":"3",
   [junit4]   2>   "stateFormat":"2",
   [junit4]   2>   "operation":"create"}
   [junit4]   2> 357250 INFO  (OverseerThreadFactory-1688-thread-1-processing-n:127.0.0.1:40609_solr) [n:127.0.0.1:40609_solr    ] o.a.s.c.CreateCollectionCmd Create collection authCollection
   [junit4]   2> 357250 INFO  (OverseerThreadFactory-1688-thread-1-processing-n:127.0.0.1:40609_solr) [n:127.0.0.1:40609_solr    ] o.a.s.c.OverseerCollectionMessageHandler creating collections conf node /collections/authCollection 
   [junit4]   2> 357250 INFO  (OverseerThreadFactory-1688-thread-1-processing-n:127.0.0.1:40609_solr) [n:127.0.0.1:40609_solr    ] o.a.s.c.c.SolrZkClient makePath: /collections/authCollection
   [junit4]   2> 357251 INFO  (zkCallback-495-thread-1-processing-n:127.0.0.1:40609_solr) [n:127.0.0.1:40609_solr    ] o.a.s.c.c.ZkStateReader A collections change: [WatchedEvent state:SyncConnected type:NodeChildrenChanged path:/collections], has occurred - updating...
   [junit4]   2> 357251 INFO  (zkCallback-496-thread-1-processing-n:127.0.0.1:39846_solr) [n:127.0.0.1:39846_solr    ] o.a.s.c.c.ZkStateReader A collections change: [WatchedEvent state:SyncConnected type:NodeChildrenChanged path:/collections], has occurred - updating...
   [junit4]   2> 357251 INFO  (zkCallback-504-thread-1) [    ] o.a.s.c.c.ZkStateReader A collections change: [WatchedEvent state:SyncConnected type:NodeChildrenChanged path:/collections], has occurred - updating...
   [junit4]   2> 357251 INFO  (zkCallback-497-thread-1-processing-n:127.0.0.1:39509_solr) [n:127.0.0.1:39509_solr    ] o.a.s.c.c.ZkStateReader A collections change: [WatchedEvent state:SyncConnected type:NodeChildrenChanged path:/collections], has occurred - updating...
   [junit4]   2> 357252 INFO  (OverseerStateUpdate-96559468139118599-127.0.0.1:40609_solr-n_0000000000) [n:127.0.0.1:40609_solr    ] o.a.s.c.Overseer processMessage: queueSize: 1, message = {
   [junit4]   2>   "name":"authCollection",
   [junit4]   2>   "fromApi":"true",
   [junit4]   2>   "replicationFactor":"1",
   [junit4]   2>   "collection.configName":"conf",
   [junit4]   2>   "numShards":"3",
   [junit4]   2>   "stateFormat":"2",
   [junit4]   2>   "operation":"create"} current state version: 0
   [junit4]   2> 357252 INFO  (OverseerStateUpdate-96559468139118599-127.0.0.1:40609_solr-n_0000000000) [n:127.0.0.1:40609_solr    ] o.a.s.c.o.ClusterStateMutator building a new cName: authCollection
   [junit4]   2> 357253 INFO  (OverseerStateUpdate-96559468139118599-127.0.0.1:40609_solr-n_0000000000) [n:127.0.0.1:40609_solr    ] o.a.s.c.o.ZkStateWriter going to create_collection /collections/authCollection/state.json
   [junit4]   2> 357352 INFO  (OverseerThreadFactory-1688-thread-1-processing-n:127.0.0.1:40609_solr) [n:127.0.0.1:40609_solr    ] o.a.s.c.CreateCollectionCmd Creating SolrCores for new collection authCollection, shardNames [shard1, shard2, shard3] , replicationFactor : 1
   [junit4]   2> 357352 INFO  (OverseerThreadFactory-1688-thread-1-processing-n:127.0.0.1:40609_solr) [n:127.0.0.1:40609_solr    ] o.a.s.c.CreateCollectionCmd Creating core authCollection_shard1_replica1 as part of shard shard1 of collection authCollection on 127.0.0.1:40609_solr
   [junit4]   2> 357353 INFO  (OverseerThreadFactory-1688-thread-1-processing-n:127.0.0.1:40609_solr) [n:127.0.0.1:40609_solr    ] o.a.s.c.CreateCollectionCmd Creating core authCollection_shard2_replica1 as part of shard shard2 of collection authCollection on 127.0.0.1:39846_solr
   [junit4]   2> 357354 INFO  (OverseerThreadFactory-1688-thread-1-processing-n:127.0.0.1:40609_solr) [n:127.0.0.1:40609_solr    ] o.a.s.c.CreateCollectionCmd Creating core authCollection_shard3_replica1 as part of shard shard3 of collection authCollection on 127.0.0.1:39509_solr
   [junit4]   2> 357364 INFO  (qtp19212712-2918) [n:127.0.0.1:39509_solr    ] o.a.s.h.a.CoreAdminOperation core create command qt=/admin/cores&collection.configName=conf&name=authCollection_shard3_replica1&action=CREATE&numShards=3&collection=authCollection&shard=shard3&wt=javabin&version=2
   [junit4]   2> 357364 INFO  (qtp19212712-2918) [n:127.0.0.1:39509_solr    ] o.a.s.c.CoreDescriptor Created CoreDescriptor: {name=authCollection_shard3_replica1, collection.configName=conf, config=solrconfig.xml, transient=false, schema=schema.xml, loadOnStartup=true, configSetProperties=configsetprops.json, collection=authCollection, numShards=3, dataDir=data/, shard=shard3}
   [junit4]   2> 357365 INFO  (qtp19212712-2918) [n:127.0.0.1:39509_solr c:authCollection s:shard3  x:authCollection_shard3_replica1] o.a.s.c.ZkController publishing state=down
   [junit4]   2> 357366 INFO  (qtp19212712-2918) [n:127.0.0.1:39509_solr c:authCollection s:shard3  x:authCollection_shard3_replica1] o.a.s.c.ZkController Registering watch for collection authCollection
   [junit4]   2> 357366 INFO  (OverseerStateUpdate-96559468139118599-127.0.0.1:40609_solr-n_0000000000) [n:127.0.0.1:40609_solr    ] o.a.s.c.Overseer processMessage: queueSize: 1, message = {
   [junit4]   2>   "core":"authCollection_shard3_replica1",
   [junit4]   2>   "roles":null,
   [junit4]   2>   "base_url":"https://127.0.0.1:39509/solr",
   [junit4]   2>   "node_name":"127.0.0.1:39509_solr",
   [junit4]   2>   "numShards":"3",
   [junit4]   2>   "state":"down",
   [junit4]   2>   "shard":"shard3",
   [junit4]   2>   "collection":"authCollection",
   [junit4]   2>   "operation":"state"} current state version: 0
   [junit4]   2> 357366 INFO  (qtp19212712-2918) [n:127.0.0.1:39509_solr c:authCollection s:shard3  x:authCollection_shard3_replica1] o.a.s.c.c.ZkStateReader Add data for [authCollection] ver [0]
   [junit4]   2> 357366 INFO  (OverseerStateUpdate-96559468139118599-127.0.0.1:40609_solr-n_0000000000) [n:127.0.0.1:40609_solr    ] o.a.s.c.o.ReplicaMutator Update state numShards=3 message={
   [junit4]   2>   "core":"authCollection_shard3_replica1",
   [junit4]   2>   "roles":null,
   [junit4]   2>   "base_url":"https://127.0.0.1:39509/solr",
   [junit4]   2>   "node_name":"127.0.0.1:39509_solr",
   [junit4]   2>   "numShards":"3",
   [junit4]   2>   "state":"down",
   [junit4]   2>   "shard":"shard3",
   [junit4]   2>   "collection":"authCollection",
   [junit4]   2>   "operation":"state"}
   [junit4]   2> 357367 INFO  (qtp19212712-2918) [n:127.0.0.1:39509_solr c:authCollection s:shard3  x:authCollection_shard3_replica1] o.a.s.c.ZkController look for our core node name
   [junit4]   2> 357433 INFO  (qtp26831109-2904) [n:127.0.0.1:40609_solr    ] o.a.s.h.a.CoreAdminOperation core create command qt=/admin/cores&collection.configName=conf&name=authCollection_shard1_replica1&action=CREATE&numShards=3&collection=authCollection&shard=shard1&wt=javabin&version=2
   [junit4]   2> 357433 INFO  (qtp26831109-2904) [n:127.0.0.1:40609_solr    ] o.a.s.c.CoreDescriptor Created CoreDescriptor: {name=authCollection_shard1_replica1, collection.configName=conf, config=solrconfig.xml, transient=false, schema=schema.xml, loadOnStartup=true, configSetProperties=configsetprops.json, collection=authCollection, numShards=3, dataDir=data/, shard=shard1}
   [junit4]   2> 357434 INFO  (qtp26831109-2904) [n:127.0.0.1:40609_solr c:authCollection s:shard1  x:authCollection_shard1_replica1] o.a.s.c.ZkController publishing state=down
   [junit4]   2> 357434 INFO  (qtp26831109-2904) [n:127.0.0.1:40609_solr c:authCollection s:shard1  x:authCollection_shard1_replica1] o.a.s.c.ZkController Registering watch for collection authCollection
   [junit4]   2> 357434 INFO  (OverseerStateUpdate-96559468139118599-127.0.0.1:40609_solr-n_0000000000) [n:127.0.0.1:40609_solr    ] o.a.s.c.Overseer processMessage: queueSize: 1, message = {
   [junit4]   2>   "core":"authCollection_shard1_replica1",
   [junit4]   2>   "roles":null,
   [junit4]   2>   "base_url":"https://127.0.0.1:40609/solr",
   [junit4]   2>   "node_name":"127.0.0.1:40609_solr",
   [junit4]   2>   "numShards":"3",
   [junit4]   2>   "state":"down",
   [junit4]   2>   "shard":"shard1",
   [junit4]   2>   "collection":"authCollection",
   [junit4]   2>   "operation":"state"} current state version: 0
   [junit4]   2> 357434 INFO  (qtp26831109-2904) [n:127.0.0.1:40609_solr c:authCollection s:shard1  x:authCollection_shard1_replica1] o.a.s.c.c.ZkStateReader Add data for [authCollection] ver [0]
   [junit4]   2> 357434 INFO  (OverseerStateUpdate-96559468139118599-127.0.0.1:40609_solr-n_0000000000) [n:127.0.0.1:40609_solr    ] o.a.s.c.o.ReplicaMutator Update state numShards=3 message={
   [junit4]   2>   "core":"authCollection_shard1_replica1",
   [junit4]   2>   "roles":null,
   [junit4]   2>   "base_url":"https://127.0.0.1:40609/solr",
   [junit4]   2>   "node_name":"127.0.0.1:40609_solr",
   [junit4]   2>   "numShards":"3",
   [junit4]   2>   "state":"down",
   [junit4]   2>   "shard":"shard1",
   [junit4]   2>   "collection":"authCollection",
   [junit4]   2>   "operation":"state"}
   [junit4]   2> 357436 INFO  (qtp26831109-2904) [n:127.0.0.1:40609_solr c:authCollection s:shard1  x:authCollection_shard1_replica1] o.a.s.c.ZkController look for our core node name
   [junit4]   2> 357437 INFO  (qtp15382215-2915) [n:127.0.0.1:39846_solr    ] o.a.s.h.a.CoreAdminOperation core create command qt=/admin/cores&collection.configName=conf&name=authCollection_shard2_replica1&action=CREATE&numShards=3&collection=authCollection&shard=shard2&wt=javabin&version=2
   [junit4]   2> 357437 INFO  (qtp15382215-2915) [n:127.0.0.1:39846_solr    ] o.a.s.c.CoreDescriptor Created CoreDescriptor: {name=authCollection_shard2_replica1, collection.configName=conf, config=solrconfig.xml, transient=false, schema=schema.xml, loadOnStartup=true, configSetProperties=configsetprops.json, collection=authCollection, numShards=3, dataDir=data/, shard=shard2}
   [junit4]   2> 357438 INFO  (qtp15382215-2915) [n:127.0.0.1:39846_solr c:authCollection s:shard2  x:authCollection_shard2_replica1] o.a.s.c.ZkController publishing state=down
   [junit4]   2> 357438 INFO  (qtp15382215-2915) [n:127.0.0.1:39846_solr c:authCollection s:shard2  x:authCollection_shard2_replica1] o.a.s.c.ZkController Registering watch for collection authCollection
   [junit4]   2> 357438 INFO  (qtp15382215-2915) [n:127.0.0.1:39846_solr c:authCollection s:shard2  x:authCollection_shard2_replica1] o.a.s.c.c.ZkStateReader Add data for [authCollection] ver [0]
   [junit4]   2> 357439 INFO  (OverseerStateUpdate-96559468139118599-127.0.0.1:40609_solr-n_0000000000) [n:127.0.0.1:40609_solr    ] o.a.s.c.Overseer processMessage: queueSize: 1, message = {
   [junit4]   2>   "core":"authCollection_shard2_replica1",
   [junit4]   2>   "roles":null,
   [junit4]   2>   "base_url":"https://127.0.0.1:39846/solr",
   [junit4]   2>   "node_name":"127.0.0.1:39846_solr",
   [junit4]   2>   "numShards":"3",
   [junit4]   2>   "state":"down",
   [junit4]   2>   "shard":"shard2",
   [junit4]   2>   "collection":"authCollection",
   [junit4]   2>   "operation":"state"} current state version: 0
   [junit4]   2> 357439 INFO  (OverseerStateUpdate-96559468139118599-127.0.0.1:40609_solr-n_0000000000) [n:127.0.0.1:40609_solr    ] o.a.s.c.o.ReplicaMutator Update state numShards=3 message={
   [junit4]   2>   "core":"authCollection_shard2_replica1",
   [junit4]   2>   "roles":null,
   [junit4]   2>   "base_url":"https://127.0.0.1:39846/solr",
   [junit4]   2>   "node_name":"127.0.0.1:39846_solr",
   [junit4]   2>   "numShards":"3",
   [junit4]   2>   "state":"down",
   [junit4]   2>   "shard":"shard2",
   [junit4]   2>   "collection":"authCollection",
   [junit4]   2>   "operation":"state"}
   [junit4]   2> 357439 INFO  (qtp15382215-2915) [n:127.0.0.1:39846_solr c:authCollection s:shard2  x:authCollection_shard2_replica1] o.a.s.c.ZkController look for our core node name
   [junit4]   2> 357540 INFO  (OverseerStateUpdate-96559468139118599-127.0.0.1:40609_solr-n_0000000000) [n:127.0.0.1:40609_solr    ] o.a.s.c.o.ZkStateWriter going to update_collection /collections/authCollection/state.json version: 0
   [junit4]   2> 357540 INFO  (zkCallback-495-thread-2-processing-n:127.0.0.1:40609_solr) [n:127.0.0.1:40609_solr    ] o.a.s.c.c.ZkStateReader A cluster state change: [WatchedEvent state:SyncConnected type:NodeDataChanged path:/collections/authCollection/state.json] for collection [authCollection] has occurred - updating... (live nodes size: [3])
   [junit4]   2> 357540 INFO  (zkCallback-497-thread-1-processing-n:127.0.0.1:39509_solr) [n:127.0.0.1:39509_solr    ] o.a.s.c.c.ZkStateReader A cluster state change: [WatchedEvent state:SyncConnected type:NodeDataChanged path:/collections/authCollection/state.json] for collection [authCollection] has occurred - updating... (live nodes size: [3])
   [junit4]   2> 357540 INFO  (zkCallback-496-thread-1-processing-n:127.0.0.1:39846_solr) [n:127.0.0.1:39846_solr    ] o.a.s.c.c.ZkStateReader A cluster state change: [WatchedEvent state:SyncConnected type:NodeDataChanged path:/collections/authCollection/state.json] for collection [authCollection] has occurred - updating... (live nodes size: [3])
   [junit4]   2> 357541 INFO  (zkCallback-495-thread-2-processing-n:127.0.0.1:40609_solr) [n:127.0.0.1:40609_solr    ] o.a.s.c.c.ZkStateReader Updating data for [authCollection] from [0] to [1]
   [junit4]   2> 357541 INFO  (zkCallback-496-thread-1-processing-n:127.0.0.1:39846_solr) [n:127.0.0.1:39846_solr    ] o.a.s.c.c.ZkStateReader Updating data for [authCollection] from [0] to [1]
   [junit4]   2> 357541 INFO  (zkCallback-497-thread-1-processing-n:127.0.0.1:39509_solr) [n:127.0.0.1:39509_solr    ] o.a.s.c.c.ZkStateReader Updating data for [authCollection] from [0] to [1]
   [junit4]   2> 358367 INFO  (qtp19212712-2918) [n:127.0.0.1:39509_solr c:authCollection s:shard3  x:authCollection_shard3_replica1] o.a.s.c.ZkController waiting to find shard id in clusterstate for authCollection_shard3_replica1
   [junit4]   2> 358367 INFO  (qtp19212712-2918) [n:127.0.0.1:39509_solr c:authCollection s:shard3  x:authCollection_shard3_replica1] o.a.s.c.ZkController Check for collection zkNode:authCollection
   [junit4]   2> 358368 INFO  (qtp19212712-2918) [n:127.0.0.1:39509_solr c:authCollection s:shard3  x:authCollection_shard3_replica1] o.a.s.c.ZkController Collection zkNode exists
   [junit4]   2> 358368 INFO  (qtp19212712-2918) [n:127.0.0.1:39509_solr c:authCollection s:shard3  x:authCollection_shard3_replica1] o.a.s.c.c.ZkStateReader Load collection config from: [/collections/authCollection]
   [junit4]   2> 358368 INFO  (qtp19212712-2918) [n:127.0.0.1:39509_solr c:authCollection s:shard3  x:authCollection_shard3_replica1] o.a.s.c.c.ZkStateReader path=[/collections/authCollection] [configName]=[conf] specified config exists in ZooKeeper
   [junit4]   2> 358373 INFO  (qtp19212712-2918) [n:127.0.0.1:39509_solr c:authCollection s:shard3  x:authCollection_shard3_replica1] o.a.s.c.SolrResourceLoader new SolrResourceLoader for directory: '/home/jenkins/workspace/Lucene-Solr-6.x-Linux/solr/build/solr-core/test/J2/temp/solr.security.BasicAuthIntegrationTest_AE293A8BA186279C-001/tempDir-001/node3/authCollection_shard3_replica1'
   [junit4]   2> 358374 INFO  (qtp19212712-2918) [n:127.0.0.1:39509_solr c:authCollection s:shard3  x:authCollection_shard3_replica1] o.a.s.c.SolrResourceLoader JNDI not configured for solr (NoInitialContextEx)
   [junit4]   2> 358374 INFO  (qtp19212712-2918) [n:127.0.0.1:39509_solr c:authCollection s:shard3  x:authCollection_shard3_replica1] o.a.s.c.SolrResourceLoader solr home defaulted to 'solr/' (could not find system property or JNDI)
   [junit4]   2> 358375 INFO  (qtp19212712-2918) [n:127.0.0.1:39509_solr c:authCollection s:shard3  x:authCollection_shard3_replica1] o.a.s.c.Config loaded config solrconfig.xml with version 0 
   [junit4]   2> 358381 INFO  (qtp19212712-2918) [n:127.0.0.1:39509_solr c:authCollection s:shard3  x:authCollection_shard3_replica1] o.a.s.c.SolrConfig current version of requestparams : -1
   [junit4]   2> 358383 INFO  (qtp19212712-2918) [n:127.0.0.1:39509_solr c:authCollection s:shard3  x:authCollection_shard3_replica1] o.a.s.c.SolrConfig Using Lucene MatchVersion: 6.3.0
   [junit4]   2> 358387 INFO  (qtp19212712-2918) [n:127.0.0.1:39509_solr c:authCollection s:shard3  x:authCollection_shard3_replica1] o.a.s.c.SolrConfig Loaded SolrConfig: solrconfig.xml
   [junit4]   2> 358391 INFO  (qtp19212712-2918) [n:127.0.0.1:39509_solr c:authCollection s:shard3  x:authCollection_shard3_replica1] o.a.s.s.IndexSchema [authCollection_shard3_replica1] Schema name=minimal
   [junit4]   2> 358394 INFO  (qtp19212712-2918) [n:127.0.0.1:39509_solr c:authCollection s:shard3  x:authCollection_shard3_replica1] o.a.s.s.IndexSchema unique key field: id
   [junit4]   2> 358395 INFO  (qtp19212712-2918) [n:127.0.0.1:39509_solr c:authCollection s:shard3  x:authCollection_shard3_replica1] o.a.s.c.ConfigSetProperties Did not find ConfigSet properties, assuming default properties: Can't find resource 'configsetprops.json' in classpath or '/configs/conf', cwd=/home/jenkins/workspace/Lucene-Solr-6.x-Linux/solr/build/solr-core/test/J2
   [junit4]   2> 358395 INFO  (qtp19212712-2918) [n:127.0.0.1:39509_solr c:authCollection s:shard3  x:authCollection_shard3_replica1] o.a.s.c.CoreContainer Creating SolrCore 'authCollection_shard3_replica1' using configuration from collection authCollection
   [junit4]   2> 358396 INFO  (qtp19212712-2918) [n:127.0.0.1:39509_solr c:authCollection s:shard3 r:core_node1 x:authCollection_shard3_replica1] o.a.s.c.SolrCore org.apache.solr.core.MockDirectoryFactory
   [junit4]   2> 358396 INFO  (qtp19212712-2918) [n:127.0.0.1:39509_solr c:authCollection s:shard3 r:core_node1 x:authCollection_shard3_replica1] o.a.s.c.SolrCore [[authCollection_shard3_replica1] ] Opening new SolrCore at [/home/jenkins/workspace/Lucene-Solr-6.x-Linux/solr/build/solr-core/test/J2/temp/solr.security.BasicAuthIntegrationTest_AE293A8BA186279C-001/tempDir-001/node3/authCollection_shard3_replica1], dataDir=[/home/jenkins/workspace/Lucene-Solr-6.x-Linux/solr/build/solr-core/test/J2/temp/solr.security.BasicAuthIntegrationTest_AE293A8BA186279C-001/tempDir-001/node3/./authCollection_shard3_replica1/data/]
   [junit4]   2> 358396 INFO  (qtp19212712-2918) [n:127.0.0.1:39509_solr c:authCollection s:shard3 r:core_node1 x:authCollection_shard3_replica1] o.a.s.c.SolrCore JMX monitoring not detected for core: authCollection_shard3_replica1
   [junit4]   2> 358397 INFO  (qtp19212712-2918) [n:127.0.0.1:39509_solr c:authCollection s:shard3 r:core_node1 x:authCollection_shard3_replica1] o.a.s.c.CachingDirectoryFactory return new directory for /home/jenkins/workspace/Lucene-Solr-6.x-Linux/solr/build/solr-core/test/J2/temp/solr.security.BasicAuthIntegrationTest_AE293A8BA186279C-001/tempDir-001/node3/./authCollection_shard3_replica1/data/snapshot_metadata
   [junit4]   2> 358397 INFO  (qtp19212712-2918) [n:127.0.0.1:39509_solr c:authCollection s:shard3 r:core_node1 x:authCollection_shard3_replica1] o.a.s.c.s.SolrSnapshotMetaDataManager Loading from snapshot metadata file...
   [junit4]   2> 358398 INFO  (qtp19212712-2918) [n:127.0.0.1:39509_solr c:authCollection s:shard3 r:core_node1 x:authCollection_shard3_replica1] o.a.s.c.CachingDirectoryFactory return new directory for /home/jenkins/workspace/Lucene-Solr-6.x-Linux/solr/build/solr-core/test/J2/temp/solr.security.BasicAuthIntegrationTest_AE293A8BA186279C-001/tempDir-001/node3/./authCollection_shard3_replica1/data
   [junit4]   2> 358398 INFO  (qtp19212712-2918) [n:127.0.0.1:39509_solr c:authCollection s:shard3 r:core_node1 x:authCollection_shard3_replica1] o.a.s.c.SolrCore New index directory detected: old=null new=/home/jenkins/workspace/Lucene-Solr-6.x-Linux/solr/build/solr-core/test/J2/temp/solr.security.BasicAuthIntegrationTest_AE293A8BA186279C-001/tempDir-001/node3/./authCollection_shard3_replica1/data/index/
   [junit4]   2> 358398 WARN  (qtp19212712-2918) [n:127.0.0.1:39509_solr c:authCollection s:shard3 r:core_node1 x:authCollection_shard3_replica1] o.a.s.c.SolrCore [authCollection_shard3_replica1] Solr index directory '/home/jenkins/workspace/Lucene-Solr-6.x-Linux/solr/build/solr-core/test/J2/temp/solr.security.BasicAuthIntegrationTest_AE293A8BA186279C-001/tempDir-001/node3/./authCollection_shard3_replica1/data/index' doesn't exist. Creating new index...
   [junit4]   2> 358400 INFO  (qtp19212712-2918) [n:127.0.0.1:39509_solr c:authCollection s:shard3 r:core_node1 x:authCollection_shard3_replica1] o.a.s.c.CachingDirectoryFactory return new directory for /home/jenkins/workspace/Lucene-Solr-6.x-Linux/solr/build/solr-core/test/J2/temp/solr.security.BasicAuthIntegrationTest_AE293A8BA186279C-001/tempDir-001/node3/./authCollection_shard3_replica1/data/index
   [junit4]   2> 358402 INFO  (qtp19212712-2918) [n:127.0.0.1:39509_solr c:authCollection s:shard3 r:core_node1 x:authCollection_shard3_replica1] o.a.s.c.SolrDeletionPolicy SolrDeletionPolicy.onCommit: commits: num=1
   [junit4]   2> 	commit{dir=MockDirectoryWrapper(RAMDirectory@1080c4 lockFactory=org.apache.lucene.store.SingleInstanceLockFactory@1ada596),segFN=segments_1,generation=1}
   [junit4]   2> 358402 INFO  (qtp19212712-2918) [n:127.0.0.1:39509_solr c:authCollection s:shard3 r:core_node1 x:authCollection_shard3_replica1] o.a.s.c.SolrDeletionPolicy newest commit generation = 1
   [junit4]   2> 358404 INFO  (qtp19212712-2918) [n:127.0.0.1:39509_solr c:authCollection s:shard3 r:core_node1 x:authCollection_shard3_replica1] o.a.s.c.SolrCore no updateRequestProcessorChain defined as default, creating implicit default
   [junit4]   2> 358406 INFO  (qtp19212712-2918) [n:127.0.0.1:39509_solr c:authCollection s:shard3 r:core_node1 x:authCollection_shard3_replica1] o.a.s.h.l.XMLLoader xsltCacheLifetimeSeconds=60
   [junit4]   2> 358407 INFO  (qtp19212712-2918) [n:127.0.0.1:39509_solr c:authCollection s:shard3 r:core_node1 x:authCollection_shard3_replica1] o.a.s.h.l.XMLLoader xsltCacheLifetimeSeconds=60
   [junit4]   2> 358407 INFO  (qtp19212712-2918) [n:127.0.0.1:39509_solr c:authCollection s:shard3 r:core_node1 x:authCollection_shard3_replica1] o.a.s.h.l.XMLLoader xsltCacheLifetimeSeconds=60
   [junit4]   2> 358408 INFO  (qtp19212712-2918) [n:127.0.0.1:39509_solr c:authCollection s:shard3 r:core_node1 x:authCollection_shard3_replica1] o.a.s.h.l.XMLLoader xsltCacheLifetimeSeconds=60
   [junit4]   2> 358410 INFO  (qtp19212712-2918) [n:127.0.0.1:39509_solr c:authCollection s:shard3 r:core_node1 x:authCollection_shard3_replica1] o.a.s.c.RequestHandlers Registered paths: /admin/mbeans,/update/json/docs,/admin/luke,/export,/get,/admin/properties,/update/json,/admin/threads,/update/csv,/sql,/graph,/select,/admin/segments,/admin/system,/replication,/config,/stream,/schema,/admin/plugins,/admin/logging,/admin/ping,/update,/admin/file,/terms
   [junit4]   2> 358410 INFO  (qtp19212712-2918) [n:127.0.0.1:39509_solr c:authCollection s:shard3 r:core_node1 x:authCollection_shard3_replica1] o.a.s.c.SolrCore Using default statsCache cache: org.apache.solr.search.stats.LocalStatsCache
   [junit4]   2> 358410 INFO  (OldIndexDirectoryCleanupThreadForCore-authCollection_shard3_replica1) [n:127.0.0.1:39509_solr c:authCollection s:shard3 r:core_node1 x:authCollection_shard3_replica1] o.a.s.c.SolrCore Looking for old index directories to cleanup for core authCollection_shard3_replica1 in /home/jenkins/workspace/Lucene-Solr-6.x-Linux/solr/build/solr-core/test/J2/temp/solr.security.BasicAuthIntegrationTest_AE293A8BA186279C-001/tempDir-001/node3/./authCollection_shard3_replica1/data/
   [junit4]   2> 358410 WARN  (OldIndexDirectoryCleanupThreadForCore-authCollection_shard3_replica1) [n:127.0.0.1:39509_solr c:authCollection s:shard3 r:core_node1 x:authCollection_shard3_replica1] o.a.s.c.DirectoryFactory /home/jenkins/workspace/Lucene-Solr-6.x-Linux/solr/build/solr-core/test/J2/temp/solr.security.BasicAuthIntegrationTest_AE293A8BA186279C-001/tempDir-001/node3/./authCollection_shard3_replica1/data/ does not point to a valid data directory; skipping clean-up of old index directories.
   [junit4]   2> 358410 INFO  (qtp19212712-2918) [n:127.0.0.1:39509_solr c:authCollection s:shard3 r:core_node1 x:authCollection_shard3_replica1] o.a.s.u.UpdateHandler Using UpdateLog implementation: org.apache.solr.update.UpdateLog
   [junit4]   2> 358410 INFO  (qtp19212712-2918) [n:127.0.0.1:39509_solr c:authCollection s:shard3 r:core_node1 x:authCollection_shard3_replica1] o.a.s.u.UpdateLog Initializing UpdateLog: dataDir=null defaultSyncLevel=FLUSH numRecordsToKeep=100 maxNumLogsToKeep=10 numVersionBuckets=65536
   [junit4]   2> 358412 INFO  (qtp19212712-2918) [n:127.0.0.1:39509_solr c:authCollection s:shard3 r:core_node1 x:authCollection_shard3_replica1] o.a.s.u.CommitTracker Hard AutoCommit: disabled
   [junit4]   2> 358412 INFO  (qtp19212712-2918) [n:127.0.0.1:39509_solr c:authCollection s:shard3 r:core_node1 x:authCollection_shard3_replica1] o.a.s.u.CommitTracker Soft AutoCommit: disabled
   [junit4]   2> 358412 INFO  (qtp19212712-2918) [n:127.0.0.1:39509_solr c:authCollection s:shard3 r:core_node1 x:authCollection_shard3_replica1] o.a.s.c.SolrDeletionPolicy SolrDeletionPolicy.onInit: commits: num=1
   [junit4]   2> 	commit{dir=MockDirectoryWrapper(RAMDirectory@1080c4 lockFactory=org.apache.lucene.store.SingleInstanceLockFactory@1ada596),segFN=segments_1,generation=1}
   [junit4]   2> 358412 INFO  (qtp19212712-2918) [n:127.0.0.1:39509_solr c:authCollection s:shard3 r:core_node1 x:authCollection_shard3_replica1] o.a.s.c.SolrDeletionPolicy newest commit generation = 1
   [junit4]   2> 358412 INFO  (qtp19212712-2918) [n:127.0.0.1:39509_solr c:authCollection s:shard3 r:core_node1 x:authCollection_shard3_replica1] o.a.s.s.SolrIndexSearcher Opening [Searcher@1666a55[authCollection_shard3_replica1] main]
   [junit4]   2> 358413 INFO  (qtp19212712-2918) [n:127.0.0.1:39509_solr c:authCollection s:shard3 r:core_node1 x:authCollection_shard3_replica1] o.a.s.c.c.ZkStateReader Load collection config from: [/collections/authCollection]
   [junit4]   2> 358413 INFO  (qtp19212712-2918) [n:127.0.0.1:39509_solr c:authCollection s:shard3 r:core_node1 x:authCollection_shard3_replica1] o.a.s.c.c.ZkStateReader path=[/collections/authCollection] [configName]=[conf] specified config exists in ZooKeeper
   [junit4]   2> 358413 INFO  (qtp19212712-2918) [n:127.0.0.1:39509_solr c:authCollection s:shard3 r:core_node1 x:authCollection_shard3_replica1] o.a.s.r.ManagedResourceStorage Setting up ZooKeeper-based storage for the RestManager with znodeBase: /configs/conf
   [junit4]   2> 358413 INFO  (qtp19212712-2918) [n:127.0.0.1:39509_solr c:authCollection s:shard3 r:core_node1 x:authCollection_shard3_replica1] o.a.s.r.ManagedResourceStorage Configured ZooKeeperStorageIO with znodeBase: /configs/conf
   [junit4]   2> 358413 INFO  (qtp19212712-2918) [n:127.0.0.1:39509_solr c:authCollection s:shard3 r:core_node1 x:authCollection_shard3_replica1] o.a.s.r.RestManager Initializing RestManager with initArgs: {}
   [junit4]   2> 358413 INFO  (qtp19212712-2918) [n:127.0.0.1:39509_solr c:authCollection s:shard3 r:core_node1 x:authCollection_shard3_replica1] o.a.s.r.ManagedResourceStorage Reading _rest_managed.json using ZooKeeperStorageIO:path=/configs/conf
   [junit4]   2> 358414 INFO  (qtp19212712-2918) [n:127.0.0.1:39509_solr c:authCollection s:shard3 r:core_node1 x:authCollection_shard3_replica1] o.a.s.r.ManagedResourceStorage No data found for znode /configs/conf/_rest_managed.json
   [junit4]   2> 358414 INFO  (qtp19212712-2918) [n:127.0.0.1:39509_solr c:authCollection s:shard3 r:core_node1 x:authCollection_shard3_replica1] o.a.s.r.ManagedResourceStorage Loaded null at path _rest_managed.json using ZooKeeperStorageIO:path=/configs/conf
   [junit4]   2> 358414 INFO  (qtp19212712-2918) [n:127.0.0.1:39509_solr c:authCollection s:shard3 r:core_node1 x:authCollection_shard3_replica1] o.a.s.r.RestManager Initializing 0 registered ManagedResources
   [junit4]   2> 358414 INFO  (qtp19212712-2918) [n:127.0.0.1:39509_solr c:authCollection s:shard3 r:core_node1 x:authCollection_shard3_replica1] o.a.s.h.ReplicationHandler Commits will be reserved for  10000
   [junit4]   2> 358414 INFO  (searcherExecutor-1695-thread-1-processing-n:127.0.0.1:39509_solr x:authCollection_shard3_replica1 s:shard3 c:authCollection r:core_node1) [n:127.0.0.1:39509_solr c:authCollection s:shard3 r:core_node1 x:authCollection_shard3_replica1] o.a.s.c.SolrCore [authCollection_shard3_replica1] Registered new searcher Searcher@1666a55[authCollection_shard3_replica1] main{ExitableDirectoryReader(UninvertingDirectoryReader())}
   [junit4]   2> 358414 INFO  (qtp19212712-2918) [n:127.0.0.1:39509_solr c:authCollection s:shard3 r:core_node1 x:authCollection_shard3_replica1] o.a.s.u.UpdateLog Looking up max value of version field to seed version buckets
   [junit4]   2> 358414 INFO  (qtp19212712-2918) [n:127.0.0.1:39509_solr c:authCollection s:shard3 r:core_node1 x:authCollection_shard3_replica1] o.a.s.u.VersionInfo Refreshing highest value of _version_ for 65536 version buckets from index
   [junit4]   2> 358414 INFO  (qtp19212712-2918) [n:127.0.0.1:39509_solr c:authCollection s:shard3 r:core_node1 x:authCollection_shard3_replica1] o.a.s.u.VersionInfo No terms found for _version_, cannot seed version bucket highest value from index
   [junit4]   2> 358414 INFO  (qtp19212712-2918) [n:127.0.0.1:39509_solr c:authCollection s:shard3 r:core_node1 x:authCollection_shard3_replica1] o.a.s.u.UpdateLog Could not find max version in index or recent updates, using new clock 1544951491806101504
   [junit4]   2> 358416 INFO  (qtp19212712-2918) [n:127.0.0.1:39509_solr c:authCollection s:shard3 r:core_node1 x:authCollection_shard3_replica1] o.a.s.u.UpdateLog Took 1.0ms to seed version buckets with highest version 1544951491806101504
   [junit4]   2> 358416 INFO  (qtp19212712-2918) [n:127.0.0.1:39509_solr c:authCollection s:shard3 r:core_node1 x:authCollection_shard3_replica1] o.a.s.c.ZkController watch zkdir /configs/conf
   [junit4]   2> 358417 INFO  (qtp19212712-2918) [n:127.0.0.1:39509_solr c:authCollection s:shard3 r:core_node1 x:authCollection_shard3_replica1] o.a.s.c.CoreContainer registering core: authCollection_shard3_replica1
   [junit4]   2> 358417 INFO  (qtp19212712-2918) [n:127.0.0.1:39509_solr c:authCollection s:shard3 r:core_node1 x:authCollection_shard3_replica1] o.a.s.c.ZkController Register replica - core:authCollection_shard3_replica1 address:https://127.0.0.1:39509/solr collection:authCollection shard:shard3
   [junit4]   2> 358418 INFO  (qtp19212712-2918) [n:127.0.0.1:39509_solr c:authCollection s:shard3 r:core_node1 x:authCollection_shard3_replica1] o.a.s.c.c.SolrZkClient makePath: /collections/authCollection/leader_elect/shard3/election
   [junit4]   2> 358420 INFO  (qtp19212712-2918) [n:127.0.0.1:39509_solr c:authCollection s:shard3 r:core_node1 x:authCollection_shard3_replica1] o.a.s.c.LeaderElector Joined leadership election with path: /collections/authCollection/leader_elect/shard3/election/96559468139118601-core_node1-n_0000000000
   [junit4]   2> 358421 INFO  (qtp19212712-2918) [n:127.0.0.1:39509_solr c:authCollection s:shard3 r:core_node1 x:authCollection_shard3_replica1] o.a.s.c.ShardLeaderElectionContext Running the leader process for shard=shard3 and weAreReplacement=false and leaderVoteWait=10000
   [junit4]   2> 358422 INFO  (qtp19212712-2918) [n:127.0.0.1:39509_solr c:authCollection s:shard3 r:core_node1 x:authCollection_shard3_replica1] o.a.s.c.ShardLeaderElectionContext Enough replicas found to continue.
   [junit4]   2> 358422 INFO  (qtp19212712-2918) [n:127.0.0.1:39509_solr c:authCollection s:shard3 r:core_node1 x:authCollection_shard3_replica1] o.a.s.c.ShardLeaderElectionContext I may be the new leader - try and sync
   [junit4]   2> 358422 INFO  (qtp19212712-2918) [n:127.0.0.1:39509_solr c:authCollection s:shard3 r:core_node1 x:authCollection_shard3_replica1] o.a.s.c.SyncStrategy Sync replicas to https://127.0.0.1:39509/solr/authCollection_shard3_replica1/
   [junit4]   2> 358422 INFO  (qtp19212712-2918) [n:127.0.0.1:39509_solr c:authCollection s:shard3 r:core_node1 x:authCollection_shard3_replica1] o.a.s.c.SyncStrategy Sync Success - now sync replicas to me
   [junit4]   2> 358422 INFO  (qtp19212712-2918) [n:127.0.0.1:39509_solr c:authCollection s:shard3 r:core_node1 x:authCollection_shard3_replica1] o.a.s.c.SyncStrategy https://127.0.0.1:39509/solr/authCollection_shard3_replica1/ has no replicas
   [junit4]   2> 358422 INFO  (OverseerStateUpdate-96559468139118599-127.0.0.1:40609_solr-n_0000000000) [n:127.0.0.1:40609_solr    ] o.a.s.c.Overseer processMessage: queueSize: 1, message = {
   [junit4]   2>   "operation":"leader",
   [junit4]   2>   "shard":"shard3",
   [junit4]   2>   "collection":"authCollection"} current state version: 0
   [junit4]   2> 358423 INFO  (qtp19212712-2918) [n:127.0.0.1:39509_solr c:authCollection s:shard3 r:core_node1 x:authCollection_shard3_replica1] o.a.s.c.c.SolrZkClient makePath: /collections/authCollection/leaders/shard3
   [junit4]   2> 358429 INFO  (qtp19212712-2918) [n:127.0.0.1:39509_solr c:authCollection s:shard3 r:core_node1 x:authCollection_shard3_replica1] o.a.s.c.ShardLeaderElectionContextBase Creating leader registration node /collections/authCollection/leaders/shard3/leader after winning as /collections/authCollection/leader_elect/shard3/election/96559468139118601-core_node1-n_0000000000
   [junit4]   2> 358431 INFO  (OverseerStateUpdate-96559468139118599-127.0.0.1:40609_solr-n_0000000000) [n:127.0.0.1:40609_solr    ] o.a.s.c.Overseer processMessage: queueSize: 1, message = {
   [junit4]   2>   "operation":"leader",
   [junit4]   2>   "shard":"shard3",
   [junit4]   2>   "collection":"authCollection",
   [junit4]   2>   "base_url":"https://127.0.0.1:39509/solr",
   [junit4]   2>   "core":"authCollection_shard3_replica1",
   [junit4]   2>   "state":"active"} current state version: 0
   [junit4]   2> 358432 INFO  (qtp19212712-2918) [n:127.0.0.1:39509_solr c:authCollection s:shard3 r:core_node1 x:authCollection_shard3_replica1] o.a.s.c.ShardLeaderElectionContext I am the new leader: https://127.0.0.1:39509/solr/authCollection_shard3_replica1/ shard3
   [junit4]   2> 358436 INFO  (qtp26831109-2904) [n:127.0.0.1:40609_solr c:authCollection s:shard1  x:authCollection_shard1_replica1] o.a.s.c.ZkController waiting to find shard id in clusterstate for authCollection_shard1_replica1
   [junit4]   2> 358436 INFO  (qtp26831109-2904) [n:127.0.0.1:40609_solr c:authCollection s:shard1  x:authCollection_shard1_replica1] o.a.s.c.ZkController Check for collection zkNode:authCollection
   [junit4]   2> 358436 INFO  (qtp26831109-2904) [n:127.0.0.1:40609_solr c:authCollection s:shard1  x:authCollection_shard1_replica1] o.a.s.c.ZkController Collection zkNode exists
   [junit4]   2> 358436 INFO  (qtp26831109-2904) [n:127.0.0.1:40609_solr c:authCollection s:shard1  x:authCollection_shard1_replica1] o.a.s.c.c.ZkStateReader Load collection config from: [/collections/authCollection]
   [junit4]   2> 358436 INFO  (qtp26831109-2904) [n:127.0.0.1:40609_solr c:authCollection s:shard1  x:authCollection_shard1_replica1] o.a.s.c.c.ZkStateReader path=[/collections/authCollection] [configName]=[conf] specified config exists in ZooKeeper
   [junit4]   2> 358436 INFO  (qtp26831109-2904) [n:127.0.0.1:40609_solr c:authCollection s:shard1  x:authCollection_shard1_replica1] o.a.s.c.SolrResourceLoader new SolrResourceLoader for directory: '/home/jenkins/workspace/Lucene-Solr-6.x-Linux/solr/build/solr-core/test/J2/temp/solr.security.BasicAuthIntegrationTest_AE293A8BA186279C-001/tempDir-001/node1/authCollection_shard1_replica1'
   [junit4]   2> 358437 INFO  (qtp26831109-2904) [n:127.0.0.1:40609_solr c:authCollection s:shard1  x:authCollection_shard1_replica1] o.a.s.c.SolrResourceLoader JNDI not configured for solr (NoInitialContextEx)
   [junit4]   2> 358437 INFO  (qtp26831109-2904) [n:127.0.0.1:40609_solr c:authCollection s:shard1  x:authCollection_shard1_replica1] o.a.s.c.SolrResourceLoader solr home defaulted to 'solr/' (could not find system property or JNDI)
   [junit4]   2> 358438 INFO  (qtp26831109-2904) [n:127.0.0.1:40609_solr c:authCollection s:shard1  x:authCollection_shard1_replica1] o.a.s.c.Config loaded config solrconfig.xml with version 0 
   [junit4]   2> 358439 INFO  (qtp15382215-2915) [n:127.0.0.1:39846_solr c:authCollection s:shard2  x:authCollection_shard2_replica1] o.a.s.c.ZkController waiting to find shard id in clusterstate for authCollection_shard2_replica1
   [junit4]   2> 358439 INFO  (qtp15382215-2915) [n:127.0.0.1:39846_solr c:authCollection s:shard2  x:authCollection_shard2_replica1] o.a.s.c.ZkController Check for collection zkNode:authCollection
   [junit4]   2> 358440 INFO  (qtp15382215-2915) [n:127.0.0.1:39846_solr c:authCollection s:shard2  x:authCollection_shard2_replica1] o.a.s.c.ZkController Collection zkNode exists
   [junit4]   2> 358440 INFO  (qtp15382215-2915) [n:127.0.0.1:39846_solr c:authCollection s:shard2  x:authCollection_shard2_replica1] o.a.s.c.c.ZkStateReader Load collection config from: [/collections/authCollection]
   [junit4]   2> 358441 INFO  (qtp15382215-2915) [n:127.0.0.1:39846_solr c:authCollection s:shard2  x:authCollection_shard2_replica1] o.a.s.c.c.ZkStateReader path=[/collections/authCollection] [configName]=[conf] specified config exists in ZooKeeper
   [junit4]   2> 358441 INFO  (qtp15382215-2915) [n:127.0.0.1:39846_solr c:authCollection s:shard2  x:authCollection_shard2_replica1] o.a.s.c.SolrResourceLoader new SolrResourceLoader for directory: '/home/jenkins/workspace/Lucene-Solr-6.x-Linux/solr/build/solr-core/test/J2/temp/solr.security.BasicAuthIntegrationTest_AE293A8BA186279C-001/tempDir-00

[...truncated too long message...]

r-core/test/J2/temp/solr.security.BasicAuthIntegrationTest_AE293A8BA186279C-001/tempDir-001/node2/./authCollection_shard2_replica1/data
   [junit4]   2> 360743 INFO  (coreCloseExecutor-1725-thread-1) [n:127.0.0.1:39846_solr c:authCollection s:shard2 r:core_node3 x:authCollection_shard2_replica1] o.a.s.c.CachingDirectoryFactory looking to close /home/jenkins/workspace/Lucene-Solr-6.x-Linux/solr/build/solr-core/test/J2/temp/solr.security.BasicAuthIntegrationTest_AE293A8BA186279C-001/tempDir-001/node2/./authCollection_shard2_replica1/data/index [CachedDir<<refCount=0;path=/home/jenkins/workspace/Lucene-Solr-6.x-Linux/solr/build/solr-core/test/J2/temp/solr.security.BasicAuthIntegrationTest_AE293A8BA186279C-001/tempDir-001/node2/./authCollection_shard2_replica1/data/index;done=false>>]
   [junit4]   2> 360743 INFO  (coreCloseExecutor-1725-thread-1) [n:127.0.0.1:39846_solr c:authCollection s:shard2 r:core_node3 x:authCollection_shard2_replica1] o.a.s.c.CachingDirectoryFactory Closing directory, CoreContainer#isShutdown=true
   [junit4]   2> 360743 INFO  (coreCloseExecutor-1725-thread-1) [n:127.0.0.1:39846_solr c:authCollection s:shard2 r:core_node3 x:authCollection_shard2_replica1] o.a.s.c.CachingDirectoryFactory Closing directory: /home/jenkins/workspace/Lucene-Solr-6.x-Linux/solr/build/solr-core/test/J2/temp/solr.security.BasicAuthIntegrationTest_AE293A8BA186279C-001/tempDir-001/node2/./authCollection_shard2_replica1/data/index
   [junit4]   2> 360751 INFO  (jetty-launcher-481-thread-2) [    ] o.a.s.c.Overseer Overseer (id=96559468139118599-127.0.0.1:40609_solr-n_0000000000) closing
   [junit4]   2> 360751 INFO  (OverseerStateUpdate-96559468139118599-127.0.0.1:40609_solr-n_0000000000) [n:127.0.0.1:40609_solr    ] o.a.s.c.Overseer Overseer Loop exiting : 127.0.0.1:40609_solr
   [junit4]   2> 360751 INFO  (zkCallback-496-thread-2-processing-n:127.0.0.1:39846_solr) [n:127.0.0.1:39846_solr    ] o.a.s.c.c.ZkStateReader A live node change: [WatchedEvent state:SyncConnected type:NodeChildrenChanged path:/live_nodes], has occurred - updating... (live nodes size: [3])
   [junit4]   2> 360751 WARN  (zkCallback-496-thread-2-processing-n:127.0.0.1:39846_solr) [n:127.0.0.1:39846_solr    ] o.a.s.c.c.ZkStateReader ZooKeeper watch triggered, but Solr cannot talk to ZK: [KeeperErrorCode = Session expired for /live_nodes]
   [junit4]   2> 360751 INFO  (zkCallback-495-thread-3-processing-n:127.0.0.1:40609_solr) [n:127.0.0.1:40609_solr    ] o.a.s.c.c.ZkStateReader A live node change: [WatchedEvent state:SyncConnected type:NodeChildrenChanged path:/live_nodes], has occurred - updating... (live nodes size: [3])
   [junit4]   2> 360754 INFO  (zkCallback-495-thread-3-processing-n:127.0.0.1:40609_solr) [n:127.0.0.1:40609_solr    ] o.a.s.c.c.ZkStateReader Updated live nodes from ZooKeeper... (3) -> (1)
   [junit4]   2> 360754 INFO  (jetty-launcher-481-thread-1) [    ] o.e.j.s.h.ContextHandler Stopped o.e.j.s.ServletContextHandler@16a0cb2{/solr,null,UNAVAILABLE}
   [junit4]   2> 360754 INFO  (zkCallback-495-thread-3-processing-n:127.0.0.1:40609_solr) [n:127.0.0.1:40609_solr    ] o.a.s.c.c.ZkStateReader A live node change: [WatchedEvent state:SyncConnected type:NodeChildrenChanged path:/live_nodes], has occurred - updating... (live nodes size: [1])
   [junit4]   2> 360755 ERROR (TEST-BasicAuthIntegrationTest.testBasicAuth-seed#[AE293A8BA186279C]-EventThread) [n:127.0.0.1:39509_solr    ] o.a.z.ClientCnxn Error while calling watcher 
   [junit4]   2> java.util.concurrent.RejectedExecutionException: Task org.apache.solr.common.util.ExecutorUtil$MDCAwareThreadPoolExecutor$$Lambda$51/9592308@1e32514 rejected from org.apache.solr.common.util.ExecutorUtil$MDCAwareThreadPoolExecutor@1dca170[Terminated, pool size = 0, active threads = 0, queued tasks = 0, completed tasks = 7]
   [junit4]   2> 	at java.util.concurrent.ThreadPoolExecutor$AbortPolicy.rejectedExecution(ThreadPoolExecutor.java:2047)
   [junit4]   2> 	at java.util.concurrent.ThreadPoolExecutor.reject(ThreadPoolExecutor.java:823)
   [junit4]   2> 	at java.util.concurrent.ThreadPoolExecutor.execute(ThreadPoolExecutor.java:1369)
   [junit4]   2> 	at org.apache.solr.common.util.ExecutorUtil$MDCAwareThreadPoolExecutor.execute(ExecutorUtil.java:214)
   [junit4]   2> 	at java.util.concurrent.AbstractExecutorService.submit(AbstractExecutorService.java:112)
   [junit4]   2> 	at org.apache.solr.common.cloud.SolrZkClient$3.process(SolrZkClient.java:266)
   [junit4]   2> 	at org.apache.zookeeper.ClientCnxn$EventThread.processEvent(ClientCnxn.java:522)
   [junit4]   2> 	at org.apache.zookeeper.ClientCnxn$EventThread.run(ClientCnxn.java:498)
   [junit4]   2> 360755 ERROR (TEST-BasicAuthIntegrationTest.testBasicAuth-seed#[AE293A8BA186279C]-EventThread) [n:127.0.0.1:39509_solr    ] o.a.z.ClientCnxn Error while calling watcher 
   [junit4]   2> java.util.concurrent.RejectedExecutionException: Task org.apache.solr.common.util.ExecutorUtil$MDCAwareThreadPoolExecutor$$Lambda$51/9592308@107997e rejected from org.apache.solr.common.util.ExecutorUtil$MDCAwareThreadPoolExecutor@1dca170[Terminated, pool size = 0, active threads = 0, queued tasks = 0, completed tasks = 7]
   [junit4]   2> 	at java.util.concurrent.ThreadPoolExecutor$AbortPolicy.rejectedExecution(ThreadPoolExecutor.java:2047)
   [junit4]   2> 	at java.util.concurrent.ThreadPoolExecutor.reject(ThreadPoolExecutor.java:823)
   [junit4]   2> 	at java.util.concurrent.ThreadPoolExecutor.execute(ThreadPoolExecutor.java:1369)
   [junit4]   2> 	at org.apache.solr.common.util.ExecutorUtil$MDCAwareThreadPoolExecutor.execute(ExecutorUtil.java:214)
   [junit4]   2> 	at java.util.concurrent.AbstractExecutorService.submit(AbstractExecutorService.java:112)
   [junit4]   2> 	at org.apache.solr.common.cloud.SolrZkClient$3.process(SolrZkClient.java:266)
   [junit4]   2> 	at org.apache.zookeeper.ClientCnxn$EventThread.processEvent(ClientCnxn.java:522)
   [junit4]   2> 	at org.apache.zookeeper.ClientCnxn$EventThread.run(ClientCnxn.java:498)
   [junit4]   2> 360757 INFO  (jetty-launcher-481-thread-3) [    ] o.e.j.s.h.ContextHandler Stopped o.e.j.s.ServletContextHandler@8f92c3{/solr,null,UNAVAILABLE}
   [junit4]   2> 362254 WARN  (zkCallback-495-thread-3-processing-n:127.0.0.1:40609_solr) [n:127.0.0.1:40609_solr    ] o.a.s.c.c.ZkStateReader ZooKeeper watch triggered, but Solr cannot talk to ZK: [KeeperErrorCode = Session expired for /live_nodes]
   [junit4]   2> 362255 INFO  (jetty-launcher-481-thread-2) [    ] o.e.j.s.h.ContextHandler Stopped o.e.j.s.ServletContextHandler@159af0d{/solr,null,UNAVAILABLE}
   [junit4]   2> 362255 INFO  (SUITE-BasicAuthIntegrationTest-seed#[AE293A8BA186279C]-worker) [    ] o.a.s.c.ZkTestServer connecting to 127.0.0.1:44692 44692
   [junit4]   2> 362278 INFO  (Thread-618) [    ] o.a.s.c.ZkTestServer connecting to 127.0.0.1:44692 44692
   [junit4]   2> 362278 WARN  (Thread-618) [    ] o.a.s.c.ZkTestServer Watch limit violations: 
   [junit4]   2> Maximum concurrent create/delete watches above limit:
   [junit4]   2> 
   [junit4]   2> 	5	/solr/aliases.json
   [junit4]   2> 	4	/solr/security.json
   [junit4]   2> 	4	/solr/configs/conf
   [junit4]   2> 
   [junit4]   2> Maximum concurrent data watches above limit:
   [junit4]   2> 
   [junit4]   2> 	5	/solr/clusterstate.json
   [junit4]   2> 	5	/solr/clusterprops.json
   [junit4]   2> 	4	/solr/collections/authCollection/state.json
   [junit4]   2> 	2	/solr/overseer_elect/election/96559468139118600-127.0.0.1:39846_solr-n_0000000001
   [junit4]   2> 
   [junit4]   2> Maximum concurrent children watches above limit:
   [junit4]   2> 
   [junit4]   2> 	13	/solr/overseer/queue
   [junit4]   2> 	5	/solr/collections
   [junit4]   2> 	4	/solr/live_nodes
   [junit4]   2> 	3	/solr/overseer/collection-queue-work
   [junit4]   2> 	3	/solr/overseer/queue-work
   [junit4]   2> 
   [junit4]   2> 362278 INFO  (SUITE-BasicAuthIntegrationTest-seed#[AE293A8BA186279C]-worker) [    ] o.a.s.SolrTestCaseJ4 ###deleteCore
   [junit4]   2> NOTE: leaving temporary files on disk at: /home/jenkins/workspace/Lucene-Solr-6.x-Linux/solr/build/solr-core/test/J2/temp/solr.security.BasicAuthIntegrationTest_AE293A8BA186279C-001
   [junit4]   2> Sep 09, 2016 12:22:41 AM com.carrotsearch.randomizedtesting.ThreadLeakControl checkThreadLeaks
   [junit4]   2> WARNING: Will linger awaiting termination of 1 leaked thread(s).
   [junit4]   2> NOTE: test params are: codec=Asserting(Lucene62): {}, docValues:{}, maxPointsInLeafNode=826, maxMBSortInHeap=6.497525899294576, sim=RandomSimilarity(queryNorm=true,coord=crazy): {}, locale=pt, timezone=US/Aleutian
   [junit4]   2> NOTE: Linux 4.4.0-36-generic i386/Oracle Corporation 1.8.0_102 (32-bit)/cpus=12,threads=1,free=198160152,total=536870912
   [junit4]   2> NOTE: All tests run in this JVM: [TimeZoneUtilsTest, TestStressReorder, SmileWriterTest, BlockJoinFacetSimpleTest, StatelessScriptUpdateProcessorFactoryTest, TestConfigSetsAPI, CurrencyFieldXmlFileTest, TestZkChroot, TestMaxScoreQueryParser, FieldMutatingUpdateProcessorTest, ExitableDirectoryReaderTest, StatsComponentTest, TestSizeLimitedDistributedMap, TestReversedWildcardFilterFactory, TestReload, LukeRequestHandlerTest, TestSolrQueryParser, TestLMJelinekMercerSimilarityFactory, TestNonDefinedSimilarityFactory, TestUtils, CoreAdminRequestStatusTest, BasicDistributedZk2Test, TestOverriddenPrefixQueryForCustomFieldType, TestDFRSimilarityFactory, DistributedFacetPivotLongTailTest, BigEndianAscendingWordDeserializerTest, TestDynamicFieldResource, CachingDirectoryFactoryTest, TestDocTermOrds, HdfsNNFailoverTest, CustomCollectionTest, DistributedSuggestComponentTest, TestCloudPivotFacet, JavabinLoaderTest, VMParamsZkACLAndCredentialsProvidersTest, UpdateParamsTest, TestStandardQParsers, ConfigSetsAPITest, BadCopyFieldTest, OverseerStatusTest, RecoveryZkTest, TestSolrConfigHandler, SpatialRPTFieldTypeTest, BasicAuthIntegrationTest]
   [junit4] Completed [108/630 (1!)] on J2 in 5.89s, 1 test, 1 error <<< FAILURES!

[...truncated 54258 lines...]


Mime
View raw message