lucene-dev mailing list archives

Site index · List index
Message view « Date » · « Thread »
Top « Date » · « Thread »
From Policeman Jenkins Server <jenk...@thetaphi.de>
Subject [JENKINS] Lucene-Solr-master-Windows (64bit/jdk1.8.0_102) - Build # 6092 - Still Unstable!
Date Thu, 01 Sep 2016 13:40:46 GMT
Build: http://jenkins.thetaphi.de/job/Lucene-Solr-master-Windows/6092/
Java: 64bit/jdk1.8.0_102 -XX:-UseCompressedOops -XX:+UseG1GC

5 tests failed.
FAILED:  junit.framework.TestSuite.org.apache.solr.schema.TestManagedSchemaAPI

Error Message:
ObjectTracker found 10 object(s) that were not released!!! [MockDirectoryWrapper, MockDirectoryWrapper, MockDirectoryWrapper, MDCAwareThreadPoolExecutor, MockDirectoryWrapper, TransactionLog, TransactionLog, MockDirectoryWrapper, MDCAwareThreadPoolExecutor, MockDirectoryWrapper]

Stack Trace:
java.lang.AssertionError: ObjectTracker found 10 object(s) that were not released!!! [MockDirectoryWrapper, MockDirectoryWrapper, MockDirectoryWrapper, MDCAwareThreadPoolExecutor, MockDirectoryWrapper, TransactionLog, TransactionLog, MockDirectoryWrapper, MDCAwareThreadPoolExecutor, MockDirectoryWrapper]
	at __randomizedtesting.SeedInfo.seed([8D1D4826B214854E]:0)
	at org.junit.Assert.fail(Assert.java:93)
	at org.junit.Assert.assertTrue(Assert.java:43)
	at org.junit.Assert.assertNull(Assert.java:551)
	at org.apache.solr.SolrTestCaseJ4.teardownTestCases(SolrTestCaseJ4.java:257)
	at sun.reflect.GeneratedMethodAccessor29.invoke(Unknown Source)
	at sun.reflect.DelegatingMethodAccessorImpl.invoke(DelegatingMethodAccessorImpl.java:43)
	at java.lang.reflect.Method.invoke(Method.java:498)
	at com.carrotsearch.randomizedtesting.RandomizedRunner.invoke(RandomizedRunner.java:1764)
	at com.carrotsearch.randomizedtesting.RandomizedRunner$7.evaluate(RandomizedRunner.java:834)
	at com.carrotsearch.randomizedtesting.rules.StatementAdapter.evaluate(StatementAdapter.java:36)
	at com.carrotsearch.randomizedtesting.rules.SystemPropertiesRestoreRule$1.evaluate(SystemPropertiesRestoreRule.java:57)
	at org.apache.lucene.util.AbstractBeforeAfterRule$1.evaluate(AbstractBeforeAfterRule.java:45)
	at com.carrotsearch.randomizedtesting.rules.StatementAdapter.evaluate(StatementAdapter.java:36)
	at org.apache.lucene.util.TestRuleStoreClassName$1.evaluate(TestRuleStoreClassName.java:41)
	at com.carrotsearch.randomizedtesting.rules.NoShadowingOrOverridesOnMethodsRule$1.evaluate(NoShadowingOrOverridesOnMethodsRule.java:40)
	at com.carrotsearch.randomizedtesting.rules.NoShadowingOrOverridesOnMethodsRule$1.evaluate(NoShadowingOrOverridesOnMethodsRule.java:40)
	at com.carrotsearch.randomizedtesting.rules.StatementAdapter.evaluate(StatementAdapter.java:36)
	at com.carrotsearch.randomizedtesting.rules.StatementAdapter.evaluate(StatementAdapter.java:36)
	at com.carrotsearch.randomizedtesting.rules.StatementAdapter.evaluate(StatementAdapter.java:36)
	at org.apache.lucene.util.TestRuleAssertionsRequired$1.evaluate(TestRuleAssertionsRequired.java:53)
	at org.apache.lucene.util.TestRuleMarkFailure$1.evaluate(TestRuleMarkFailure.java:47)
	at org.apache.lucene.util.TestRuleIgnoreAfterMaxFailures$1.evaluate(TestRuleIgnoreAfterMaxFailures.java:64)
	at org.apache.lucene.util.TestRuleIgnoreTestSuites$1.evaluate(TestRuleIgnoreTestSuites.java:54)
	at com.carrotsearch.randomizedtesting.rules.StatementAdapter.evaluate(StatementAdapter.java:36)
	at com.carrotsearch.randomizedtesting.ThreadLeakControl$StatementRunner.run(ThreadLeakControl.java:367)
	at java.lang.Thread.run(Thread.java:745)


FAILED:  junit.framework.TestSuite.org.apache.solr.schema.TestManagedSchemaAPI

Error Message:
Could not remove the following files (in the order of attempts):    C:\Users\jenkins\workspace\Lucene-Solr-master-Windows\solr\build\solr-core\test\J1\temp\solr.schema.TestManagedSchemaAPI_8D1D4826B214854E-001\tempDir-001\node2\testschemaapi_shard1_replica1\data\tlog\tlog.0000000000000000001: java.nio.file.FileSystemException: C:\Users\jenkins\workspace\Lucene-Solr-master-Windows\solr\build\solr-core\test\J1\temp\solr.schema.TestManagedSchemaAPI_8D1D4826B214854E-001\tempDir-001\node2\testschemaapi_shard1_replica1\data\tlog\tlog.0000000000000000001: The process cannot access the file because it is being used by another process.     C:\Users\jenkins\workspace\Lucene-Solr-master-Windows\solr\build\solr-core\test\J1\temp\solr.schema.TestManagedSchemaAPI_8D1D4826B214854E-001\tempDir-001\node2\testschemaapi_shard1_replica1\data\tlog: java.nio.file.DirectoryNotEmptyException: C:\Users\jenkins\workspace\Lucene-Solr-master-Windows\solr\build\solr-core\test\J1\temp\solr.schema.TestManagedSchemaAPI_8D1D4826B214854E-001\tempDir-001\node2\testschemaapi_shard1_replica1\data\tlog    C:\Users\jenkins\workspace\Lucene-Solr-master-Windows\solr\build\solr-core\test\J1\temp\solr.schema.TestManagedSchemaAPI_8D1D4826B214854E-001\tempDir-001\node2\testschemaapi_shard1_replica1\data: java.nio.file.DirectoryNotEmptyException: C:\Users\jenkins\workspace\Lucene-Solr-master-Windows\solr\build\solr-core\test\J1\temp\solr.schema.TestManagedSchemaAPI_8D1D4826B214854E-001\tempDir-001\node2\testschemaapi_shard1_replica1\data    C:\Users\jenkins\workspace\Lucene-Solr-master-Windows\solr\build\solr-core\test\J1\temp\solr.schema.TestManagedSchemaAPI_8D1D4826B214854E-001\tempDir-001\node2\testschemaapi_shard1_replica1: java.nio.file.DirectoryNotEmptyException: C:\Users\jenkins\workspace\Lucene-Solr-master-Windows\solr\build\solr-core\test\J1\temp\solr.schema.TestManagedSchemaAPI_8D1D4826B214854E-001\tempDir-001\node2\testschemaapi_shard1_replica1    C:\Users\jenkins\workspace\Lucene-Solr-master-Windows\solr\build\solr-core\test\J1\temp\solr.schema.TestManagedSchemaAPI_8D1D4826B214854E-001\tempDir-001\node2: java.nio.file.DirectoryNotEmptyException: C:\Users\jenkins\workspace\Lucene-Solr-master-Windows\solr\build\solr-core\test\J1\temp\solr.schema.TestManagedSchemaAPI_8D1D4826B214854E-001\tempDir-001\node2    C:\Users\jenkins\workspace\Lucene-Solr-master-Windows\solr\build\solr-core\test\J1\temp\solr.schema.TestManagedSchemaAPI_8D1D4826B214854E-001\tempDir-001\node1\testschemaapi_shard1_replica2\data\tlog\tlog.0000000000000000000: java.nio.file.FileSystemException: C:\Users\jenkins\workspace\Lucene-Solr-master-Windows\solr\build\solr-core\test\J1\temp\solr.schema.TestManagedSchemaAPI_8D1D4826B214854E-001\tempDir-001\node1\testschemaapi_shard1_replica2\data\tlog\tlog.0000000000000000000: The process cannot access the file because it is being used by another process.     C:\Users\jenkins\workspace\Lucene-Solr-master-Windows\solr\build\solr-core\test\J1\temp\solr.schema.TestManagedSchemaAPI_8D1D4826B214854E-001\tempDir-001\node1\testschemaapi_shard1_replica2\data\tlog: java.nio.file.DirectoryNotEmptyException: C:\Users\jenkins\workspace\Lucene-Solr-master-Windows\solr\build\solr-core\test\J1\temp\solr.schema.TestManagedSchemaAPI_8D1D4826B214854E-001\tempDir-001\node1\testschemaapi_shard1_replica2\data\tlog    C:\Users\jenkins\workspace\Lucene-Solr-master-Windows\solr\build\solr-core\test\J1\temp\solr.schema.TestManagedSchemaAPI_8D1D4826B214854E-001\tempDir-001\node1\testschemaapi_shard1_replica2\data: java.nio.file.DirectoryNotEmptyException: C:\Users\jenkins\workspace\Lucene-Solr-master-Windows\solr\build\solr-core\test\J1\temp\solr.schema.TestManagedSchemaAPI_8D1D4826B214854E-001\tempDir-001\node1\testschemaapi_shard1_replica2\data    C:\Users\jenkins\workspace\Lucene-Solr-master-Windows\solr\build\solr-core\test\J1\temp\solr.schema.TestManagedSchemaAPI_8D1D4826B214854E-001\tempDir-001\node1\testschemaapi_shard1_replica2: java.nio.file.DirectoryNotEmptyException: C:\Users\jenkins\workspace\Lucene-Solr-master-Windows\solr\build\solr-core\test\J1\temp\solr.schema.TestManagedSchemaAPI_8D1D4826B214854E-001\tempDir-001\node1\testschemaapi_shard1_replica2    C:\Users\jenkins\workspace\Lucene-Solr-master-Windows\solr\build\solr-core\test\J1\temp\solr.schema.TestManagedSchemaAPI_8D1D4826B214854E-001\tempDir-001\node1: java.nio.file.DirectoryNotEmptyException: C:\Users\jenkins\workspace\Lucene-Solr-master-Windows\solr\build\solr-core\test\J1\temp\solr.schema.TestManagedSchemaAPI_8D1D4826B214854E-001\tempDir-001\node1    C:\Users\jenkins\workspace\Lucene-Solr-master-Windows\solr\build\solr-core\test\J1\temp\solr.schema.TestManagedSchemaAPI_8D1D4826B214854E-001\tempDir-001: java.nio.file.DirectoryNotEmptyException: C:\Users\jenkins\workspace\Lucene-Solr-master-Windows\solr\build\solr-core\test\J1\temp\solr.schema.TestManagedSchemaAPI_8D1D4826B214854E-001\tempDir-001    C:\Users\jenkins\workspace\Lucene-Solr-master-Windows\solr\build\solr-core\test\J1\temp\solr.schema.TestManagedSchemaAPI_8D1D4826B214854E-001: java.nio.file.DirectoryNotEmptyException: C:\Users\jenkins\workspace\Lucene-Solr-master-Windows\solr\build\solr-core\test\J1\temp\solr.schema.TestManagedSchemaAPI_8D1D4826B214854E-001 

Stack Trace:
java.io.IOException: Could not remove the following files (in the order of attempts):
   C:\Users\jenkins\workspace\Lucene-Solr-master-Windows\solr\build\solr-core\test\J1\temp\solr.schema.TestManagedSchemaAPI_8D1D4826B214854E-001\tempDir-001\node2\testschemaapi_shard1_replica1\data\tlog\tlog.0000000000000000001: java.nio.file.FileSystemException: C:\Users\jenkins\workspace\Lucene-Solr-master-Windows\solr\build\solr-core\test\J1\temp\solr.schema.TestManagedSchemaAPI_8D1D4826B214854E-001\tempDir-001\node2\testschemaapi_shard1_replica1\data\tlog\tlog.0000000000000000001: The process cannot access the file because it is being used by another process.

   C:\Users\jenkins\workspace\Lucene-Solr-master-Windows\solr\build\solr-core\test\J1\temp\solr.schema.TestManagedSchemaAPI_8D1D4826B214854E-001\tempDir-001\node2\testschemaapi_shard1_replica1\data\tlog: java.nio.file.DirectoryNotEmptyException: C:\Users\jenkins\workspace\Lucene-Solr-master-Windows\solr\build\solr-core\test\J1\temp\solr.schema.TestManagedSchemaAPI_8D1D4826B214854E-001\tempDir-001\node2\testschemaapi_shard1_replica1\data\tlog
   C:\Users\jenkins\workspace\Lucene-Solr-master-Windows\solr\build\solr-core\test\J1\temp\solr.schema.TestManagedSchemaAPI_8D1D4826B214854E-001\tempDir-001\node2\testschemaapi_shard1_replica1\data: java.nio.file.DirectoryNotEmptyException: C:\Users\jenkins\workspace\Lucene-Solr-master-Windows\solr\build\solr-core\test\J1\temp\solr.schema.TestManagedSchemaAPI_8D1D4826B214854E-001\tempDir-001\node2\testschemaapi_shard1_replica1\data
   C:\Users\jenkins\workspace\Lucene-Solr-master-Windows\solr\build\solr-core\test\J1\temp\solr.schema.TestManagedSchemaAPI_8D1D4826B214854E-001\tempDir-001\node2\testschemaapi_shard1_replica1: java.nio.file.DirectoryNotEmptyException: C:\Users\jenkins\workspace\Lucene-Solr-master-Windows\solr\build\solr-core\test\J1\temp\solr.schema.TestManagedSchemaAPI_8D1D4826B214854E-001\tempDir-001\node2\testschemaapi_shard1_replica1
   C:\Users\jenkins\workspace\Lucene-Solr-master-Windows\solr\build\solr-core\test\J1\temp\solr.schema.TestManagedSchemaAPI_8D1D4826B214854E-001\tempDir-001\node2: java.nio.file.DirectoryNotEmptyException: C:\Users\jenkins\workspace\Lucene-Solr-master-Windows\solr\build\solr-core\test\J1\temp\solr.schema.TestManagedSchemaAPI_8D1D4826B214854E-001\tempDir-001\node2
   C:\Users\jenkins\workspace\Lucene-Solr-master-Windows\solr\build\solr-core\test\J1\temp\solr.schema.TestManagedSchemaAPI_8D1D4826B214854E-001\tempDir-001\node1\testschemaapi_shard1_replica2\data\tlog\tlog.0000000000000000000: java.nio.file.FileSystemException: C:\Users\jenkins\workspace\Lucene-Solr-master-Windows\solr\build\solr-core\test\J1\temp\solr.schema.TestManagedSchemaAPI_8D1D4826B214854E-001\tempDir-001\node1\testschemaapi_shard1_replica2\data\tlog\tlog.0000000000000000000: The process cannot access the file because it is being used by another process.

   C:\Users\jenkins\workspace\Lucene-Solr-master-Windows\solr\build\solr-core\test\J1\temp\solr.schema.TestManagedSchemaAPI_8D1D4826B214854E-001\tempDir-001\node1\testschemaapi_shard1_replica2\data\tlog: java.nio.file.DirectoryNotEmptyException: C:\Users\jenkins\workspace\Lucene-Solr-master-Windows\solr\build\solr-core\test\J1\temp\solr.schema.TestManagedSchemaAPI_8D1D4826B214854E-001\tempDir-001\node1\testschemaapi_shard1_replica2\data\tlog
   C:\Users\jenkins\workspace\Lucene-Solr-master-Windows\solr\build\solr-core\test\J1\temp\solr.schema.TestManagedSchemaAPI_8D1D4826B214854E-001\tempDir-001\node1\testschemaapi_shard1_replica2\data: java.nio.file.DirectoryNotEmptyException: C:\Users\jenkins\workspace\Lucene-Solr-master-Windows\solr\build\solr-core\test\J1\temp\solr.schema.TestManagedSchemaAPI_8D1D4826B214854E-001\tempDir-001\node1\testschemaapi_shard1_replica2\data
   C:\Users\jenkins\workspace\Lucene-Solr-master-Windows\solr\build\solr-core\test\J1\temp\solr.schema.TestManagedSchemaAPI_8D1D4826B214854E-001\tempDir-001\node1\testschemaapi_shard1_replica2: java.nio.file.DirectoryNotEmptyException: C:\Users\jenkins\workspace\Lucene-Solr-master-Windows\solr\build\solr-core\test\J1\temp\solr.schema.TestManagedSchemaAPI_8D1D4826B214854E-001\tempDir-001\node1\testschemaapi_shard1_replica2
   C:\Users\jenkins\workspace\Lucene-Solr-master-Windows\solr\build\solr-core\test\J1\temp\solr.schema.TestManagedSchemaAPI_8D1D4826B214854E-001\tempDir-001\node1: java.nio.file.DirectoryNotEmptyException: C:\Users\jenkins\workspace\Lucene-Solr-master-Windows\solr\build\solr-core\test\J1\temp\solr.schema.TestManagedSchemaAPI_8D1D4826B214854E-001\tempDir-001\node1
   C:\Users\jenkins\workspace\Lucene-Solr-master-Windows\solr\build\solr-core\test\J1\temp\solr.schema.TestManagedSchemaAPI_8D1D4826B214854E-001\tempDir-001: java.nio.file.DirectoryNotEmptyException: C:\Users\jenkins\workspace\Lucene-Solr-master-Windows\solr\build\solr-core\test\J1\temp\solr.schema.TestManagedSchemaAPI_8D1D4826B214854E-001\tempDir-001
   C:\Users\jenkins\workspace\Lucene-Solr-master-Windows\solr\build\solr-core\test\J1\temp\solr.schema.TestManagedSchemaAPI_8D1D4826B214854E-001: java.nio.file.DirectoryNotEmptyException: C:\Users\jenkins\workspace\Lucene-Solr-master-Windows\solr\build\solr-core\test\J1\temp\solr.schema.TestManagedSchemaAPI_8D1D4826B214854E-001

	at org.apache.lucene.util.IOUtils.rm(IOUtils.java:323)
	at org.apache.lucene.util.TestRuleTemporaryFilesCleanup.afterAlways(TestRuleTemporaryFilesCleanup.java:216)
	at com.carrotsearch.randomizedtesting.rules.TestRuleAdapter$1.afterAlways(TestRuleAdapter.java:31)
	at com.carrotsearch.randomizedtesting.rules.StatementAdapter.evaluate(StatementAdapter.java:43)
	at com.carrotsearch.randomizedtesting.rules.StatementAdapter.evaluate(StatementAdapter.java:36)
	at org.apache.lucene.util.TestRuleAssertionsRequired$1.evaluate(TestRuleAssertionsRequired.java:53)
	at org.apache.lucene.util.TestRuleMarkFailure$1.evaluate(TestRuleMarkFailure.java:47)
	at org.apache.lucene.util.TestRuleIgnoreAfterMaxFailures$1.evaluate(TestRuleIgnoreAfterMaxFailures.java:64)
	at org.apache.lucene.util.TestRuleIgnoreTestSuites$1.evaluate(TestRuleIgnoreTestSuites.java:54)
	at com.carrotsearch.randomizedtesting.rules.StatementAdapter.evaluate(StatementAdapter.java:36)
	at com.carrotsearch.randomizedtesting.ThreadLeakControl$StatementRunner.run(ThreadLeakControl.java:367)
	at java.lang.Thread.run(Thread.java:745)


FAILED:  org.apache.solr.common.cloud.TestCollectionStateWatchers.testDeletionsTriggerWatches

Error Message:
Error from server at http://127.0.0.1:50630/solr: Could not find collection : tobedeleted

Stack Trace:
org.apache.solr.client.solrj.impl.HttpSolrClient$RemoteSolrException: Error from server at http://127.0.0.1:50630/solr: Could not find collection : tobedeleted
	at __randomizedtesting.SeedInfo.seed([BED70CE32A0F39F3:1C16C46CA86CEF9E]:0)
	at org.apache.solr.client.solrj.impl.HttpSolrClient.executeMethod(HttpSolrClient.java:608)
	at org.apache.solr.client.solrj.impl.HttpSolrClient.request(HttpSolrClient.java:261)
	at org.apache.solr.client.solrj.impl.HttpSolrClient.request(HttpSolrClient.java:250)
	at org.apache.solr.client.solrj.impl.LBHttpSolrClient.doRequest(LBHttpSolrClient.java:415)
	at org.apache.solr.client.solrj.impl.LBHttpSolrClient.request(LBHttpSolrClient.java:367)
	at org.apache.solr.client.solrj.impl.CloudSolrClient.sendRequest(CloudSolrClient.java:1280)
	at org.apache.solr.client.solrj.impl.CloudSolrClient.requestWithRetryOnStaleState(CloudSolrClient.java:1050)
	at org.apache.solr.client.solrj.impl.CloudSolrClient.request(CloudSolrClient.java:992)
	at org.apache.solr.client.solrj.SolrRequest.process(SolrRequest.java:149)
	at org.apache.solr.client.solrj.SolrRequest.process(SolrRequest.java:166)
	at org.apache.solr.common.cloud.TestCollectionStateWatchers.testDeletionsTriggerWatches(TestCollectionStateWatchers.java:275)
	at sun.reflect.NativeMethodAccessorImpl.invoke0(Native Method)
	at sun.reflect.NativeMethodAccessorImpl.invoke(NativeMethodAccessorImpl.java:62)
	at sun.reflect.DelegatingMethodAccessorImpl.invoke(DelegatingMethodAccessorImpl.java:43)
	at java.lang.reflect.Method.invoke(Method.java:498)
	at com.carrotsearch.randomizedtesting.RandomizedRunner.invoke(RandomizedRunner.java:1764)
	at com.carrotsearch.randomizedtesting.RandomizedRunner$8.evaluate(RandomizedRunner.java:871)
	at com.carrotsearch.randomizedtesting.RandomizedRunner$9.evaluate(RandomizedRunner.java:907)
	at com.carrotsearch.randomizedtesting.RandomizedRunner$10.evaluate(RandomizedRunner.java:921)
	at com.carrotsearch.randomizedtesting.rules.SystemPropertiesRestoreRule$1.evaluate(SystemPropertiesRestoreRule.java:57)
	at org.apache.lucene.util.TestRuleSetupTeardownChained$1.evaluate(TestRuleSetupTeardownChained.java:49)
	at org.apache.lucene.util.AbstractBeforeAfterRule$1.evaluate(AbstractBeforeAfterRule.java:45)
	at org.apache.lucene.util.TestRuleThreadAndTestName$1.evaluate(TestRuleThreadAndTestName.java:48)
	at org.apache.lucene.util.TestRuleIgnoreAfterMaxFailures$1.evaluate(TestRuleIgnoreAfterMaxFailures.java:64)
	at org.apache.lucene.util.TestRuleMarkFailure$1.evaluate(TestRuleMarkFailure.java:47)
	at com.carrotsearch.randomizedtesting.rules.StatementAdapter.evaluate(StatementAdapter.java:36)
	at com.carrotsearch.randomizedtesting.ThreadLeakControl$StatementRunner.run(ThreadLeakControl.java:367)
	at com.carrotsearch.randomizedtesting.ThreadLeakControl.forkTimeoutingTask(ThreadLeakControl.java:809)
	at com.carrotsearch.randomizedtesting.ThreadLeakControl$3.evaluate(ThreadLeakControl.java:460)
	at com.carrotsearch.randomizedtesting.RandomizedRunner.runSingleTest(RandomizedRunner.java:880)
	at com.carrotsearch.randomizedtesting.RandomizedRunner$5.evaluate(RandomizedRunner.java:781)
	at com.carrotsearch.randomizedtesting.RandomizedRunner$6.evaluate(RandomizedRunner.java:816)
	at com.carrotsearch.randomizedtesting.RandomizedRunner$7.evaluate(RandomizedRunner.java:827)
	at com.carrotsearch.randomizedtesting.rules.StatementAdapter.evaluate(StatementAdapter.java:36)
	at com.carrotsearch.randomizedtesting.rules.SystemPropertiesRestoreRule$1.evaluate(SystemPropertiesRestoreRule.java:57)
	at org.apache.lucene.util.AbstractBeforeAfterRule$1.evaluate(AbstractBeforeAfterRule.java:45)
	at com.carrotsearch.randomizedtesting.rules.StatementAdapter.evaluate(StatementAdapter.java:36)
	at org.apache.lucene.util.TestRuleStoreClassName$1.evaluate(TestRuleStoreClassName.java:41)
	at com.carrotsearch.randomizedtesting.rules.NoShadowingOrOverridesOnMethodsRule$1.evaluate(NoShadowingOrOverridesOnMethodsRule.java:40)
	at com.carrotsearch.randomizedtesting.rules.NoShadowingOrOverridesOnMethodsRule$1.evaluate(NoShadowingOrOverridesOnMethodsRule.java:40)
	at com.carrotsearch.randomizedtesting.rules.StatementAdapter.evaluate(StatementAdapter.java:36)
	at com.carrotsearch.randomizedtesting.rules.StatementAdapter.evaluate(StatementAdapter.java:36)
	at com.carrotsearch.randomizedtesting.rules.StatementAdapter.evaluate(StatementAdapter.java:36)
	at org.apache.lucene.util.TestRuleAssertionsRequired$1.evaluate(TestRuleAssertionsRequired.java:53)
	at org.apache.lucene.util.TestRuleMarkFailure$1.evaluate(TestRuleMarkFailure.java:47)
	at org.apache.lucene.util.TestRuleIgnoreAfterMaxFailures$1.evaluate(TestRuleIgnoreAfterMaxFailures.java:64)
	at org.apache.lucene.util.TestRuleIgnoreTestSuites$1.evaluate(TestRuleIgnoreTestSuites.java:54)
	at com.carrotsearch.randomizedtesting.rules.StatementAdapter.evaluate(StatementAdapter.java:36)
	at com.carrotsearch.randomizedtesting.ThreadLeakControl$StatementRunner.run(ThreadLeakControl.java:367)
	at java.lang.Thread.run(Thread.java:745)


FAILED:  junit.framework.TestSuite.org.apache.solr.cloud.TestSolrCloudWithSecureImpersonation

Error Message:
java.lang.NullPointerException

Stack Trace:
com.google.common.util.concurrent.UncheckedExecutionException: java.lang.NullPointerException
	at __randomizedtesting.SeedInfo.seed([8D1D4826B214854E]:0)
	at com.google.common.cache.LocalCache$Segment.get(LocalCache.java:2263)
	at com.google.common.cache.LocalCache.get(LocalCache.java:4000)
	at com.google.common.cache.LocalCache.getOrLoad(LocalCache.java:4004)
	at com.google.common.cache.LocalCache$LocalLoadingCache.get(LocalCache.java:4874)
	at org.apache.hadoop.security.Groups.getGroups(Groups.java:182)
	at org.apache.solr.cloud.TestSolrCloudWithSecureImpersonation.getUsersFirstGroup(TestSolrCloudWithSecureImpersonation.java:64)
	at org.apache.solr.cloud.TestSolrCloudWithSecureImpersonation.getImpersonatorSettings(TestSolrCloudWithSecureImpersonation.java:86)
	at org.apache.solr.cloud.TestSolrCloudWithSecureImpersonation.startup(TestSolrCloudWithSecureImpersonation.java:99)
	at sun.reflect.NativeMethodAccessorImpl.invoke0(Native Method)
	at sun.reflect.NativeMethodAccessorImpl.invoke(NativeMethodAccessorImpl.java:62)
	at sun.reflect.DelegatingMethodAccessorImpl.invoke(DelegatingMethodAccessorImpl.java:43)
	at java.lang.reflect.Method.invoke(Method.java:498)
	at com.carrotsearch.randomizedtesting.RandomizedRunner.invoke(RandomizedRunner.java:1764)
	at com.carrotsearch.randomizedtesting.RandomizedRunner$6.evaluate(RandomizedRunner.java:811)
	at com.carrotsearch.randomizedtesting.RandomizedRunner$7.evaluate(RandomizedRunner.java:827)
	at com.carrotsearch.randomizedtesting.rules.StatementAdapter.evaluate(StatementAdapter.java:36)
	at com.carrotsearch.randomizedtesting.rules.SystemPropertiesRestoreRule$1.evaluate(SystemPropertiesRestoreRule.java:57)
	at org.apache.lucene.util.AbstractBeforeAfterRule$1.evaluate(AbstractBeforeAfterRule.java:45)
	at com.carrotsearch.randomizedtesting.rules.StatementAdapter.evaluate(StatementAdapter.java:36)
	at org.apache.lucene.util.TestRuleStoreClassName$1.evaluate(TestRuleStoreClassName.java:41)
	at com.carrotsearch.randomizedtesting.rules.NoShadowingOrOverridesOnMethodsRule$1.evaluate(NoShadowingOrOverridesOnMethodsRule.java:40)
	at com.carrotsearch.randomizedtesting.rules.NoShadowingOrOverridesOnMethodsRule$1.evaluate(NoShadowingOrOverridesOnMethodsRule.java:40)
	at com.carrotsearch.randomizedtesting.rules.StatementAdapter.evaluate(StatementAdapter.java:36)
	at com.carrotsearch.randomizedtesting.rules.StatementAdapter.evaluate(StatementAdapter.java:36)
	at com.carrotsearch.randomizedtesting.rules.StatementAdapter.evaluate(StatementAdapter.java:36)
	at org.apache.lucene.util.TestRuleAssertionsRequired$1.evaluate(TestRuleAssertionsRequired.java:53)
	at org.apache.lucene.util.TestRuleMarkFailure$1.evaluate(TestRuleMarkFailure.java:47)
	at org.apache.lucene.util.TestRuleIgnoreAfterMaxFailures$1.evaluate(TestRuleIgnoreAfterMaxFailures.java:64)
	at org.apache.lucene.util.TestRuleIgnoreTestSuites$1.evaluate(TestRuleIgnoreTestSuites.java:54)
	at com.carrotsearch.randomizedtesting.rules.StatementAdapter.evaluate(StatementAdapter.java:36)
	at com.carrotsearch.randomizedtesting.ThreadLeakControl$StatementRunner.run(ThreadLeakControl.java:367)
	at java.lang.Thread.run(Thread.java:745)
Caused by: java.lang.NullPointerException
	at java.lang.ProcessBuilder.start(ProcessBuilder.java:1012)
	at org.apache.hadoop.util.Shell.runCommand(Shell.java:483)
	at org.apache.hadoop.util.Shell.run(Shell.java:456)
	at org.apache.hadoop.util.Shell$ShellCommandExecutor.execute(Shell.java:722)
	at org.apache.hadoop.util.Shell.execCommand(Shell.java:815)
	at org.apache.hadoop.util.Shell.execCommand(Shell.java:798)
	at org.apache.hadoop.security.ShellBasedUnixGroupsMapping.getUnixGroups(ShellBasedUnixGroupsMapping.java:84)
	at org.apache.hadoop.security.ShellBasedUnixGroupsMapping.getGroups(ShellBasedUnixGroupsMapping.java:52)
	at org.apache.hadoop.security.JniBasedUnixGroupsMappingWithFallback.getGroups(JniBasedUnixGroupsMappingWithFallback.java:51)
	at org.apache.hadoop.security.Groups$GroupCacheLoader.fetchGroupList(Groups.java:239)
	at org.apache.hadoop.security.Groups$GroupCacheLoader.load(Groups.java:220)
	at org.apache.hadoop.security.Groups$GroupCacheLoader.load(Groups.java:208)
	at com.google.common.cache.LocalCache$LoadingValueReference.loadFuture(LocalCache.java:3599)
	at com.google.common.cache.LocalCache$Segment.loadSync(LocalCache.java:2379)
	at com.google.common.cache.LocalCache$Segment.lockedGetOrLoad(LocalCache.java:2342)
	at com.google.common.cache.LocalCache$Segment.get(LocalCache.java:2257)
	... 31 more


FAILED:  junit.framework.TestSuite.org.apache.solr.cloud.TestSolrCloudWithSecureImpersonation

Error Message:


Stack Trace:
java.lang.NullPointerException
	at __randomizedtesting.SeedInfo.seed([8D1D4826B214854E]:0)
	at org.apache.solr.cloud.TestSolrCloudWithSecureImpersonation.shutdown(TestSolrCloudWithSecureImpersonation.java:154)
	at sun.reflect.NativeMethodAccessorImpl.invoke0(Native Method)
	at sun.reflect.NativeMethodAccessorImpl.invoke(NativeMethodAccessorImpl.java:62)
	at sun.reflect.DelegatingMethodAccessorImpl.invoke(DelegatingMethodAccessorImpl.java:43)
	at java.lang.reflect.Method.invoke(Method.java:498)
	at com.carrotsearch.randomizedtesting.RandomizedRunner.invoke(RandomizedRunner.java:1764)
	at com.carrotsearch.randomizedtesting.RandomizedRunner$7.evaluate(RandomizedRunner.java:834)
	at com.carrotsearch.randomizedtesting.rules.StatementAdapter.evaluate(StatementAdapter.java:36)
	at com.carrotsearch.randomizedtesting.rules.SystemPropertiesRestoreRule$1.evaluate(SystemPropertiesRestoreRule.java:57)
	at org.apache.lucene.util.AbstractBeforeAfterRule$1.evaluate(AbstractBeforeAfterRule.java:45)
	at com.carrotsearch.randomizedtesting.rules.StatementAdapter.evaluate(StatementAdapter.java:36)
	at org.apache.lucene.util.TestRuleStoreClassName$1.evaluate(TestRuleStoreClassName.java:41)
	at com.carrotsearch.randomizedtesting.rules.NoShadowingOrOverridesOnMethodsRule$1.evaluate(NoShadowingOrOverridesOnMethodsRule.java:40)
	at com.carrotsearch.randomizedtesting.rules.NoShadowingOrOverridesOnMethodsRule$1.evaluate(NoShadowingOrOverridesOnMethodsRule.java:40)
	at com.carrotsearch.randomizedtesting.rules.StatementAdapter.evaluate(StatementAdapter.java:36)
	at com.carrotsearch.randomizedtesting.rules.StatementAdapter.evaluate(StatementAdapter.java:36)
	at com.carrotsearch.randomizedtesting.rules.StatementAdapter.evaluate(StatementAdapter.java:36)
	at org.apache.lucene.util.TestRuleAssertionsRequired$1.evaluate(TestRuleAssertionsRequired.java:53)
	at org.apache.lucene.util.TestRuleMarkFailure$1.evaluate(TestRuleMarkFailure.java:47)
	at org.apache.lucene.util.TestRuleIgnoreAfterMaxFailures$1.evaluate(TestRuleIgnoreAfterMaxFailures.java:64)
	at org.apache.lucene.util.TestRuleIgnoreTestSuites$1.evaluate(TestRuleIgnoreTestSuites.java:54)
	at com.carrotsearch.randomizedtesting.rules.StatementAdapter.evaluate(StatementAdapter.java:36)
	at com.carrotsearch.randomizedtesting.ThreadLeakControl$StatementRunner.run(ThreadLeakControl.java:367)
	at java.lang.Thread.run(Thread.java:745)




Build Log:
[...truncated 10667 lines...]
   [junit4] Suite: org.apache.solr.cloud.TestSolrCloudWithSecureImpersonation
   [junit4]   2> Creating dataDir: C:\Users\jenkins\workspace\Lucene-Solr-master-Windows\solr\build\solr-core\test\J1\temp\solr.cloud.TestSolrCloudWithSecureImpersonation_8D1D4826B214854E-001\init-core-data-001
   [junit4]   2> 288001 INFO  (SUITE-TestSolrCloudWithSecureImpersonation-seed#[8D1D4826B214854E]-worker) [    ] o.a.s.SolrTestCaseJ4 Randomized ssl (false) and clientAuth (false) via: @org.apache.solr.util.RandomizeSSL(reason=, value=NaN, ssl=NaN, clientAuth=NaN)
   [junit4]   2> 288300 WARN  (SUITE-TestSolrCloudWithSecureImpersonation-seed#[8D1D4826B214854E]-worker) [    ] o.a.h.u.NativeCodeLoader Unable to load native-hadoop library for your platform... using builtin-java classes where applicable
   [junit4]   2> 288329 ERROR (SUITE-TestSolrCloudWithSecureImpersonation-seed#[8D1D4826B214854E]-worker) [    ] o.a.h.u.Shell Failed to locate the winutils binary in the hadoop binary path
   [junit4]   2> java.io.IOException: Could not locate executable null\bin\winutils.exe in the Hadoop binaries.
   [junit4]   2> 	at org.apache.hadoop.util.Shell.getQualifiedBinPath(Shell.java:356)
   [junit4]   2> 	at org.apache.hadoop.util.Shell.getWinUtilsPath(Shell.java:371)
   [junit4]   2> 	at org.apache.hadoop.util.Shell.<clinit>(Shell.java:364)
   [junit4]   2> 	at org.apache.hadoop.util.StringUtils.<clinit>(StringUtils.java:80)
   [junit4]   2> 	at org.apache.hadoop.security.Groups.parseStaticMapping(Groups.java:130)
   [junit4]   2> 	at org.apache.hadoop.security.Groups.<init>(Groups.java:94)
   [junit4]   2> 	at org.apache.hadoop.security.Groups.<init>(Groups.java:74)
   [junit4]   2> 	at org.apache.solr.cloud.TestSolrCloudWithSecureImpersonation.getUsersFirstGroup(TestSolrCloudWithSecureImpersonation.java:60)
   [junit4]   2> 	at org.apache.solr.cloud.TestSolrCloudWithSecureImpersonation.getImpersonatorSettings(TestSolrCloudWithSecureImpersonation.java:86)
   [junit4]   2> 	at org.apache.solr.cloud.TestSolrCloudWithSecureImpersonation.startup(TestSolrCloudWithSecureImpersonation.java:99)
   [junit4]   2> 	at sun.reflect.NativeMethodAccessorImpl.invoke0(Native Method)
   [junit4]   2> 	at sun.reflect.NativeMethodAccessorImpl.invoke(NativeMethodAccessorImpl.java:62)
   [junit4]   2> 	at sun.reflect.DelegatingMethodAccessorImpl.invoke(DelegatingMethodAccessorImpl.java:43)
   [junit4]   2> 	at java.lang.reflect.Method.invoke(Method.java:498)
   [junit4]   2> 	at com.carrotsearch.randomizedtesting.RandomizedRunner.invoke(RandomizedRunner.java:1764)
   [junit4]   2> 	at com.carrotsearch.randomizedtesting.RandomizedRunner$6.evaluate(RandomizedRunner.java:811)
   [junit4]   2> 	at com.carrotsearch.randomizedtesting.RandomizedRunner$7.evaluate(RandomizedRunner.java:827)
   [junit4]   2> 	at com.carrotsearch.randomizedtesting.rules.StatementAdapter.evaluate(StatementAdapter.java:36)
   [junit4]   2> 	at com.carrotsearch.randomizedtesting.rules.SystemPropertiesRestoreRule$1.evaluate(SystemPropertiesRestoreRule.java:57)
   [junit4]   2> 	at org.apache.lucene.util.AbstractBeforeAfterRule$1.evaluate(AbstractBeforeAfterRule.java:45)
   [junit4]   2> 	at com.carrotsearch.randomizedtesting.rules.StatementAdapter.evaluate(StatementAdapter.java:36)
   [junit4]   2> 	at org.apache.lucene.util.TestRuleStoreClassName$1.evaluate(TestRuleStoreClassName.java:41)
   [junit4]   2> 	at com.carrotsearch.randomizedtesting.rules.NoShadowingOrOverridesOnMethodsRule$1.evaluate(NoShadowingOrOverridesOnMethodsRule.java:40)
   [junit4]   2> 	at com.carrotsearch.randomizedtesting.rules.NoShadowingOrOverridesOnMethodsRule$1.evaluate(NoShadowingOrOverridesOnMethodsRule.java:40)
   [junit4]   2> 	at com.carrotsearch.randomizedtesting.rules.StatementAdapter.evaluate(StatementAdapter.java:36)
   [junit4]   2> 	at com.carrotsearch.randomizedtesting.rules.StatementAdapter.evaluate(StatementAdapter.java:36)
   [junit4]   2> 	at com.carrotsearch.randomizedtesting.rules.StatementAdapter.evaluate(StatementAdapter.java:36)
   [junit4]   2> 	at org.apache.lucene.util.TestRuleAssertionsRequired$1.evaluate(TestRuleAssertionsRequired.java:53)
   [junit4]   2> 	at org.apache.lucene.util.TestRuleMarkFailure$1.evaluate(TestRuleMarkFailure.java:47)
   [junit4]   2> 	at org.apache.lucene.util.TestRuleIgnoreAfterMaxFailures$1.evaluate(TestRuleIgnoreAfterMaxFailures.java:64)
   [junit4]   2> 	at org.apache.lucene.util.TestRuleIgnoreTestSuites$1.evaluate(TestRuleIgnoreTestSuites.java:54)
   [junit4]   2> 	at com.carrotsearch.randomizedtesting.rules.StatementAdapter.evaluate(StatementAdapter.java:36)
   [junit4]   2> 	at com.carrotsearch.randomizedtesting.ThreadLeakControl$StatementRunner.run(ThreadLeakControl.java:367)
   [junit4]   2> 	at java.lang.Thread.run(Thread.java:745)
   [junit4]   2> 288389 INFO  (SUITE-TestSolrCloudWithSecureImpersonation-seed#[8D1D4826B214854E]-worker) [    ] o.a.s.SolrTestCaseJ4 ###deleteCore
   [junit4]   2> NOTE: test params are: codec=Asserting(Lucene62): {}, docValues:{}, maxPointsInLeafNode=145, maxMBSortInHeap=6.866268939079598, sim=RandomSimilarity(queryNorm=true): {}, locale=cs, timezone=Pacific/Midway
   [junit4]   2> NOTE: Windows 10 10.0 amd64/Oracle Corporation 1.8.0_102 (64-bit)/cpus=3,threads=1,free=161170984,total=536870912
   [junit4]   2> NOTE: All tests run in this JVM: [CollectionsAPIDistributedZkTest, ResponseLogComponentTest, DefaultValueUpdateProcessorTest, TestSolrIndexConfig, ZkSolrClientTest, TestTrie, TestMaxScoreQueryParser, NumericFieldsTest, StressHdfsTest, OpenCloseCoreStressTest, SuggestComponentTest, TestSolrCloudWithSecureImpersonation]
   [junit4]   2> NOTE: reproduce with: ant test  -Dtestcase=TestSolrCloudWithSecureImpersonation -Dtests.seed=8D1D4826B214854E -Dtests.slow=true -Dtests.locale=cs -Dtests.timezone=Pacific/Midway -Dtests.asserts=true -Dtests.file.encoding=UTF-8
   [junit4] ERROR   0.00s J1 | TestSolrCloudWithSecureImpersonation (suite) <<<
   [junit4]    > Throwable #1: com.google.common.util.concurrent.UncheckedExecutionException: java.lang.NullPointerException
   [junit4]    > 	at __randomizedtesting.SeedInfo.seed([8D1D4826B214854E]:0)
   [junit4]    > 	at com.google.common.cache.LocalCache$Segment.get(LocalCache.java:2263)
   [junit4]    > 	at com.google.common.cache.LocalCache.get(LocalCache.java:4000)
   [junit4]    > 	at com.google.common.cache.LocalCache.getOrLoad(LocalCache.java:4004)
   [junit4]    > 	at com.google.common.cache.LocalCache$LocalLoadingCache.get(LocalCache.java:4874)
   [junit4]    > 	at org.apache.hadoop.security.Groups.getGroups(Groups.java:182)
   [junit4]    > 	at org.apache.solr.cloud.TestSolrCloudWithSecureImpersonation.getUsersFirstGroup(TestSolrCloudWithSecureImpersonation.java:64)
   [junit4]    > 	at org.apache.solr.cloud.TestSolrCloudWithSecureImpersonation.getImpersonatorSettings(TestSolrCloudWithSecureImpersonation.java:86)
   [junit4]    > 	at org.apache.solr.cloud.TestSolrCloudWithSecureImpersonation.startup(TestSolrCloudWithSecureImpersonation.java:99)
   [junit4]    > 	at java.lang.Thread.run(Thread.java:745)
   [junit4]    > Caused by: java.lang.NullPointerException
   [junit4]    > 	at java.lang.ProcessBuilder.start(ProcessBuilder.java:1012)
   [junit4]    > 	at org.apache.hadoop.util.Shell.runCommand(Shell.java:483)
   [junit4]    > 	at org.apache.hadoop.util.Shell.run(Shell.java:456)
   [junit4]    > 	at org.apache.hadoop.util.Shell$ShellCommandExecutor.execute(Shell.java:722)
   [junit4]    > 	at org.apache.hadoop.util.Shell.execCommand(Shell.java:815)
   [junit4]    > 	at org.apache.hadoop.util.Shell.execCommand(Shell.java:798)
   [junit4]    > 	at org.apache.hadoop.security.ShellBasedUnixGroupsMapping.getUnixGroups(ShellBasedUnixGroupsMapping.java:84)
   [junit4]    > 	at org.apache.hadoop.security.ShellBasedUnixGroupsMapping.getGroups(ShellBasedUnixGroupsMapping.java:52)
   [junit4]    > 	at org.apache.hadoop.security.JniBasedUnixGroupsMappingWithFallback.getGroups(JniBasedUnixGroupsMappingWithFallback.java:51)
   [junit4]    > 	at org.apache.hadoop.security.Groups$GroupCacheLoader.fetchGroupList(Groups.java:239)
   [junit4]    > 	at org.apache.hadoop.security.Groups$GroupCacheLoader.load(Groups.java:220)
   [junit4]    > 	at org.apache.hadoop.security.Groups$GroupCacheLoader.load(Groups.java:208)
   [junit4]    > 	at com.google.common.cache.LocalCache$LoadingValueReference.loadFuture(LocalCache.java:3599)
   [junit4]    > 	at com.google.common.cache.LocalCache$Segment.loadSync(LocalCache.java:2379)
   [junit4]    > 	at com.google.common.cache.LocalCache$Segment.lockedGetOrLoad(LocalCache.java:2342)
   [junit4]    > 	at com.google.common.cache.LocalCache$Segment.get(LocalCache.java:2257)
   [junit4]    > 	... 31 moreThrowable #2: java.lang.NullPointerException
   [junit4]    > 	at __randomizedtesting.SeedInfo.seed([8D1D4826B214854E]:0)
   [junit4]    > 	at org.apache.solr.cloud.TestSolrCloudWithSecureImpersonation.shutdown(TestSolrCloudWithSecureImpersonation.java:154)
   [junit4]    > 	at java.lang.Thread.run(Thread.java:745)
   [junit4] Completed [49/632 (1!)] on J1 in 0.44s, 0 tests, 2 errors <<< FAILURES!

[...truncated 1675 lines...]
   [junit4] Suite: org.apache.solr.schema.TestManagedSchemaAPI
   [junit4]   2> Creating dataDir: C:\Users\jenkins\workspace\Lucene-Solr-master-Windows\solr\build\solr-core\test\J1\temp\solr.schema.TestManagedSchemaAPI_8D1D4826B214854E-001\init-core-data-001
   [junit4]   2> 2838571 INFO  (SUITE-TestManagedSchemaAPI-seed#[8D1D4826B214854E]-worker) [    ] o.a.s.SolrTestCaseJ4 Randomized ssl (false) and clientAuth (false) via: @org.apache.solr.util.RandomizeSSL(reason=, value=NaN, ssl=NaN, clientAuth=NaN)
   [junit4]   2> 2838573 INFO  (SUITE-TestManagedSchemaAPI-seed#[8D1D4826B214854E]-worker) [    ] o.a.s.c.ZkTestServer STARTING ZK TEST SERVER
   [junit4]   2> 2838573 INFO  (Thread-4808) [    ] o.a.s.c.ZkTestServer client port:0.0.0.0/0.0.0.0:0
   [junit4]   2> 2838573 INFO  (Thread-4808) [    ] o.a.s.c.ZkTestServer Starting server
   [junit4]   2> 2838671 INFO  (SUITE-TestManagedSchemaAPI-seed#[8D1D4826B214854E]-worker) [    ] o.a.s.c.ZkTestServer start zk server on port:64602
   [junit4]   2> 2838671 INFO  (SUITE-TestManagedSchemaAPI-seed#[8D1D4826B214854E]-worker) [    ] o.a.s.c.c.SolrZkClient Using default ZkCredentialsProvider
   [junit4]   2> 2838672 INFO  (SUITE-TestManagedSchemaAPI-seed#[8D1D4826B214854E]-worker) [    ] o.a.s.c.c.ConnectionManager Waiting for client to connect to ZooKeeper
   [junit4]   2> 2838678 INFO  (zkCallback-10043-thread-1) [    ] o.a.s.c.c.ConnectionManager Watcher org.apache.solr.common.cloud.ConnectionManager@6c7e93b3 name:ZooKeeperConnection Watcher:127.0.0.1:64602 got event WatchedEvent state:SyncConnected type:None path:null path:null type:None
   [junit4]   2> 2838678 INFO  (SUITE-TestManagedSchemaAPI-seed#[8D1D4826B214854E]-worker) [    ] o.a.s.c.c.ConnectionManager Client is connected to ZooKeeper
   [junit4]   2> 2838679 INFO  (SUITE-TestManagedSchemaAPI-seed#[8D1D4826B214854E]-worker) [    ] o.a.s.c.c.SolrZkClient Using default ZkACLProvider
   [junit4]   2> 2838679 INFO  (SUITE-TestManagedSchemaAPI-seed#[8D1D4826B214854E]-worker) [    ] o.a.s.c.c.SolrZkClient makePath: /solr/solr.xml
   [junit4]   2> 2838683 INFO  (jetty-launcher-10042-thread-1) [    ] o.e.j.s.Server jetty-9.3.8.v20160314
   [junit4]   2> 2838683 INFO  (jetty-launcher-10042-thread-2) [    ] o.e.j.s.Server jetty-9.3.8.v20160314
   [junit4]   2> 2838683 INFO  (jetty-launcher-10042-thread-1) [    ] o.e.j.s.h.ContextHandler Started o.e.j.s.ServletContextHandler@556c1fe8{/solr,null,AVAILABLE}
   [junit4]   2> 2838683 INFO  (jetty-launcher-10042-thread-2) [    ] o.e.j.s.h.ContextHandler Started o.e.j.s.ServletContextHandler@4eff352a{/solr,null,AVAILABLE}
   [junit4]   2> 2838688 INFO  (jetty-launcher-10042-thread-2) [    ] o.e.j.s.ServerConnector Started ServerConnector@1caaac76{HTTP/1.1,[http/1.1]}{127.0.0.1:64607}
   [junit4]   2> 2838688 INFO  (jetty-launcher-10042-thread-1) [    ] o.e.j.s.ServerConnector Started ServerConnector@683ede5b{HTTP/1.1,[http/1.1]}{127.0.0.1:64606}
   [junit4]   2> 2838688 INFO  (jetty-launcher-10042-thread-2) [    ] o.e.j.s.Server Started @2844876ms
   [junit4]   2> 2838688 INFO  (jetty-launcher-10042-thread-1) [    ] o.e.j.s.Server Started @2844876ms
   [junit4]   2> 2838688 INFO  (jetty-launcher-10042-thread-2) [    ] o.a.s.c.s.e.JettySolrRunner Jetty properties: {hostContext=/solr, hostPort=64607}
   [junit4]   2> 2838688 INFO  (jetty-launcher-10042-thread-1) [    ] o.a.s.c.s.e.JettySolrRunner Jetty properties: {hostContext=/solr, hostPort=64606}
   [junit4]   2> 2838688 INFO  (jetty-launcher-10042-thread-2) [    ] o.a.s.s.SolrDispatchFilter SolrDispatchFilter.init(): sun.misc.Launcher$AppClassLoader@73d16e93
   [junit4]   2> 2838688 INFO  (jetty-launcher-10042-thread-1) [    ] o.a.s.s.SolrDispatchFilter SolrDispatchFilter.init(): sun.misc.Launcher$AppClassLoader@73d16e93
   [junit4]   2> 2838688 INFO  (jetty-launcher-10042-thread-2) [    ] o.a.s.c.SolrResourceLoader new SolrResourceLoader for directory: 'C:\Users\jenkins\workspace\Lucene-Solr-master-Windows\solr\build\solr-core\test\J1\temp\solr.schema.TestManagedSchemaAPI_8D1D4826B214854E-001\tempDir-001\node2'
   [junit4]   2> 2838688 INFO  (jetty-launcher-10042-thread-1) [    ] o.a.s.c.SolrResourceLoader new SolrResourceLoader for directory: 'C:\Users\jenkins\workspace\Lucene-Solr-master-Windows\solr\build\solr-core\test\J1\temp\solr.schema.TestManagedSchemaAPI_8D1D4826B214854E-001\tempDir-001\node1'
   [junit4]   2> 2838689 INFO  (jetty-launcher-10042-thread-2) [    ] o.a.s.c.SolrResourceLoader JNDI not configured for solr (NoInitialContextEx)
   [junit4]   2> 2838689 INFO  (jetty-launcher-10042-thread-1) [    ] o.a.s.c.SolrResourceLoader JNDI not configured for solr (NoInitialContextEx)
   [junit4]   2> 2838689 INFO  (jetty-launcher-10042-thread-2) [    ] o.a.s.c.SolrResourceLoader solr home defaulted to 'solr/' (could not find system property or JNDI)
   [junit4]   2> 2838689 INFO  (jetty-launcher-10042-thread-1) [    ] o.a.s.c.SolrResourceLoader solr home defaulted to 'solr/' (could not find system property or JNDI)
   [junit4]   2> 2838690 INFO  (jetty-launcher-10042-thread-1) [    ] o.a.s.c.c.SolrZkClient Using default ZkCredentialsProvider
   [junit4]   2> 2838690 INFO  (jetty-launcher-10042-thread-2) [    ] o.a.s.c.c.SolrZkClient Using default ZkCredentialsProvider
   [junit4]   2> 2838690 INFO  (jetty-launcher-10042-thread-1) [    ] o.a.s.c.c.ConnectionManager Waiting for client to connect to ZooKeeper
   [junit4]   2> 2838690 INFO  (jetty-launcher-10042-thread-2) [    ] o.a.s.c.c.ConnectionManager Waiting for client to connect to ZooKeeper
   [junit4]   2> 2838692 INFO  (zkCallback-10044-thread-1) [    ] o.a.s.c.c.ConnectionManager Watcher org.apache.solr.common.cloud.ConnectionManager@b6478cb name:ZooKeeperConnection Watcher:127.0.0.1:64602/solr got event WatchedEvent state:SyncConnected type:None path:null path:null type:None
   [junit4]   2> 2838692 INFO  (jetty-launcher-10042-thread-2) [    ] o.a.s.c.c.ConnectionManager Client is connected to ZooKeeper
   [junit4]   2> 2838692 INFO  (zkCallback-10045-thread-1) [    ] o.a.s.c.c.ConnectionManager Watcher org.apache.solr.common.cloud.ConnectionManager@39ec55b7 name:ZooKeeperConnection Watcher:127.0.0.1:64602/solr got event WatchedEvent state:SyncConnected type:None path:null path:null type:None
   [junit4]   2> 2838692 INFO  (jetty-launcher-10042-thread-2) [    ] o.a.s.c.c.SolrZkClient Using default ZkACLProvider
   [junit4]   2> 2838692 INFO  (jetty-launcher-10042-thread-1) [    ] o.a.s.c.c.ConnectionManager Client is connected to ZooKeeper
   [junit4]   2> 2838692 INFO  (jetty-launcher-10042-thread-1) [    ] o.a.s.c.c.SolrZkClient Using default ZkACLProvider
   [junit4]   2> 2838693 INFO  (jetty-launcher-10042-thread-2) [    ] o.a.s.s.SolrDispatchFilter solr.xml found in ZooKeeper. Loading...
   [junit4]   2> 2838693 INFO  (jetty-launcher-10042-thread-1) [    ] o.a.s.s.SolrDispatchFilter solr.xml found in ZooKeeper. Loading...
   [junit4]   2> 2838702 WARN  (NIOServerCxn.Factory:0.0.0.0/0.0.0.0:0) [    ] o.a.z.s.NIOServerCnxn caught end of stream exception
   [junit4]   2> EndOfStreamException: Unable to read additional data from client sessionid 0x156e5e335320001, likely client has closed socket
   [junit4]   2> 	at org.apache.zookeeper.server.NIOServerCnxn.doIO(NIOServerCnxn.java:228)
   [junit4]   2> 	at org.apache.zookeeper.server.NIOServerCnxnFactory.run(NIOServerCnxnFactory.java:208)
   [junit4]   2> 	at java.lang.Thread.run(Thread.java:745)
   [junit4]   2> 2838703 INFO  (jetty-launcher-10042-thread-2) [    ] o.a.s.c.CorePropertiesLocator Config-defined core root directory: C:\Users\jenkins\workspace\Lucene-Solr-master-Windows\solr\build\solr-core\test\J1\temp\solr.schema.TestManagedSchemaAPI_8D1D4826B214854E-001\tempDir-001\node2\.
   [junit4]   2> 2838702 INFO  (jetty-launcher-10042-thread-1) [    ] o.a.s.c.CorePropertiesLocator Config-defined core root directory: C:\Users\jenkins\workspace\Lucene-Solr-master-Windows\solr\build\solr-core\test\J1\temp\solr.schema.TestManagedSchemaAPI_8D1D4826B214854E-001\tempDir-001\node1\.
   [junit4]   2> 2838703 INFO  (jetty-launcher-10042-thread-2) [    ] o.a.s.c.CoreContainer New CoreContainer 1039447290
   [junit4]   2> 2838703 INFO  (jetty-launcher-10042-thread-1) [    ] o.a.s.c.CoreContainer New CoreContainer 1284490468
   [junit4]   2> 2838703 INFO  (jetty-launcher-10042-thread-1) [    ] o.a.s.c.CoreContainer Loading cores into CoreContainer [instanceDir=C:\Users\jenkins\workspace\Lucene-Solr-master-Windows\solr\build\solr-core\test\J1\temp\solr.schema.TestManagedSchemaAPI_8D1D4826B214854E-001\tempDir-001\node1]
   [junit4]   2> 2838703 INFO  (jetty-launcher-10042-thread-2) [    ] o.a.s.c.CoreContainer Loading cores into CoreContainer [instanceDir=C:\Users\jenkins\workspace\Lucene-Solr-master-Windows\solr\build\solr-core\test\J1\temp\solr.schema.TestManagedSchemaAPI_8D1D4826B214854E-001\tempDir-001\node2]
   [junit4]   2> 2838703 WARN  (jetty-launcher-10042-thread-1) [    ] o.a.s.c.CoreContainer Couldn't add files from C:\Users\jenkins\workspace\Lucene-Solr-master-Windows\solr\build\solr-core\test\J1\temp\solr.schema.TestManagedSchemaAPI_8D1D4826B214854E-001\tempDir-001\node1\lib to classpath: C:\Users\jenkins\workspace\Lucene-Solr-master-Windows\solr\build\solr-core\test\J1\temp\solr.schema.TestManagedSchemaAPI_8D1D4826B214854E-001\tempDir-001\node1\lib
   [junit4]   2> 2838703 WARN  (jetty-launcher-10042-thread-2) [    ] o.a.s.c.CoreContainer Couldn't add files from C:\Users\jenkins\workspace\Lucene-Solr-master-Windows\solr\build\solr-core\test\J1\temp\solr.schema.TestManagedSchemaAPI_8D1D4826B214854E-001\tempDir-001\node2\lib to classpath: C:\Users\jenkins\workspace\Lucene-Solr-master-Windows\solr\build\solr-core\test\J1\temp\solr.schema.TestManagedSchemaAPI_8D1D4826B214854E-001\tempDir-001\node2\lib
   [junit4]   2> 2838703 INFO  (jetty-launcher-10042-thread-1) [    ] o.a.s.h.c.HttpShardHandlerFactory created with socketTimeout : 90000,urlScheme : ,connTimeout : 15000,maxConnectionsPerHost : 20,maxConnections : 10000,corePoolSize : 0,maximumPoolSize : 2147483647,maxThreadIdleTime : 5,sizeOfQueue : -1,fairnessPolicy : false,
   [junit4]   2> 2838703 INFO  (jetty-launcher-10042-thread-2) [    ] o.a.s.h.c.HttpShardHandlerFactory created with socketTimeout : 90000,urlScheme : ,connTimeout : 15000,maxConnectionsPerHost : 20,maxConnections : 10000,corePoolSize : 0,maximumPoolSize : 2147483647,maxThreadIdleTime : 5,sizeOfQueue : -1,fairnessPolicy : false,
   [junit4]   2> 2838709 INFO  (jetty-launcher-10042-thread-2) [    ] o.a.s.u.UpdateShardHandler Created UpdateShardHandler HTTP client with params: socketTimeout=340000&connTimeout=45000&maxConnections=100000&maxConnectionsPerHost=100000
   [junit4]   2> 2838709 INFO  (jetty-launcher-10042-thread-2) [    ] o.a.s.l.LogWatcher SLF4J impl is org.slf4j.impl.Log4jLoggerFactory
   [junit4]   2> 2838709 INFO  (jetty-launcher-10042-thread-1) [    ] o.a.s.u.UpdateShardHandler Created UpdateShardHandler HTTP client with params: socketTimeout=340000&connTimeout=45000&maxConnections=100000&maxConnectionsPerHost=100000
   [junit4]   2> 2838710 INFO  (jetty-launcher-10042-thread-1) [    ] o.a.s.l.LogWatcher SLF4J impl is org.slf4j.impl.Log4jLoggerFactory
   [junit4]   2> 2838710 INFO  (jetty-launcher-10042-thread-1) [    ] o.a.s.l.LogWatcher Registering Log Listener [Log4j (org.slf4j.impl.Log4jLoggerFactory)]
   [junit4]   2> 2838709 INFO  (jetty-launcher-10042-thread-2) [    ] o.a.s.l.LogWatcher Registering Log Listener [Log4j (org.slf4j.impl.Log4jLoggerFactory)]
   [junit4]   2> 2838710 INFO  (jetty-launcher-10042-thread-1) [    ] o.a.s.c.ZkContainer Zookeeper client=127.0.0.1:64602/solr
   [junit4]   2> 2838710 INFO  (jetty-launcher-10042-thread-1) [    ] o.a.s.c.ZkController zkHost includes chroot
   [junit4]   2> 2838710 INFO  (jetty-launcher-10042-thread-2) [    ] o.a.s.c.ZkContainer Zookeeper client=127.0.0.1:64602/solr
   [junit4]   2> 2838710 INFO  (jetty-launcher-10042-thread-1) [    ] o.a.s.c.c.SolrZkClient Using default ZkCredentialsProvider
   [junit4]   2> 2838710 INFO  (jetty-launcher-10042-thread-2) [    ] o.a.s.c.ZkController zkHost includes chroot
   [junit4]   2> 2838710 INFO  (jetty-launcher-10042-thread-2) [    ] o.a.s.c.c.SolrZkClient Using default ZkCredentialsProvider
   [junit4]   2> 2838711 INFO  (jetty-launcher-10042-thread-1) [    ] o.a.s.c.c.ConnectionManager Waiting for client to connect to ZooKeeper
   [junit4]   2> 2838711 INFO  (jetty-launcher-10042-thread-2) [    ] o.a.s.c.c.ConnectionManager Waiting for client to connect to ZooKeeper
   [junit4]   2> 2838712 INFO  (zkCallback-10050-thread-1) [    ] o.a.s.c.c.ConnectionManager Watcher org.apache.solr.common.cloud.ConnectionManager@4e9641f0 name:ZooKeeperConnection Watcher:127.0.0.1:64602 got event WatchedEvent state:SyncConnected type:None path:null path:null type:None
   [junit4]   2> 2838712 INFO  (zkCallback-10051-thread-1) [    ] o.a.s.c.c.ConnectionManager Watcher org.apache.solr.common.cloud.ConnectionManager@64b90b08 name:ZooKeeperConnection Watcher:127.0.0.1:64602 got event WatchedEvent state:SyncConnected type:None path:null path:null type:None
   [junit4]   2> 2838712 INFO  (jetty-launcher-10042-thread-1) [    ] o.a.s.c.c.ConnectionManager Client is connected to ZooKeeper
   [junit4]   2> 2838712 INFO  (jetty-launcher-10042-thread-2) [    ] o.a.s.c.c.ConnectionManager Client is connected to ZooKeeper
   [junit4]   2> 2838712 INFO  (jetty-launcher-10042-thread-1) [    ] o.a.s.c.c.SolrZkClient Using default ZkACLProvider
   [junit4]   2> 2838712 INFO  (jetty-launcher-10042-thread-2) [    ] o.a.s.c.c.SolrZkClient Using default ZkACLProvider
   [junit4]   2> 2838713 WARN  (NIOServerCxn.Factory:0.0.0.0/0.0.0.0:0) [    ] o.a.z.s.NIOServerCnxn caught end of stream exception
   [junit4]   2> EndOfStreamException: Unable to read additional data from client sessionid 0x156e5e335320003, likely client has closed socket
   [junit4]   2> 	at org.apache.zookeeper.server.NIOServerCnxn.doIO(NIOServerCnxn.java:228)
   [junit4]   2> 	at org.apache.zookeeper.server.NIOServerCnxnFactory.run(NIOServerCnxnFactory.java:208)
   [junit4]   2> 	at java.lang.Thread.run(Thread.java:745)
   [junit4]   2> 2838713 INFO  (jetty-launcher-10042-thread-2) [n:127.0.0.1:64607_solr    ] o.a.s.c.ZkController Added new OnReconnect listener org.apache.solr.cloud.ZkController$$Lambda$9/95131194@7908b153
   [junit4]   2> 2838713 INFO  (jetty-launcher-10042-thread-1) [n:127.0.0.1:64606_solr    ] o.a.s.c.ZkController Added new OnReconnect listener org.apache.solr.cloud.ZkController$$Lambda$9/95131194@1ad987da
   [junit4]   2> 2838714 INFO  (jetty-launcher-10042-thread-2) [n:127.0.0.1:64607_solr    ] o.a.s.c.c.ConnectionManager Waiting for client to connect to ZooKeeper
   [junit4]   2> 2838714 INFO  (jetty-launcher-10042-thread-1) [n:127.0.0.1:64606_solr    ] o.a.s.c.c.ConnectionManager Waiting for client to connect to ZooKeeper
   [junit4]   2> 2838715 INFO  (zkCallback-10053-thread-1-processing-n:127.0.0.1:64606_solr) [n:127.0.0.1:64606_solr    ] o.a.s.c.c.ConnectionManager Watcher org.apache.solr.common.cloud.ConnectionManager@52c2b6e6 name:ZooKeeperConnection Watcher:127.0.0.1:64602/solr got event WatchedEvent state:SyncConnected type:None path:null path:null type:None
   [junit4]   2> 2838715 INFO  (jetty-launcher-10042-thread-1) [n:127.0.0.1:64606_solr    ] o.a.s.c.c.ConnectionManager Client is connected to ZooKeeper
   [junit4]   2> 2838715 INFO  (zkCallback-10052-thread-1-processing-n:127.0.0.1:64607_solr) [n:127.0.0.1:64607_solr    ] o.a.s.c.c.ConnectionManager Watcher org.apache.solr.common.cloud.ConnectionManager@70894e6c name:ZooKeeperConnection Watcher:127.0.0.1:64602/solr got event WatchedEvent state:SyncConnected type:None path:null path:null type:None
   [junit4]   2> 2838715 INFO  (jetty-launcher-10042-thread-2) [n:127.0.0.1:64607_solr    ] o.a.s.c.c.ConnectionManager Client is connected to ZooKeeper
   [junit4]   2> 2838716 INFO  (jetty-launcher-10042-thread-1) [n:127.0.0.1:64606_solr    ] o.a.s.c.c.SolrZkClient makePath: /overseer/queue
   [junit4]   2> 2838716 INFO  (jetty-launcher-10042-thread-2) [n:127.0.0.1:64607_solr    ] o.a.s.c.c.SolrZkClient makePath: /overseer/queue
   [junit4]   2> 2838718 INFO  (jetty-launcher-10042-thread-2) [n:127.0.0.1:64607_solr    ] o.a.s.c.c.SolrZkClient makePath: /overseer/collection-queue-work
   [junit4]   2> 2838718 INFO  (jetty-launcher-10042-thread-1) [n:127.0.0.1:64606_solr    ] o.a.s.c.c.SolrZkClient makePath: /overseer/collection-queue-work
   [junit4]   2> 2838721 INFO  (jetty-launcher-10042-thread-1) [n:127.0.0.1:64606_solr    ] o.a.s.c.c.SolrZkClient makePath: /overseer/collection-map-running
   [junit4]   2> 2838721 INFO  (jetty-launcher-10042-thread-2) [n:127.0.0.1:64607_solr    ] o.a.s.c.c.SolrZkClient makePath: /overseer/collection-map-running
   [junit4]   2> 2838722 INFO  (jetty-launcher-10042-thread-2) [n:127.0.0.1:64607_solr    ] o.a.s.c.c.SolrZkClient makePath: /overseer/collection-map-completed
   [junit4]   2> 2838722 INFO  (jetty-launcher-10042-thread-1) [n:127.0.0.1:64606_solr    ] o.a.s.c.c.SolrZkClient makePath: /overseer/collection-map-completed
   [junit4]   2> 2838724 INFO  (jetty-launcher-10042-thread-2) [n:127.0.0.1:64607_solr    ] o.a.s.c.c.SolrZkClient makePath: /overseer/collection-map-failure
   [junit4]   2> 2838724 INFO  (jetty-launcher-10042-thread-1) [n:127.0.0.1:64606_solr    ] o.a.s.c.c.SolrZkClient makePath: /overseer/collection-map-failure
   [junit4]   2> 2838725 INFO  (jetty-launcher-10042-thread-2) [n:127.0.0.1:64607_solr    ] o.a.s.c.c.SolrZkClient makePath: /live_nodes
   [junit4]   2> 2838725 INFO  (jetty-launcher-10042-thread-1) [n:127.0.0.1:64606_solr    ] o.a.s.c.c.SolrZkClient makePath: /live_nodes
   [junit4]   2> 2838726 INFO  (jetty-launcher-10042-thread-1) [n:127.0.0.1:64606_solr    ] o.a.s.c.c.SolrZkClient makePath: /collections
   [junit4]   2> 2838726 INFO  (jetty-launcher-10042-thread-2) [n:127.0.0.1:64607_solr    ] o.a.s.c.c.SolrZkClient makePath: /collections
   [junit4]   2> 2838727 INFO  (jetty-launcher-10042-thread-2) [n:127.0.0.1:64607_solr    ] o.a.s.c.c.SolrZkClient makePath: /aliases.json
   [junit4]   2> 2838728 INFO  (jetty-launcher-10042-thread-1) [n:127.0.0.1:64606_solr    ] o.a.s.c.c.SolrZkClient makePath: /aliases.json
   [junit4]   2> 2838729 INFO  (jetty-launcher-10042-thread-2) [n:127.0.0.1:64607_solr    ] o.a.s.c.c.SolrZkClient makePath: /clusterstate.json
   [junit4]   2> 2838729 INFO  (jetty-launcher-10042-thread-1) [n:127.0.0.1:64606_solr    ] o.a.s.c.c.SolrZkClient makePath: /clusterstate.json
   [junit4]   2> 2838729 INFO  (jetty-launcher-10042-thread-1) [n:127.0.0.1:64606_solr    ] o.a.s.c.c.SolrZkClient makePath: /security.json
   [junit4]   2> 2838729 INFO  (jetty-launcher-10042-thread-2) [n:127.0.0.1:64607_solr    ] o.a.s.c.c.SolrZkClient makePath: /security.json
   [junit4]   2> 2838731 INFO  (jetty-launcher-10042-thread-2) [n:127.0.0.1:64607_solr    ] o.a.s.c.c.ZkStateReader Updating cluster state from ZooKeeper... 
   [junit4]   2> 2838731 INFO  (jetty-launcher-10042-thread-1) [n:127.0.0.1:64606_solr    ] o.a.s.c.c.ZkStateReader Updating cluster state from ZooKeeper... 
   [junit4]   2> 2838731 INFO  (jetty-launcher-10042-thread-2) [n:127.0.0.1:64607_solr    ] o.a.s.c.c.ZkStateReader Loaded empty cluster properties
   [junit4]   2> 2838731 INFO  (jetty-launcher-10042-thread-1) [n:127.0.0.1:64606_solr    ] o.a.s.c.c.ZkStateReader Loaded empty cluster properties
   [junit4]   2> 2838732 INFO  (jetty-launcher-10042-thread-2) [n:127.0.0.1:64607_solr    ] o.a.s.c.c.ZkStateReader Updated live nodes from ZooKeeper... (0) -> (0)
   [junit4]   2> 2838732 INFO  (jetty-launcher-10042-thread-1) [n:127.0.0.1:64606_solr    ] o.a.s.c.c.ZkStateReader Updated live nodes from ZooKeeper... (0) -> (0)
   [junit4]   2> 2838735 INFO  (jetty-launcher-10042-thread-1) [n:127.0.0.1:64606_solr    ] o.a.s.c.c.SolrZkClient makePath: /overseer_elect
   [junit4]   2> 2838735 INFO  (jetty-launcher-10042-thread-2) [n:127.0.0.1:64607_solr    ] o.a.s.c.c.SolrZkClient makePath: /overseer_elect
   [junit4]   2> 2838736 INFO  (jetty-launcher-10042-thread-2) [n:127.0.0.1:64607_solr    ] o.a.s.c.c.SolrZkClient makePath: /overseer_elect/election
   [junit4]   2> 2838736 INFO  (jetty-launcher-10042-thread-1) [n:127.0.0.1:64606_solr    ] o.a.s.c.c.SolrZkClient makePath: /overseer_elect/election
   [junit4]   2> 2838737 INFO  (jetty-launcher-10042-thread-1) [n:127.0.0.1:64606_solr    ] o.a.s.c.Overseer Overseer (id=null) closing
   [junit4]   2> 2838738 INFO  (jetty-launcher-10042-thread-2) [n:127.0.0.1:64607_solr    ] o.a.s.c.Overseer Overseer (id=null) closing
   [junit4]   2> 2838738 INFO  (jetty-launcher-10042-thread-1) [n:127.0.0.1:64606_solr    ] o.a.s.c.LeaderElector Joined leadership election with path: /overseer_elect/election/96517206047850501-127.0.0.1:64606_solr-n_0000000000
   [junit4]   2> 2838738 INFO  (jetty-launcher-10042-thread-2) [n:127.0.0.1:64607_solr    ] o.a.s.c.LeaderElector Joined leadership election with path: /overseer_elect/election/96517206047850502-127.0.0.1:64607_solr-n_0000000001
   [junit4]   2> 2838738 INFO  (jetty-launcher-10042-thread-1) [n:127.0.0.1:64606_solr    ] o.a.s.c.OverseerElectionContext I am going to be the leader 127.0.0.1:64606_solr
   [junit4]   2> 2838738 INFO  (jetty-launcher-10042-thread-1) [n:127.0.0.1:64606_solr    ] o.a.s.c.c.SolrZkClient makePath: /overseer_elect/leader
   [junit4]   2> 2838739 INFO  (jetty-launcher-10042-thread-2) [n:127.0.0.1:64607_solr    ] o.a.s.c.LeaderElector Watching path /overseer_elect/election/96517206047850501-127.0.0.1:64606_solr-n_0000000000 to know if I could be the leader
   [junit4]   2> 2838740 INFO  (jetty-launcher-10042-thread-2) [n:127.0.0.1:64607_solr    ] o.a.s.c.ZkController Register node as live in ZooKeeper:/live_nodes/127.0.0.1:64607_solr
   [junit4]   2> 2838740 INFO  (jetty-launcher-10042-thread-2) [n:127.0.0.1:64607_solr    ] o.a.s.c.c.SolrZkClient makePath: /live_nodes/127.0.0.1:64607_solr
   [junit4]   2> 2838741 INFO  (jetty-launcher-10042-thread-1) [n:127.0.0.1:64606_solr    ] o.a.s.c.Overseer Overseer (id=96517206047850501-127.0.0.1:64606_solr-n_0000000000) starting
   [junit4]   2> 2838741 INFO  (zkCallback-10052-thread-1-processing-n:127.0.0.1:64607_solr) [n:127.0.0.1:64607_solr    ] o.a.s.c.c.ZkStateReader A live node change: [WatchedEvent state:SyncConnected type:NodeChildrenChanged path:/live_nodes], has occurred - updating... (live nodes size: [0])
   [junit4]   2> 2838745 INFO  (zkCallback-10053-thread-1-processing-n:127.0.0.1:64606_solr) [n:127.0.0.1:64606_solr    ] o.a.s.c.c.ZkStateReader A live node change: [WatchedEvent state:SyncConnected type:NodeChildrenChanged path:/live_nodes], has occurred - updating... (live nodes size: [0])
   [junit4]   2> 2838747 INFO  (zkCallback-10052-thread-1-processing-n:127.0.0.1:64607_solr) [n:127.0.0.1:64607_solr    ] o.a.s.c.c.ZkStateReader Updated live nodes from ZooKeeper... (0) -> (1)
   [junit4]   2> 2838747 INFO  (jetty-launcher-10042-thread-1) [n:127.0.0.1:64606_solr    ] o.a.s.c.c.SolrZkClient makePath: /overseer/queue-work
   [junit4]   2> 2838748 INFO  (zkCallback-10053-thread-1-processing-n:127.0.0.1:64606_solr) [n:127.0.0.1:64606_solr    ] o.a.s.c.c.ZkStateReader Updated live nodes from ZooKeeper... (0) -> (1)
   [junit4]   2> 2838748 INFO  (jetty-launcher-10042-thread-2) [n:127.0.0.1:64607_solr    ] o.a.s.c.CoreContainer Security conf doesn't exist. Skipping setup for authorization module.
   [junit4]   2> 2838748 INFO  (jetty-launcher-10042-thread-2) [n:127.0.0.1:64607_solr    ] o.a.s.c.CoreContainer No authentication plugin used.
   [junit4]   2> 2838748 INFO  (jetty-launcher-10042-thread-2) [n:127.0.0.1:64607_solr    ] o.a.s.c.CorePropertiesLocator Looking for core definitions underneath C:\Users\jenkins\workspace\Lucene-Solr-master-Windows\solr\build\solr-core\test\J1\temp\solr.schema.TestManagedSchemaAPI_8D1D4826B214854E-001\tempDir-001\node2\.
   [junit4]   2> 2838749 INFO  (jetty-launcher-10042-thread-2) [n:127.0.0.1:64607_solr    ] o.a.s.c.CorePropertiesLocator Found 0 core definitions
   [junit4]   2> 2838750 INFO  (jetty-launcher-10042-thread-2) [n:127.0.0.1:64607_solr    ] o.a.s.s.SolrDispatchFilter user.dir=C:\Users\jenkins\workspace\Lucene-Solr-master-Windows\solr\build\solr-core\test\J1
   [junit4]   2> 2838750 INFO  (jetty-launcher-10042-thread-2) [n:127.0.0.1:64607_solr    ] o.a.s.s.SolrDispatchFilter SolrDispatchFilter.init() done
   [junit4]   2> 2838753 INFO  (jetty-launcher-10042-thread-1) [n:127.0.0.1:64606_solr    ] o.a.s.c.OverseerAutoReplicaFailoverThread Starting OverseerAutoReplicaFailoverThread autoReplicaFailoverWorkLoopDelay=10000 autoReplicaFailoverWaitAfterExpiration=30000 autoReplicaFailoverBadNodeExpiration=60000
   [junit4]   2> 2838754 INFO  (jetty-launcher-10042-thread-1) [n:127.0.0.1:64606_solr    ] o.a.s.c.ZkController Publish node=127.0.0.1:64606_solr as DOWN
   [junit4]   2> 2838755 INFO  (jetty-launcher-10042-thread-1) [n:127.0.0.1:64606_solr    ] o.a.s.c.ZkController Register node as live in ZooKeeper:/live_nodes/127.0.0.1:64606_solr
   [junit4]   2> 2838755 INFO  (jetty-launcher-10042-thread-1) [n:127.0.0.1:64606_solr    ] o.a.s.c.c.SolrZkClient makePath: /live_nodes/127.0.0.1:64606_solr
   [junit4]   2> 2838756 INFO  (OverseerStateUpdate-96517206047850501-127.0.0.1:64606_solr-n_0000000000) [n:127.0.0.1:64606_solr    ] o.a.s.c.Overseer Starting to work on the main queue
   [junit4]   2> 2838756 INFO  (zkCallback-10052-thread-1-processing-n:127.0.0.1:64607_solr) [n:127.0.0.1:64607_solr    ] o.a.s.c.c.ZkStateReader A live node change: [WatchedEvent state:SyncConnected type:NodeChildrenChanged path:/live_nodes], has occurred - updating... (live nodes size: [1])
   [junit4]   2> 2838756 INFO  (zkCallback-10053-thread-1-processing-n:127.0.0.1:64606_solr) [n:127.0.0.1:64606_solr    ] o.a.s.c.c.ZkStateReader A live node change: [WatchedEvent state:SyncConnected type:NodeChildrenChanged path:/live_nodes], has occurred - updating... (live nodes size: [1])
   [junit4]   2> 2838756 INFO  (zkCallback-10052-thread-1-processing-n:127.0.0.1:64607_solr) [n:127.0.0.1:64607_solr    ] o.a.s.c.c.ZkStateReader Updated live nodes from ZooKeeper... (1) -> (2)
   [junit4]   2> 2838756 INFO  (zkCallback-10053-thread-1-processing-n:127.0.0.1:64606_solr) [n:127.0.0.1:64606_solr    ] o.a.s.c.c.ZkStateReader Updated live nodes from ZooKeeper... (1) -> (2)
   [junit4]   2> 2838756 INFO  (OverseerStateUpdate-96517206047850501-127.0.0.1:64606_solr-n_0000000000) [n:127.0.0.1:64606_solr    ] o.a.s.c.c.ZkStateReader Updated live nodes from ZooKeeper... (2) -> (2)
   [junit4]   2> 2838758 INFO  (OverseerStateUpdate-96517206047850501-127.0.0.1:64606_solr-n_0000000000) [n:127.0.0.1:64606_solr    ] o.a.s.c.Overseer processMessage: queueSize: 1, message = {
   [junit4]   2>   "operation":"downnode",
   [junit4]   2>   "node_name":"127.0.0.1:64606_solr"} current state version: 0
   [junit4]   2> 2838758 INFO  (OverseerStateUpdate-96517206047850501-127.0.0.1:64606_solr-n_0000000000) [n:127.0.0.1:64606_solr    ] o.a.s.c.o.NodeMutator DownNode state invoked for node: 127.0.0.1:64606_solr
   [junit4]   2> 2838761 INFO  (jetty-launcher-10042-thread-1) [n:127.0.0.1:64606_solr    ] o.a.s.c.CoreContainer Security conf doesn't exist. Skipping setup for authorization module.
   [junit4]   2> 2838761 INFO  (jetty-launcher-10042-thread-1) [n:127.0.0.1:64606_solr    ] o.a.s.c.CoreContainer No authentication plugin used.
   [junit4]   2> 2838761 INFO  (jetty-launcher-10042-thread-1) [n:127.0.0.1:64606_solr    ] o.a.s.c.CorePropertiesLocator Looking for core definitions underneath C:\Users\jenkins\workspace\Lucene-Solr-master-Windows\solr\build\solr-core\test\J1\temp\solr.schema.TestManagedSchemaAPI_8D1D4826B214854E-001\tempDir-001\node1\.
   [junit4]   2> 2838762 INFO  (jetty-launcher-10042-thread-1) [n:127.0.0.1:64606_solr    ] o.a.s.c.CorePropertiesLocator Found 0 core definitions
   [junit4]   2> 2838763 INFO  (jetty-launcher-10042-thread-1) [n:127.0.0.1:64606_solr    ] o.a.s.s.SolrDispatchFilter user.dir=C:\Users\jenkins\workspace\Lucene-Solr-master-Windows\solr\build\solr-core\test\J1
   [junit4]   2> 2838763 INFO  (jetty-launcher-10042-thread-1) [n:127.0.0.1:64606_solr    ] o.a.s.s.SolrDispatchFilter SolrDispatchFilter.init() done
   [junit4]   2> 2838763 INFO  (SUITE-TestManagedSchemaAPI-seed#[8D1D4826B214854E]-worker) [    ] o.a.s.c.c.SolrZkClient Using default ZkCredentialsProvider
   [junit4]   2> 2838764 INFO  (SUITE-TestManagedSchemaAPI-seed#[8D1D4826B214854E]-worker) [    ] o.a.s.c.c.ConnectionManager Waiting for client to connect to ZooKeeper
   [junit4]   2> 2838767 INFO  (OverseerCollectionConfigSetProcessor-96517206047850501-127.0.0.1:64606_solr-n_0000000000) [n:127.0.0.1:64606_solr    ] o.a.s.c.OverseerTaskProcessor Process current queue of overseer operations
   [junit4]   2> 2838772 INFO  (zkCallback-10056-thread-1) [    ] o.a.s.c.c.ConnectionManager Watcher org.apache.solr.common.cloud.ConnectionManager@3bdf05ab name:ZooKeeperConnection Watcher:127.0.0.1:64602 got event WatchedEvent state:SyncConnected type:None path:null path:null type:None
   [junit4]   2> 2838772 INFO  (SUITE-TestManagedSchemaAPI-seed#[8D1D4826B214854E]-worker) [    ] o.a.s.c.c.ConnectionManager Client is connected to ZooKeeper
   [junit4]   2> 2838772 INFO  (SUITE-TestManagedSchemaAPI-seed#[8D1D4826B214854E]-worker) [    ] o.a.s.c.c.SolrZkClient Using default ZkACLProvider
   [junit4]   2> 2838775 INFO  (SUITE-TestManagedSchemaAPI-seed#[8D1D4826B214854E]-worker) [    ] o.a.s.c.c.SolrZkClient Using default ZkCredentialsProvider
   [junit4]   2> 2838776 INFO  (SUITE-TestManagedSchemaAPI-seed#[8D1D4826B214854E]-worker) [    ] o.a.s.c.c.ConnectionManager Waiting for client to connect to ZooKeeper
   [junit4]   2> 2838780 INFO  (zkCallback-10059-thread-1) [    ] o.a.s.c.c.ConnectionManager Watcher org.apache.solr.common.cloud.ConnectionManager@3aa81e8b name:ZooKeeperConnection Watcher:127.0.0.1:64602/solr got event WatchedEvent state:SyncConnected type:None path:null path:null type:None
   [junit4]   2> 2838780 INFO  (SUITE-TestManagedSchemaAPI-seed#[8D1D4826B214854E]-worker) [    ] o.a.s.c.c.ConnectionManager Client is connected to ZooKeeper
   [junit4]   2> 2838780 INFO  (SUITE-TestManagedSchemaAPI-seed#[8D1D4826B214854E]-worker) [    ] o.a.s.c.c.SolrZkClient Using default ZkACLProvider
   [junit4]   2> 2838780 INFO  (SUITE-TestManagedSchemaAPI-seed#[8D1D4826B214854E]-worker) [    ] o.a.s.c.c.ZkStateReader Updating cluster state from ZooKeeper... 
   [junit4]   2> 2838781 INFO  (SUITE-TestManagedSchemaAPI-seed#[8D1D4826B214854E]-worker) [    ] o.a.s.c.c.ZkStateReader Loaded empty cluster properties
   [junit4]   2> 2838781 INFO  (SUITE-TestManagedSchemaAPI-seed#[8D1D4826B214854E]-worker) [    ] o.a.s.c.c.ZkStateReader Updated live nodes from ZooKeeper... (0) -> (2)
   [junit4]   2> 2838784 INFO  (SUITE-TestManagedSchemaAPI-seed#[8D1D4826B214854E]-worker) [    ] o.a.s.c.c.SolrZkClient makePath: /configs/conf1/managed-schema
   [junit4]   2> 2838787 INFO  (SUITE-TestManagedSchemaAPI-seed#[8D1D4826B214854E]-worker) [    ] o.a.s.c.c.SolrZkClient makePath: /configs/conf1/solrconfig.xml
   [junit4]   2> 2838809 INFO  (TEST-TestManagedSchemaAPI.test-seed#[8D1D4826B214854E]) [    ] o.a.s.SolrTestCaseJ4 ###Starting test
   [junit4]   2> 2838812 INFO  (qtp1902620818-46221) [n:127.0.0.1:64606_solr    ] o.a.s.h.a.CollectionsHandler Invoked Collection Action :create with params replicationFactor=2&collection.configName=conf1&name=testschemaapi&action=CREATE&numShards=1&wt=javabin&version=2 and sendToOCPQueue=true
   [junit4]   2> 2838817 INFO  (OverseerCollectionConfigSetProcessor-96517206047850501-127.0.0.1:64606_solr-n_0000000000) [n:127.0.0.1:64606_solr    ] o.a.s.c.OverseerTaskProcessor Overseer Collection Message Handler: Get the message id:/overseer/collection-queue-work/qn-0000000000 message:{
   [junit4]   2>   "name":"testschemaapi",
   [junit4]   2>   "fromApi":"true",
   [junit4]   2>   "replicationFactor":"2",
   [junit4]   2>   "collection.configName":"conf1",
   [junit4]   2>   "numShards":"1",
   [junit4]   2>   "stateFormat":"2",
   [junit4]   2>   "operation":"create"}
   [junit4]   2> 2838818 INFO  (OverseerThreadFactory-10943-thread-1-processing-n:127.0.0.1:64606_solr) [n:127.0.0.1:64606_solr    ] o.a.s.c.OverseerCollectionMessageHandler OverseerCollectionMessageHandler.processMessage : create , {
   [junit4]   2>   "name":"testschemaapi",
   [junit4]   2>   "fromApi":"true",
   [junit4]   2>   "replicationFactor":"2",
   [junit4]   2>   "collection.configName":"conf1",
   [junit4]   2>   "numShards":"1",
   [junit4]   2>   "stateFormat":"2",
   [junit4]   2>   "operation":"create"}
   [junit4]   2> 2838818 INFO  (OverseerThreadFactory-10943-thread-1-processing-n:127.0.0.1:64606_solr) [n:127.0.0.1:64606_solr    ] o.a.s.c.CreateCollectionCmd Create collection testschemaapi
   [junit4]   2> 2838818 INFO  (OverseerThreadFactory-10943-thread-1-processing-n:127.0.0.1:64606_solr) [n:127.0.0.1:64606_solr    ] o.a.s.c.OverseerCollectionMessageHandler creating collections conf node /collections/testschemaapi 
   [junit4]   2> 2838819 INFO  (OverseerThreadFactory-10943-thread-1-processing-n:127.0.0.1:64606_solr) [n:127.0.0.1:64606_solr    ] o.a.s.c.c.SolrZkClient makePath: /collections/testschemaapi
   [junit4]   2> 2838821 INFO  (zkCallback-10052-thread-1-processing-n:127.0.0.1:64607_solr) [n:127.0.0.1:64607_solr    ] o.a.s.c.c.ZkStateReader A collections change: [WatchedEvent state:SyncConnected type:NodeChildrenChanged path:/collections], has occurred - updating...
   [junit4]   2> 2838821 INFO  (zkCallback-10053-thread-1-processing-n:127.0.0.1:64606_solr) [n:127.0.0.1:64606_solr    ] o.a.s.c.c.ZkStateReader A collections change: [WatchedEvent state:SyncConnected type:NodeChildrenChanged path:/collections], has occurred - updating...
   [junit4]   2> 2838822 INFO  (zkCallback-10059-thread-1) [    ] o.a.s.c.c.ZkStateReader A collections change: [WatchedEvent state:SyncConnected type:NodeChildrenChanged path:/collections], has occurred - updating...
   [junit4]   2> 2838824 INFO  (OverseerStateUpdate-96517206047850501-127.0.0.1:64606_solr-n_0000000000) [n:127.0.0.1:64606_solr    ] o.a.s.c.Overseer processMessage: queueSize: 1, message = {
   [junit4]   2>   "name":"testschemaapi",
   [junit4]   2>   "fromApi":"true",
   [junit4]   2>   "replicationFactor":"2",
   [junit4]   2>   "collection.configName":"conf1",
   [junit4]   2>   "numShards":"1",
   [junit4]   2>   "stateFormat":"2",
   [junit4]   2>   "operation":"create"} current state version: 0
   [junit4]   2> 2838824 INFO  (OverseerStateUpdate-96517206047850501-127.0.0.1:64606_solr-n_0000000000) [n:127.0.0.1:64606_solr    ] o.a.s.c.o.ClusterStateMutator building a new cName: testschemaapi
   [junit4]   2> 2838825 INFO  (OverseerStateUpdate-96517206047850501-127.0.0.1:64606_solr-n_0000000000) [n:127.0.0.1:64606_solr    ] o.a.s.c.o.ZkStateWriter going to create_collection /collections/testschemaapi/state.json
   [junit4]   2> 2838907 INFO  (OverseerThreadFactory-10943-thread-1-processing-n:127.0.0.1:64606_solr) [n:127.0.0.1:64606_solr    ] o.a.s.c.CreateCollectionCmd Creating SolrCores for new collection testschemaapi, shardNames [shard1] , replicationFactor : 2
   [junit4]   2> 2838907 INFO  (OverseerThreadFactory-10943-thread-1-processing-n:127.0.0.1:64606_solr) [n:127.0.0.1:64606_solr    ] o.a.s.c.CreateCollectionCmd Creating core testschemaapi_shard1_replica1 as part of shard shard1 of collection testschemaapi on 127.0.0.1:64607_solr
   [junit4]   2> 2838907 INFO  (OverseerThreadFactory-10943-thread-1-processing-n:127.0.0.1:64606_solr) [n:127.0.0.1:64606_solr    ] o.a.s.c.CreateCollectionCmd Creating core testschemaapi_shard1_replica2 as part of shard shard1 of collection testschemaapi on 127.0.0.1:64606_solr
   [junit4]   2> 2838911 INFO  (qtp1902620818-46225) [n:127.0.0.1:64606_solr    ] o.a.s.h.a.CoreAdminOperation core create command qt=/admin/cores&collection.configName=conf1&name=testschemaapi_shard1_replica2&action=CREATE&numShards=1&collection=testschemaapi&shard=shard1&wt=javabin&version=2
   [junit4]   2> 2838911 INFO  (qtp1801023945-46232) [n:127.0.0.1:64607_solr    ] o.a.s.h.a.CoreAdminOperation core create command qt=/admin/cores&collection.configName=conf1&name=testschemaapi_shard1_replica1&action=CREATE&numShards=1&collection=testschemaapi&shard=shard1&wt=javabin&version=2
   [junit4]   2> 2838912 INFO  (qtp1902620818-46225) [n:127.0.0.1:64606_solr    ] o.a.s.c.CoreDescriptor Created CoreDescriptor: {name=testschemaapi_shard1_replica2, collection.configName=conf1, config=solrconfig.xml, transient=false, schema=schema.xml, loadOnStartup=true, configSetProperties=configsetprops.json, collection=testschemaapi, numShards=1, dataDir=data\, shard=shard1}
   [junit4]   2> 2838913 INFO  (qtp1801023945-46232) [n:127.0.0.1:64607_solr    ] o.a.s.c.CoreDescriptor Created CoreDescriptor: {name=testschemaapi_shard1_replica1, collection.configName=conf1, config=solrconfig.xml, transient=false, schema=schema.xml, loadOnStartup=true, configSetProperties=configsetprops.json, collection=testschemaapi, numShards=1, dataDir=data\, shard=shard1}
   [junit4]   2> 2838913 INFO  (qtp1902620818-46225) [n:127.0.0.1:64606_solr c:testschemaapi s:shard1  x:testschemaapi_shard1_replica2] o.a.s.c.ZkController publishing state=down
   [junit4]   2> 2838913 INFO  (qtp1801023945-46232) [n:127.0.0.1:64607_solr c:testschemaapi s:shard1  x:testschemaapi_shard1_replica1] o.a.s.c.ZkController publishing state=down
   [junit4]   2> 2838913 INFO  (qtp1902620818-46225) [n:127.0.0.1:64606_solr c:testschemaapi s:shard1  x:testschemaapi_shard1_replica2] o.a.s.c.ZkController Registering watch for collection testschemaapi
   [junit4]   2> 2838913 INFO  (qtp1801023945-46232) [n:127.0.0.1:64607_solr c:testschemaapi s:shard1  x:testschemaapi_shard1_replica1] o.a.s.c.ZkController Registering watch for collection testschemaapi
   [junit4]   2> 2838913 INFO  (qtp1902620818-46225) [n:127.0.0.1:64606_solr c:testschemaapi s:shard1  x:testschemaapi_shard1_replica2] o.a.s.c.c.ZkStateReader Add data for [testschemaapi] ver [0]
   [junit4]   2> 2838913 INFO  (OverseerStateUpdate-96517206047850501-127.0.0.1:64606_solr-n_0000000000) [n:127.0.0.1:64606_solr    ] o.a.s.c.Overseer processMessage: queueSize: 2, message = {
   [junit4]   2>   "core":"testschemaapi_shard1_replica2",
   [junit4]   2>   "roles":null,
   [junit4]   2>   "base_url":"http://127.0.0.1:64606/solr",
   [junit4]   2>   "node_name":"127.0.0.1:64606_solr",
   [junit4]   2>   "numShards":"1",
   [junit4]   2>   "state":"down",
   [junit4]   2>   "shard":"shard1",
   [junit4]   2>   "collection":"testschemaapi",
   [junit4]   2>   "operation":"state"} current state version: 0
   [junit4]   2> 2838913 INFO  (qtp1902620818-46225) [n:127.0.0.1:64606_solr c:testschemaapi s:shard1  x:testschemaapi_shard1_replica2] o.a.s.c.ZkController look for our core node name
   [junit4]   2> 2838913 INFO  (qtp1801023945-46232) [n:127.0.0.1:64607_solr c:testschemaapi s:shard1  x:testschemaapi_shard1_replica1] o.a.s.c.c.ZkStateReader Add data for [testschemaapi] ver [0]
   [junit4]   2> 2838913 INFO  (OverseerStateUpdate-96517206047850501-127.0.0.1:64606_solr-n_0000000000) [n:127.0.0.1:64606_solr    ] o.a.s.c.o.ReplicaMutator Update state numShards=1 message={
   [junit4]   2>   "core":"testschemaapi_shard1_replica2",
   [junit4]   2>   "roles":null,
   [junit4]   2>   "base_url":"http://127.0.0.1:64606/solr",
   [junit4]   2>   "node_name":"127.0.0.1:64606_solr",
   [junit4]   2>   "numShards":"1",
   [junit4]   2>   "state":"down",
   [junit4]   2>   "shard":"shard1",
   [junit4]   2>   "collection":"testschemaapi",
   [junit4]   2>   "operation":"state"}
   [junit4]   2> 2838914 INFO  (qtp1801023945-46232) [n:127.0.0.1:64607_solr c:testschemaapi s:shard1  x:testschemaapi_shard1_replica1] o.a.s.c.ZkController look for our core node name
   [junit4]   2> 2838916 INFO  (OverseerStateUpdate-96517206047850501-127.0.0.1:64606_solr-n_0000000000) [n:127.0.0.1:64606_solr    ] o.a.s.c.Overseer processMessage: queueSize: 1, message = {
   [junit4]   2>   "core":"testschemaapi_shard1_replica1",
   [junit4]   2>   "roles":null,
   [junit4]   2>   "base_url":"http://127.0.0.1:64607/solr",
   [junit4]   2>   "node_name":"127.0.0.1:64607_solr",
   [junit4]   2>   "numShards":"1",
   [junit4]   2>   "state":"down",
   [junit4]   2>   "shard":"shard1",
   [junit4]   2>   "collection":"testschemaapi",
   [junit4]   2>   "operation":"state"} current state version: 0
   [junit4]   2> 2838916 INFO  (OverseerStateUpdate-96517206047850501-127.0.0.1:64606_solr-n_0000000000) [n:127.0.0.1:64606_solr    ] o.a.s.c.o.ReplicaMutator Update state numShards=1 message={
   [junit4]   2>   "core":"testschemaapi_shard1_replica1",
   [junit4]   2>   "roles":null,
   [junit4]   2>   "base_url":"http://127.0.0.1:64607/solr",
   [junit4]   2>   "node_name":"127.0.0.1:64607_solr",
   [junit4]   2>   "numShards":"1",
   [junit4]   2>   "state":"down",
   [junit4]   2>   "shard":"shard1",
   [junit4]   2>   "collection":"testschemaapi",
   [junit4]   2>   "operation":"state"}
   [junit4]   2> 2839001 INFO  (OverseerStateUpdate-96517206047850501-127.0.0.1:64606_solr-n_0000000000) [n:127.0.0.1:64606_solr    ] o.a.s.c.o.ZkStateWriter going to update_collection /collections/testschemaapi/state.json version: 0
   [junit4]   2> 2839002 INFO  (zkCallback-10052-thread-1-processing-n:127.0.0.1:64607_solr) [n:127.0.0.1:64607_solr    ] o.a.s.c.c.ZkStateReader A cluster state change: [WatchedEvent state:SyncConnected type:NodeDataChanged path:/collections/testschemaapi/state.json] for collection [testschemaapi] has occurred - updating... (live nodes size: [2])
   [junit4]   2> 2839002 INFO  (zkCallback-10053-thread-2-processing-n:127.0.0.1:64606_solr) [n:127.0.0.1:64606_solr    ] o.a.s.c.c.ZkStateReader A cluster state change: [WatchedEvent state:SyncConnected type:NodeDataChanged path:/collections/testschemaapi/state.json] for collection [testschemaapi] has occurred - updating... (live nodes size: [2])
   [junit4]   2> 2839002 INFO  (zkCallback-10052-thread-1-processing-n:127.0.0.1:64607_solr) [n:127.0.0.1:64607_solr    ] o.a.s.c.c.ZkStateReader Updating data for [testschemaapi] from [0] to [1]
   [junit4]   2> 2839002 INFO  (zkCallback-10053-thread-2-processing-n:127.0.0.1:64606_solr) [n:127.0.0.1:64606_solr    ] o.a.s.c.c.ZkStateReader Updating data for [testschemaapi] from [0] to [1]
   [junit4]   2> 2839744 INFO  (qtp1801023945-46232) [n:127.0.0.1:64607_solr c:testschemaapi s:shard1  x:testschemaapi_shard1_replica1] o.a.s.c.ZkController waiting to find shard id in clusterstate for testschemaapi_shard1_replica1
   [junit4]   2> 2839744 INFO  (qtp1902620818-46225) [n:127.0.0.1:64606_solr c:testschemaapi s:shard1  x:testschemaapi_shard1_replica2] o.a.s.c.ZkController waiting to find shard id in clusterstate for testschemaapi_shard1_replica2
   [junit4]   2> 2839744 INFO  (qtp1902620818-46225) [n:127.0.0.1:64606_solr c:testschemaapi s:shard1  x:testschemaapi_shard1_replica2] o.a.s.c.ZkController Check for collection zkNode:testschemaapi
   [junit4]   2> 2839744 INFO  (qtp1801023945-46232) [n:127.0.0.1:64607_solr c:testschemaapi s:shard1  x:testschemaapi_shard1_replica1] o.a.s.c.ZkController Check for collection zkNode:testschemaapi
   [junit4]   2> 2839744 INFO  (qtp1902620818-46225) [n:127.0.0.1:64606_solr c:testschemaapi s:shard1  x:testschemaapi_shard1_replica2] o.a.s.c.ZkController Collection zkNode exists
   [junit4]   2> 2839744 INFO  (qtp1801023945-46232) [n:127.0.0.1:64607_solr c:testschemaapi s:shard1  x:testschemaapi_shard1_replica1] o.a.s.c.ZkController Collection zkNode exists
   [junit4]   2> 2839744 INFO  (qtp1902620818-46225) [n:127.0.0.1:64606_solr c:testschemaapi s:shard1  x:testschemaapi_shard1_replica2] o.a.s.c.c.ZkStateReader Load collection config from: [/collections/testschemaapi]
   [junit4]   2> 2839744 INFO  (qtp1801023945-46232) [n:127.0.0.1:64607_solr c:testschemaapi s:shard1  x:testschemaapi_shard1_replica1] o.a.s.c.c.ZkStateReader Load collection config from: [/collections/testschemaapi]
   [junit4]   2> 2839745 INFO  (qtp1902620818-46225) [n:127.0.0.1:64606_solr c:testschemaapi s:shard1  x:testschemaapi_shard1_replica2] o.a.s.c.c.ZkStateReader path=[/collections/testschemaapi] [configName]=[conf1] specified config exists in ZooKeeper
   [junit4]   2> 2839745 INFO  (qtp1801023945-46232) [n:127.0.0.1:64607_solr c:testschemaapi s:shard1  x:testschemaapi_shard1_replica1] o.a.s.c.c.ZkStateReader path=[/collections/testschemaapi] [configName]=[conf1] specified config exists in ZooKeeper
   [junit4]   2> 2839745 INFO  (qtp1902620818-46225) [n:127.0.0.1:64606_solr c:testschemaapi s:shard1  x:testschemaapi_shard1_replica2] o.a.s.c.SolrResourceLoader new SolrResourceLoader for directory: 'C:\Users\jenkins\workspace\Lucene-Solr-master-Windows\solr\build\solr-core\test\J1\temp\solr.schema.TestManagedSchemaAPI_8D1D4826B214854E-001\tempDir-001\node1\testschemaapi_shard1_replica2'
   [junit4]   2> 2839745 INFO  (qtp1801023945-46232) [n:127.0.0.1:64607_solr c:testschemaapi s:shard1  x:testschemaapi_shard1_replica1] o.a.s.c.SolrResourceLoader new SolrResourceLoader for directory: 'C:\Users\jenkins\workspace\Lucene-Solr-master-Windows\solr\build\solr-core\test\J1\temp\solr.schema.TestManagedSchemaAPI_8D1D4826B214854E-001\tempDir-001\node2\testschemaapi_shard1_replica1'
   [junit4]   2> 2839745 INFO  (qtp1902620818-46225) [n:127.0.0.1:64606_solr c:testschemaapi s:shard1  x:testschemaapi_shard1_replica2] o.a.s.c.SolrResourceLoader JNDI not configured for solr (NoInitialContextEx)
   [junit4]   2> 2839745 INFO  (qtp1801023945-46232) [n:127.0.0.1:64607_solr c:testschemaapi s:shard1  x:testschemaapi_shard1_replica1] o.a.s.c.SolrResourceLoader JNDI not configured for solr (NoInitialContextEx)
   [junit4]   2> 2839745 INFO  (qtp1902620818-46225) [n:127.0.0.1:64606_solr c:testschemaapi s:shard1  x:testschemaapi_shard1_replica2] o.a.s.c.SolrResourceLoader solr home defaulted to 'solr/' (could not find system property or JNDI)
   [junit4]   2> 2839745 INFO  (qtp1801023945-46232) [n:127.0.0.1:64607_solr c:testschemaapi s:shard1  x:testschemaapi_shard1_replica1] o.a.s.c.SolrResourceLoader solr home defaulted to 'solr/' (could not find system property or JNDI)
   [junit4]   2> 2839749 INFO  (qtp1801023945-46232) [n:127.0.0.1:64607_solr c:testschemaapi s:shard1  x:testschemaapi_shard1_replica1] o.a.s.c.Config loaded config solrconfig.xml with version 0 
   [junit4]   2> 2839749 INFO  (qtp1902620818-46225) [n:127.0.0.1:64606_solr c:testschemaapi s:shard1  x:testschemaapi_shard1_replica2] o.a.s.c.Config loaded config solrconfig.xml with version 0 
   [junit4]   2> 2839754 INFO  (qtp1902620818-46225) [n:127.0.0.1:64606_solr c:testschemaapi s:shard1  x:testschemaapi_shard1_replica2] o.a.s.c.SolrConfig current version of requestparams : -1
   [junit4]   2> 2839754 INFO  (qtp1801023945-46232) [n:127.0.0.1:64607_solr c:testschemaapi s:shard1  x:testschemaapi_shard1_replica1] o.a.s.c.SolrConfig current version of requestparams : -1
   [junit4]   2> 2839776 INFO  (qtp1902620818-46225) [n:127.0.0.1:64606_solr c:testschemaapi s:shard1  x:testschemaapi_shard1_replica2] o.a.s.c.SolrConfig Using Lucene MatchVersion: 7.0.0
   [junit4]   2> 2839776 INFO  (qtp1801023945-46232) [n:127.0.0.1:64607_solr c:testschemaapi s:shard1  x:testschemaapi_shard1_replica1] o.a.s.c.SolrConfig Using Lucene MatchVersion: 7.0.0
   [junit4]   2> 2839780 INFO  (qtp1902620818-46225) [n:127.0.0.1:64606_solr c:testschemaapi s:shard1  x:testschemaapi_shard1_replica2] o.a.s.c.SolrConfig Loaded SolrConfig: solrconfig.xml
   [junit4]   2> 2839780 INFO  (qtp1801023945-46232) [n:127.0.0.1:64607_solr c:testschemaapi s:shard1  x:testschemaapi_shard1_replica1] o.a.s.c.SolrConfig Loaded SolrConfig: solrconfig.xml
   [junit4]   2> 2839783 INFO  (qtp1902620818-46225) [n:127.0.0.1:64606_solr c:testschemaapi s:shard1  x:testschemaapi_shard1_replica2] o.a.s.s.IndexSchema [testschemaapi_shard1_replica2] Schema name=minimal
   [junit4]   2> 2839783 INFO  (qtp1801023945-46232) [n:127.0.0.1:64607_solr c:testschemaapi s:shard1  x:testschemaapi_shard1_replica1] o.a.s.s.IndexSchema [testschemaapi_shard1_replica1] Schema name=minimal
   [junit4]   2> 2839790 INFO  (qtp1801023945-46232) [n:127.0.0.1:64607_solr c:testschemaapi s:shard1  x:testschemaapi_shard1_replica1] o.a.s.s.IndexSchema unique key field: id
   [junit4]   2> 2839790 INFO  (qtp1902620818-46225) [n:127.0.0.1:64606_solr c:testschemaapi s:shard1  x:testschemaapi_shard1_replica2] o.a.s.s.IndexSchema unique key field: id
   [junit4]   2> 2839796 INFO  (qtp1902620818-46225) [n:127.0.0.1:64606_solr c:testschemaapi s:shard1  x:testschemaapi_shard1_replica2] o.a.s.c.ConfigSetProperties Did not find ConfigSet properties, assuming default properties: Can't find resource 'configsetprops.json' in classpath or '/configs/conf1', cwd=C:\Users\jenkins\workspace\Lucene-Solr-master-Windows\solr\build\solr-core\test\J1
   [junit4]   2> 2839796 INFO  (qtp1801023945-46232) [n:127.0.0.1:64607_solr c:testschemaapi s:shard1  x:testschemaapi_shard1_replica1] o.a.s.c.ConfigSetProperties Did not find ConfigSet properties, assuming default properties: Can't find resource 'configsetprops.json' in classpath or '/configs/conf1', cwd=C:\Users\jenkins\workspace\Lucene-Solr-master-Windows\solr\build\solr-core\test\J1
   [junit4]   2> 2839796 INFO  (qtp1902620818-46225) [n:127.0.0.1:64606_solr c:testschemaapi s:shard1  x:testschemaapi_shard1_replica2] o.a.s.c.CoreContainer Creating SolrCore 'testschemaapi_shard1_replica2' using configuration from collection testschemaapi
   [junit4]   2> 2839796 INFO  (qtp1801023945-46232) [n:127.0.0.1:64607_solr c:testschemaapi s:shard1  x:testschemaapi_shard1_replica1] o.a.s.c.CoreContainer Creating SolrCore 'testschemaapi_shard1_replica1' using configuration from collection testschemaapi
   [junit4]   2> 2839796 INFO  (qtp1801023945-46232) [n:127.0.0.1:64607_solr c:testschemaapi s:shard1 r:core_node2 x:testschemaapi_shard1_replica1] o.a.s.c.SolrCore org.apache.solr.core.MockDirectoryFactory
   [junit4]   2> 2839796 INFO  (qtp1902620818-46225) [n:127.0.0.1:64606_solr c:testschemaapi s:shard1 r:core_node1 x:testschemaapi_shard1_replica2] o.a.s.c.SolrCore org.apache.solr.core.MockDirectoryFactory
   [junit4]   2> 2839796 INFO  (qtp1801023945-46232) [n:127.0.0.1:64607_solr c:testschemaapi s:shard1 r:core_node2 x:testschemaapi_shard1_replica1] o.a.s.c.SolrCore [[testschemaapi_shard1_replica1] ] Opening new SolrCore at [C:\Users\jenkins\workspace\Lucene-Solr-master-Windows\solr\build\solr-core\test\J1\temp\solr.schema.TestManagedSchemaAPI_8D1D4826B214854E-001\tempDir-001\node2\testschemaapi_shard1_replica1], dataDir=[C:\Users\jenkins\workspace\Lucene-Solr-master-Windows\solr\build\solr-core\test\J1\temp\solr.schema.TestManagedSchemaAPI_8D1D4826B214854E-001\tempDir-001\node2\.\testschemaapi_shard1_replica1\data\]
   [junit4]   2> 2839796 INFO  (qtp1902620818-46225) [n:127.0.0.1:64606_solr c:testschemaapi s:shard1 r:core_node1 x:testschemaapi_shard1_replica2] o.a.s.c.SolrCore [[testschemaapi_shard1_replica2] ] Opening new SolrCore at [C:\Users\jenkins\workspace\Lucene-Solr-master-Windows\solr\build\solr-core\test\J1\temp\solr.schema.TestManagedSchemaAPI_8D1D4826B214854E-001\tempDir-001\node1\testschemaapi_shard1_replica2], dataDir=[C:\Users\jenkins\workspace\Lucene-Solr-master-Windows\solr\build\solr-core\test\J1\temp\solr.schema.TestManagedSchemaAPI_8D1D4826B214854E-001\tempDir-001\node1\.\testschemaapi_shard1_replica2\data\]
   [junit4]   2> 2839796 INFO  (qtp1902620818-46225) [n:127.0.0.1:64606_solr c:testschemaapi s:shard1 r:core_node1 x:testschemaapi_shard1_replica2] o.a.s.c.SolrCore JMX monitoring not detected for core: testschemaapi_shard1_replica2
   [junit4]   2> 2839796 INFO  (qtp1801023945-46232) [n:127.0.0.1:64607_solr c:testschemaapi s:shard1 r:core_node2 x:testschemaapi_shard1_replica1] o.a.s.c.SolrCore JMX monitoring not detected for core: testschemaapi_shard1_replica1
   [junit4]   2> 2839796 INFO  (qtp1902620818-46225) [n:127.0.0.1:64606_solr c:testschemaapi s:shard1 r:core_node1 x:testschemaapi_shard1_replica2] o.a.s.c.CachingDirectoryFactory return new directory for C:\Users\jenkins\workspace\Lucene-Solr-master-Windows\solr\build\solr-core\test\J1\temp\solr.schema.TestManagedSchemaAPI_8D1D4826B214854E-001\tempDir-001\node1\.\testschemaapi_shard1_replica2\data\snapshot_metadata
   [junit4]   2> 2839796 INFO  (qtp1902620818-46225) [n:127.0.0.1:64606_solr c:testschemaapi s:shard1 r:core_node1 x:testschemaapi_shard1_replica2] o.a.s.c.s.SolrSnapshotMetaDataManager Loading from snapshot metadata file...
   [junit4]   2> 2839796 INFO  (qtp1801023945-46232) [n:127.0.0.1:64607_solr c:testschemaapi s:shard1 r:core_node2 x:testschemaapi_shard1_replica1] o.a.s.c.CachingDirectoryFactory return new directory for C:\Users\jenkins\workspace\Lucene-Solr-master-Windows\solr\build\solr-core\test\J1\temp\

[...truncated too long message...]

rIsRemovedAfterTimeout-seed#[BED70CE32A0F39F3]-EventThread) [n:127.0.0.1:51379_solr    ] o.a.z.ClientCnxn Error while calling watcher 
   [junit4]   2> java.util.concurrent.RejectedExecutionException: Task org.apache.solr.common.util.ExecutorUtil$MDCAwareThreadPoolExecutor$$Lambda$8/420568788@28c6114b rejected from org.apache.solr.common.util.ExecutorUtil$MDCAwareThreadPoolExecutor@2cf9908b[Shutting down, pool size = 1, active threads = 1, queued tasks = 0, completed tasks = 14]
   [junit4]   2> 	at java.util.concurrent.ThreadPoolExecutor$AbortPolicy.rejectedExecution(ThreadPoolExecutor.java:2047)
   [junit4]   2> 	at java.util.concurrent.ThreadPoolExecutor.reject(ThreadPoolExecutor.java:823)
   [junit4]   2> 	at java.util.concurrent.ThreadPoolExecutor.execute(ThreadPoolExecutor.java:1369)
   [junit4]   2> 	at org.apache.solr.common.util.ExecutorUtil$MDCAwareThreadPoolExecutor.execute(ExecutorUtil.java:214)
   [junit4]   2> 	at java.util.concurrent.AbstractExecutorService.submit(AbstractExecutorService.java:112)
   [junit4]   2> 	at org.apache.solr.common.cloud.SolrZkClient$3.process(SolrZkClient.java:266)
   [junit4]   2> 	at org.apache.zookeeper.ClientCnxn$EventThread.processEvent(ClientCnxn.java:522)
   [junit4]   2> 	at org.apache.zookeeper.ClientCnxn$EventThread.run(ClientCnxn.java:498)
   [junit4]   2> 213943 ERROR (TEST-TestCollectionStateWatchers.testWaitForStateWatcherIsRetainedOnPredicateFailure-seed#[BED70CE32A0F39F3]-EventThread) [n:127.0.0.1:50630_solr    ] o.a.z.ClientCnxn Error while calling watcher 
   [junit4]   2> java.util.concurrent.RejectedExecutionException: Task org.apache.solr.common.util.ExecutorUtil$MDCAwareThreadPoolExecutor$$Lambda$8/420568788@26d6619d rejected from org.apache.solr.common.util.ExecutorUtil$MDCAwareThreadPoolExecutor@63d4eb23[Shutting down, pool size = 1, active threads = 1, queued tasks = 0, completed tasks = 30]
   [junit4]   2> 	at java.util.concurrent.ThreadPoolExecutor$AbortPolicy.rejectedExecution(ThreadPoolExecutor.java:2047)
   [junit4]   2> 	at java.util.concurrent.ThreadPoolExecutor.reject(ThreadPoolExecutor.java:823)
   [junit4]   2> 	at java.util.concurrent.ThreadPoolExecutor.execute(ThreadPoolExecutor.java:1369)
   [junit4]   2> 	at org.apache.solr.common.util.ExecutorUtil$MDCAwareThreadPoolExecutor.execute(ExecutorUtil.java:214)
   [junit4]   2> 	at java.util.concurrent.AbstractExecutorService.submit(AbstractExecutorService.java:112)
   [junit4]   2> 	at org.apache.solr.common.cloud.SolrZkClient$3.process(SolrZkClient.java:266)
   [junit4]   2> 	at org.apache.zookeeper.ClientCnxn$EventThread.processEvent(ClientCnxn.java:522)
   [junit4]   2> 	at org.apache.zookeeper.ClientCnxn$EventThread.run(ClientCnxn.java:498)
   [junit4]   2> 213941 WARN  (zkCallback-502-thread-1-processing-n:127.0.0.1:50640_solr) [n:127.0.0.1:50640_solr    ] o.a.s.c.c.ZkStateReader ZooKeeper watch triggered, but Solr cannot talk to ZK: [KeeperErrorCode = Session expired for /live_nodes]
   [junit4]   2> 213943 INFO  (zkCallback-483-thread-3-processing-n:127.0.0.1:50633_solr) [n:127.0.0.1:50633_solr    ] o.a.s.c.c.ZkStateReader Updated live nodes from ZooKeeper... (4) -> (1)
   [junit4]   2> 213944 INFO  (jetty-launcher-465-thread-2) [    ] o.e.j.s.h.ContextHandler Stopped o.e.j.s.ServletContextHandler@7162320a{/solr,null,UNAVAILABLE}
   [junit4]   2> 213945 INFO  (zkCallback-483-thread-3-processing-n:127.0.0.1:50633_solr) [n:127.0.0.1:50633_solr    ] o.a.s.c.c.ZkStateReader A live node change: [WatchedEvent state:SyncConnected type:NodeChildrenChanged path:/live_nodes], has occurred - updating... (live nodes size: [1])
   [junit4]   2> 213946 WARN  (zkCallback-483-thread-3-processing-n:127.0.0.1:50633_solr) [n:127.0.0.1:50633_solr    ] o.a.s.c.c.ZkStateReader ZooKeeper watch triggered, but Solr cannot talk to ZK: [KeeperErrorCode = Session expired for /live_nodes]
   [junit4]   2> 213947 INFO  (jetty-launcher-465-thread-4) [    ] o.e.j.s.h.ContextHandler Stopped o.e.j.s.ServletContextHandler@48777a30{/solr,null,UNAVAILABLE}
   [junit4]   2> 215441 WARN  (zkCallback-508-thread-1-processing-n:127.0.0.1:50630_solr) [n:127.0.0.1:50630_solr    ] o.a.s.c.LeaderElector 
   [junit4]   2> org.apache.zookeeper.KeeperException$SessionExpiredException: KeeperErrorCode = Session expired for /overseer_elect/election
   [junit4]   2> 	at org.apache.zookeeper.KeeperException.create(KeeperException.java:127)
   [junit4]   2> 	at org.apache.zookeeper.KeeperException.create(KeeperException.java:51)
   [junit4]   2> 	at org.apache.zookeeper.ZooKeeper.getChildren(ZooKeeper.java:1472)
   [junit4]   2> 	at org.apache.solr.common.cloud.SolrZkClient$6.execute(SolrZkClient.java:331)
   [junit4]   2> 	at org.apache.solr.common.cloud.SolrZkClient$6.execute(SolrZkClient.java:328)
   [junit4]   2> 	at org.apache.solr.common.cloud.ZkCmdExecutor.retryOperation(ZkCmdExecutor.java:60)
   [junit4]   2> 	at org.apache.solr.common.cloud.SolrZkClient.getChildren(SolrZkClient.java:328)
   [junit4]   2> 	at org.apache.solr.cloud.LeaderElector.checkIfIamLeader(LeaderElector.java:105)
   [junit4]   2> 	at org.apache.solr.cloud.LeaderElector.access$200(LeaderElector.java:56)
   [junit4]   2> 	at org.apache.solr.cloud.LeaderElector$ElectionWatcher.process(LeaderElector.java:348)
   [junit4]   2> 	at org.apache.solr.common.cloud.SolrZkClient$3.lambda$process$0(SolrZkClient.java:266)
   [junit4]   2> 	at java.util.concurrent.Executors$RunnableAdapter.call(Executors.java:511)
   [junit4]   2> 	at java.util.concurrent.FutureTask.run(FutureTask.java:266)
   [junit4]   2> 	at org.apache.solr.common.util.ExecutorUtil$MDCAwareThreadPoolExecutor.lambda$execute$0(ExecutorUtil.java:229)
   [junit4]   2> 	at java.util.concurrent.ThreadPoolExecutor.runWorker(ThreadPoolExecutor.java:1142)
   [junit4]   2> 	at java.util.concurrent.ThreadPoolExecutor$Worker.run(ThreadPoolExecutor.java:617)
   [junit4]   2> 	at java.lang.Thread.run(Thread.java:745)
   [junit4]   2> 215442 INFO  (jetty-launcher-465-thread-3) [    ] o.e.j.s.h.ContextHandler Stopped o.e.j.s.ServletContextHandler@40b0ed29{/solr,null,UNAVAILABLE}
   [junit4]   2> 215443 WARN  (zkCallback-516-thread-1-processing-n:127.0.0.1:51379_solr) [n:127.0.0.1:51379_solr    ] o.a.s.c.c.ZkStateReader ZooKeeper watch triggered, but Solr cannot talk to ZK: [KeeperErrorCode = Session expired for /live_nodes]
   [junit4]   2> 215444 INFO  (jetty-launcher-465-thread-1) [    ] o.e.j.s.h.ContextHandler Stopped o.e.j.s.ServletContextHandler@1f752ffc{/solr,null,UNAVAILABLE}
   [junit4]   2> 215445 INFO  (SUITE-TestCollectionStateWatchers-seed#[BED70CE32A0F39F3]-worker) [    ] o.a.s.c.ZkTestServer connecting to 127.0.0.1:50626 50626
   [junit4]   2> 215447 INFO  (Thread-558) [    ] o.a.s.c.ZkTestServer connecting to 127.0.0.1:50626 50626
   [junit4]   2> 215449 WARN  (Thread-558) [    ] o.a.s.c.ZkTestServer Watch limit violations: 
   [junit4]   2> Maximum concurrent create/delete watches above limit:
   [junit4]   2> 
   [junit4]   2> 	8	/solr/aliases.json
   [junit4]   2> 	8	/solr/clusterprops.json
   [junit4]   2> 	7	/solr/security.json
   [junit4]   2> 	7	/solr/configs/config
   [junit4]   2> 	3	/solr/collections/stateformat1/state.json
   [junit4]   2> 
   [junit4]   2> Maximum concurrent data watches above limit:
   [junit4]   2> 
   [junit4]   2> 	16	/solr/collections/falsepredicate/state.json
   [junit4]   2> 	12	/solr/collections/waitforstate/state.json
   [junit4]   2> 	8	/solr/clusterstate.json
   [junit4]   2> 	7	/solr/collections/testcollection/state.json
   [junit4]   2> 	3	/solr/collections/stateformat1/state.json
   [junit4]   2> 	2	/solr/collections/currentstate/state.json
   [junit4]   2> 	2	/solr/overseer_elect/election/96517225526788106-127.0.0.1:50630_solr-n_0000000001
   [junit4]   2> 	2	/solr/collections/delayed/state.json
   [junit4]   2> 	2	/solr/overseer_elect/election/96517225526788107-127.0.0.1:50647_solr-n_0000000000
   [junit4]   2> 
   [junit4]   2> Maximum concurrent children watches above limit:
   [junit4]   2> 
   [junit4]   2> 	76	/solr/overseer/queue
   [junit4]   2> 	36	/solr/overseer/collection-queue-work
   [junit4]   2> 	14	/solr/overseer/queue-work
   [junit4]   2> 	8	/solr/collections
   [junit4]   2> 	5	/solr/live_nodes
   [junit4]   2> 
   [junit4]   2> 215449 INFO  (SUITE-TestCollectionStateWatchers-seed#[BED70CE32A0F39F3]-worker) [    ] o.a.s.SolrTestCaseJ4 ###deleteCore
   [junit4]   2> NOTE: leaving temporary files on disk at: C:\Users\jenkins\workspace\Lucene-Solr-master-Windows\solr\build\solr-solrj\test\J0\temp\solr.common.cloud.TestCollectionStateWatchers_BED70CE32A0F39F3-001
   [junit4]   2> Sep 01, 2016 1:20:41 PM com.carrotsearch.randomizedtesting.ThreadLeakControl checkThreadLeaks
   [junit4]   2> WARNING: Will linger awaiting termination of 1 leaked thread(s).
   [junit4]   2> NOTE: test params are: codec=Asserting(Lucene62), sim=ClassicSimilarity, locale=und, timezone=Asia/Pontianak
   [junit4]   2> NOTE: Windows 10 10.0 amd64/Oracle Corporation 1.8.0_102 (64-bit)/cpus=3,threads=1,free=128819072,total=373293056
   [junit4]   2> NOTE: All tests run in this JVM: [TestCollectionAdminRequest, StreamingTest, SolrExampleEmbeddedTest, SolrExampleStreamingTest, CloudSolrClientTest, TestJavaBinCodec, TermsResponseTest, TestXMLEscaping, TestToleratedUpdateError, JdbcDriverTest, NoOpResponseParserTest, LBHttpSolrClientBuilderTest, SchemaTest, FieldAnalysisResponseTest, TestRetryUtil, TestCoreAdmin, ModifiableSolrParamsTest, ConcurrentUpdateSolrClientTest, TestSpellCheckResponse, SolrExampleXMLTest, CommonAdminParamsTest, JDBCStreamTest, StreamExpressionToExpessionTest, StreamExpressionParserTest, ConcatOperationTest, OperationsTest, SolrPingTest, TestConfigSetAdminRequest, TestDelegationTokenRequest, TestDelegationTokenResponse, TestCollectionStateWatchers]
   [junit4] Completed [85/85 (1!)] on J0 in 57.00s, 9 tests, 1 error <<< FAILURES!

[...truncated 59471 lines...]


Mime
View raw message