lucene-dev mailing list archives

Site index · List index
Message view « Date » · « Thread »
Top « Date » · « Thread »
From Policeman Jenkins Server <jenk...@thetaphi.de>
Subject [JENKINS] Lucene-Solr-6.x-Solaris (64bit/jdk1.8.0) - Build # 375 - Still Unstable!
Date Sun, 04 Sep 2016 22:18:13 GMT
Build: http://jenkins.thetaphi.de/job/Lucene-Solr-6.x-Solaris/375/
Java: 64bit/jdk1.8.0 -XX:+UseCompressedOops -XX:+UseConcMarkSweepGC

3 tests failed.
FAILED:  junit.framework.TestSuite.org.apache.solr.core.TestCoreDiscovery

Error Message:
ObjectTracker found 5 object(s) that were not released!!! [MockDirectoryWrapper, MockDirectoryWrapper, SolrCore, MDCAwareThreadPoolExecutor, MockDirectoryWrapper]

Stack Trace:
java.lang.AssertionError: ObjectTracker found 5 object(s) that were not released!!! [MockDirectoryWrapper, MockDirectoryWrapper, SolrCore, MDCAwareThreadPoolExecutor, MockDirectoryWrapper]
	at __randomizedtesting.SeedInfo.seed([35036FCA06A2C923]:0)
	at org.junit.Assert.fail(Assert.java:93)
	at org.junit.Assert.assertTrue(Assert.java:43)
	at org.junit.Assert.assertNull(Assert.java:551)
	at org.apache.solr.SolrTestCaseJ4.teardownTestCases(SolrTestCaseJ4.java:258)
	at sun.reflect.GeneratedMethodAccessor18.invoke(Unknown Source)
	at sun.reflect.DelegatingMethodAccessorImpl.invoke(DelegatingMethodAccessorImpl.java:43)
	at java.lang.reflect.Method.invoke(Method.java:498)
	at com.carrotsearch.randomizedtesting.RandomizedRunner.invoke(RandomizedRunner.java:1764)
	at com.carrotsearch.randomizedtesting.RandomizedRunner$7.evaluate(RandomizedRunner.java:834)
	at com.carrotsearch.randomizedtesting.rules.StatementAdapter.evaluate(StatementAdapter.java:36)
	at com.carrotsearch.randomizedtesting.rules.SystemPropertiesRestoreRule$1.evaluate(SystemPropertiesRestoreRule.java:57)
	at org.apache.lucene.util.AbstractBeforeAfterRule$1.evaluate(AbstractBeforeAfterRule.java:45)
	at com.carrotsearch.randomizedtesting.rules.StatementAdapter.evaluate(StatementAdapter.java:36)
	at org.apache.lucene.util.TestRuleStoreClassName$1.evaluate(TestRuleStoreClassName.java:41)
	at com.carrotsearch.randomizedtesting.rules.NoShadowingOrOverridesOnMethodsRule$1.evaluate(NoShadowingOrOverridesOnMethodsRule.java:40)
	at com.carrotsearch.randomizedtesting.rules.NoShadowingOrOverridesOnMethodsRule$1.evaluate(NoShadowingOrOverridesOnMethodsRule.java:40)
	at com.carrotsearch.randomizedtesting.rules.StatementAdapter.evaluate(StatementAdapter.java:36)
	at com.carrotsearch.randomizedtesting.rules.StatementAdapter.evaluate(StatementAdapter.java:36)
	at com.carrotsearch.randomizedtesting.rules.StatementAdapter.evaluate(StatementAdapter.java:36)
	at org.apache.lucene.util.TestRuleAssertionsRequired$1.evaluate(TestRuleAssertionsRequired.java:53)
	at org.apache.lucene.util.TestRuleMarkFailure$1.evaluate(TestRuleMarkFailure.java:47)
	at org.apache.lucene.util.TestRuleIgnoreAfterMaxFailures$1.evaluate(TestRuleIgnoreAfterMaxFailures.java:64)
	at org.apache.lucene.util.TestRuleIgnoreTestSuites$1.evaluate(TestRuleIgnoreTestSuites.java:54)
	at com.carrotsearch.randomizedtesting.rules.StatementAdapter.evaluate(StatementAdapter.java:36)
	at com.carrotsearch.randomizedtesting.ThreadLeakControl$StatementRunner.run(ThreadLeakControl.java:367)
	at java.lang.Thread.run(Thread.java:745)


FAILED:  junit.framework.TestSuite.org.apache.solr.core.TestCoreDiscovery

Error Message:
1 thread leaked from SUITE scope at org.apache.solr.core.TestCoreDiscovery:     1) Thread[id=2446, name=searcherExecutor-1640-thread-1, state=WAITING, group=TGRP-TestCoreDiscovery]         at sun.misc.Unsafe.park(Native Method)         at java.util.concurrent.locks.LockSupport.park(LockSupport.java:175)         at java.util.concurrent.locks.AbstractQueuedSynchronizer$ConditionObject.await(AbstractQueuedSynchronizer.java:2039)         at java.util.concurrent.LinkedBlockingQueue.take(LinkedBlockingQueue.java:442)         at java.util.concurrent.ThreadPoolExecutor.getTask(ThreadPoolExecutor.java:1067)         at java.util.concurrent.ThreadPoolExecutor.runWorker(ThreadPoolExecutor.java:1127)         at java.util.concurrent.ThreadPoolExecutor$Worker.run(ThreadPoolExecutor.java:617)         at java.lang.Thread.run(Thread.java:745)

Stack Trace:
com.carrotsearch.randomizedtesting.ThreadLeakError: 1 thread leaked from SUITE scope at org.apache.solr.core.TestCoreDiscovery: 
   1) Thread[id=2446, name=searcherExecutor-1640-thread-1, state=WAITING, group=TGRP-TestCoreDiscovery]
        at sun.misc.Unsafe.park(Native Method)
        at java.util.concurrent.locks.LockSupport.park(LockSupport.java:175)
        at java.util.concurrent.locks.AbstractQueuedSynchronizer$ConditionObject.await(AbstractQueuedSynchronizer.java:2039)
        at java.util.concurrent.LinkedBlockingQueue.take(LinkedBlockingQueue.java:442)
        at java.util.concurrent.ThreadPoolExecutor.getTask(ThreadPoolExecutor.java:1067)
        at java.util.concurrent.ThreadPoolExecutor.runWorker(ThreadPoolExecutor.java:1127)
        at java.util.concurrent.ThreadPoolExecutor$Worker.run(ThreadPoolExecutor.java:617)
        at java.lang.Thread.run(Thread.java:745)
	at __randomizedtesting.SeedInfo.seed([35036FCA06A2C923]:0)


FAILED:  junit.framework.TestSuite.org.apache.solr.core.TestCoreDiscovery

Error Message:
There are still zombie threads that couldn't be terminated:    1) Thread[id=2446, name=searcherExecutor-1640-thread-1, state=WAITING, group=TGRP-TestCoreDiscovery]         at sun.misc.Unsafe.park(Native Method)         at java.util.concurrent.locks.LockSupport.park(LockSupport.java:175)         at java.util.concurrent.locks.AbstractQueuedSynchronizer$ConditionObject.await(AbstractQueuedSynchronizer.java:2039)         at java.util.concurrent.LinkedBlockingQueue.take(LinkedBlockingQueue.java:442)         at java.util.concurrent.ThreadPoolExecutor.getTask(ThreadPoolExecutor.java:1067)         at java.util.concurrent.ThreadPoolExecutor.runWorker(ThreadPoolExecutor.java:1127)         at java.util.concurrent.ThreadPoolExecutor$Worker.run(ThreadPoolExecutor.java:617)         at java.lang.Thread.run(Thread.java:745)

Stack Trace:
com.carrotsearch.randomizedtesting.ThreadLeakError: There are still zombie threads that couldn't be terminated:
   1) Thread[id=2446, name=searcherExecutor-1640-thread-1, state=WAITING, group=TGRP-TestCoreDiscovery]
        at sun.misc.Unsafe.park(Native Method)
        at java.util.concurrent.locks.LockSupport.park(LockSupport.java:175)
        at java.util.concurrent.locks.AbstractQueuedSynchronizer$ConditionObject.await(AbstractQueuedSynchronizer.java:2039)
        at java.util.concurrent.LinkedBlockingQueue.take(LinkedBlockingQueue.java:442)
        at java.util.concurrent.ThreadPoolExecutor.getTask(ThreadPoolExecutor.java:1067)
        at java.util.concurrent.ThreadPoolExecutor.runWorker(ThreadPoolExecutor.java:1127)
        at java.util.concurrent.ThreadPoolExecutor$Worker.run(ThreadPoolExecutor.java:617)
        at java.lang.Thread.run(Thread.java:745)
	at __randomizedtesting.SeedInfo.seed([35036FCA06A2C923]:0)




Build Log:
[...truncated 10808 lines...]
   [junit4] Suite: org.apache.solr.core.TestCoreDiscovery
   [junit4]   2> Creating dataDir: /export/home/jenkins/workspace/Lucene-Solr-6.x-Solaris/solr/build/solr-core/test/J1/temp/solr.core.TestCoreDiscovery_35036FCA06A2C923-001/init-core-data-001
   [junit4]   2> 301769 INFO  (SUITE-TestCoreDiscovery-seed#[35036FCA06A2C923]-worker) [    ] o.a.s.SolrTestCaseJ4 Randomized ssl (false) and clientAuth (false) via: @org.apache.solr.util.RandomizeSSL(reason=, value=NaN, ssl=NaN, clientAuth=NaN)
   [junit4]   2> 301769 INFO  (SUITE-TestCoreDiscovery-seed#[35036FCA06A2C923]-worker) [    ] o.a.s.SolrTestCaseJ4 ####initCore
   [junit4]   2> 301769 INFO  (SUITE-TestCoreDiscovery-seed#[35036FCA06A2C923]-worker) [    ] o.a.s.SolrTestCaseJ4 ####initCore end
   [junit4]   2> 301771 INFO  (TEST-TestCoreDiscovery.testNonCoreDirCantRead-seed#[35036FCA06A2C923]) [    ] o.a.s.SolrTestCaseJ4 ###Starting testNonCoreDirCantRead
   [junit4]   2> 301776 INFO  (TEST-TestCoreDiscovery.testNonCoreDirCantRead-seed#[35036FCA06A2C923]) [    ] o.a.s.c.SolrResourceLoader JNDI not configured for solr (NoInitialContextEx)
   [junit4]   2> 301776 INFO  (TEST-TestCoreDiscovery.testNonCoreDirCantRead-seed#[35036FCA06A2C923]) [    ] o.a.s.c.SolrResourceLoader using system property solr.solr.home: /export/home/jenkins/workspace/Lucene-Solr-6.x-Solaris/solr/build/solr-core/test/J1/temp/solr.core.TestCoreDiscovery_35036FCA06A2C923-001/tempDir-001
   [junit4]   2> 301776 INFO  (TEST-TestCoreDiscovery.testNonCoreDirCantRead-seed#[35036FCA06A2C923]) [    ] o.a.s.c.SolrResourceLoader new SolrResourceLoader for directory: '/export/home/jenkins/workspace/Lucene-Solr-6.x-Solaris/solr/build/solr-core/test/J1/temp/solr.core.TestCoreDiscovery_35036FCA06A2C923-001/tempDir-001'
   [junit4]   2> 301776 INFO  (TEST-TestCoreDiscovery.testNonCoreDirCantRead-seed#[35036FCA06A2C923]) [    ] o.a.s.c.SolrResourceLoader JNDI not configured for solr (NoInitialContextEx)
   [junit4]   2> 301776 INFO  (TEST-TestCoreDiscovery.testNonCoreDirCantRead-seed#[35036FCA06A2C923]) [    ] o.a.s.c.SolrResourceLoader using system property solr.solr.home: /export/home/jenkins/workspace/Lucene-Solr-6.x-Solaris/solr/build/solr-core/test/J1/temp/solr.core.TestCoreDiscovery_35036FCA06A2C923-001/tempDir-001
   [junit4]   2> 301777 INFO  (TEST-TestCoreDiscovery.testNonCoreDirCantRead-seed#[35036FCA06A2C923]) [    ] o.a.s.c.SolrXmlConfig Loading container configuration from /export/home/jenkins/workspace/Lucene-Solr-6.x-Solaris/solr/build/solr-core/test/J1/temp/solr.core.TestCoreDiscovery_35036FCA06A2C923-001/tempDir-001/solr.xml
   [junit4]   2> 301781 INFO  (TEST-TestCoreDiscovery.testNonCoreDirCantRead-seed#[35036FCA06A2C923]) [    ] o.a.s.c.CorePropertiesLocator Config-defined core root directory: /export/home/jenkins/workspace/Lucene-Solr-6.x-Solaris/solr/build/solr-core/test/J1/temp/solr.core.TestCoreDiscovery_35036FCA06A2C923-001/tempDir-001
   [junit4]   2> 301781 INFO  (TEST-TestCoreDiscovery.testNonCoreDirCantRead-seed#[35036FCA06A2C923]) [    ] o.a.s.c.CoreContainer New CoreContainer 1203259797
   [junit4]   2> 301781 INFO  (TEST-TestCoreDiscovery.testNonCoreDirCantRead-seed#[35036FCA06A2C923]) [    ] o.a.s.c.CoreContainer Loading cores into CoreContainer [instanceDir=/export/home/jenkins/workspace/Lucene-Solr-6.x-Solaris/solr/build/solr-core/test/J1/temp/solr.core.TestCoreDiscovery_35036FCA06A2C923-001/tempDir-001]
   [junit4]   2> 301782 WARN  (TEST-TestCoreDiscovery.testNonCoreDirCantRead-seed#[35036FCA06A2C923]) [    ] o.a.s.c.CoreContainer Couldn't add files from /export/home/jenkins/workspace/Lucene-Solr-6.x-Solaris/solr/build/solr-core/test/J1/temp/solr.core.TestCoreDiscovery_35036FCA06A2C923-001/tempDir-001/lib to classpath: /export/home/jenkins/workspace/Lucene-Solr-6.x-Solaris/solr/build/solr-core/test/J1/temp/solr.core.TestCoreDiscovery_35036FCA06A2C923-001/tempDir-001/lib
   [junit4]   2> 301782 INFO  (TEST-TestCoreDiscovery.testNonCoreDirCantRead-seed#[35036FCA06A2C923]) [    ] o.a.s.h.c.HttpShardHandlerFactory created with socketTimeout : 600000,connTimeout : 60000,maxConnectionsPerHost : 20,maxConnections : 10000,corePoolSize : 0,maximumPoolSize : 2147483647,maxThreadIdleTime : 5,sizeOfQueue : -1,fairnessPolicy : false,useRetries : false,connectionsEvictorSleepDelay : 5000,maxConnectionIdleTime : 40000,
   [junit4]   2> 301784 INFO  (TEST-TestCoreDiscovery.testNonCoreDirCantRead-seed#[35036FCA06A2C923]) [    ] o.a.s.u.UpdateShardHandler Creating UpdateShardHandler HTTP client with params: socketTimeout=600000&connTimeout=60000&retry=true
   [junit4]   2> 301784 INFO  (TEST-TestCoreDiscovery.testNonCoreDirCantRead-seed#[35036FCA06A2C923]) [    ] o.a.s.c.SolrCores Allocating transient cache for 2 transient cores
   [junit4]   2> 301786 INFO  (TEST-TestCoreDiscovery.testNonCoreDirCantRead-seed#[35036FCA06A2C923]) [    ] o.a.s.l.LogWatcher SLF4J impl is org.slf4j.impl.Log4jLoggerFactory
   [junit4]   2> 301786 INFO  (TEST-TestCoreDiscovery.testNonCoreDirCantRead-seed#[35036FCA06A2C923]) [    ] o.a.s.l.LogWatcher Registering Log Listener [Log4j (org.slf4j.impl.Log4jLoggerFactory)]
   [junit4]   2> 301786 INFO  (TEST-TestCoreDiscovery.testNonCoreDirCantRead-seed#[35036FCA06A2C923]) [    ] o.a.s.c.CoreContainer Security conf doesn't exist. Skipping setup for authorization module.
   [junit4]   2> 301786 INFO  (TEST-TestCoreDiscovery.testNonCoreDirCantRead-seed#[35036FCA06A2C923]) [    ] o.a.s.c.CoreContainer No authentication plugin used.
   [junit4]   2> 301925 INFO  (TEST-TestCoreDiscovery.testNonCoreDirCantRead-seed#[35036FCA06A2C923]) [    ] o.a.s.c.CorePropertiesLocator Looking for core definitions underneath /export/home/jenkins/workspace/Lucene-Solr-6.x-Solaris/solr/build/solr-core/test/J1/temp/solr.core.TestCoreDiscovery_35036FCA06A2C923-001/tempDir-001
   [junit4]   2> 301926 WARN  (TEST-TestCoreDiscovery.testNonCoreDirCantRead-seed#[35036FCA06A2C923]) [    ] o.a.s.c.CorePropertiesLocator Error visiting /export/home/jenkins/workspace/Lucene-Solr-6.x-Solaris/solr/build/solr-core/test/J1/temp/solr.core.TestCoreDiscovery_35036FCA06A2C923-001/tempDir-001/cantReadDir: java.nio.file.AccessDeniedException: /export/home/jenkins/workspace/Lucene-Solr-6.x-Solaris/solr/build/solr-core/test/J1/temp/solr.core.TestCoreDiscovery_35036FCA06A2C923-001/tempDir-001/cantReadDir
   [junit4]   2> 301927 INFO  (TEST-TestCoreDiscovery.testNonCoreDirCantRead-seed#[35036FCA06A2C923]) [    ] o.a.s.c.CoreDescriptor Created CoreDescriptor: {name=core1, config=solrconfig-minimal.xml, loadOnStartup=true, schema=schema-tiny.xml, configSetProperties=configsetprops.json, transient=false, dataDir=stuffandnonsense}
   [junit4]   2> 301927 INFO  (TEST-TestCoreDiscovery.testNonCoreDirCantRead-seed#[35036FCA06A2C923]) [    ] o.a.s.c.CorePropertiesLocator Found core core1 in /export/home/jenkins/workspace/Lucene-Solr-6.x-Solaris/solr/build/solr-core/test/J1/temp/solr.core.TestCoreDiscovery_35036FCA06A2C923-001/tempDir-001/core1
   [junit4]   2> 301928 INFO  (TEST-TestCoreDiscovery.testNonCoreDirCantRead-seed#[35036FCA06A2C923]) [    ] o.a.s.c.CoreDescriptor Created CoreDescriptor: {name=core2, config=solrconfig-minimal.xml, loadOnStartup=false, schema=schema-tiny.xml, configSetProperties=configsetprops.json, transient=false, dataDir=core2}
   [junit4]   2> 301928 INFO  (TEST-TestCoreDiscovery.testNonCoreDirCantRead-seed#[35036FCA06A2C923]) [    ] o.a.s.c.CorePropertiesLocator Found core core2 in /export/home/jenkins/workspace/Lucene-Solr-6.x-Solaris/solr/build/solr-core/test/J1/temp/solr.core.TestCoreDiscovery_35036FCA06A2C923-001/tempDir-001/core2
   [junit4]   2> 301928 INFO  (TEST-TestCoreDiscovery.testNonCoreDirCantRead-seed#[35036FCA06A2C923]) [    ] o.a.s.c.CorePropertiesLocator Found 2 core definitions
   [junit4]   2> 301929 INFO  (coreLoadExecutor-1528-thread-1) [    ] o.a.s.c.SolrResourceLoader new SolrResourceLoader for directory: '/export/home/jenkins/workspace/Lucene-Solr-6.x-Solaris/solr/build/solr-core/test/J1/temp/solr.core.TestCoreDiscovery_35036FCA06A2C923-001/tempDir-001/core1'
   [junit4]   2> 301929 INFO  (coreLoadExecutor-1528-thread-1) [    ] o.a.s.c.SolrResourceLoader JNDI not configured for solr (NoInitialContextEx)
   [junit4]   2> 301929 INFO  (coreLoadExecutor-1528-thread-1) [    ] o.a.s.c.SolrResourceLoader using system property solr.solr.home: /export/home/jenkins/workspace/Lucene-Solr-6.x-Solaris/solr/build/solr-core/test/J1/temp/solr.core.TestCoreDiscovery_35036FCA06A2C923-001/tempDir-001
   [junit4]   2> 301943 INFO  (coreLoadExecutor-1528-thread-1) [    ] o.a.s.c.SolrConfig current version of requestparams : -1
   [junit4]   2> 301946 INFO  (coreLoadExecutor-1528-thread-1) [    ] o.a.s.c.SolrConfig Using Lucene MatchVersion: 6.3.0
   [junit4]   2> 301955 INFO  (coreLoadExecutor-1528-thread-1) [    ] o.a.s.c.SolrConfig Loaded SolrConfig: solrconfig-minimal.xml
   [junit4]   2> 301957 INFO  (coreLoadExecutor-1528-thread-1) [    ] o.a.s.s.IndexSchema [core1] Schema name=tiny
   [junit4]   2> 301960 INFO  (coreLoadExecutor-1528-thread-1) [    ] o.a.s.s.IndexSchema unique key field: id
   [junit4]   2> 301963 INFO  (coreLoadExecutor-1528-thread-1) [    ] o.a.s.c.ConfigSetProperties Did not find ConfigSet properties, assuming default properties: Can't find resource 'configsetprops.json' in classpath or '/export/home/jenkins/workspace/Lucene-Solr-6.x-Solaris/solr/build/solr-core/test/J1/temp/solr.core.TestCoreDiscovery_35036FCA06A2C923-001/tempDir-001/core1'
   [junit4]   2> 301963 INFO  (coreLoadExecutor-1528-thread-1) [    ] o.a.s.c.CoreContainer Creating SolrCore 'core1' using configuration from instancedir /export/home/jenkins/workspace/Lucene-Solr-6.x-Solaris/solr/build/solr-core/test/J1/temp/solr.core.TestCoreDiscovery_35036FCA06A2C923-001/tempDir-001/core1
   [junit4]   2> 301963 INFO  (coreLoadExecutor-1528-thread-1) [    x:core1] o.a.s.c.SolrCore org.apache.solr.core.MockDirectoryFactory
   [junit4]   2> 301963 INFO  (coreLoadExecutor-1528-thread-1) [    x:core1] o.a.s.c.SolrCore [[core1] ] Opening new SolrCore at [/export/home/jenkins/workspace/Lucene-Solr-6.x-Solaris/solr/build/solr-core/test/J1/temp/solr.core.TestCoreDiscovery_35036FCA06A2C923-001/tempDir-001/core1], dataDir=[/export/home/jenkins/workspace/Lucene-Solr-6.x-Solaris/solr/build/solr-core/test/J1/temp/solr.core.TestCoreDiscovery_35036FCA06A2C923-001/tempDir-001/core1/stuffandnonsense/]
   [junit4]   2> 301963 INFO  (coreLoadExecutor-1528-thread-1) [    x:core1] o.a.s.c.SolrCore JMX monitoring not detected for core: core1
   [junit4]   2> 301963 INFO  (coreLoadExecutor-1528-thread-1) [    x:core1] o.a.s.c.CachingDirectoryFactory return new directory for /export/home/jenkins/workspace/Lucene-Solr-6.x-Solaris/solr/build/solr-core/test/J1/temp/solr.core.TestCoreDiscovery_35036FCA06A2C923-001/tempDir-001/core1/stuffandnonsense/snapshot_metadata
   [junit4]   2> 301963 INFO  (coreLoadExecutor-1528-thread-1) [    x:core1] o.a.s.c.s.SolrSnapshotMetaDataManager Loading from snapshot metadata file...
   [junit4]   2> 301964 INFO  (coreLoadExecutor-1528-thread-1) [    x:core1] o.a.s.c.CachingDirectoryFactory return new directory for /export/home/jenkins/workspace/Lucene-Solr-6.x-Solaris/solr/build/solr-core/test/J1/temp/solr.core.TestCoreDiscovery_35036FCA06A2C923-001/tempDir-001/core1/stuffandnonsense
   [junit4]   2> 301964 INFO  (coreLoadExecutor-1528-thread-1) [    x:core1] o.a.s.c.SolrCore New index directory detected: old=null new=/export/home/jenkins/workspace/Lucene-Solr-6.x-Solaris/solr/build/solr-core/test/J1/temp/solr.core.TestCoreDiscovery_35036FCA06A2C923-001/tempDir-001/core1/stuffandnonsense/index/
   [junit4]   2> 301964 WARN  (coreLoadExecutor-1528-thread-1) [    x:core1] o.a.s.c.SolrCore [core1] Solr index directory '/export/home/jenkins/workspace/Lucene-Solr-6.x-Solaris/solr/build/solr-core/test/J1/temp/solr.core.TestCoreDiscovery_35036FCA06A2C923-001/tempDir-001/core1/stuffandnonsense/index' doesn't exist. Creating new index...
   [junit4]   2> 301964 INFO  (coreLoadExecutor-1528-thread-1) [    x:core1] o.a.s.c.CachingDirectoryFactory return new directory for /export/home/jenkins/workspace/Lucene-Solr-6.x-Solaris/solr/build/solr-core/test/J1/temp/solr.core.TestCoreDiscovery_35036FCA06A2C923-001/tempDir-001/core1/stuffandnonsense/index
   [junit4]   2> 301964 INFO  (coreLoadExecutor-1528-thread-1) [    x:core1] o.a.s.u.RandomMergePolicy RandomMergePolicy wrapping class org.apache.lucene.index.TieredMergePolicy: [TieredMergePolicy: maxMergeAtOnce=32, maxMergeAtOnceExplicit=23, maxMergedSegmentMB=63.7421875, floorSegmentMB=0.310546875, forceMergeDeletesPctAllowed=9.485459830711623, segmentsPerTier=48.0, maxCFSSegmentSizeMB=8.796093022207999E12, noCFSRatio=0.0
   [junit4]   2> 301965 INFO  (coreLoadExecutor-1528-thread-1) [    x:core1] o.a.s.c.SolrDeletionPolicy SolrDeletionPolicy.onCommit: commits: num=1
   [junit4]   2> 	commit{dir=MockDirectoryWrapper(RAMDirectory@4b2eefc1 lockFactory=org.apache.lucene.store.SingleInstanceLockFactory@46cbd390),segFN=segments_1,generation=1}
   [junit4]   2> 301965 INFO  (coreLoadExecutor-1528-thread-1) [    x:core1] o.a.s.c.SolrDeletionPolicy newest commit generation = 1
   [junit4]   2> 301965 INFO  (OldIndexDirectoryCleanupThreadForCore-core1) [    x:core1] o.a.s.c.SolrCore Looking for old index directories to cleanup for core core1 in /export/home/jenkins/workspace/Lucene-Solr-6.x-Solaris/solr/build/solr-core/test/J1/temp/solr.core.TestCoreDiscovery_35036FCA06A2C923-001/tempDir-001/core1/stuffandnonsense/
   [junit4]   2> 301965 WARN  (OldIndexDirectoryCleanupThreadForCore-core1) [    x:core1] o.a.s.c.DirectoryFactory /export/home/jenkins/workspace/Lucene-Solr-6.x-Solaris/solr/build/solr-core/test/J1/temp/solr.core.TestCoreDiscovery_35036FCA06A2C923-001/tempDir-001/core1/stuffandnonsense/ does not point to a valid data directory; skipping clean-up of old index directories.
   [junit4]   2> 301966 INFO  (coreLoadExecutor-1528-thread-1) [    x:core1] o.a.s.c.SolrCore no updateRequestProcessorChain defined as default, creating implicit default
   [junit4]   2> 301968 INFO  (coreLoadExecutor-1528-thread-1) [    x:core1] o.a.s.h.l.XMLLoader xsltCacheLifetimeSeconds=60
   [junit4]   2> 301969 INFO  (coreLoadExecutor-1528-thread-1) [    x:core1] o.a.s.h.l.XMLLoader xsltCacheLifetimeSeconds=60
   [junit4]   2> 301970 INFO  (coreLoadExecutor-1528-thread-1) [    x:core1] o.a.s.h.l.XMLLoader xsltCacheLifetimeSeconds=60
   [junit4]   2> 301971 INFO  (coreLoadExecutor-1528-thread-1) [    x:core1] o.a.s.h.l.XMLLoader xsltCacheLifetimeSeconds=60
   [junit4]   2> 301973 INFO  (coreLoadExecutor-1528-thread-1) [    x:core1] o.a.s.c.RequestHandlers Registered paths: /admin/mbeans,/update/json/docs,/admin/luke,/export,/get,/admin/properties,/update/json,/admin/threads,/update/csv,/sql,/graph,/select,/admin/segments,/admin/system,/replication,/config,/stream,/schema,/admin/plugins,/admin/logging,/admin/ping,/update,/admin/file,/terms
   [junit4]   2> 301973 INFO  (coreLoadExecutor-1528-thread-1) [    x:core1] o.a.s.c.SolrCore Using default statsCache cache: org.apache.solr.search.stats.LocalStatsCache
   [junit4]   2> 301973 INFO  (coreLoadExecutor-1528-thread-1) [    x:core1] o.a.s.u.CommitTracker Hard AutoCommit: disabled
   [junit4]   2> 301973 INFO  (coreLoadExecutor-1528-thread-1) [    x:core1] o.a.s.u.CommitTracker Soft AutoCommit: disabled
   [junit4]   2> 301973 INFO  (coreLoadExecutor-1528-thread-1) [    x:core1] o.a.s.u.RandomMergePolicy RandomMergePolicy wrapping class org.apache.lucene.index.TieredMergePolicy: [TieredMergePolicy: maxMergeAtOnce=37, maxMergeAtOnceExplicit=42, maxMergedSegmentMB=70.9990234375, floorSegmentMB=2.0771484375, forceMergeDeletesPctAllowed=12.61880259410295, segmentsPerTier=50.0, maxCFSSegmentSizeMB=8.796093022207999E12, noCFSRatio=0.0
   [junit4]   2> 301974 INFO  (coreLoadExecutor-1528-thread-1) [    x:core1] o.a.s.c.SolrDeletionPolicy SolrDeletionPolicy.onInit: commits: num=1
   [junit4]   2> 	commit{dir=MockDirectoryWrapper(RAMDirectory@4b2eefc1 lockFactory=org.apache.lucene.store.SingleInstanceLockFactory@46cbd390),segFN=segments_1,generation=1}
   [junit4]   2> 301974 INFO  (coreLoadExecutor-1528-thread-1) [    x:core1] o.a.s.c.SolrDeletionPolicy newest commit generation = 1
   [junit4]   2> 301974 INFO  (coreLoadExecutor-1528-thread-1) [    x:core1] o.a.s.s.SolrIndexSearcher Opening [Searcher@87d599e[core1] main]
   [junit4]   2> 301974 INFO  (coreLoadExecutor-1528-thread-1) [    x:core1] o.a.s.r.ManagedResourceStorage File-based storage initialized to use dir: /export/home/jenkins/workspace/Lucene-Solr-6.x-Solaris/solr/build/solr-core/test/J1/temp/solr.core.TestCoreDiscovery_35036FCA06A2C923-001/tempDir-001/core1/conf
   [junit4]   2> 301974 INFO  (coreLoadExecutor-1528-thread-1) [    x:core1] o.a.s.r.RestManager Initializing RestManager with initArgs: {storageDir=/export/home/jenkins/workspace/Lucene-Solr-6.x-Solaris/solr/build/solr-core/test/J1/temp/solr.core.TestCoreDiscovery_35036FCA06A2C923-001/tempDir-001/core1/conf}
   [junit4]   2> 301974 INFO  (coreLoadExecutor-1528-thread-1) [    x:core1] o.a.s.r.ManagedResourceStorage Reading _rest_managed.json using file:dir=/export/home/jenkins/workspace/Lucene-Solr-6.x-Solaris/solr/build/solr-core/test/J1/temp/solr.core.TestCoreDiscovery_35036FCA06A2C923-001/tempDir-001/core1/conf
   [junit4]   2> 301975 INFO  (coreLoadExecutor-1528-thread-1) [    x:core1] o.a.s.r.RestManager Initializing 0 registered ManagedResources
   [junit4]   2> 301975 INFO  (coreLoadExecutor-1528-thread-1) [    x:core1] o.a.s.h.ReplicationHandler Commits will be reserved for  10000
   [junit4]   2> 301975 INFO  (coreLoadExecutor-1528-thread-1) [    x:core1] o.a.s.c.CoreContainer registering core: core1
   [junit4]   2> 301975 INFO  (searcherExecutor-1529-thread-1-processing-x:core1) [    x:core1] o.a.s.c.SolrCore [core1] Registered new searcher Searcher@87d599e[core1] main{ExitableDirectoryReader(UninvertingDirectoryReader())}
   [junit4]   2> 301975 INFO  (TEST-TestCoreDiscovery.testNonCoreDirCantRead-seed#[35036FCA06A2C923]) [    ] o.a.s.c.SolrResourceLoader new SolrResourceLoader for directory: '/export/home/jenkins/workspace/Lucene-Solr-6.x-Solaris/solr/build/solr-core/test/J1/temp/solr.core.TestCoreDiscovery_35036FCA06A2C923-001/tempDir-001/core2'
   [junit4]   2> 301975 INFO  (TEST-TestCoreDiscovery.testNonCoreDirCantRead-seed#[35036FCA06A2C923]) [    ] o.a.s.c.SolrResourceLoader JNDI not configured for solr (NoInitialContextEx)
   [junit4]   2> 301975 INFO  (TEST-TestCoreDiscovery.testNonCoreDirCantRead-seed#[35036FCA06A2C923]) [    ] o.a.s.c.SolrResourceLoader using system property solr.solr.home: /export/home/jenkins/workspace/Lucene-Solr-6.x-Solaris/solr/build/solr-core/test/J1/temp/solr.core.TestCoreDiscovery_35036FCA06A2C923-001/tempDir-001
   [junit4]   2> 301983 INFO  (TEST-TestCoreDiscovery.testNonCoreDirCantRead-seed#[35036FCA06A2C923]) [    ] o.a.s.c.SolrConfig current version of requestparams : -1
   [junit4]   2> 301986 INFO  (TEST-TestCoreDiscovery.testNonCoreDirCantRead-seed#[35036FCA06A2C923]) [    ] o.a.s.c.SolrConfig Using Lucene MatchVersion: 6.3.0
   [junit4]   2> 302004 INFO  (TEST-TestCoreDiscovery.testNonCoreDirCantRead-seed#[35036FCA06A2C923]) [    ] o.a.s.c.SolrConfig Loaded SolrConfig: solrconfig-minimal.xml
   [junit4]   2> 302008 INFO  (TEST-TestCoreDiscovery.testNonCoreDirCantRead-seed#[35036FCA06A2C923]) [    ] o.a.s.s.IndexSchema [core2] Schema name=tiny
   [junit4]   2> 302011 INFO  (TEST-TestCoreDiscovery.testNonCoreDirCantRead-seed#[35036FCA06A2C923]) [    ] o.a.s.s.IndexSchema unique key field: id
   [junit4]   2> 302017 INFO  (TEST-TestCoreDiscovery.testNonCoreDirCantRead-seed#[35036FCA06A2C923]) [    ] o.a.s.c.ConfigSetProperties Did not find ConfigSet properties, assuming default properties: Can't find resource 'configsetprops.json' in classpath or '/export/home/jenkins/workspace/Lucene-Solr-6.x-Solaris/solr/build/solr-core/test/J1/temp/solr.core.TestCoreDiscovery_35036FCA06A2C923-001/tempDir-001/core2'
   [junit4]   2> 302017 INFO  (TEST-TestCoreDiscovery.testNonCoreDirCantRead-seed#[35036FCA06A2C923]) [    ] o.a.s.c.CoreContainer Creating SolrCore 'core2' using configuration from instancedir /export/home/jenkins/workspace/Lucene-Solr-6.x-Solaris/solr/build/solr-core/test/J1/temp/solr.core.TestCoreDiscovery_35036FCA06A2C923-001/tempDir-001/core2
   [junit4]   2> 302018 INFO  (TEST-TestCoreDiscovery.testNonCoreDirCantRead-seed#[35036FCA06A2C923]) [    x:core2] o.a.s.c.SolrCore org.apache.solr.core.MockDirectoryFactory
   [junit4]   2> 302018 INFO  (TEST-TestCoreDiscovery.testNonCoreDirCantRead-seed#[35036FCA06A2C923]) [    x:core2] o.a.s.c.SolrCore [[core2] ] Opening new SolrCore at [/export/home/jenkins/workspace/Lucene-Solr-6.x-Solaris/solr/build/solr-core/test/J1/temp/solr.core.TestCoreDiscovery_35036FCA06A2C923-001/tempDir-001/core2], dataDir=[/export/home/jenkins/workspace/Lucene-Solr-6.x-Solaris/solr/build/solr-core/test/J1/temp/solr.core.TestCoreDiscovery_35036FCA06A2C923-001/tempDir-001/core2/core2/]
   [junit4]   2> 302018 INFO  (TEST-TestCoreDiscovery.testNonCoreDirCantRead-seed#[35036FCA06A2C923]) [    x:core2] o.a.s.c.SolrCore JMX monitoring not detected for core: core2
   [junit4]   2> 302018 INFO  (TEST-TestCoreDiscovery.testNonCoreDirCantRead-seed#[35036FCA06A2C923]) [    x:core2] o.a.s.c.CachingDirectoryFactory return new directory for /export/home/jenkins/workspace/Lucene-Solr-6.x-Solaris/solr/build/solr-core/test/J1/temp/solr.core.TestCoreDiscovery_35036FCA06A2C923-001/tempDir-001/core2/core2/snapshot_metadata
   [junit4]   2> 302018 INFO  (TEST-TestCoreDiscovery.testNonCoreDirCantRead-seed#[35036FCA06A2C923]) [    x:core2] o.a.s.c.s.SolrSnapshotMetaDataManager Loading from snapshot metadata file...
   [junit4]   2> 302019 INFO  (TEST-TestCoreDiscovery.testNonCoreDirCantRead-seed#[35036FCA06A2C923]) [    x:core2] o.a.s.c.CachingDirectoryFactory return new directory for /export/home/jenkins/workspace/Lucene-Solr-6.x-Solaris/solr/build/solr-core/test/J1/temp/solr.core.TestCoreDiscovery_35036FCA06A2C923-001/tempDir-001/core2/core2
   [junit4]   2> 302019 INFO  (TEST-TestCoreDiscovery.testNonCoreDirCantRead-seed#[35036FCA06A2C923]) [    x:core2] o.a.s.c.SolrCore New index directory detected: old=null new=/export/home/jenkins/workspace/Lucene-Solr-6.x-Solaris/solr/build/solr-core/test/J1/temp/solr.core.TestCoreDiscovery_35036FCA06A2C923-001/tempDir-001/core2/core2/index/
   [junit4]   2> 302019 WARN  (TEST-TestCoreDiscovery.testNonCoreDirCantRead-seed#[35036FCA06A2C923]) [    x:core2] o.a.s.c.SolrCore [core2] Solr index directory '/export/home/jenkins/workspace/Lucene-Solr-6.x-Solaris/solr/build/solr-core/test/J1/temp/solr.core.TestCoreDiscovery_35036FCA06A2C923-001/tempDir-001/core2/core2/index' doesn't exist. Creating new index...
   [junit4]   2> 302019 INFO  (TEST-TestCoreDiscovery.testNonCoreDirCantRead-seed#[35036FCA06A2C923]) [    x:core2] o.a.s.c.CachingDirectoryFactory return new directory for /export/home/jenkins/workspace/Lucene-Solr-6.x-Solaris/solr/build/solr-core/test/J1/temp/solr.core.TestCoreDiscovery_35036FCA06A2C923-001/tempDir-001/core2/core2/index
   [junit4]   2> 302020 INFO  (TEST-TestCoreDiscovery.testNonCoreDirCantRead-seed#[35036FCA06A2C923]) [    x:core2] o.a.s.u.RandomMergePolicy RandomMergePolicy wrapping class org.apache.lucene.index.LogByteSizeMergePolicy: [LogByteSizeMergePolicy: minMergeSize=1677721, mergeFactor=17, maxMergeSize=2147483648, maxMergeSizeForForcedMerge=9223372036854775807, calibrateSizeByDeletes=true, maxMergeDocs=2147483647, maxCFSSegmentSizeMB=8.796093022207999E12, noCFSRatio=0.0]
   [junit4]   2> 302020 INFO  (TEST-TestCoreDiscovery.testNonCoreDirCantRead-seed#[35036FCA06A2C923]) [    x:core2] o.a.s.c.SolrDeletionPolicy SolrDeletionPolicy.onCommit: commits: num=1
   [junit4]   2> 	commit{dir=MockDirectoryWrapper(RAMDirectory@5e967c3a lockFactory=org.apache.lucene.store.SingleInstanceLockFactory@13efec9),segFN=segments_1,generation=1}
   [junit4]   2> 302021 INFO  (TEST-TestCoreDiscovery.testNonCoreDirCantRead-seed#[35036FCA06A2C923]) [    x:core2] o.a.s.c.SolrDeletionPolicy newest commit generation = 1
   [junit4]   2> 302021 INFO  (OldIndexDirectoryCleanupThreadForCore-core2) [    x:core2] o.a.s.c.SolrCore Looking for old index directories to cleanup for core core2 in /export/home/jenkins/workspace/Lucene-Solr-6.x-Solaris/solr/build/solr-core/test/J1/temp/solr.core.TestCoreDiscovery_35036FCA06A2C923-001/tempDir-001/core2/core2/
   [junit4]   2> 302021 WARN  (OldIndexDirectoryCleanupThreadForCore-core2) [    x:core2] o.a.s.c.DirectoryFactory /export/home/jenkins/workspace/Lucene-Solr-6.x-Solaris/solr/build/solr-core/test/J1/temp/solr.core.TestCoreDiscovery_35036FCA06A2C923-001/tempDir-001/core2/core2/ does not point to a valid data directory; skipping clean-up of old index directories.
   [junit4]   2> 302023 INFO  (TEST-TestCoreDiscovery.testNonCoreDirCantRead-seed#[35036FCA06A2C923]) [    x:core2] o.a.s.c.SolrCore no updateRequestProcessorChain defined as default, creating implicit default
   [junit4]   2> 302025 INFO  (TEST-TestCoreDiscovery.testNonCoreDirCantRead-seed#[35036FCA06A2C923]) [    x:core2] o.a.s.h.l.XMLLoader xsltCacheLifetimeSeconds=60
   [junit4]   2> 302026 INFO  (TEST-TestCoreDiscovery.testNonCoreDirCantRead-seed#[35036FCA06A2C923]) [    x:core2] o.a.s.h.l.XMLLoader xsltCacheLifetimeSeconds=60
   [junit4]   2> 302028 INFO  (TEST-TestCoreDiscovery.testNonCoreDirCantRead-seed#[35036FCA06A2C923]) [    x:core2] o.a.s.h.l.XMLLoader xsltCacheLifetimeSeconds=60
   [junit4]   2> 302038 INFO  (TEST-TestCoreDiscovery.testNonCoreDirCantRead-seed#[35036FCA06A2C923]) [    x:core2] o.a.s.h.l.XMLLoader xsltCacheLifetimeSeconds=60
   [junit4]   2> 302041 INFO  (TEST-TestCoreDiscovery.testNonCoreDirCantRead-seed#[35036FCA06A2C923]) [    x:core2] o.a.s.c.RequestHandlers Registered paths: /admin/mbeans,/update/json/docs,/admin/luke,/export,/get,/admin/properties,/update/json,/admin/threads,/update/csv,/sql,/graph,/select,/admin/segments,/admin/system,/replication,/config,/stream,/schema,/admin/plugins,/admin/logging,/admin/ping,/update,/admin/file,/terms
   [junit4]   2> 302041 INFO  (TEST-TestCoreDiscovery.testNonCoreDirCantRead-seed#[35036FCA06A2C923]) [    x:core2] o.a.s.c.SolrCore Using default statsCache cache: org.apache.solr.search.stats.LocalStatsCache
   [junit4]   2> 302041 INFO  (TEST-TestCoreDiscovery.testNonCoreDirCantRead-seed#[35036FCA06A2C923]) [    x:core2] o.a.s.u.CommitTracker Hard AutoCommit: disabled
   [junit4]   2> 302041 INFO  (TEST-TestCoreDiscovery.testNonCoreDirCantRead-seed#[35036FCA06A2C923]) [    x:core2] o.a.s.u.CommitTracker Soft AutoCommit: disabled
   [junit4]   2> 302041 INFO  (TEST-TestCoreDiscovery.testNonCoreDirCantRead-seed#[35036FCA06A2C923]) [    x:core2] o.a.s.u.RandomMergePolicy RandomMergePolicy wrapping class org.apache.lucene.index.LogByteSizeMergePolicy: [LogByteSizeMergePolicy: minMergeSize=1677721, mergeFactor=34, maxMergeSize=2147483648, maxMergeSizeForForcedMerge=9223372036854775807, calibrateSizeByDeletes=false, maxMergeDocs=2147483647, maxCFSSegmentSizeMB=8.796093022207999E12, noCFSRatio=1.0]
   [junit4]   2> 302042 INFO  (TEST-TestCoreDiscovery.testNonCoreDirCantRead-seed#[35036FCA06A2C923]) [    x:core2] o.a.s.c.SolrDeletionPolicy SolrDeletionPolicy.onInit: commits: num=1
   [junit4]   2> 	commit{dir=MockDirectoryWrapper(RAMDirectory@5e967c3a lockFactory=org.apache.lucene.store.SingleInstanceLockFactory@13efec9),segFN=segments_1,generation=1}
   [junit4]   2> 302042 INFO  (TEST-TestCoreDiscovery.testNonCoreDirCantRead-seed#[35036FCA06A2C923]) [    x:core2] o.a.s.c.SolrDeletionPolicy newest commit generation = 1
   [junit4]   2> 302042 INFO  (TEST-TestCoreDiscovery.testNonCoreDirCantRead-seed#[35036FCA06A2C923]) [    x:core2] o.a.s.s.SolrIndexSearcher Opening [Searcher@cf5ec8e[core2] main]
   [junit4]   2> 302043 INFO  (TEST-TestCoreDiscovery.testNonCoreDirCantRead-seed#[35036FCA06A2C923]) [    x:core2] o.a.s.r.ManagedResourceStorage File-based storage initialized to use dir: /export/home/jenkins/workspace/Lucene-Solr-6.x-Solaris/solr/build/solr-core/test/J1/temp/solr.core.TestCoreDiscovery_35036FCA06A2C923-001/tempDir-001/core2/conf
   [junit4]   2> 302043 INFO  (TEST-TestCoreDiscovery.testNonCoreDirCantRead-seed#[35036FCA06A2C923]) [    x:core2] o.a.s.r.RestManager Initializing RestManager with initArgs: {storageDir=/export/home/jenkins/workspace/Lucene-Solr-6.x-Solaris/solr/build/solr-core/test/J1/temp/solr.core.TestCoreDiscovery_35036FCA06A2C923-001/tempDir-001/core2/conf}
   [junit4]   2> 302043 INFO  (TEST-TestCoreDiscovery.testNonCoreDirCantRead-seed#[35036FCA06A2C923]) [    x:core2] o.a.s.r.ManagedResourceStorage Reading _rest_managed.json using file:dir=/export/home/jenkins/workspace/Lucene-Solr-6.x-Solaris/solr/build/solr-core/test/J1/temp/solr.core.TestCoreDiscovery_35036FCA06A2C923-001/tempDir-001/core2/conf
   [junit4]   2> 302043 INFO  (TEST-TestCoreDiscovery.testNonCoreDirCantRead-seed#[35036FCA06A2C923]) [    x:core2] o.a.s.r.RestManager Initializing 0 registered ManagedResources
   [junit4]   2> 302043 INFO  (TEST-TestCoreDiscovery.testNonCoreDirCantRead-seed#[35036FCA06A2C923]) [    x:core2] o.a.s.h.ReplicationHandler Commits will be reserved for  10000
   [junit4]   2> 302044 INFO  (TEST-TestCoreDiscovery.testNonCoreDirCantRead-seed#[35036FCA06A2C923]) [    x:core2] o.a.s.c.CoreContainer registering core: core2
   [junit4]   2> 302044 INFO  (TEST-TestCoreDiscovery.testNonCoreDirCantRead-seed#[35036FCA06A2C923]) [    x:core2] o.a.s.c.CoreContainer Shutting down CoreContainer instance=1203259797
   [junit4]   2> 302045 INFO  (coreCloseExecutor-1537-thread-1-processing-x:core2) [    x:core1] o.a.s.c.SolrCore [core1]  CLOSING SolrCore org.apache.solr.core.SolrCore@66a857d4
   [junit4]   2> 302045 INFO  (coreCloseExecutor-1537-thread-1-processing-x:core2) [    x:core1] o.a.s.u.DirectUpdateHandler2 closing DirectUpdateHandler2{commits=0,autocommits=0,soft autocommits=0,optimizes=0,rollbacks=0,expungeDeletes=0,docsPending=0,adds=0,deletesById=0,deletesByQuery=0,errors=0,cumulative_adds=0,cumulative_deletesById=0,cumulative_deletesByQuery=0,cumulative_errors=0}
   [junit4]   2> 302045 INFO  (coreCloseExecutor-1537-thread-1-processing-x:core2) [    x:core1] o.a.s.u.SolrCoreState Closing SolrCoreState
   [junit4]   2> 302045 INFO  (coreCloseExecutor-1537-thread-1-processing-x:core2) [    x:core1] o.a.s.u.DefaultSolrCoreState SolrCoreState ref count has reached 0 - closing IndexWriter
   [junit4]   2> 302045 INFO  (coreCloseExecutor-1537-thread-1-processing-x:core2) [    x:core1] o.a.s.u.DefaultSolrCoreState closing IndexWriter with IndexWriterCloser
   [junit4]   2> 302046 INFO  (coreCloseExecutor-1537-thread-2-processing-x:core2) [    x:core2] o.a.s.c.SolrCore [core2]  CLOSING SolrCore org.apache.solr.core.SolrCore@2a795664
   [junit4]   2> 302047 INFO  (searcherExecutor-1533-thread-1-processing-x:core2) [    x:core2] o.a.s.c.SolrCore [core2] Registered new searcher Searcher@cf5ec8e[core2] main{ExitableDirectoryReader(UninvertingDirectoryReader())}
   [junit4]   2> 302048 INFO  (coreCloseExecutor-1537-thread-2-processing-x:core2) [    x:core2] o.a.s.u.DirectUpdateHandler2 closing DirectUpdateHandler2{commits=0,autocommits=0,soft autocommits=0,optimizes=0,rollbacks=0,expungeDeletes=0,docsPending=0,adds=0,deletesById=0,deletesByQuery=0,errors=0,cumulative_adds=0,cumulative_deletesById=0,cumulative_deletesByQuery=0,cumulative_errors=0}
   [junit4]   2> 302048 INFO  (coreCloseExecutor-1537-thread-2-processing-x:core2) [    x:core2] o.a.s.u.SolrCoreState Closing SolrCoreState
   [junit4]   2> 302049 INFO  (coreCloseExecutor-1537-thread-2-processing-x:core2) [    x:core2] o.a.s.u.DefaultSolrCoreState SolrCoreState ref count has reached 0 - closing IndexWriter
   [junit4]   2> 302049 INFO  (coreCloseExecutor-1537-thread-2-processing-x:core2) [    x:core2] o.a.s.u.DefaultSolrCoreState closing IndexWriter with IndexWriterCloser
   [junit4]   2> 302050 INFO  (coreCloseExecutor-1537-thread-1-processing-x:core2) [    x:core1] o.a.s.c.SolrCore [core1] Closing main searcher on request.
   [junit4]   2> 302050 INFO  (coreCloseExecutor-1537-thread-1-processing-x:core2) [    x:core1] o.a.s.c.CachingDirectoryFactory Closing MockDirectoryFactory - 3 directories currently being tracked
   [junit4]   2> 302050 INFO  (coreCloseExecutor-1537-thread-1-processing-x:core2) [    x:core1] o.a.s.c.CachingDirectoryFactory looking to close /export/home/jenkins/workspace/Lucene-Solr-6.x-Solaris/solr/build/solr-core/test/J1/temp/solr.core.TestCoreDiscovery_35036FCA06A2C923-001/tempDir-001/core1/stuffandnonsense [CachedDir<<refCount=0;path=/export/home/jenkins/workspace/Lucene-Solr-6.x-Solaris/solr/build/solr-core/test/J1/temp/solr.core.TestCoreDiscovery_35036FCA06A2C923-001/tempDir-001/core1/stuffandnonsense;done=false>>]
   [junit4]   2> 302050 INFO  (coreCloseExecutor-1537-thread-1-processing-x:core2) [    x:core1] o.a.s.c.CachingDirectoryFactory Closing directory, CoreContainer#isShutdown=true
   [junit4]   2> 302051 INFO  (coreCloseExecutor-1537-thread-1-processing-x:core2) [    x:core1] o.a.s.c.CachingDirectoryFactory Closing directory: /export/home/jenkins/workspace/Lucene-Solr-6.x-Solaris/solr/build/solr-core/test/J1/temp/solr.core.TestCoreDiscovery_35036FCA06A2C923-001/tempDir-001/core1/stuffandnonsense
   [junit4]   2> 302051 INFO  (coreCloseExecutor-1537-thread-1-processing-x:core2) [    x:core1] o.a.s.c.CachingDirectoryFactory looking to close /export/home/jenkins/workspace/Lucene-Solr-6.x-Solaris/solr/build/solr-core/test/J1/temp/solr.core.TestCoreDiscovery_35036FCA06A2C923-001/tempDir-001/core1/stuffandnonsense/snapshot_metadata [CachedDir<<refCount=0;path=/export/home/jenkins/workspace/Lucene-Solr-6.x-Solaris/solr/build/solr-core/test/J1/temp/solr.core.TestCoreDiscovery_35036FCA06A2C923-001/tempDir-001/core1/stuffandnonsense/snapshot_metadata;done=false>>]
   [junit4]   2> 302051 INFO  (coreCloseExecutor-1537-thread-1-processing-x:core2) [    x:core1] o.a.s.c.CachingDirectoryFactory Closing directory, CoreContainer#isShutdown=true
   [junit4]   2> 302051 INFO  (coreCloseExecutor-1537-thread-1-processing-x:core2) [    x:core1] o.a.s.c.CachingDirectoryFactory Closing directory: /export/home/jenkins/workspace/Lucene-Solr-6.x-Solaris/solr/build/solr-core/test/J1/temp/solr.core.TestCoreDiscovery_35036FCA06A2C923-001/tempDir-001/core1/stuffandnonsense/snapshot_metadata
   [junit4]   2> 302051 INFO  (coreCloseExecutor-1537-thread-1-processing-x:core2) [    x:core1] o.a.s.c.CachingDirectoryFactory looking to close /export/home/jenkins/workspace/Lucene-Solr-6.x-Solaris/solr/build/solr-core/test/J1/temp/solr.core.TestCoreDiscovery_35036FCA06A2C923-001/tempDir-001/core1/stuffandnonsense/index [CachedDir<<refCount=0;path=/export/home/jenkins/workspace/Lucene-Solr-6.x-Solaris/solr/build/solr-core/test/J1/temp/solr.core.TestCoreDiscovery_35036FCA06A2C923-001/tempDir-001/core1/stuffandnonsense/index;done=false>>]
   [junit4]   2> 302051 INFO  (coreCloseExecutor-1537-thread-1-processing-x:core2) [    x:core1] o.a.s.c.CachingDirectoryFactory Closing directory, CoreContainer#isShutdown=true
   [junit4]   2> 302051 INFO  (coreCloseExecutor-1537-thread-1-processing-x:core2) [    x:core1] o.a.s.c.CachingDirectoryFactory Closing directory: /export/home/jenkins/workspace/Lucene-Solr-6.x-Solaris/solr/build/solr-core/test/J1/temp/solr.core.TestCoreDiscovery_35036FCA06A2C923-001/tempDir-001/core1/stuffandnonsense/index
   [junit4]   2> 302051 INFO  (coreCloseExecutor-1537-thread-2-processing-x:core2) [    x:core2] o.a.s.c.SolrCore [core2] Closing main searcher on request.
   [junit4]   2> 302051 INFO  (coreCloseExecutor-1537-thread-2-processing-x:core2) [    x:core2] o.a.s.c.CachingDirectoryFactory Closing MockDirectoryFactory - 3 directories currently being tracked
   [junit4]   2> 302051 INFO  (coreCloseExecutor-1537-thread-2-processing-x:core2) [    x:core2] o.a.s.c.CachingDirectoryFactory looking to close /export/home/jenkins/workspace/Lucene-Solr-6.x-Solaris/solr/build/solr-core/test/J1/temp/solr.core.TestCoreDiscovery_35036FCA06A2C923-001/tempDir-001/core2/core2 [CachedDir<<refCount=0;path=/export/home/jenkins/workspace/Lucene-Solr-6.x-Solaris/solr/build/solr-core/test/J1/temp/solr.core.TestCoreDiscovery_35036FCA06A2C923-001/tempDir-001/core2/core2;done=false>>]
   [junit4]   2> 302051 INFO  (coreCloseExecutor-1537-thread-2-processing-x:core2) [    x:core2] o.a.s.c.CachingDirectoryFactory Closing directory, CoreContainer#isShutdown=true
   [junit4]   2> 302051 INFO  (coreCloseExecutor-1537-thread-2-processing-x:core2) [    x:core2] o.a.s.c.CachingDirectoryFactory Closing directory: /export/home/jenkins/workspace/Lucene-Solr-6.x-Solaris/solr/build/solr-core/test/J1/temp/solr.core.TestCoreDiscovery_35036FCA06A2C923-001/tempDir-001/core2/core2
   [junit4]   2> 302051 INFO  (coreCloseExecutor-1537-thread-2-processing-x:core2) [    x:core2] o.a.s.c.CachingDirectoryFactory looking to close /export/home/jenkins/workspace/Lucene-Solr-6.x-Solaris/solr/build/solr-core/test/J1/temp/solr.core.TestCoreDiscovery_35036FCA06A2C923-001/tempDir-001/core2/core2/snapshot_metadata [CachedDir<<refCount=0;path=/export/home/jenkins/workspace/Lucene-Solr-6.x-Solaris/solr/build/solr-core/test/J1/temp/solr.core.TestCoreDiscovery_35036FCA06A2C923-001/tempDir-001/core2/core2/snapshot_metadata;done=false>>]
   [junit4]   2> 302051 INFO  (coreCloseExecutor-1537-thread-2-processing-x:core2) [    x:core2] o.a.s.c.CachingDirectoryFactory Closing directory, CoreContainer#isShutdown=true
   [junit4]   2> 302051 INFO  (coreCloseExecutor-1537-thread-2-processing-x:core2) [    x:core2] o.a.s.c.CachingDirectoryFactory Closing directory: /export/home/jenkins/workspace/Lucene-Solr-6.x-Solaris/solr/build/solr-core/test/J1/temp/solr.core.TestCoreDiscovery_35036FCA06A2C923-001/tempDir-001/core2/core2/snapshot_metadata
   [junit4]   2> 302051 INFO  (coreCloseExecutor-1537-thread-2-processing-x:core2) [    x:core2] o.a.s.c.CachingDirectoryFactory looking to close /export/home/jenkins/workspace/Lucene-Solr-6.x-Solaris/solr/build/solr-core/test/J1/temp/solr.core.TestCoreDiscovery_35036FCA06A2C923-001/tempDir-001/core2/core2/index [CachedDir<<refCount=0;path=/export/home/jenkins/workspace/Lucene-Solr-6.x-Solaris/solr/build/solr-core/test/J1/temp/solr.core.TestCoreDiscovery_35036FCA06A2C923-001/tempDir-001/core2/core2/index;done=false>>]
   [junit4]   2> 302051 INFO  (coreCloseExecutor-1537-thread-2-processing-x:core2) [    x:core2] o.a.s.c.CachingDirectoryFactory Closing directory, CoreContainer#isShutdown=true
   [junit4]   2> 302052 INFO  (coreCloseExecutor-1537-thread-2-processing-x:core2) [    x:core2] o.a.s.c.CachingDirectoryFactory Closing directory: /export/home/jenkins/workspace/Lucene-Solr-6.x-Solaris/solr/build/solr-core/test/J1/temp/solr.core.TestCoreDiscovery_35036FCA06A2C923-001/tempDir-001/core2/core2/index
   [junit4]   2> 302052 INFO  (TEST-TestCoreDiscovery.testNonCoreDirCantRead-seed#[35036FCA06A2C923]) [    x:core2] o.a.s.SolrTestCaseJ4 ###Ending testNonCoreDirCantRead
   [junit4]   2> 302056 INFO  (TEST-TestCoreDiscovery.testAlternateCoreDir-seed#[35036FCA06A2C923]) [    x:core2] o.a.s.SolrTestCaseJ4 ###Starting testAlternateCoreDir
   [junit4]   2> 302064 INFO  (TEST-TestCoreDiscovery.testAlternateCoreDir-seed#[35036FCA06A2C923]) [    x:core2] o.a.s.c.SolrResourceLoader JNDI not configured for solr (NoInitialContextEx)
   [junit4]   2> 302064 INFO  (TEST-TestCoreDiscovery.testAlternateCoreDir-seed#[35036FCA06A2C923]) [    x:core2] o.a.s.c.SolrResourceLoader using system property solr.solr.home: /export/home/jenkins/workspace/Lucene-Solr-6.x-Solaris/solr/build/solr-core/test/J1/temp/solr.core.TestCoreDiscovery_35036FCA06A2C923-001/tempDir-002
   [junit4]   2> 302064 INFO  (TEST-TestCoreDiscovery.testAlternateCoreDir-seed#[35036FCA06A2C923]) [    x:core2] o.a.s.c.SolrResourceLoader new SolrResourceLoader for directory: '/export/home/jenkins/workspace/Lucene-Solr-6.x-Solaris/solr/build/solr-core/test/J1/temp/solr.core.TestCoreDiscovery_35036FCA06A2C923-001/tempDir-002'
   [junit4]   2> 302064 INFO  (TEST-TestCoreDiscovery.testAlternateCoreDir-seed#[35036FCA06A2C923]) [    x:core2] o.a.s.c.SolrResourceLoader JNDI not configured for solr (NoInitialContextEx)
   [junit4]   2> 302064 INFO  (TEST-TestCoreDiscovery.testAlternateCoreDir-seed#[35036FCA06A2C923]) [    x:core2] o.a.s.c.SolrResourceLoader using system property solr.solr.home: /export/home/jenkins/workspace/Lucene-Solr-6.x-Solaris/solr/build/solr-core/test/J1/temp/solr.core.TestCoreDiscovery_35036FCA06A2C923-001/tempDir-002
   [junit4]   2> 302064 INFO  (TEST-TestCoreDiscovery.testAlternateCoreDir-seed#[35036FCA06A2C923]) [    x:core2] o.a.s.c.SolrXmlConfig Loading container configuration from /export/home/jenkins/workspace/Lucene-Solr-6.x-Solaris/solr/build/solr-core/test/J1/temp/solr.core.TestCoreDiscovery_35036FCA06A2C923-001/tempDir-002/solr.xml
   [junit4]   2> 302094 INFO  (TEST-TestCoreDiscovery.testAlternateCoreDir-seed#[35036FCA06A2C923]) [    x:core2] o.a.s.c.CorePropertiesLocator Config-defined core root directory: /export/home/jenkins/workspace/Lucene-Solr-6.x-Solaris/solr/build/solr-core/test/J1/temp/solr.core.TestCoreDiscovery_35036FCA06A2C923-001/tempDir-003
   [junit4]   2> 302094 INFO  (TEST-TestCoreDiscovery.testAlternateCoreDir-seed#[35036FCA06A2C923]) [    x:core2] o.a.s.c.CoreContainer New CoreContainer 316043351
   [junit4]   2> 302094 INFO  (TEST-TestCoreDiscovery.testAlternateCoreDir-seed#[35036FCA06A2C923]) [    x:core2] o.a.s.c.CoreContainer Loading cores into CoreContainer [instanceDir=/export/home/jenkins/workspace/Lucene-Solr-6.x-Solaris/solr/build/solr-core/test/J1/temp/solr.core.TestCoreDiscovery_35036FCA06A2C923-001/tempDir-002]
   [junit4]   2> 302094 WARN  (TEST-TestCoreDiscovery.testAlternateCoreDir-seed#[35036FCA06A2C923]) [    x:core2] o.a.s.c.CoreContainer Couldn't add files from /export/home/jenkins/workspace/Lucene-Solr-6.x-Solaris/solr/build/solr-core/test/J1/temp/solr.core.TestCoreDiscovery_35036FCA06A2C923-001/tempDir-002/lib to classpath: /export/home/jenkins/workspace/Lucene-Solr-6.x-Solaris/solr/build/solr-core/test/J1/temp/solr.core.TestCoreDiscovery_35036FCA06A2C923-001/tempDir-002/lib
   [junit4]   2> 302095 INFO  (TEST-TestCoreDiscovery.testAlternateCoreDir-seed#[35036FCA06A2C923]) [    x:core2] o.a.s.h.c.HttpShardHandlerFactory created with socketTimeout : 600000,connTimeout : 60000,maxConnectionsPerHost : 20,maxConnections : 10000,corePoolSize : 0,maximumPoolSize : 2147483647,maxThreadIdleTime : 5,sizeOfQueue : -1,fairnessPolicy : false,useRetries : false,connectionsEvictorSleepDelay : 5000,maxConnectionIdleTime : 40000,
   [junit4]   2> 302096 INFO  (TEST-TestCoreDiscovery.testAlternateCoreDir-seed#[35036FCA06A2C923]) [    x:core2] o.a.s.u.UpdateShardHandler Creating UpdateShardHandler HTTP client with params: socketTimeout=600000&connTimeout=60000&retry=true
   [junit4]   2> 302097 INFO  (TEST-TestCoreDiscovery.testAlternateCoreDir-seed#[35036FCA06A2C923]) [    x:core2] o.a.s.c.SolrCores Allocating transient cache for 2 transient cores
   [junit4]   2> 302097 INFO  (TEST-TestCoreDiscovery.testAlternateCoreDir-seed#[35036FCA06A2C923]) [    x:core2] o.a.s.l.LogWatcher SLF4J impl is org.slf4j.impl.Log4jLoggerFactory
   [junit4]   2> 302097 INFO  (TEST-TestCoreDiscovery.testAlternateCoreDir-seed#[35036FCA06A2C923]) [    x:core2] o.a.s.l.LogWatcher Registering Log Listener [Log4j (org.slf4j.impl.Log4jLoggerFactory)]
   [junit4]   2> 302097 INFO  (TEST-TestCoreDiscovery.testAlternateCoreDir-seed#[35036FCA06A2C923]) [    x:core2] o.a.s.c.CoreContainer Security conf doesn't exist. Skipping setup for authorization module.
   [junit4]   2> 302097 INFO  (TEST-TestCoreDiscovery.testAlternateCoreDir-seed#[35036FCA06A2C923]) [    x:core2] o.a.s.c.CoreContainer No authentication plugin used.
   [junit4]   2> 302098 INFO  (TEST-TestCoreDiscovery.testAlternateCoreDir-seed#[35036FCA06A2C923]) [    x:core2] o.a.s.c.CorePropertiesLocator Looking for core definitions underneath /export/home/jenkins/workspace/Lucene-Solr-6.x-Solaris/solr/build/solr-core/test/J1/temp/solr.core.TestCoreDiscovery_35036FCA06A2C923-001/tempDir-003
   [junit4]   2> 302099 INFO  (TEST-TestCoreDiscovery.testAlternateCoreDir-seed#[35036FCA06A2C923]) [    x:core2] o.a.s.c.CoreDescriptor Created CoreDescriptor: {name=core2, config=solrconfig-minimal.xml, loadOnStartup=false, schema=schema-tiny.xml, configSetProperties=configsetprops.json, transient=false, dataDir=core2}
   [junit4]   2> 302099 INFO  (TEST-TestCoreDiscovery.testAlternateCoreDir-seed#[35036FCA06A2C923]) [    x:core2] o.a.s.c.CorePropertiesLocator Found core core2 in /export/home/jenkins/workspace/Lucene-Solr-6.x-Solaris/solr/build/solr-core/test/J1/temp/solr.core.TestCoreDiscovery_35036FCA06A2C923-001/tempDir-003/core2
   [junit4]   2> 302099 INFO  (TEST-TestCoreDiscovery.testAlternateCoreDir-seed#[35036FCA06A2C923]) [    x:core2] o.a.s.c.CoreDescriptor Created CoreDescriptor: {name=core1, config=solrconfig-minimal.xml, loadOnStartup=true, schema=schema-tiny.xml, configSetProperties=configsetprops.json, transient=false, dataDir=core1}
   [junit4]   2> 302099 INFO  (TEST-TestCoreDiscovery.testAlternateCoreDir-seed#[35036FCA06A2C923]) [    x:core2] o.a.s.c.CorePropertiesLocator Found core core1 in /export/home/jenkins/workspace/Lucene-Solr-6.x-Solaris/solr/build/solr-core/test/J1/temp/solr.core.TestCoreDiscovery_35036FCA06A2C923-001/tempDir-003/core1
   [junit4]   2> 302099 INFO  (TEST-TestCoreDiscovery.testAlternateCoreDir-seed#[35036FCA06A2C923]) [    x:core2] o.a.s.c.CorePropertiesLocator Found 2 core definitions
   [junit4]   2> 302099 INFO  (coreLoadExecutor-1544-thread-1-processing-x:core2) [    x:core2] o.a.s.c.SolrResourceLoader new SolrResourceLoader for directory: '/export/home/jenkins/workspace/Lucene-Solr-6.x-Solaris/solr/build/solr-core/test/J1/temp/solr.core.TestCoreDiscovery_35036FCA06A2C923-001/tempDir-003/core1'
   [junit4]   2> 302099 INFO  (coreLoadExecutor-1544-thread-1-processing-x:core2) [    x:core2] o.a.s.c.SolrResourceLoader JNDI not configured for solr (NoInitialContextEx)
   [junit4]   2> 302100 INFO  (coreLoadExecutor-1544-thread-1-processing-x:core2) [    x:core2] o.a.s.c.SolrResourceLoader using system property solr.solr.home: /export/home/jenkins/workspace/Lucene-Solr-6.x-Solaris/solr/build/solr-core/test/J1/temp/solr.core.TestCoreDiscovery_35036FCA06A2C923-001/tempDir-002
   [junit4]   2> 302106 INFO  (coreLoadExecutor-1544-thread-1-processing-x:core2) [    x:core2] o.a.s.c.SolrConfig current version of requestparams : -1
   [junit4]   2> 302108 INFO  (coreLoadExecutor-1544-thread-1-processing-x:core2) [    x:core2] o.a.s.c.SolrConfig Using Lucene MatchVersion: 6.3.0
   [junit4]   2> 302130 INFO  (coreLoadExecutor-1544-thread-1-processing-x:core2) [    x:core2] o.a.s.c.SolrConfig Loaded SolrConfig: solrconfig-minimal.xml
   [junit4]   2> 302135 INFO  (coreLoadExecutor-1544-thread-1-processing-x:core2) [    x:core2] o.a.s.s.IndexSchema [core1] Schema name=tiny
   [junit4]   2> 302138 INFO  (coreLoadExecutor-1544-thread-1-processing-x:core2) [    x:core2] o.a.s.s.IndexSchema unique key field: id
   [junit4]   2> 302140 INFO  (coreLoadExecutor-1544-thread-1-processing-x:core2) [    x:core2] o.a.s.c.ConfigSetProperties Did not find ConfigSet properties, assuming default properties: Can't find resource 'configsetprops.json' in classpath or '/export/home/jenkins/workspace/Lucene-Solr-6.x-Solaris/solr/build/solr-core/test/J1/temp/solr.core.TestCoreDiscovery_35036FCA06A2C923-001/tempDir-003/core1'
   [junit4]   2> 302141 INFO  (coreLoadExecutor-1544-thread-1-processing-x:core2) [    x:core2] o.a.s.c.CoreContainer Creating SolrCore 'core1' using configuration from instancedir /export/home/jenkins/workspace/Lucene-Solr-6.x-Solaris/solr/build/solr-core/test/J1/temp/solr.core.TestCoreDiscovery_35036FCA06A2C923-001/tempDir-003/core1
   [junit4]   2> 302141 INFO  (coreLoadExecutor-1544-thread-1-processing-x:core2) [    x:core1] o.a.s.c.SolrCore org.apache.solr.core.MockDirectoryFactory
   [junit4]   2> 302142 INFO  (coreLoadExecutor-1544-thread-1-processing-x:core2) [    x:core1] o.a.s.c.SolrCore [[core1] ] Opening new SolrCore at [/export/home/jenkins/workspace/Lucene-Solr-6.x-Solaris/solr/build/solr-core/test/J1/temp/solr.core.TestCoreDiscovery_35036FCA06A2C923-001/tempDir-003/core1], dataDir=[/export/home/jenkins/workspace/Lucene-Solr-6.x-Solaris/solr/build/solr-core/test/J1/temp/solr.core.TestCoreDiscovery_35036FCA06A2C923-001/tempDir-003/core1/core1/]
   [junit4]   2> 302142 INFO  (coreLoadExecutor-1544-thread-1-processing-x:core2) [    x:core1] o.a.s.c.SolrCore JMX monitoring not detected for core: core1
   [junit4]   2> 302142 INFO  (coreLoadExecutor-1544-thread-1-processing-x:core2) [    x:core1] o.a.s.c.CachingDirectoryFactory return new directory for /export/home/jenkins/workspace/Lucene-Solr-6.x-Solaris/solr/build/solr-core/test/J1/temp/solr.core.TestCoreDiscovery_35036FCA06A2C923-001/tempDir-003/core1/core1/snapshot_metadata
   [junit4]   2> 302142 INFO  (coreLoadExecutor-1544-thread-1-processing-x:core2) [    x:core1] o.a.s.c.s.SolrSnapshotMetaDataManager Loading from snapshot metadata file...
   [junit4]   2> 302143 INFO  (coreLoadExecutor-1544-thread-1-processing-x:core2) [    x:core1] o.a.s.c.CachingDirectoryFactory return new directory for /export/home/jenkins/workspace/Lucene-Solr-6.x-Solaris/solr/build/solr-core/test/J1/temp/solr.core.TestCoreDiscovery_35036FCA06A2C923-001/tempDir-003/core1/core1
   [junit4]   2> 302143 INFO  (coreLoadExecutor-1544-thread-1-processing-x:core2) [    x:core1] o.a.s.c.SolrCore New index directory detected: old=null new=/export/home/jenkins/workspace/Lucene-Solr-6.x-Solaris/solr/build/solr-core/test/J1/temp/solr.core.TestCoreDiscovery_35036FCA06A2C923-001/tempDir-003/core1/core1/index/
   [junit4]   2> 302143 WARN  (coreLoadExecutor-1544-thread-1-processing-x:core2) [    x:core1] o.a.s.c.SolrCore [core1] Solr index directory '/export/home/jenkins/workspace/Lucene-Solr-6.x-Solaris/solr/build/solr-core/test/J1/temp/solr.core.TestCoreDiscovery_35036FCA06A2C923-001/tempDir-003/core1/core1/index' doesn't exist. Creating new index...
   [junit4]   2> 302143 INFO  (coreLoadExecutor-1544-thread-1-processing-x:core2) [    x:core1] o.a.s.c.CachingDirectoryFactory return new directory for /export/home/jenkins/workspace/Lucene-Solr-6.x-Solaris/solr/build/solr-core/test/J1/temp/solr.core.TestCoreDiscovery_35036FCA06A2C923-001/tempDir-003/core1/core1/index
   [junit4]   2> 302144 INFO  (coreLoadExecutor-1544-thread-1-processing-x:core2) [    x:core1] o.a.s.u.RandomMergePolicy RandomMergePolicy wrapping class org.apache.lucene.index.TieredMergePolicy: [TieredMergePolicy: maxMergeAtOnce=32, maxMergeAtOnceExplicit=23, maxMergedSegmentMB=63.7421875, floorSegmentMB=0.310546875, forceMergeDeletesPctAllowed=9.485459830711623, segmentsPerTier=48.0, maxCFSSegmentSizeMB=8.796093022207999E12, noCFSRatio=0.0
   [junit4]   2> 302144 INFO  (coreLoadExecutor-1544-thread-1-processing-x:core2) [    x:core1] o.a.s.c.SolrDeletionPolicy SolrDeletionPolicy.onCommit: commits: num=1
   [junit4]   2> 	commit{dir=MockDirectoryWrapper(RAMDirectory@56d4d5d2 lockFactory=org.apache.lucene.store.SingleInstanceLockFactory@5e9dce73),segFN=segments_1,generation=1}
   [junit4]   2> 302144 INFO  (coreLoadExecutor-1544-thread-1-processing-x:core2) [    x:core1] o.a.s.c.SolrDeletionPolicy newest commit generation = 1
   [junit4]   2> 302146 INFO  (OldIndexDirectoryCleanupThreadForCore-core1) [    x:core1] o.a.s.c.SolrCore Looking for old index directories to cleanup for core core1 in /export/home/jenkins/workspace/Lucene-Solr-6.x-Solaris/solr/build/solr-core/test/J1/temp/solr.core.TestCoreDiscovery_35036FCA06A2C923-001/tempDir-003/core1/core1/
   [junit4]   2> 302146 WARN  (OldIndexDirectoryCleanupThreadForCore-core1) [    x:core1] o.a.s.c.DirectoryFactory /export/home/jenkins/workspace/Lucene-Solr-6.x-Solaris/solr/build/solr-core/test/J1/temp/solr.core.TestCoreDiscovery_35036FCA06A2C923-001/tempDir-003/core1/core1/ does not point to a valid data directory; skipping clean-up of old index directories.
   [junit4]   2> 302147 INFO  (coreLoadExecutor-1544-thread-1-processing-x:core2) [    x:core1] o.a.s.c.SolrCore no updateRequestProcessorChain defined as default, creating implicit default
   [junit4]   2> 302149 INFO  (coreLoadExecutor-1544-thread-1-processing-x:core2) [    x:core1] o.a.s.h.l.XMLLoader xsltCacheLifetimeSeconds=60
   [junit4]   2> 302150 INFO  (coreLoadExecutor-1544-thread-1-processing-x:core2) [    x:core1] o.a.s.h.l.XMLLoader xsltCacheLifetimeSeconds=60
   [junit4]   2> 302152 INFO  (coreLoadExecutor-1544-thread-1-processing-x:core2) [    x:core1] o.a.s.h.l.XMLLoader xsltCacheLifetimeSeconds=60
   [junit4]   2> 302153 INFO  (coreLoadExecutor-1544-thread-1-processing-x:core2) [    x:core1] o.a.s.h.l.XMLLoader xsltCacheLifetimeSeconds=60
   [junit4]   2> 302155 INFO  (coreLoadExecutor-1544-thread-1-processing-x:core2) [    x:core1] o.a.s.c.RequestHandlers Registered paths: /admin/mbeans,/update/json/docs,/admin/luke,/export,/get,/admin/properties,/update/json,/admin/threads,/update/csv,/sql,/graph,/select,/admin/segments,/admin/system,/replication,/config,/stream,/schema,/admin/plugins,/admin/logging,/admin/ping,/update,/admin/file,/terms
   [junit4]   2> 302155 INFO  (coreLoadExecutor-1544-thread-1-processing-x:core2) [    x:core1] o.a.s.c.SolrCore Using default statsCache cache: org.apache.solr.search.stats.LocalStatsCache
   [junit4]   2> 302156 INFO  (coreLoadExecutor-1544-thread-1-processing-x:core2) [    x:core1] o.a.s.u.CommitTracker Hard AutoCommit: disabled
   [junit4]   2> 302156 INFO  (coreLoadExecutor-1544-thread-1-processing-x:core2) [    x:core1] o.a.s.u.CommitTracker Soft AutoCommit: disabled
   [junit4]   2> 302156 INFO  (coreLoadExecutor-1544-thread-1-processing-x:core2) [    x:core1] o.a.s.u.RandomMergePolicy RandomMergePolicy wrapping class org.apache.lucene.index.TieredMergePolicy: [TieredMergePolicy: maxMergeAtOnce=37, maxMergeAtOnceExplicit=42, maxMergedSegmentMB=70.9990234375, floorSegmentMB=2.0771484375, forceMergeDeletesPctAllowed=12.61880259410295, segmentsPerTier=50.0, maxCFSSegmentSizeMB=8.796093022207999E12, noCFSRatio=0.0
   [junit4]   2> 302156 INFO  (coreLoadExecutor-1544-thread-1-processing-x:core2) [    x:core1] o.a.s.c.SolrDeletionPolicy SolrDeletionPolicy.onInit: commits: num=1
   [junit4]   2> 	commit{dir=MockDirectoryWrapper(RAMDirectory@56d4d5d2 lockFactory=org.apache.lucene.store.SingleInstanceLockFactory@5e9dce73),segFN=segments_1,generation=1}
   [junit4]   2> 302156 INFO  (coreLoadExecutor-1544-thread-1-processing-x:core2) [    x:core1] o.a.s.c.SolrDeletionPolicy newest commit generation = 1
   [junit4]   2> 302156 INFO  (coreLoadExecutor-1544-thread-1-processing-x:core2) [    x:core1] o.a.s.s.SolrIndexSearcher Opening [Searcher@35c07c6d[core1] main]
   [junit4]   2> 302157 INFO  (coreLoadExecutor-1544-thread-1-processing-x:core2) [    x:core1] o.a.s.r.ManagedResourceStorage File-based storage initialized to use dir: /export/home/jenkins/workspace/Lucene-Solr-6.x-Solaris/solr/build/solr-core/test/J1/temp/solr.core.TestCoreDiscovery_35036FCA06A2C923-001/tempDir-003/core1/conf
   [junit4]   2> 302157 INFO  (coreLoadExecutor-1544-thread-1-processing-x:core2) [    x:core1] o.a.s.r.RestManager Initializing RestManager with initArgs: {storageDir=/export/home/jenkins/workspace/Lucene-Solr-6.x-Solaris/solr/build/solr-core/test/J1/temp/solr.core.TestCoreDiscovery_35036FCA06A2C923-001/tempDir-003/core1/conf}
   [junit4]   2> 302157 INFO  (coreLoadExecutor-1544-thread-1-processing-x:core2) [    x:core1] o.a.s.r.ManagedResourceStorage Reading _rest_managed.json using file:dir=/export/home/jenkins/workspace/Lucene-Solr-6.x-Solaris/solr/build/solr-core/test/J1/temp/solr.core.TestCoreDiscovery_35036FCA06A2C923-001/tempDir-003/core1/conf
   [junit4]   2> 302157 INFO  (coreLoadExecutor-1544-thread-1-processing-x:core2) [    x:core1] o.a.s.r.RestManager Initializing 0 registered ManagedResources
   [junit4]   2> 302157 INFO  (coreLoadExecutor-1544-thread-1-processing-x:core2) [    x:core1] o.a.s.h.ReplicationHandler Commits will be reserved for  10000
   [junit4]   2> 302157 INFO  (searcherExecutor-1545-thread-1-processing-x:core1) [    x:core1] o.a.s.c.SolrCore [core1] Registered new searcher Searcher@35c07c6d[core1] main{ExitableDirectoryReader(UninvertingDirectoryReader())}
   [junit4]   2> 302158 INFO  (coreLoadExecutor-1544-thread-1-processing-x:core2) [    x:core1] o.a.s.c.CoreContainer registering core: core1
   [junit4]   2> 302158 INFO  (TEST-TestCoreDiscovery.testAlternateCoreDir-seed#[35036FCA06A2C923]) [    x:core2] o.a.s.c.SolrResourceLoader new SolrResourceLoader for directory: '/export/home/jenkins/workspace/Lucene-Solr-6.x-Solaris/solr/build/solr-core/test/J1/temp/solr.core.TestCoreDiscovery_35036FCA06A2C923-001/tempDir-003/core2'
   [junit4]   2> 302158 INFO  (TEST-TestCoreDiscovery.testAlternateCoreDir-seed#[35036FCA06A2C923]) [    x:core2] o.a.s.c.SolrResourceLoader JNDI not configured for solr (NoInitialContextEx)
   [junit4]   2> 302158 INFO  (TEST-TestCoreDiscovery.testAlternateCoreDir-seed#[35036FCA06A2C923]) [    x:core2] o.a.s.c.SolrResourceLoader using system property solr.solr.home: /export/home/jenkins/workspace/Lucene-Solr-6.x-Solaris/solr/build/solr-core/test/J1/temp/solr.core.TestCoreDiscovery_35036FCA06A2C923-001/tempDir-002
   [junit4]   2> 302164 INFO  (TEST-TestCoreDiscovery.testAlternateCoreDir-seed#[35036FCA06A2C923]) [    x:core2] o.a.s.c.SolrConfig current version of requestparams : -1
   [junit4]   2> 302166 INFO  (TEST-TestCoreDiscovery.testAlternateCoreDir-seed#[35036FCA06A2C923]) [    x:core2] o.a.s.c.SolrConfig Using Lucene MatchVersion: 6.3.0
   [junit4]   2> 302172 INFO  (TEST-TestCoreDiscovery.testAlternateCoreDir-seed#[35036FCA06A2C923]) [    x:core2] o.a.s.c.SolrConfig Loaded SolrConfig: solrconfig-minimal.xml
   [junit4]   2> 302175 INFO  (TEST-TestCoreDiscovery.testAlternateCoreDir-seed#[35036FCA06A2C923]) [    x:core2] o.a.s.s.IndexSchema [core2] Schema name=tiny
   [junit4]   2> 302176 INFO  (TEST-TestCoreDiscovery.testAlternateCoreDir-seed#[35036FCA06A2C923]) [    x:core2] o.a.s.s.IndexSchema unique key field: id
   [junit4]   2> 302178 INFO  (TEST-TestCoreDiscovery.testAlternateCoreDir-seed#[35036FCA06A2C923]) [    x:core2] o.a.s.c.ConfigSetProperties Did not find ConfigSet properties, assuming default properties: Can't find resource 'configsetprops.json' in classpath or '/export/home/jenkins/workspace/Lucene-Solr-6.x-Solaris/solr/build/solr-core/test/J1/temp/solr.core.TestCoreDiscovery_35036FCA06A2C923-001/tempDir-003/core2'
   [junit4]   2> 302178 INFO  (TEST-TestCoreDiscovery.testAlternateCoreDir-seed#[35036FCA06A2C923]) [    x:core2] o.a.s.c.CoreContainer Creating SolrCore 'core2' using configuration from instancedir /export/home/jenkins/workspace/Lucene-Solr-6.x-Solaris/solr/build/solr-core/test/J1/temp/solr.core.TestCoreDiscovery_35036FCA06A2C923-001/tempDir-003/core2
   [junit4]   2> 302179 INFO  (TEST-TestCoreDiscovery.testAlternateCoreDir-seed#[35036FCA06A2C923]) [    x:core2] o.a.s.c.SolrCore org.apache.solr.core.MockDirectoryFactory
   [junit4]   2> 302179 INFO  (TEST-TestCoreDiscovery.testAlternateCoreDir-seed#[35036FCA06A2C923]) [    x:core2] o.a.s.c.SolrCore [[core2] ] Opening new SolrCore at [/export/home/jenkins/workspace/Lucene-Solr-6.x-Solaris/solr/build/solr-core/test/J1/temp/solr.core.TestCoreDiscovery_35036FCA06A2C923-001/tempDir-003/core2], dataDir=[/export/home/jenkins/workspace/Lucene-Solr-6.x-Solaris/solr/build/solr-core/test/J1/temp/solr.core.TestCoreDiscovery_35036FCA06A2C923-001/tempDir-003/core2/core2/]
   [junit4]   2> 302179 INFO  (TEST-TestCoreDiscovery.testAlternateCoreDir-seed#[35036FCA06A2C923]) [    x:core2] o.a.s.c.SolrCore JMX monitoring not detected for core: core2
   [junit4]   2> 302179 INFO  (TEST-TestCoreDiscovery.testAlternateCoreDir-seed#[35036FCA06A2C923]) [    x:core2] o.a.s.c.CachingDirectoryFactory return new directory for /export/home/jenkins/workspace/Lucene-Solr-6.x-Solaris/solr/build/solr-core/test/J1/temp/solr.core.TestCoreDiscovery_35036FCA06A2C923-001/tempDir-003/core2/core2/snapshot_metadata
   [junit4]   2> 302179 INFO  (TEST-TestCoreDiscovery.testAlternateCoreDir-seed#[35036FCA06A2C923]) [    x:core2] o.a.s.c.s.SolrSnapshotMetaDataManager Loading from snapshot metadata file...
   [junit4]   2> 302180 INFO  (TEST-TestCoreDiscovery.testAlternateCoreDir-seed#[35036FCA06A2C923]) [    x:core2] o.a.s.c.CachingDirectoryFactory return new directory for /export/home/jenkins/workspace/Lucene-Solr-6.x-Solaris/solr/build/solr-core/test/J1/temp/solr.core.TestCoreDiscovery_35036FCA06A2C923-001/tempDir-003/core2/core2
   [junit4]   2> 302180 INFO  (TEST-TestCoreDiscovery.testAlternateCoreDir-seed#[35036FCA06A2C923]) [    x:core2] o.a.s.c.SolrCore New index directory detected: old=null new=/export/home/jenkins/workspace/Lucene-Solr-6.x-Solaris/solr/build/solr-core/test/J1/temp/solr.core.TestCoreDiscovery_35036FCA06A2C923-001/tempDir-003/core2/core2/index/
   [junit4]   2> 302180 WARN  (TEST-TestCoreDiscovery.testAlternateCoreDir-seed#[35036FCA06A2C923]) [    x:core2] o.a.s.c.SolrCore [core2] Solr index directory '/export/home/jenkins/workspace/Lucene-Solr-6.x-Solaris/solr/build/solr-core/test/J1/temp/solr.core.TestCoreDiscovery_35036FCA06A2C923-001/tempDir-003/core2/core2/index' doesn't exist. Creating new index...
   [junit4]   2> 302180 INFO  (TEST-TestCoreDiscovery.testAlternateCoreDir-seed#[35036FCA06A2C923]) [    x:core2] o.a.s.c.CachingDirectoryFactory return new directory for /export/home/jenkins/workspace/Lucene-Solr-6.x-Solaris/solr/build/solr-core/test/J1/temp/solr.core.TestCoreDiscovery_35036FCA06A2C923-001/tempDir-003/core2/core2/index
   [junit4]   2> 302181 INFO  (TEST-TestCoreDiscovery.testAlternateCoreDir-seed#[35036FCA06A2C923]) [    x:core2] o.a.s.u.RandomMergePolicy RandomMergePolicy wrapping class org.apache.lucene.index.TieredMergePolicy: [TieredMergePolicy: maxMergeAtOnce=32, maxMergeAtOnceExplicit=39, maxMergedSegmentMB=92.10546875, floorSegmentMB=0.546875, forceMergeDeletesPctAllowed=13.258531427881362, segmentsPerTier=48.0, maxCFSSegmentSizeMB=8.796093022207999E12, noCFSRatio=1.0
   [junit4]   2> 302181 INFO  (TEST-TestCoreDiscovery.testAlternateCoreDir-seed#[35036FCA06A2C923]) [    x:core2] o.a.s.c.SolrDeletionPolicy SolrDeletionPolicy.onCommit: commits: num=1
   [junit4]   2> 	commit{dir=MockDirectoryWrapper(RAMDirectory@9ea2717 lockFactory=org.apache.lucene.store.SingleInstanceLockFactory@4fe1ec9),segFN=segments_1,generation=1}
   [junit4]   2> 302181 INFO  (TEST-TestCoreDiscovery.testAlternateCoreDir-seed#[35036FCA06A2C923]) [    x:core2] o.a.s.c.SolrDeletionPolicy newest commit generation = 1
   [junit4]   2> 302181 INFO  (OldIndexDirectoryCleanupThreadForCore-core2) [    x:core2] o.a.s.c.SolrCore Looking for old index directories to cleanup for core core2 in /export/home/jenkins/workspace/Lucene-Solr-6.x-Solaris/solr/build/solr-core/test/J1/temp/solr.core.TestCoreDiscovery_35036FCA06A2C923-001/tempDir-003/core2/core2/
   [junit4]   2> 302181 WARN  (OldIndexDirectoryCleanupThreadForCore-core2) [    x:core2] o.a.s.c.DirectoryFactory /export/home/jenkins/workspace/Lucene-Solr-6.x-Solaris/solr/build/solr-core/test/J1/temp/solr.core.TestCoreDiscovery_35036FCA06A2C923-001/tempDir-003/core2/core2/ does not point to a valid data directory; skipping clean-up of old index directories.
   [junit4]   2> 302183 INFO  (TEST-TestCoreDiscovery.testAlternateCoreDir-seed#[35036FCA06A2C923]) [    x:core2] o.a.s.c.SolrCore no updateRequestProcessorChain defined as default, creating implicit default
   [junit4]   2> 302184 INFO  (TEST-TestCoreDiscovery.testAlternateCoreDir-seed#[35036FCA06A2C923]) [    x:core2] o.a.s.h.l.XMLLoader xsltCacheLifetimeSeconds=60
   [junit4]   2> 302186 INFO  (TEST-TestCoreDiscovery.testAlternateCoreDir-seed#[35036FCA06A2C923]) [    x:core2] o.a.s.h.l.XMLLoader xsltCacheLifetimeSeconds=60
   [junit4]   2> 302186 INFO  (TEST-TestCoreDiscovery.testAlternateCoreDir-seed#[35036FCA06A2C923]) [    x:core2] o.a.s.h.l.XMLLoader xsltCacheLifetimeSeconds=60
   [junit4]   2> 302187 INFO  (TEST-TestCoreDiscovery.testAlternateCoreDir-seed#[35036FCA06A2C923]) [    x:core2] o.a.s.h.l.XMLLoader xsltCacheLifetimeSeconds=60
   [junit4]   2> 302189 INFO  (TEST-TestCoreDiscovery.testAlternateCoreDir-seed#[35036FCA06A2C923]) [    x:core2] o.a.s.c.RequestHandlers Registered paths: /admin/mbeans,/update/json/docs,/admin/luke,/export,/get,/admin/properties,/update/json,/admin/threads,/update/csv,/sql,/graph,/select,/admin/segments,/admin/system,/replication,/config,/stream,/schema,/admin/plugins,/admin/logging,/admin/ping,/update,/admin/file,/terms
   [junit4]   2> 302189 INFO  (TEST-TestCoreDiscovery.testAlternateCoreDir-seed#[35036FCA06A2C923]) [    x:core2] o.a.s.c.SolrCore Using default statsCache cache: org.apache.solr.search.stats.LocalStatsCache
   [junit4]   2> 302190 INFO  (TEST-TestCoreDiscovery.testAlternateCoreDir-seed#[35036FCA06A2C923]) [    x:core2] o.a.s.u.CommitTracker Hard AutoCommit: disabled
   [junit4]   2> 302190 INFO  (TEST-TestCoreDiscovery.testAlternateCoreDir-seed#[35036FCA06A2C923]) [    x:core2] o.a.s.u.CommitTracker Soft AutoCommit: disabled
   [junit4]   2> 302190 INFO  (TEST-TestCoreDiscovery.testAlternateCoreDir-seed#[35036FCA06A2C923]) [    x:core2] o.a.s.u.RandomMergePolicy RandomMergePolicy wrapping class org.apache.lucene.index.LogDocMergePolicy: [LogDocMergePolicy: minMergeSize=1000, mergeFactor=10, maxMergeSize=9223372036854775807, maxMergeSizeForForcedMerge=9223372036854775807, calibrateSizeByDeletes=false, maxMergeDocs=2147483647, maxCFSSegmentSizeMB=8.796093022207999E12, noCFSRatio=1.0]
   [junit4]   2> 302190 INFO  (TEST-TestCoreDiscovery.testAlternateCoreDir-seed#[35036FCA06A2C923]) [    x:core2] o.a.s.c.SolrDeletionPolicy SolrDeletionPolicy.onInit: commits: num=1
   [junit4]   2> 	commit{dir=MockDirectoryWrapper(RAMDirectory@9ea2717 lockFactory=org.apache.lucene.store.SingleInstanceLockFactory@4fe1ec9),segFN=segments_1,generation=1}
   [junit4]   2> 302190 INFO  (TEST-TestCoreDiscovery.testAlternateCoreDir-seed#[35036FCA06A2C923]) [    x:core2] o.a.s.c.SolrDeletionPolicy newest commit generation = 1
   [junit4]   2> 302190 INFO  (TEST-TestCoreDiscovery.testAlternateCoreDir-seed#[35036FCA06A2C923]) [    x:core2] o.a.s.s.SolrIndexSearcher Opening [Searcher@53016e63[core2] main]
   [junit4]   2> 302191 INFO  (TEST-TestCoreDiscovery.testAlternateCoreDir-seed#[35036FCA06A2C923]) [    x:core2] o.a.s.r.ManagedResourceStorage File-based storage initialized to use dir: /export/home/jenkins/workspace/Lucene-Solr-6.x-Solaris/solr/build/solr-core/test/J1/temp/solr.core.TestCoreDiscovery_35036FCA06A2C923-001/tempDir-003/core2/conf
   [junit4]   2> 302191 INFO  (TEST-TestCoreDiscovery.testAlternateCoreDir-seed#[35036FCA06A2C923]) [    x:core2] o.a.s.r.RestManager Initializing RestManager with initArgs: {storageDir=/export/home/jenkins/workspace/Lucene-Solr-6.x-Solaris/solr/build/solr-core/test/J1/temp/solr.core.TestCoreDiscovery_35036FCA06A2C923-001/tempDir-003/core2/conf}
   [junit4]   2> 302191 INFO  (TEST-TestCoreDiscovery.testAlternateCoreDir-seed#[35036FCA06A2C923]) [    x:core2] o.a.s.r.ManagedResourceStorage Reading _rest_managed.json using file:dir=/export/home/jenkins/workspace/Lucene-Solr-6.x-Solaris/solr/build/solr-core/test/J1/temp/solr.core.TestCoreDiscovery_35036FCA06A2C923-001/tempDir-003/core2/conf
   [junit4]   2> 302191 INFO  (TEST-TestCoreDiscovery.testAlternateCoreDir-seed#[35036FCA06A2C923]) [    x:core2] o.a.s.r.RestManager Initializing 0 registered ManagedResources
   [junit4]   2> 302191 INFO  (TEST-TestCoreDiscovery.testAlternateCoreDir-seed#[35036FCA06A2C923]) [    x:core2] o.a.s.h.ReplicationHandler Commits will be reserved for  10000
   [junit4]   2> 302192 INFO  (TEST-TestCoreDiscovery.testAlternateCoreDir-seed#[35036FCA06A2C923]) [    x:core2] o.a.s.c.CoreContainer registering core: core2
   [junit4]   2> 302192 INFO  (TEST-TestCoreDiscovery.testAlternateCoreDir-seed#[35036FCA06A2C923]) [    x:core2] o.a.s.c.CoreContainer Shutting down CoreContainer instance=316043351
   [junit4]   2> 302193 INFO  (coreCloseExecutor-1553-thread-1-processing-x:core2) [    x:core1] o.a.s.c.SolrCore [core1]  CLOSING SolrCore org.apache.solr.core.SolrCore@2bdd3b73
   [junit4]   2> 302193 INFO  (coreCloseExecutor-1553-thread-1-processing-x:core2) [    x:core1] o.a.s.u.DirectUpdateHandler2 closing DirectUpdateHandler2{commits=0,autocommits=0,soft autocommits=0,optimizes=0,rollbacks=0,expungeDeletes=0,docsPending=0,adds=0,deletesById=0,deletesByQuery=0,errors=0,cumulative_adds=0,cumulative_deletesById=0,cumulative_deletesByQuery=0,cumulative_errors=0}
   [junit4]   2> 302193 INFO  (coreCloseExecutor-1553-thread-1-processing-x:core2) [    x:core1] o.a.s.u.SolrCoreState Closing SolrCoreState
   [junit4]   2> 302193 INFO  (coreCloseExecutor-1553-thread-1-processing-x:core2) [    x:core1] o.a.s.u.DefaultSolrCoreState SolrCoreState ref count has reached 0 - closing IndexWriter
   [junit4]   2> 302193 INFO  (coreCloseExecutor-1553-thread-1-processing-x:core2) [    x:core1] o.a.s.u.DefaultSolrCoreState closing IndexWriter with IndexWriterCloser
   [junit4]   2> 302193 INFO  (coreCloseExecutor-1553-thread-2-processing-x:core2) [    x:core2] o.a.s.c.SolrCore [core2]  CLOSING SolrCore org.apache.solr.core.SolrCore@50ec1e3f
   [junit4]   2> 302193 INFO  (coreCloseExecutor-1553-thread-2-processing-x:core2) [    x:core2] o.a.s.u.DirectUpdateHandler2 closing DirectUpdateHandler2{commits=0,autocommits=0,soft autocommits=0,optimizes=0,rollbacks=0,expungeDeletes=0,docsPending=0,adds=0,deletesById=0,deletesByQuery=0,errors=0,cumulative_adds=0,cumulative_deletesById=0,cumulative_deletesByQuery=0,cumulative_errors=0}
   [junit4]   2> 302193 INFO  (coreCloseExecutor-1553-thread-2-processing-x:core2) [    x:core2] o.a.s.u.SolrCoreState Closing SolrCoreState
   [junit4]   2> 302193 INFO  (coreCloseExecutor-1553-thread-2-processing-x:core2) [    x:core2] o.a.s.u.DefaultSolrCoreState SolrCoreState ref count has reached 0 - closing IndexWriter
   [junit4]   2> 302193 INFO  (coreCloseExecutor-1553-thread-2-processing-x:core2) [    x:core2] o.a.s.u.DefaultSolrCoreState closing IndexWriter with IndexWriterCloser
   [junit4]   2> 302194 INFO  (searcherExecutor-1549-thread-1-processing-x:core2) [    x:core2] o.a.s.c.SolrCore [core2] Registered new searcher Searcher@53016e63[core2] main{ExitableDirectoryReader(UninvertingDirectoryReader())}
   [junit4]   2> 302195 INFO  (coreCloseExecutor-1553-thread-2-processing-x:core2) [    x:core2] o.a.s.c.SolrCore [core2] Closing main searcher on request.
   [junit4]   2> 302195 INFO  (coreCloseExecutor-1553-thread-2-processing-x:core2) [    x:core2] o.a.s.c.CachingDirectoryFactory Closing MockDirectoryFactory - 3 directories currently being tracked
   [junit4]   2> 302195 INFO  (coreCloseExecutor-1553-thread-2-processing-x:core2) [    x:core2] o.a.s.c.CachingDirectoryFactory looking to close /export/home/jenkins/workspace/Lucene-Solr-6.x-Solaris/solr/build/solr-core/test/J1/temp/solr.core.TestCoreDiscovery_35036FCA06A2C923-001/tempDir-003/core2/core2 [CachedDir<<refCount=0;path=/export/home/jenkins/workspace/Lucene-Solr-6.x-Solaris/solr/build/solr-core/test/J1/temp/solr.core.TestCoreDiscovery_35036FCA06A2C923-001/tempDir-003/core2/core2;done=false>>]
   [junit4]   2> 302195 INFO  (coreCloseExecutor-1553-thread-2-processing-x:core2) [    x:core2] o.a.s.c.CachingDirectoryFactory Closing directory, CoreContainer#isShutdown=true
   [junit4]   2> 302195 INFO  (coreCloseExecutor-1553-thread-2-processing-x:core2) [    x:core2] o.a.s.c.CachingDirectoryFactory Closing directory: /export/home/jenkins/workspace/Lucene-Solr-6.x-Solaris/solr/build/solr-core/test/J1/temp/solr.core.TestCoreDiscovery_35036FCA06A2C923-001/tempDir-003/core2/core2
   [junit4]   2> 302195 INFO  (coreCloseExecutor-1553-thread-2-processing-x:core2) [    x:core2] o.a.s.c.CachingDirectoryFactory looking to close /export/home/jenkins/workspace/Lucene-Solr-6.x-Solaris/solr/build/solr-core/test/J1/temp/solr.core.TestCoreDiscovery_35036FCA06A2C923-001/tempDir-003/core2/core2/snapshot_metadata [CachedDir<<refCount=0;path=/export/home/jenkins/workspace/Lucene-Solr-6.x-Solaris/solr/build/solr-core/test/J1/temp/solr.core.TestCoreDiscovery_35036FCA06A2C923-001/tempDir-003/core2/core2/snapshot_metadata;done=false>>]
   [junit4]   2> 302195 INFO  (coreCloseExecutor-1553-thread-2-processing-x:core2) [    x:core2] o.a.s.c.CachingDirectoryFactory Closing directory, CoreContainer#isShutdown=true
   [junit4]   2> 302195 INFO  (coreCloseExecutor-1553-thread-2-processing-x:core2) [    x:core2] o.a.s.c.CachingDirectoryFactory Closing directory: /export/home/jenkins/workspace/Lucene-Solr-6.x-Solaris/solr/build/solr-core/test/J1/temp/solr.core.TestCoreDiscovery_35036FCA06A2C923-001/tempDir-003/core2/core2/snapshot_metadata
   [junit4]   2> 302195 INFO  (coreCloseExecutor-1553-thread-2-processing-x:core2) [    x:core2] o.a.s.c.CachingDirectoryFactory looking to close /export/home/jenkins/workspace/Lucene-Solr-6.x-Solaris/solr/build/solr-core/test/J1/temp/solr.core.TestCoreDiscovery_35036FCA06A2C923-001/tempDir-003/core2/core2/index [CachedDir<<refCount=0;path=/export/home/jenkins/workspace/Lucene-Solr-6.x-Solaris/solr/build/solr-core/test/J1/temp/solr.core.TestCoreDiscovery_35036FCA06A2C923-001/tempDir-003/core2/core2/index;done=false>>]
   [junit4]   2> 302195 INFO  (coreCloseExecutor-1553-thread-2-processing-x:core2) [    x:core2] o.a.s.c.CachingDirectoryFactory Closing directory, CoreContainer#isShutdown=true
   [junit4]   2> 302195 INFO  (coreCloseExecutor-1553-thread-2-processing-x:core2) [    x:core2] o.a.s.c.CachingDirectoryFactory Closing directory: /export/home/jenkins/workspace/Lucene-Solr-6.x-Solaris/solr/build/solr-core/test/J1/temp/solr.core.TestCoreDiscovery_35036FCA06A2C923-001/tempDir-003/core2/core2/index
   [junit4]   2> 302196 INFO  (coreCloseExecutor-1553-thread-1-processing-x:core2) [    x:core1] o.a.s.c.SolrCore [core1] Closing main searcher on request.
   [junit4]   2> 302196 INFO  (coreCloseExecutor-1553-thread-1-processing-x:core2) [    x:core1] o.a.s.c.CachingDirectoryFactory Closing MockDirectoryFactory - 3 directories currently being tracked
   [junit4]   2> 302196 INFO  (coreCloseExecutor-1553-thread-1-processing-x:core2) [    x:core1] o.a.s.c.CachingDirectoryFactory looking to close /export/home/jenkins/workspace/Lucene-Solr-6.x-Solaris/solr/build/solr-core/test/J1/temp/solr.core.TestCoreDiscovery_35036FCA06A2C923-001/tempDir-003/core1/core1/snapshot_metadata [CachedDir<<refCount=0;path=/export/home/jenkins/workspace/Lucene-Solr-6.x-Solaris/solr/build/solr-core/test/J1/temp/solr.core.TestCoreDiscovery_35036FCA06A2C923-001/tempDir-003/core1/core1/snapshot_metadata;done=false>>]
   [junit4]   2> 302196 INFO  (coreCloseExecutor-1553-thread-1-processing-x:core2) [    x:core1] o.a.s.c.CachingDirectoryFactory Closing directory, CoreContainer#isShutdown=true
   [junit4]   2> 302196 INFO  (coreCloseExecutor-1553-thread-1-processing-x:core2) [    x:core1] o.a.s.c.CachingDirectoryFactory Closing directory: /export/home/jenkins/workspace/Lucene-Solr-6.x-Solaris/solr/build/solr-core/test/J1/temp/solr.core.TestCoreDiscovery_35036FCA06A2C923-001/tempDir-003/core1/core1/snapshot_metadata
   [junit4]   2> 302196 INFO  (coreCloseExecutor-1553-thread-1-processing-x:core2) [    x:core1] o.a.s.c.CachingDirectoryFactory looking to close /export/home/jenkins/workspace/Lucene-Solr-6.x-Solaris/solr/build/solr-core/test/J1/temp/solr.core.TestCoreDiscovery_35036FCA06A2C923-001/tempDir-003/core1/core1/index [CachedDir<<refCount=0;path=/export/home/jenkins/workspace/Lucene-Solr-6.x-Solaris/solr/build/solr-core/test/J1/temp/solr.core.TestCoreDiscovery_35036FCA06A2C923-001/tempDir-003/core1/core1/index;done=false>>]
   [junit4]   2> 302196 INFO  (coreCloseExecutor-1553-thread-1-processing-x:core2) [    x:core1] o.a.s.c.CachingDirectoryFactory Closing directory, CoreContainer#isShutdown=true
   [junit4]   2> 302196 INFO  (coreCloseExecutor-1553-thread-1-processing-x:core2) [    x:core1] o.a.s.c.CachingDirectoryFactory Closing directory: /export/home/jenkins/workspace/Lucene-Solr-6.x-Solaris/solr/build/solr-core/test/J1/temp/solr.core.TestCoreDiscovery_35036FCA06A2C923-001/tempDir-003/core1/core1/index
   [junit4]   2> 302197 INFO  (coreCloseExecutor-1553-thread-1-processing-x:core2) [    x:core1] o.a.s.c.CachingDirectoryFactory looking to close /export/home/jenkins/workspace/Lucene-Solr-6.x-Solaris/solr/build/solr-core/test/J1/temp/solr.core.TestCoreDiscovery_35036FCA06A2C923-001/tempDir-003/core1/core1 [CachedDir<<refCount=0;path=/export/home/jenkins/workspace/Lucene-Solr-6.x-Solaris/solr/build/solr-core/test/J1/temp/solr.core.TestCoreDiscovery_35036FCA06A2C923-001/tempDir-003/core1/core1;done=false>>]
   [junit4]   2> 302197 INFO  (coreCloseExecutor-1553-thread-1-processing-x:core2) [    x:core1] o.a.s.c.CachingDirectoryFactory Closing directory, CoreContainer#isShutdown=true
   [junit4]   2> 302197 INFO  (coreCloseExecutor-1553-thread-1-processing-x:core2) [    x:core1] o.a.s.c.CachingDirectoryFactory Closing directory: /export/home/jenkins/workspace/Lucene-Solr-6.x-Solaris/solr/build/solr-core/test/J1/temp/solr.core.TestCoreDiscovery_35036FCA06A2C923-001/tempDir-003/core1/core1
   [junit4]   2> 302197 INFO  (TEST-TestCoreDiscovery.testAlternateCoreDir-seed#[35036FCA06A2C923]) [    x:core2] o.a.s.SolrTestCaseJ4 ###Ending testAlternateCoreDir
   [junit4]   2> 302199 INFO  (TEST-TestCoreDiscovery.testDiscovery-seed#[35036FCA06A2C923]) [    x:core2] o.a.s.SolrTestCaseJ4 ###Starting testDiscovery
   [junit4]   2> 302208 INFO  (TEST-TestCoreDiscovery.testDiscovery-seed#[35036FCA06A2C923]) [    x:core2] o.a.s.c.SolrResourceLoader JNDI not configured for solr (NoInitialContextEx)
   [junit4]   2> 302209 INFO  (TEST-TestCoreDiscovery.testDiscovery-seed#[35036FCA06A2C923]) [    x:core2] o.a.s.c.SolrResourceLoader using system property solr.solr.home: /export/home/jenkins/workspace/Lucene-Solr-6.x-Solaris/solr/build/solr-core/test/J1/temp/solr.core.TestCoreDiscovery_35036FCA06A2C923-001/tempDir-004
   [junit4]   2> 302209 INFO  (TEST-TestCoreDiscovery.testDiscovery-seed#[35036FCA06A2C923]) [    x:core2] o.a.s.c.SolrResourceLoader new SolrResourceLoader for directory: '/export/home/jenkins/workspace/Lucene-Solr-6.x-Solaris/solr/build/solr-core/test/J1/temp/solr.core.TestCoreDiscovery_35036FCA06A2C923-001/tempDir-004'
   [junit4]   2> 302209 INFO  (TEST-TestCoreDiscovery.testDiscovery-seed#[35036FCA06A2C923]) [    x:core2] o.a.s.c.SolrResourceLoader JNDI not configured for solr (NoInitialContextEx)
   [junit4]   2> 302209 INFO  (TEST-TestCoreDiscovery.testDiscovery-seed#[35036FCA06A2C923]) [    x:core2] o.a.s.c.SolrResourceLoader using system property solr.solr.home: /export/home/jenkins/workspace/Lucene-Solr-6.x-Solaris/solr/build/solr-core/test/J1/temp/solr.core.TestCoreDiscovery_35036FCA06A2C923-001/tempDir-004
   [junit4]   2> 302209 INFO  (TEST-TestCoreDiscovery.testDiscovery-seed#[35036FCA06A2C923]) [    x:core2] o.a.s.c.SolrXmlConfig Loading container configuration from /export/home/jenkins/workspace/Lucene-Solr-6.x-Solaris/solr/build/solr-core/test/J1/temp/solr.core.TestCoreDiscovery_35036FCA06A2C923-001/tempDir-004/solr.xml
   [junit4]   2> 302217 INFO  (TEST-TestCoreDiscovery.testDiscovery-seed#[35036FCA06A2C923]) [    x:core2] o.a.s.c.CorePropertiesLocator Config-defined core root directory: /export/home/jenkins/workspace/Lucene-Solr-6.x-Solaris/solr/build/solr-core/test/J1/temp/solr.core.TestCoreDiscovery_35036FCA06A2C923-001/tempDir-004
   [junit4]   2> 302217 INFO  (TEST-TestCoreDiscovery.testDiscovery-seed#[35036FCA06A2C923]) [    x:core2] o.a.s.c.CoreContainer New CoreContainer 686393456
   [junit4]   2> 302217 INFO  (TEST-TestCoreDiscovery.testDiscovery-seed#[35036FCA06A2C923]) [    x:core2] o.a.s.c.CoreContainer Loading cores into CoreContainer [instanceDir=/export/home/jenkins/workspace/Lucene-Solr-6.x-Solaris/solr/build/solr-core/test/J1/temp/solr.core.TestCoreDiscovery_35036FCA06A2C923-001/tempDir-004]
   [junit4]   2> 302217 WARN  (TEST-TestCoreDiscovery.testDiscovery-seed#[35036FCA06A2C923]) [    x:core2] o.a.s.c.CoreContainer Couldn't add files from /export/home/jenkins/workspace/Lucene-Solr-6.x-Solaris/solr/build/solr-core/test/J1/temp/solr.core.TestCoreDiscovery_35036FCA06A2C923-001/tempDir-004/lib to classpath: /export/home/jenkins/workspace/Lucene-Solr-6.x-Solaris/solr/build/solr-core/test/J1/temp/solr.core.TestCoreDiscovery_35036FCA06A2C923-001/tempDir-004/lib
   [junit4]   2> 302218 INFO  (TEST-TestCoreDiscovery.testDiscovery-seed#[35036FCA06A2C923]) [    x:core2] o.a.s.h.c.HttpShardHandlerFactory created with socketTimeout : 600000,connTimeout : 60000,maxConnectionsPerHost : 20,maxConnections : 10000,corePoolSize : 0,maximumPoolSize : 2147483647,maxThreadIdleTime : 5,sizeOfQueue : -1,fairnessPolicy : false,useRetries : false,connectionsEvictorSleepDelay : 5000,maxConnectionIdleTime : 40000,
   [junit4]   2> 302219 INFO  (TEST-TestCoreDiscovery.testDiscovery-seed#[35036FCA06A2C923]) [    x:core2] o.a.s.u.UpdateShardHandler Creating UpdateShardHandler HTTP client with params: socketTimeout=600000&connTimeout=60000&retry=true
   [junit4]   2> 302219 INFO  (TEST-TestCoreDiscovery.testDiscovery-seed#[35036FCA06A2C923]) [    x:core2] o.a.s.c.SolrCores Allocating transient cache for 2 transient cores
   [junit4]   2> 302220 INFO  (TEST-TestCoreDiscovery.testDiscovery-seed#[35036FCA06A2C923]) [    x:core2] o.a.s.l.LogWatcher SLF4J impl is org.slf4j.impl.Log4jLoggerFactory
   [junit4]   2> 302220 INFO  (TEST-TestCoreDiscovery.testDiscovery-seed#[35036FCA06A2C923]) [    x:core2] o.a.s.l.LogWatcher Registering Log Listener [Log4j (org.slf4j.impl.Log4jLoggerFactory)]
   [junit4]   2> 302220 INFO  (TEST-TestCoreDiscovery.testDiscovery-seed#[35036FCA06A2C923]) [    x:core2] o.a.s.c.CoreContainer Security conf doesn't exist. Skipping setup for authorization module.
   [junit4]   2> 302220 INFO  (TEST-TestCoreDiscovery.testDiscovery-seed#[35036FCA06A2C923]) [    x:core2] o.a.s.c.CoreContainer No authentication plugin used.
   [junit4]   2> 302222 INFO  (TEST-TestCoreDiscovery.testDiscovery-seed#[35036FCA06A2C923]) [    x:core2] o.a.s.c.CorePropertiesLocator Looking for core definitions underneath /export/home/jenkins/workspace/Lucene-Solr-6.x-Solaris/solr/build/solr-core/test/J1/temp/solr.core.TestCoreDiscovery_35036FCA06A2C923-001/tempDir-004
   [junit4]   2> 302223 INFO  (TEST-TestCoreDiscovery.testDiscovery-seed#[35036FCA06A2C923]) [    x:core2] o.a.s.c.CoreDescriptor Created CoreDescriptor: {name=core1, config=solrconfig-minimal.xml, loadOnStartup=true, schema=schema-tiny.xml, configSetProperties=configsetprops.json, transient=false, dataDir=core1}
   [junit4]   2> 302223 INFO  (TEST-TestCoreDiscovery.testDiscovery-seed#[35036FCA06A2C923]) [    x:core2] o.a.s.c.CorePropertiesLocator Found core core1 in /export/home/jen

[...truncated too long message...]

apache.lucene.util.TestRuleMarkFailure$1.evaluate(TestRuleMarkFailure.java:47)
   [junit4]   2> 	at com.carrotsearch.randomizedtesting.rules.StatementAdapter.evaluate(StatementAdapter.java:36)
   [junit4]   2> 	at com.carrotsearch.randomizedtesting.ThreadLeakControl$StatementRunner.run(ThreadLeakControl.java:367)
   [junit4]   2> 	at com.carrotsearch.randomizedtesting.ThreadLeakControl.forkTimeoutingTask(ThreadLeakControl.java:809)
   [junit4]   2> 	at com.carrotsearch.randomizedtesting.ThreadLeakControl$3.evaluate(ThreadLeakControl.java:460)
   [junit4]   2> 	at com.carrotsearch.randomizedtesting.RandomizedRunner.runSingleTest(RandomizedRunner.java:880)
   [junit4]   2> 	at com.carrotsearch.randomizedtesting.RandomizedRunner$5.evaluate(RandomizedRunner.java:781)
   [junit4]   2> 	at com.carrotsearch.randomizedtesting.RandomizedRunner$6.evaluate(RandomizedRunner.java:816)
   [junit4]   2> 	at com.carrotsearch.randomizedtesting.RandomizedRunner$7.evaluate(RandomizedRunner.java:827)
   [junit4]   2> 	at com.carrotsearch.randomizedtesting.rules.StatementAdapter.evaluate(StatementAdapter.java:36)
   [junit4]   2> 	at com.carrotsearch.randomizedtesting.rules.SystemPropertiesRestoreRule$1.evaluate(SystemPropertiesRestoreRule.java:57)
   [junit4]   2> 	at org.apache.lucene.util.AbstractBeforeAfterRule$1.evaluate(AbstractBeforeAfterRule.java:45)
   [junit4]   2> 	at com.carrotsearch.randomizedtesting.rules.StatementAdapter.evaluate(StatementAdapter.java:36)
   [junit4]   2> 	at org.apache.lucene.util.TestRuleStoreClassName$1.evaluate(TestRuleStoreClassName.java:41)
   [junit4]   2> 	at com.carrotsearch.randomizedtesting.rules.NoShadowingOrOverridesOnMethodsRule$1.evaluate(NoShadowingOrOverridesOnMethodsRule.java:40)
   [junit4]   2> 	at com.carrotsearch.randomizedtesting.rules.NoShadowingOrOverridesOnMethodsRule$1.evaluate(NoShadowingOrOverridesOnMethodsRule.java:40)
   [junit4]   2> 	at com.carrotsearch.randomizedtesting.rules.StatementAdapter.evaluate(StatementAdapter.java:36)
   [junit4]   2> 	at com.carrotsearch.randomizedtesting.rules.StatementAdapter.evaluate(StatementAdapter.java:36)
   [junit4]   2> 	at com.carrotsearch.randomizedtesting.rules.StatementAdapter.evaluate(StatementAdapter.java:36)
   [junit4]   2> 	at org.apache.lucene.util.TestRuleAssertionsRequired$1.evaluate(TestRuleAssertionsRequired.java:53)
   [junit4]   2> 	at org.apache.lucene.util.TestRuleMarkFailure$1.evaluate(TestRuleMarkFailure.java:47)
   [junit4]   2> 	at org.apache.lucene.util.TestRuleIgnoreAfterMaxFailures$1.evaluate(TestRuleIgnoreAfterMaxFailures.java:64)
   [junit4]   2> 	at org.apache.lucene.util.TestRuleIgnoreTestSuites$1.evaluate(TestRuleIgnoreTestSuites.java:54)
   [junit4]   2> 	at com.carrotsearch.randomizedtesting.rules.StatementAdapter.evaluate(StatementAdapter.java:36)
   [junit4]   2> 	at com.carrotsearch.randomizedtesting.ThreadLeakControl$StatementRunner.run(ThreadLeakControl.java:367)
   [junit4]   2> 	at java.lang.Thread.run(Thread.java:745)
   [junit4]   2> 
   [junit4]   2> Sep 04, 2016 9:38:45 PM com.carrotsearch.randomizedtesting.ThreadLeakControl checkThreadLeaks
   [junit4]   2> WARNING: Will linger awaiting termination of 1 leaked thread(s).
   [junit4]   2> Sep 04, 2016 9:39:05 PM com.carrotsearch.randomizedtesting.ThreadLeakControl checkThreadLeaks
   [junit4]   2> SEVERE: 1 thread leaked from SUITE scope at org.apache.solr.core.TestCoreDiscovery: 
   [junit4]   2>    1) Thread[id=2446, name=searcherExecutor-1640-thread-1, state=WAITING, group=TGRP-TestCoreDiscovery]
   [junit4]   2>         at sun.misc.Unsafe.park(Native Method)
   [junit4]   2>         at java.util.concurrent.locks.LockSupport.park(LockSupport.java:175)
   [junit4]   2>         at java.util.concurrent.locks.AbstractQueuedSynchronizer$ConditionObject.await(AbstractQueuedSynchronizer.java:2039)
   [junit4]   2>         at java.util.concurrent.LinkedBlockingQueue.take(LinkedBlockingQueue.java:442)
   [junit4]   2>         at java.util.concurrent.ThreadPoolExecutor.getTask(ThreadPoolExecutor.java:1067)
   [junit4]   2>         at java.util.concurrent.ThreadPoolExecutor.runWorker(ThreadPoolExecutor.java:1127)
   [junit4]   2>         at java.util.concurrent.ThreadPoolExecutor$Worker.run(ThreadPoolExecutor.java:617)
   [junit4]   2>         at java.lang.Thread.run(Thread.java:745)
   [junit4]   2> Sep 04, 2016 9:39:05 PM com.carrotsearch.randomizedtesting.ThreadLeakControl tryToInterruptAll
   [junit4]   2> INFO: Starting to interrupt leaked threads:
   [junit4]   2>    1) Thread[id=2446, name=searcherExecutor-1640-thread-1, state=WAITING, group=TGRP-TestCoreDiscovery]
   [junit4]   2> Sep 04, 2016 9:39:08 PM com.carrotsearch.randomizedtesting.ThreadLeakControl tryToInterruptAll
   [junit4]   2> SEVERE: There are still zombie threads that couldn't be terminated:
   [junit4]   2>    1) Thread[id=2446, name=searcherExecutor-1640-thread-1, state=WAITING, group=TGRP-TestCoreDiscovery]
   [junit4]   2>         at sun.misc.Unsafe.park(Native Method)
   [junit4]   2>         at java.util.concurrent.locks.LockSupport.park(LockSupport.java:175)
   [junit4]   2>         at java.util.concurrent.locks.AbstractQueuedSynchronizer$ConditionObject.await(AbstractQueuedSynchronizer.java:2039)
   [junit4]   2>         at java.util.concurrent.LinkedBlockingQueue.take(LinkedBlockingQueue.java:442)
   [junit4]   2>         at java.util.concurrent.ThreadPoolExecutor.getTask(ThreadPoolExecutor.java:1067)
   [junit4]   2>         at java.util.concurrent.ThreadPoolExecutor.runWorker(ThreadPoolExecutor.java:1127)
   [junit4]   2>         at java.util.concurrent.ThreadPoolExecutor$Worker.run(ThreadPoolExecutor.java:617)
   [junit4]   2>         at java.lang.Thread.run(Thread.java:745)
   [junit4]   2> NOTE: test params are: codec=Lucene62, sim=RandomSimilarity(queryNorm=true,coord=no): {}, locale=mk, timezone=America/El_Salvador
   [junit4]   2> NOTE: SunOS 5.11 amd64/Oracle Corporation 1.8.0_102 (64-bit)/cpus=3,threads=2,free=66401328,total=159473664
   [junit4]   2> NOTE: All tests run in this JVM: [BaseCdcrDistributedZkTest, NumericFieldsTest, DistributedMLTComponentTest, TestSolrCLIRunExample, OverseerModifyCollectionTest, DistributedDebugComponentTest, TestSolrQueryParserResource, TestDynamicFieldCollectionResource, WordBreakSolrSpellCheckerTest, DistributedQueueTest, DocExpirationUpdateProcessorFactoryTest, CacheHeaderTest, TestReplicaProperties, DistributedQueryComponentCustomSortTest, ChangedSchemaMergeTest, BinaryUpdateRequestHandlerTest, TestRecovery, MergeStrategyTest, QueryParsingTest, SolrIndexSplitterTest, IndexSchemaRuntimeFieldTest, TestAtomicUpdateErrorCases, TestRandomFaceting, TestLegacyFieldCache, TestSubQueryTransformer, TestManagedStopFilterFactory, TestManagedSchema, OpenCloseCoreStressTest, DateFieldTest, TermVectorComponentDistributedTest, PeerSyncReplicationTest, TestCoreDiscovery]
   [junit4]   2> NOTE: reproduce with: ant test  -Dtestcase=TestCoreDiscovery -Dtests.seed=35036FCA06A2C923 -Dtests.slow=true -Dtests.locale=mk -Dtests.timezone=America/El_Salvador -Dtests.asserts=true -Dtests.file.encoding=ISO-8859-1
   [junit4] ERROR   0.00s J1 | TestCoreDiscovery (suite) <<<
   [junit4]    > Throwable #1: java.lang.AssertionError: ObjectTracker found 5 object(s) that were not released!!! [MockDirectoryWrapper, MockDirectoryWrapper, SolrCore, MDCAwareThreadPoolExecutor, MockDirectoryWrapper]
   [junit4]    > 	at __randomizedtesting.SeedInfo.seed([35036FCA06A2C923]:0)
   [junit4]    > 	at org.apache.solr.SolrTestCaseJ4.teardownTestCases(SolrTestCaseJ4.java:258)
   [junit4]    > 	at java.lang.Thread.run(Thread.java:745)Throwable #2: com.carrotsearch.randomizedtesting.ThreadLeakError: 1 thread leaked from SUITE scope at org.apache.solr.core.TestCoreDiscovery: 
   [junit4]    >    1) Thread[id=2446, name=searcherExecutor-1640-thread-1, state=WAITING, group=TGRP-TestCoreDiscovery]
   [junit4]    >         at sun.misc.Unsafe.park(Native Method)
   [junit4]    >         at java.util.concurrent.locks.LockSupport.park(LockSupport.java:175)
   [junit4]    >         at java.util.concurrent.locks.AbstractQueuedSynchronizer$ConditionObject.await(AbstractQueuedSynchronizer.java:2039)
   [junit4]    >         at java.util.concurrent.LinkedBlockingQueue.take(LinkedBlockingQueue.java:442)
   [junit4]    >         at java.util.concurrent.ThreadPoolExecutor.getTask(ThreadPoolExecutor.java:1067)
   [junit4]    >         at java.util.concurrent.ThreadPoolExecutor.runWorker(ThreadPoolExecutor.java:1127)
   [junit4]    >         at java.util.concurrent.ThreadPoolExecutor$Worker.run(ThreadPoolExecutor.java:617)
   [junit4]    >         at java.lang.Thread.run(Thread.java:745)
   [junit4]    > 	at __randomizedtesting.SeedInfo.seed([35036FCA06A2C923]:0)Throwable #3: com.carrotsearch.randomizedtesting.ThreadLeakError: There are still zombie threads that couldn't be terminated:
   [junit4]    >    1) Thread[id=2446, name=searcherExecutor-1640-thread-1, state=WAITING, group=TGRP-TestCoreDiscovery]
   [junit4]    >         at sun.misc.Unsafe.park(Native Method)
   [junit4]    >         at java.util.concurrent.locks.LockSupport.park(LockSupport.java:175)
   [junit4]    >         at java.util.concurrent.locks.AbstractQueuedSynchronizer$ConditionObject.await(AbstractQueuedSynchronizer.java:2039)
   [junit4]    >         at java.util.concurrent.LinkedBlockingQueue.take(LinkedBlockingQueue.java:442)
   [junit4]    >         at java.util.concurrent.ThreadPoolExecutor.getTask(ThreadPoolExecutor.java:1067)
   [junit4]    >         at java.util.concurrent.ThreadPoolExecutor.runWorker(ThreadPoolExecutor.java:1127)
   [junit4]    >         at java.util.concurrent.ThreadPoolExecutor$Worker.run(ThreadPoolExecutor.java:617)
   [junit4]    >         at java.lang.Thread.run(Thread.java:745)
   [junit4]    > 	at __randomizedtesting.SeedInfo.seed([35036FCA06A2C923]:0)
   [junit4] Completed [82/632 (1!)] on J1 in 146.29s, 12 tests, 1 failure, 2 errors <<< FAILURES!

[...truncated 61923 lines...]


Mime
View raw message