lucene-dev mailing list archives

Site index · List index
Message view « Date » · « Thread »
Top « Date » · « Thread »
From Policeman Jenkins Server <jenk...@thetaphi.de>
Subject [JENKINS] Lucene-Solr-5.5-Linux (64bit/jdk1.8.0_102) - Build # 379 - Still Unstable!
Date Sun, 04 Sep 2016 07:51:55 GMT
Build: http://jenkins.thetaphi.de/job/Lucene-Solr-5.5-Linux/379/
Java: 64bit/jdk1.8.0_102 -XX:-UseCompressedOops -XX:+UseSerialGC

1 tests failed.
FAILED:  org.apache.solr.handler.TestReplicationHandler.doTestIndexFetchOnMasterRestart

Error Message:
expected:<1> but was:<2>

Stack Trace:
java.lang.AssertionError: expected:<1> but was:<2>
	at __randomizedtesting.SeedInfo.seed([9C3778951B87EB73:44C0BC71B05C292F]:0)
	at org.junit.Assert.fail(Assert.java:93)
	at org.junit.Assert.failNotEquals(Assert.java:647)
	at org.junit.Assert.assertEquals(Assert.java:128)
	at org.junit.Assert.assertEquals(Assert.java:472)
	at org.junit.Assert.assertEquals(Assert.java:456)
	at org.apache.solr.handler.TestReplicationHandler.doTestIndexFetchOnMasterRestart(TestReplicationHandler.java:624)
	at sun.reflect.NativeMethodAccessorImpl.invoke0(Native Method)
	at sun.reflect.NativeMethodAccessorImpl.invoke(NativeMethodAccessorImpl.java:62)
	at sun.reflect.DelegatingMethodAccessorImpl.invoke(DelegatingMethodAccessorImpl.java:43)
	at java.lang.reflect.Method.invoke(Method.java:498)
	at com.carrotsearch.randomizedtesting.RandomizedRunner.invoke(RandomizedRunner.java:1764)
	at com.carrotsearch.randomizedtesting.RandomizedRunner$8.evaluate(RandomizedRunner.java:871)
	at com.carrotsearch.randomizedtesting.RandomizedRunner$9.evaluate(RandomizedRunner.java:907)
	at com.carrotsearch.randomizedtesting.RandomizedRunner$10.evaluate(RandomizedRunner.java:921)
	at com.carrotsearch.randomizedtesting.rules.SystemPropertiesRestoreRule$1.evaluate(SystemPropertiesRestoreRule.java:57)
	at org.apache.lucene.util.TestRuleSetupTeardownChained$1.evaluate(TestRuleSetupTeardownChained.java:49)
	at org.apache.lucene.util.AbstractBeforeAfterRule$1.evaluate(AbstractBeforeAfterRule.java:45)
	at org.apache.lucene.util.TestRuleThreadAndTestName$1.evaluate(TestRuleThreadAndTestName.java:48)
	at org.apache.lucene.util.TestRuleIgnoreAfterMaxFailures$1.evaluate(TestRuleIgnoreAfterMaxFailures.java:64)
	at org.apache.lucene.util.TestRuleMarkFailure$1.evaluate(TestRuleMarkFailure.java:47)
	at com.carrotsearch.randomizedtesting.rules.StatementAdapter.evaluate(StatementAdapter.java:36)
	at com.carrotsearch.randomizedtesting.ThreadLeakControl$StatementRunner.run(ThreadLeakControl.java:367)
	at com.carrotsearch.randomizedtesting.ThreadLeakControl.forkTimeoutingTask(ThreadLeakControl.java:809)
	at com.carrotsearch.randomizedtesting.ThreadLeakControl$3.evaluate(ThreadLeakControl.java:460)
	at com.carrotsearch.randomizedtesting.RandomizedRunner.runSingleTest(RandomizedRunner.java:880)
	at com.carrotsearch.randomizedtesting.RandomizedRunner$5.evaluate(RandomizedRunner.java:781)
	at com.carrotsearch.randomizedtesting.RandomizedRunner$6.evaluate(RandomizedRunner.java:816)
	at com.carrotsearch.randomizedtesting.RandomizedRunner$7.evaluate(RandomizedRunner.java:827)
	at com.carrotsearch.randomizedtesting.rules.StatementAdapter.evaluate(StatementAdapter.java:36)
	at com.carrotsearch.randomizedtesting.rules.SystemPropertiesRestoreRule$1.evaluate(SystemPropertiesRestoreRule.java:57)
	at org.apache.lucene.util.AbstractBeforeAfterRule$1.evaluate(AbstractBeforeAfterRule.java:45)
	at com.carrotsearch.randomizedtesting.rules.StatementAdapter.evaluate(StatementAdapter.java:36)
	at org.apache.lucene.util.TestRuleStoreClassName$1.evaluate(TestRuleStoreClassName.java:41)
	at com.carrotsearch.randomizedtesting.rules.NoShadowingOrOverridesOnMethodsRule$1.evaluate(NoShadowingOrOverridesOnMethodsRule.java:40)
	at com.carrotsearch.randomizedtesting.rules.NoShadowingOrOverridesOnMethodsRule$1.evaluate(NoShadowingOrOverridesOnMethodsRule.java:40)
	at com.carrotsearch.randomizedtesting.rules.StatementAdapter.evaluate(StatementAdapter.java:36)
	at com.carrotsearch.randomizedtesting.rules.StatementAdapter.evaluate(StatementAdapter.java:36)
	at com.carrotsearch.randomizedtesting.rules.StatementAdapter.evaluate(StatementAdapter.java:36)
	at org.apache.lucene.util.TestRuleAssertionsRequired$1.evaluate(TestRuleAssertionsRequired.java:53)
	at org.apache.lucene.util.TestRuleMarkFailure$1.evaluate(TestRuleMarkFailure.java:47)
	at org.apache.lucene.util.TestRuleIgnoreAfterMaxFailures$1.evaluate(TestRuleIgnoreAfterMaxFailures.java:64)
	at org.apache.lucene.util.TestRuleIgnoreTestSuites$1.evaluate(TestRuleIgnoreTestSuites.java:54)
	at com.carrotsearch.randomizedtesting.rules.StatementAdapter.evaluate(StatementAdapter.java:36)
	at com.carrotsearch.randomizedtesting.ThreadLeakControl$StatementRunner.run(ThreadLeakControl.java:367)
	at java.lang.Thread.run(Thread.java:745)




Build Log:
[...truncated 10672 lines...]
   [junit4] Suite: org.apache.solr.handler.TestReplicationHandler
   [junit4]   2> Creating dataDir: /home/jenkins/workspace/Lucene-Solr-5.5-Linux/solr/build/solr-core/test/J0/temp/solr.handler.TestReplicationHandler_9C3778951B87EB73-001/init-core-data-001
   [junit4]   2> 4377 INFO  (TEST-TestReplicationHandler.doTestHandlerPathUnchanged-seed#[9C3778951B87EB73]) [    ] o.a.s.SolrTestCaseJ4 ###Starting doTestHandlerPathUnchanged
   [junit4]   2> 4378 INFO  (TEST-TestReplicationHandler.doTestHandlerPathUnchanged-seed#[9C3778951B87EB73]) [    ] o.a.s.SolrTestCaseJ4 Writing core.properties file to /home/jenkins/workspace/Lucene-Solr-5.5-Linux/solr/build/solr-core/test/J0/temp/solr.handler.TestReplicationHandler_9C3778951B87EB73-001/solr-instance-001/collection1
   [junit4]   2> 4386 INFO  (TEST-TestReplicationHandler.doTestHandlerPathUnchanged-seed#[9C3778951B87EB73]) [    ] o.e.j.s.Server jetty-9.2.13.v20150730
   [junit4]   2> 4387 INFO  (TEST-TestReplicationHandler.doTestHandlerPathUnchanged-seed#[9C3778951B87EB73]) [    ] o.e.j.s.h.ContextHandler Started o.e.j.s.ServletContextHandler@5328cf96{/solr,null,AVAILABLE}
   [junit4]   2> 4398 INFO  (TEST-TestReplicationHandler.doTestHandlerPathUnchanged-seed#[9C3778951B87EB73]) [    ] o.e.j.s.ServerConnector Started ServerConnector@8764110{HTTP/1.1}{127.0.0.1:42835}
   [junit4]   2> 4398 INFO  (TEST-TestReplicationHandler.doTestHandlerPathUnchanged-seed#[9C3778951B87EB73]) [    ] o.e.j.s.Server Started @6034ms
   [junit4]   2> 4402 INFO  (TEST-TestReplicationHandler.doTestHandlerPathUnchanged-seed#[9C3778951B87EB73]) [    ] o.a.s.c.s.e.JettySolrRunner Jetty properties: {solr.data.dir=/home/jenkins/workspace/Lucene-Solr-5.5-Linux/solr/build/solr-core/test/J0/temp/solr.handler.TestReplicationHandler_9C3778951B87EB73-001/solr-instance-001/collection1/data, hostContext=/solr, hostPort=42835}
   [junit4]   2> 4403 INFO  (TEST-TestReplicationHandler.doTestHandlerPathUnchanged-seed#[9C3778951B87EB73]) [    ] o.a.s.s.SolrDispatchFilter SolrDispatchFilter.init(): sun.misc.Launcher$AppClassLoader@73d16e93
   [junit4]   2> 4403 INFO  (TEST-TestReplicationHandler.doTestHandlerPathUnchanged-seed#[9C3778951B87EB73]) [    ] o.a.s.c.SolrResourceLoader new SolrResourceLoader for directory: '/home/jenkins/workspace/Lucene-Solr-5.5-Linux/solr/build/solr-core/test/J0/temp/solr.handler.TestReplicationHandler_9C3778951B87EB73-001/solr-instance-001'
   [junit4]   2> 4403 INFO  (TEST-TestReplicationHandler.doTestHandlerPathUnchanged-seed#[9C3778951B87EB73]) [    ] o.a.s.c.SolrResourceLoader JNDI not configured for solr (NoInitialContextEx)
   [junit4]   2> 4404 INFO  (TEST-TestReplicationHandler.doTestHandlerPathUnchanged-seed#[9C3778951B87EB73]) [    ] o.a.s.c.SolrResourceLoader solr home defaulted to 'solr/' (could not find system property or JNDI)
   [junit4]   2> 4404 INFO  (TEST-TestReplicationHandler.doTestHandlerPathUnchanged-seed#[9C3778951B87EB73]) [    ] o.a.s.c.SolrXmlConfig Loading container configuration from /home/jenkins/workspace/Lucene-Solr-5.5-Linux/solr/build/solr-core/test/J0/temp/solr.handler.TestReplicationHandler_9C3778951B87EB73-001/solr-instance-001/solr.xml
   [junit4]   2> 4414 INFO  (TEST-TestReplicationHandler.doTestHandlerPathUnchanged-seed#[9C3778951B87EB73]) [    ] o.a.s.c.CorePropertiesLocator Config-defined core root directory: /home/jenkins/workspace/Lucene-Solr-5.5-Linux/solr/build/solr-core/test/J0/temp/solr.handler.TestReplicationHandler_9C3778951B87EB73-001/solr-instance-001/.
   [junit4]   2> 4414 INFO  (TEST-TestReplicationHandler.doTestHandlerPathUnchanged-seed#[9C3778951B87EB73]) [    ] o.a.s.c.CoreContainer New CoreContainer 1942621576
   [junit4]   2> 4414 INFO  (TEST-TestReplicationHandler.doTestHandlerPathUnchanged-seed#[9C3778951B87EB73]) [    ] o.a.s.c.CoreContainer Loading cores into CoreContainer [instanceDir=/home/jenkins/workspace/Lucene-Solr-5.5-Linux/solr/build/solr-core/test/J0/temp/solr.handler.TestReplicationHandler_9C3778951B87EB73-001/solr-instance-001]
   [junit4]   2> 4415 WARN  (TEST-TestReplicationHandler.doTestHandlerPathUnchanged-seed#[9C3778951B87EB73]) [    ] o.a.s.c.CoreContainer Couldn't add files from /home/jenkins/workspace/Lucene-Solr-5.5-Linux/solr/build/solr-core/test/J0/temp/solr.handler.TestReplicationHandler_9C3778951B87EB73-001/solr-instance-001/lib to classpath: /home/jenkins/workspace/Lucene-Solr-5.5-Linux/solr/build/solr-core/test/J0/temp/solr.handler.TestReplicationHandler_9C3778951B87EB73-001/solr-instance-001/lib
   [junit4]   2> 4415 INFO  (TEST-TestReplicationHandler.doTestHandlerPathUnchanged-seed#[9C3778951B87EB73]) [    ] o.a.s.h.c.HttpShardHandlerFactory created with socketTimeout : 90000,urlScheme : ,connTimeout : 15000,maxConnectionsPerHost : 20,maxConnections : 10000,corePoolSize : 0,maximumPoolSize : 2147483647,maxThreadIdleTime : 5,sizeOfQueue : -1,fairnessPolicy : false,useRetries : false,connectionsEvictorSleepDelay : 5000,maxConnectionIdleTime : 40000,
   [junit4]   2> 4416 INFO  (TEST-TestReplicationHandler.doTestHandlerPathUnchanged-seed#[9C3778951B87EB73]) [    ] o.a.s.u.UpdateShardHandler Creating UpdateShardHandler HTTP client with params: socketTimeout=340000&connTimeout=45000&retry=true
   [junit4]   2> 4417 INFO  (TEST-TestReplicationHandler.doTestHandlerPathUnchanged-seed#[9C3778951B87EB73]) [    ] o.a.s.l.LogWatcher SLF4J impl is org.slf4j.impl.Log4jLoggerFactory
   [junit4]   2> 4417 INFO  (TEST-TestReplicationHandler.doTestHandlerPathUnchanged-seed#[9C3778951B87EB73]) [    ] o.a.s.l.LogWatcher Registering Log Listener [Log4j (org.slf4j.impl.Log4jLoggerFactory)]
   [junit4]   2> 4417 INFO  (TEST-TestReplicationHandler.doTestHandlerPathUnchanged-seed#[9C3778951B87EB73]) [    ] o.a.s.c.CoreContainer Security conf doesn't exist. Skipping setup for authorization module.
   [junit4]   2> 4417 INFO  (TEST-TestReplicationHandler.doTestHandlerPathUnchanged-seed#[9C3778951B87EB73]) [    ] o.a.s.c.CoreContainer No authentication plugin used.
   [junit4]   2> 4420 INFO  (TEST-TestReplicationHandler.doTestHandlerPathUnchanged-seed#[9C3778951B87EB73]) [    ] o.a.s.c.CorePropertiesLocator Looking for core definitions underneath /home/jenkins/workspace/Lucene-Solr-5.5-Linux/solr/build/solr-core/test/J0/temp/solr.handler.TestReplicationHandler_9C3778951B87EB73-001/solr-instance-001/.
   [junit4]   2> 4421 INFO  (TEST-TestReplicationHandler.doTestHandlerPathUnchanged-seed#[9C3778951B87EB73]) [    ] o.a.s.c.CoreDescriptor Created CoreDescriptor: {name=collection1, config=solrconfig.xml, loadOnStartup=true, schema=schema.xml, configSetProperties=configsetprops.json, transient=false, dataDir=data/}
   [junit4]   2> 4421 INFO  (TEST-TestReplicationHandler.doTestHandlerPathUnchanged-seed#[9C3778951B87EB73]) [    ] o.a.s.c.CorePropertiesLocator Found core collection1 in /home/jenkins/workspace/Lucene-Solr-5.5-Linux/solr/build/solr-core/test/J0/temp/solr.handler.TestReplicationHandler_9C3778951B87EB73-001/solr-instance-001/./collection1
   [junit4]   2> 4422 INFO  (TEST-TestReplicationHandler.doTestHandlerPathUnchanged-seed#[9C3778951B87EB73]) [    ] o.a.s.c.CorePropertiesLocator Found 1 core definitions
   [junit4]   2> 4426 INFO  (TEST-TestReplicationHandler.doTestHandlerPathUnchanged-seed#[9C3778951B87EB73]) [    ] o.a.s.s.SolrDispatchFilter user.dir=/home/jenkins/workspace/Lucene-Solr-5.5-Linux/solr/build/solr-core/test/J0
   [junit4]   2> 4426 INFO  (TEST-TestReplicationHandler.doTestHandlerPathUnchanged-seed#[9C3778951B87EB73]) [    ] o.a.s.s.SolrDispatchFilter SolrDispatchFilter.init() done
   [junit4]   2> 4427 INFO  (coreLoadExecutor-32-thread-1) [    ] o.a.s.c.SolrResourceLoader new SolrResourceLoader for directory: '/home/jenkins/workspace/Lucene-Solr-5.5-Linux/solr/build/solr-core/test/J0/temp/solr.handler.TestReplicationHandler_9C3778951B87EB73-001/solr-instance-001/collection1'
   [junit4]   2> 4429 INFO  (coreLoadExecutor-32-thread-1) [    ] o.a.s.c.SolrResourceLoader JNDI not configured for solr (NoInitialContextEx)
   [junit4]   2> 4429 INFO  (coreLoadExecutor-32-thread-1) [    ] o.a.s.c.SolrResourceLoader solr home defaulted to 'solr/' (could not find system property or JNDI)
   [junit4]   2> 4447 INFO  (coreLoadExecutor-32-thread-1) [    ] o.a.s.c.SolrConfig current version of requestparams : -1
   [junit4]   2> 4453 INFO  (coreLoadExecutor-32-thread-1) [    ] o.a.s.c.SolrConfig Using Lucene MatchVersion: 5.5.3
   [junit4]   2> 4464 INFO  (coreLoadExecutor-32-thread-1) [    ] o.a.s.c.SolrConfig Loaded SolrConfig: solrconfig.xml
   [junit4]   2> 4495 INFO  (coreLoadExecutor-32-thread-1) [    ] o.a.s.s.IndexSchema [collection1] Schema name=test
   [junit4]   2> 4499 INFO  (coreLoadExecutor-32-thread-1) [    ] o.a.s.s.IndexSchema unique key field: id
   [junit4]   2> 4500 INFO  (coreLoadExecutor-32-thread-1) [    ] o.a.s.c.ConfigSetProperties Did not find ConfigSet properties, assuming default properties: Can't find resource 'configsetprops.json' in classpath or '/home/jenkins/workspace/Lucene-Solr-5.5-Linux/solr/build/solr-core/test/J0/temp/solr.handler.TestReplicationHandler_9C3778951B87EB73-001/solr-instance-001/collection1'
   [junit4]   2> 4500 INFO  (coreLoadExecutor-32-thread-1) [    ] o.a.s.c.CoreContainer Creating SolrCore 'collection1' using configuration from instancedir /home/jenkins/workspace/Lucene-Solr-5.5-Linux/solr/build/solr-core/test/J0/temp/solr.handler.TestReplicationHandler_9C3778951B87EB73-001/solr-instance-001/./collection1
   [junit4]   2> 4501 INFO  (coreLoadExecutor-32-thread-1) [    x:collection1] o.a.s.c.SolrCore org.apache.solr.core.MockDirectoryFactory
   [junit4]   2> 4501 INFO  (coreLoadExecutor-32-thread-1) [    x:collection1] o.a.s.c.SolrCore [[collection1] ] Opening new SolrCore at [/home/jenkins/workspace/Lucene-Solr-5.5-Linux/solr/build/solr-core/test/J0/temp/solr.handler.TestReplicationHandler_9C3778951B87EB73-001/solr-instance-001/collection1], dataDir=[/home/jenkins/workspace/Lucene-Solr-5.5-Linux/solr/build/solr-core/test/J0/temp/solr.handler.TestReplicationHandler_9C3778951B87EB73-001/solr-instance-001/./collection1/data/]
   [junit4]   2> 4501 INFO  (coreLoadExecutor-32-thread-1) [    x:collection1] o.a.s.c.SolrCore JMX monitoring not detected for core: collection1
   [junit4]   2> 4503 INFO  (coreLoadExecutor-32-thread-1) [    x:collection1] o.a.s.c.CachingDirectoryFactory return new directory for /home/jenkins/workspace/Lucene-Solr-5.5-Linux/solr/build/solr-core/test/J0/temp/solr.handler.TestReplicationHandler_9C3778951B87EB73-001/solr-instance-001/./collection1/data
   [junit4]   2> 4503 INFO  (coreLoadExecutor-32-thread-1) [    x:collection1] o.a.s.c.SolrCore New index directory detected: old=null new=/home/jenkins/workspace/Lucene-Solr-5.5-Linux/solr/build/solr-core/test/J0/temp/solr.handler.TestReplicationHandler_9C3778951B87EB73-001/solr-instance-001/./collection1/data/index/
   [junit4]   2> 4503 WARN  (coreLoadExecutor-32-thread-1) [    x:collection1] o.a.s.c.SolrCore [collection1] Solr index directory '/home/jenkins/workspace/Lucene-Solr-5.5-Linux/solr/build/solr-core/test/J0/temp/solr.handler.TestReplicationHandler_9C3778951B87EB73-001/solr-instance-001/./collection1/data/index' doesn't exist. Creating new index...
   [junit4]   2> 4503 INFO  (coreLoadExecutor-32-thread-1) [    x:collection1] o.a.s.c.CachingDirectoryFactory return new directory for /home/jenkins/workspace/Lucene-Solr-5.5-Linux/solr/build/solr-core/test/J0/temp/solr.handler.TestReplicationHandler_9C3778951B87EB73-001/solr-instance-001/./collection1/data/index
   [junit4]   2> 4505 INFO  (coreLoadExecutor-32-thread-1) [    x:collection1] o.a.s.u.RandomMergePolicy RandomMergePolicy wrapping class org.apache.lucene.index.AlcoholicMergePolicy: [AlcoholicMergePolicy: minMergeSize=0, mergeFactor=10, maxMergeSize=936859710, maxMergeSizeForForcedMerge=9223372036854775807, calibrateSizeByDeletes=true, maxMergeDocs=2147483647, maxCFSSegmentSizeMB=8.796093022207999E12, noCFSRatio=0.1]
   [junit4]   2> 4506 INFO  (coreLoadExecutor-32-thread-1) [    x:collection1] o.a.s.c.SolrDeletionPolicy SolrDeletionPolicy.onCommit: commits: num=1
   [junit4]   2> 	commit{dir=MockDirectoryWrapper(RAMDirectory@48843d5e lockFactory=org.apache.lucene.store.SingleInstanceLockFactory@73a9c723),segFN=segments_1,generation=1}
   [junit4]   2> 4506 INFO  (coreLoadExecutor-32-thread-1) [    x:collection1] o.a.s.c.SolrDeletionPolicy newest commit generation = 1
   [junit4]   2> 4507 INFO  (OldIndexDirectoryCleanupThreadForCore-collection1) [    x:collection1] o.a.s.c.SolrCore Looking for old index directories to cleanup for core collection1 in /home/jenkins/workspace/Lucene-Solr-5.5-Linux/solr/build/solr-core/test/J0/temp/solr.handler.TestReplicationHandler_9C3778951B87EB73-001/solr-instance-001/./collection1/data/
   [junit4]   2> 4508 INFO  (coreLoadExecutor-32-thread-1) [    x:collection1] o.a.s.c.SolrCore no updateRequestProcessorChain defined as default, creating implicit default
   [junit4]   2> 4510 INFO  (coreLoadExecutor-32-thread-1) [    x:collection1] o.a.s.h.l.XMLLoader xsltCacheLifetimeSeconds=60
   [junit4]   2> 4512 INFO  (coreLoadExecutor-32-thread-1) [    x:collection1] o.a.s.h.l.XMLLoader xsltCacheLifetimeSeconds=60
   [junit4]   2> 4512 INFO  (coreLoadExecutor-32-thread-1) [    x:collection1] o.a.s.h.l.XMLLoader xsltCacheLifetimeSeconds=60
   [junit4]   2> 4513 INFO  (coreLoadExecutor-32-thread-1) [    x:collection1] o.a.s.h.l.XMLLoader xsltCacheLifetimeSeconds=60
   [junit4]   2> 4517 INFO  (coreLoadExecutor-32-thread-1) [    x:collection1] o.a.s.c.PluginBag requestHandler : 'lazy' created with startup=lazy 
   [junit4]   2> 4518 INFO  (coreLoadExecutor-32-thread-1) [    x:collection1] o.a.s.c.RequestHandlers Registered paths: /admin/mbeans,standard,lazy,/update/csv,/update/json/docs,/admin/luke,/admin/segments,/get,/admin/system,/replication,/admin/properties,defaults,/config,/schema,/admin/plugins,/admin/logging,/update/json,/admin/threads,/admin/ping,/update,/admin/file
   [junit4]   2> 4519 INFO  (coreLoadExecutor-32-thread-1) [    x:collection1] o.a.s.c.SolrCore Using default statsCache cache: org.apache.solr.search.stats.LocalStatsCache
   [junit4]   2> 4519 INFO  (coreLoadExecutor-32-thread-1) [    x:collection1] o.a.s.u.CommitTracker Hard AutoCommit: disabled
   [junit4]   2> 4519 INFO  (coreLoadExecutor-32-thread-1) [    x:collection1] o.a.s.u.CommitTracker Soft AutoCommit: disabled
   [junit4]   2> 4519 INFO  (coreLoadExecutor-32-thread-1) [    x:collection1] o.a.s.u.RandomMergePolicy RandomMergePolicy wrapping class org.apache.lucene.index.LogDocMergePolicy: [LogDocMergePolicy: minMergeSize=1000, mergeFactor=23, maxMergeSize=9223372036854775807, maxMergeSizeForForcedMerge=9223372036854775807, calibrateSizeByDeletes=true, maxMergeDocs=2147483647, maxCFSSegmentSizeMB=8.796093022207999E12, noCFSRatio=0.4349347009770239]
   [junit4]   2> 4520 INFO  (coreLoadExecutor-32-thread-1) [    x:collection1] o.a.s.c.SolrDeletionPolicy SolrDeletionPolicy.onInit: commits: num=1
   [junit4]   2> 	commit{dir=MockDirectoryWrapper(RAMDirectory@48843d5e lockFactory=org.apache.lucene.store.SingleInstanceLockFactory@73a9c723),segFN=segments_1,generation=1}
   [junit4]   2> 4520 INFO  (coreLoadExecutor-32-thread-1) [    x:collection1] o.a.s.c.SolrDeletionPolicy newest commit generation = 1
   [junit4]   2> 4520 INFO  (coreLoadExecutor-32-thread-1) [    x:collection1] o.a.s.s.SolrIndexSearcher Opening Searcher@5cb84c61[collection1] main
   [junit4]   2> 4521 INFO  (coreLoadExecutor-32-thread-1) [    x:collection1] o.a.s.r.ManagedResourceStorage File-based storage initialized to use dir: /home/jenkins/workspace/Lucene-Solr-5.5-Linux/solr/build/solr-core/test/J0/temp/solr.handler.TestReplicationHandler_9C3778951B87EB73-001/solr-instance-001/collection1/conf
   [junit4]   2> 4521 INFO  (coreLoadExecutor-32-thread-1) [    x:collection1] o.a.s.r.RestManager Initializing RestManager with initArgs: {storageDir=/home/jenkins/workspace/Lucene-Solr-5.5-Linux/solr/build/solr-core/test/J0/temp/solr.handler.TestReplicationHandler_9C3778951B87EB73-001/solr-instance-001/collection1/conf}
   [junit4]   2> 4521 INFO  (coreLoadExecutor-32-thread-1) [    x:collection1] o.a.s.r.ManagedResourceStorage Reading _rest_managed.json using file:dir=/home/jenkins/workspace/Lucene-Solr-5.5-Linux/solr/build/solr-core/test/J0/temp/solr.handler.TestReplicationHandler_9C3778951B87EB73-001/solr-instance-001/collection1/conf
   [junit4]   2> 4521 INFO  (coreLoadExecutor-32-thread-1) [    x:collection1] o.a.s.r.RestManager Initializing 0 registered ManagedResources
   [junit4]   2> 4521 INFO  (coreLoadExecutor-32-thread-1) [    x:collection1] o.a.s.h.ReplicationHandler Replication enabled for following config files: schema.xml,xslt/dummy.xsl
   [junit4]   2> 4522 INFO  (coreLoadExecutor-32-thread-1) [    x:collection1] o.a.s.h.ReplicationHandler Commits will be reserved for  10000
   [junit4]   2> 4522 INFO  (searcherExecutor-33-thread-1-processing-x:collection1) [    x:collection1] o.a.s.c.SolrCore [collection1] Registered new searcher Searcher@5cb84c61[collection1] main{ExitableDirectoryReader(UninvertingDirectoryReader())}
   [junit4]   2> 4522 INFO  (coreLoadExecutor-32-thread-1) [    x:collection1] o.a.s.c.CoreContainer registering core: collection1
   [junit4]   2> 4939 INFO  (TEST-TestReplicationHandler.doTestHandlerPathUnchanged-seed#[9C3778951B87EB73]) [    ] o.a.s.SolrTestCaseJ4 Writing core.properties file to /home/jenkins/workspace/Lucene-Solr-5.5-Linux/solr/build/solr-core/test/J0/temp/solr.handler.TestReplicationHandler_9C3778951B87EB73-001/solr-instance-002/collection1
   [junit4]   2> 4943 INFO  (TEST-TestReplicationHandler.doTestHandlerPathUnchanged-seed#[9C3778951B87EB73]) [    ] o.e.j.s.Server jetty-9.2.13.v20150730
   [junit4]   2> 4960 INFO  (TEST-TestReplicationHandler.doTestHandlerPathUnchanged-seed#[9C3778951B87EB73]) [    ] o.e.j.s.h.ContextHandler Started o.e.j.s.ServletContextHandler@29e74d0e{/solr,null,AVAILABLE}
   [junit4]   2> 4962 INFO  (TEST-TestReplicationHandler.doTestHandlerPathUnchanged-seed#[9C3778951B87EB73]) [    ] o.e.j.s.ServerConnector Started ServerConnector@7fe33f4a{HTTP/1.1}{127.0.0.1:34145}
   [junit4]   2> 4962 INFO  (TEST-TestReplicationHandler.doTestHandlerPathUnchanged-seed#[9C3778951B87EB73]) [    ] o.e.j.s.Server Started @6598ms
   [junit4]   2> 4962 INFO  (TEST-TestReplicationHandler.doTestHandlerPathUnchanged-seed#[9C3778951B87EB73]) [    ] o.a.s.c.s.e.JettySolrRunner Jetty properties: {solr.data.dir=/home/jenkins/workspace/Lucene-Solr-5.5-Linux/solr/build/solr-core/test/J0/temp/solr.handler.TestReplicationHandler_9C3778951B87EB73-001/solr-instance-002/collection1/data, hostContext=/solr, hostPort=34145}
   [junit4]   2> 4963 INFO  (TEST-TestReplicationHandler.doTestHandlerPathUnchanged-seed#[9C3778951B87EB73]) [    ] o.a.s.s.SolrDispatchFilter SolrDispatchFilter.init(): sun.misc.Launcher$AppClassLoader@73d16e93
   [junit4]   2> 4963 INFO  (TEST-TestReplicationHandler.doTestHandlerPathUnchanged-seed#[9C3778951B87EB73]) [    ] o.a.s.c.SolrResourceLoader new SolrResourceLoader for directory: '/home/jenkins/workspace/Lucene-Solr-5.5-Linux/solr/build/solr-core/test/J0/temp/solr.handler.TestReplicationHandler_9C3778951B87EB73-001/solr-instance-002'
   [junit4]   2> 4963 INFO  (TEST-TestReplicationHandler.doTestHandlerPathUnchanged-seed#[9C3778951B87EB73]) [    ] o.a.s.c.SolrResourceLoader JNDI not configured for solr (NoInitialContextEx)
   [junit4]   2> 4963 INFO  (TEST-TestReplicationHandler.doTestHandlerPathUnchanged-seed#[9C3778951B87EB73]) [    ] o.a.s.c.SolrResourceLoader solr home defaulted to 'solr/' (could not find system property or JNDI)
   [junit4]   2> 4963 INFO  (TEST-TestReplicationHandler.doTestHandlerPathUnchanged-seed#[9C3778951B87EB73]) [    ] o.a.s.c.SolrXmlConfig Loading container configuration from /home/jenkins/workspace/Lucene-Solr-5.5-Linux/solr/build/solr-core/test/J0/temp/solr.handler.TestReplicationHandler_9C3778951B87EB73-001/solr-instance-002/solr.xml
   [junit4]   2> 4972 INFO  (TEST-TestReplicationHandler.doTestHandlerPathUnchanged-seed#[9C3778951B87EB73]) [    ] o.a.s.c.CorePropertiesLocator Config-defined core root directory: /home/jenkins/workspace/Lucene-Solr-5.5-Linux/solr/build/solr-core/test/J0/temp/solr.handler.TestReplicationHandler_9C3778951B87EB73-001/solr-instance-002/.
   [junit4]   2> 4972 INFO  (TEST-TestReplicationHandler.doTestHandlerPathUnchanged-seed#[9C3778951B87EB73]) [    ] o.a.s.c.CoreContainer New CoreContainer 487851347
   [junit4]   2> 4972 INFO  (TEST-TestReplicationHandler.doTestHandlerPathUnchanged-seed#[9C3778951B87EB73]) [    ] o.a.s.c.CoreContainer Loading cores into CoreContainer [instanceDir=/home/jenkins/workspace/Lucene-Solr-5.5-Linux/solr/build/solr-core/test/J0/temp/solr.handler.TestReplicationHandler_9C3778951B87EB73-001/solr-instance-002]
   [junit4]   2> 4973 WARN  (TEST-TestReplicationHandler.doTestHandlerPathUnchanged-seed#[9C3778951B87EB73]) [    ] o.a.s.c.CoreContainer Couldn't add files from /home/jenkins/workspace/Lucene-Solr-5.5-Linux/solr/build/solr-core/test/J0/temp/solr.handler.TestReplicationHandler_9C3778951B87EB73-001/solr-instance-002/lib to classpath: /home/jenkins/workspace/Lucene-Solr-5.5-Linux/solr/build/solr-core/test/J0/temp/solr.handler.TestReplicationHandler_9C3778951B87EB73-001/solr-instance-002/lib
   [junit4]   2> 4973 INFO  (TEST-TestReplicationHandler.doTestHandlerPathUnchanged-seed#[9C3778951B87EB73]) [    ] o.a.s.h.c.HttpShardHandlerFactory created with socketTimeout : 90000,urlScheme : ,connTimeout : 15000,maxConnectionsPerHost : 20,maxConnections : 10000,corePoolSize : 0,maximumPoolSize : 2147483647,maxThreadIdleTime : 5,sizeOfQueue : -1,fairnessPolicy : false,useRetries : false,connectionsEvictorSleepDelay : 5000,maxConnectionIdleTime : 40000,
   [junit4]   2> 4974 INFO  (TEST-TestReplicationHandler.doTestHandlerPathUnchanged-seed#[9C3778951B87EB73]) [    ] o.a.s.u.UpdateShardHandler Creating UpdateShardHandler HTTP client with params: socketTimeout=340000&connTimeout=45000&retry=true
   [junit4]   2> 4975 INFO  (TEST-TestReplicationHandler.doTestHandlerPathUnchanged-seed#[9C3778951B87EB73]) [    ] o.a.s.l.LogWatcher SLF4J impl is org.slf4j.impl.Log4jLoggerFactory
   [junit4]   2> 4975 INFO  (TEST-TestReplicationHandler.doTestHandlerPathUnchanged-seed#[9C3778951B87EB73]) [    ] o.a.s.l.LogWatcher Registering Log Listener [Log4j (org.slf4j.impl.Log4jLoggerFactory)]
   [junit4]   2> 4975 INFO  (TEST-TestReplicationHandler.doTestHandlerPathUnchanged-seed#[9C3778951B87EB73]) [    ] o.a.s.c.CoreContainer Security conf doesn't exist. Skipping setup for authorization module.
   [junit4]   2> 4975 INFO  (TEST-TestReplicationHandler.doTestHandlerPathUnchanged-seed#[9C3778951B87EB73]) [    ] o.a.s.c.CoreContainer No authentication plugin used.
   [junit4]   2> 4976 INFO  (TEST-TestReplicationHandler.doTestHandlerPathUnchanged-seed#[9C3778951B87EB73]) [    ] o.a.s.c.CorePropertiesLocator Looking for core definitions underneath /home/jenkins/workspace/Lucene-Solr-5.5-Linux/solr/build/solr-core/test/J0/temp/solr.handler.TestReplicationHandler_9C3778951B87EB73-001/solr-instance-002/.
   [junit4]   2> 4978 INFO  (TEST-TestReplicationHandler.doTestHandlerPathUnchanged-seed#[9C3778951B87EB73]) [    ] o.a.s.c.CoreDescriptor Created CoreDescriptor: {name=collection1, config=solrconfig.xml, loadOnStartup=true, schema=schema.xml, configSetProperties=configsetprops.json, transient=false, dataDir=data/}
   [junit4]   2> 4978 INFO  (TEST-TestReplicationHandler.doTestHandlerPathUnchanged-seed#[9C3778951B87EB73]) [    ] o.a.s.c.CorePropertiesLocator Found core collection1 in /home/jenkins/workspace/Lucene-Solr-5.5-Linux/solr/build/solr-core/test/J0/temp/solr.handler.TestReplicationHandler_9C3778951B87EB73-001/solr-instance-002/./collection1
   [junit4]   2> 4978 INFO  (TEST-TestReplicationHandler.doTestHandlerPathUnchanged-seed#[9C3778951B87EB73]) [    ] o.a.s.c.CorePropertiesLocator Found 1 core definitions
   [junit4]   2> 4978 INFO  (coreLoadExecutor-42-thread-1) [    ] o.a.s.c.SolrResourceLoader new SolrResourceLoader for directory: '/home/jenkins/workspace/Lucene-Solr-5.5-Linux/solr/build/solr-core/test/J0/temp/solr.handler.TestReplicationHandler_9C3778951B87EB73-001/solr-instance-002/collection1'
   [junit4]   2> 4979 INFO  (TEST-TestReplicationHandler.doTestHandlerPathUnchanged-seed#[9C3778951B87EB73]) [    ] o.a.s.s.SolrDispatchFilter user.dir=/home/jenkins/workspace/Lucene-Solr-5.5-Linux/solr/build/solr-core/test/J0
   [junit4]   2> 4979 INFO  (TEST-TestReplicationHandler.doTestHandlerPathUnchanged-seed#[9C3778951B87EB73]) [    ] o.a.s.s.SolrDispatchFilter SolrDispatchFilter.init() done
   [junit4]   2> 4979 INFO  (coreLoadExecutor-42-thread-1) [    ] o.a.s.c.SolrResourceLoader JNDI not configured for solr (NoInitialContextEx)
   [junit4]   2> 4979 INFO  (coreLoadExecutor-42-thread-1) [    ] o.a.s.c.SolrResourceLoader solr home defaulted to 'solr/' (could not find system property or JNDI)
   [junit4]   2> 4987 INFO  (coreLoadExecutor-42-thread-1) [    ] o.a.s.c.SolrConfig current version of requestparams : -1
   [junit4]   2> 4991 INFO  (coreLoadExecutor-42-thread-1) [    ] o.a.s.c.SolrConfig Using Lucene MatchVersion: 5.5.3
   [junit4]   2> 4999 INFO  (coreLoadExecutor-42-thread-1) [    ] o.a.s.c.SolrConfig Loaded SolrConfig: solrconfig.xml
   [junit4]   2> 5003 INFO  (coreLoadExecutor-42-thread-1) [    ] o.a.s.s.IndexSchema [collection1] Schema name=test
   [junit4]   2> 5007 INFO  (coreLoadExecutor-42-thread-1) [    ] o.a.s.s.IndexSchema unique key field: id
   [junit4]   2> 5008 INFO  (coreLoadExecutor-42-thread-1) [    ] o.a.s.c.ConfigSetProperties Did not find ConfigSet properties, assuming default properties: Can't find resource 'configsetprops.json' in classpath or '/home/jenkins/workspace/Lucene-Solr-5.5-Linux/solr/build/solr-core/test/J0/temp/solr.handler.TestReplicationHandler_9C3778951B87EB73-001/solr-instance-002/collection1'
   [junit4]   2> 5008 INFO  (coreLoadExecutor-42-thread-1) [    ] o.a.s.c.CoreContainer Creating SolrCore 'collection1' using configuration from instancedir /home/jenkins/workspace/Lucene-Solr-5.5-Linux/solr/build/solr-core/test/J0/temp/solr.handler.TestReplicationHandler_9C3778951B87EB73-001/solr-instance-002/./collection1
   [junit4]   2> 5008 INFO  (coreLoadExecutor-42-thread-1) [    x:collection1] o.a.s.c.SolrCore org.apache.solr.core.MockDirectoryFactory
   [junit4]   2> 5008 INFO  (coreLoadExecutor-42-thread-1) [    x:collection1] o.a.s.c.SolrCore [[collection1] ] Opening new SolrCore at [/home/jenkins/workspace/Lucene-Solr-5.5-Linux/solr/build/solr-core/test/J0/temp/solr.handler.TestReplicationHandler_9C3778951B87EB73-001/solr-instance-002/collection1], dataDir=[/home/jenkins/workspace/Lucene-Solr-5.5-Linux/solr/build/solr-core/test/J0/temp/solr.handler.TestReplicationHandler_9C3778951B87EB73-001/solr-instance-002/./collection1/data/]
   [junit4]   2> 5009 INFO  (coreLoadExecutor-42-thread-1) [    x:collection1] o.a.s.c.SolrCore JMX monitoring not detected for core: collection1
   [junit4]   2> 5009 INFO  (coreLoadExecutor-42-thread-1) [    x:collection1] o.a.s.c.CachingDirectoryFactory return new directory for /home/jenkins/workspace/Lucene-Solr-5.5-Linux/solr/build/solr-core/test/J0/temp/solr.handler.TestReplicationHandler_9C3778951B87EB73-001/solr-instance-002/./collection1/data
   [junit4]   2> 5009 INFO  (coreLoadExecutor-42-thread-1) [    x:collection1] o.a.s.c.SolrCore New index directory detected: old=null new=/home/jenkins/workspace/Lucene-Solr-5.5-Linux/solr/build/solr-core/test/J0/temp/solr.handler.TestReplicationHandler_9C3778951B87EB73-001/solr-instance-002/./collection1/data/index/
   [junit4]   2> 5009 WARN  (coreLoadExecutor-42-thread-1) [    x:collection1] o.a.s.c.SolrCore [collection1] Solr index directory '/home/jenkins/workspace/Lucene-Solr-5.5-Linux/solr/build/solr-core/test/J0/temp/solr.handler.TestReplicationHandler_9C3778951B87EB73-001/solr-instance-002/./collection1/data/index' doesn't exist. Creating new index...
   [junit4]   2> 5009 INFO  (coreLoadExecutor-42-thread-1) [    x:collection1] o.a.s.c.CachingDirectoryFactory return new directory for /home/jenkins/workspace/Lucene-Solr-5.5-Linux/solr/build/solr-core/test/J0/temp/solr.handler.TestReplicationHandler_9C3778951B87EB73-001/solr-instance-002/./collection1/data/index
   [junit4]   2> 5010 INFO  (coreLoadExecutor-42-thread-1) [    x:collection1] o.a.s.u.RandomMergePolicy RandomMergePolicy wrapping class org.apache.lucene.index.AlcoholicMergePolicy: [AlcoholicMergePolicy: minMergeSize=0, mergeFactor=10, maxMergeSize=936859710, maxMergeSizeForForcedMerge=9223372036854775807, calibrateSizeByDeletes=true, maxMergeDocs=2147483647, maxCFSSegmentSizeMB=8.796093022207999E12, noCFSRatio=0.1]
   [junit4]   2> 5011 INFO  (coreLoadExecutor-42-thread-1) [    x:collection1] o.a.s.c.SolrDeletionPolicy SolrDeletionPolicy.onCommit: commits: num=1
   [junit4]   2> 	commit{dir=MockDirectoryWrapper(RAMDirectory@70b5e54e lockFactory=org.apache.lucene.store.SingleInstanceLockFactory@11eb0a98),segFN=segments_1,generation=1}
   [junit4]   2> 5011 INFO  (coreLoadExecutor-42-thread-1) [    x:collection1] o.a.s.c.SolrDeletionPolicy newest commit generation = 1
   [junit4]   2> 5011 INFO  (OldIndexDirectoryCleanupThreadForCore-collection1) [    x:collection1] o.a.s.c.SolrCore Looking for old index directories to cleanup for core collection1 in /home/jenkins/workspace/Lucene-Solr-5.5-Linux/solr/build/solr-core/test/J0/temp/solr.handler.TestReplicationHandler_9C3778951B87EB73-001/solr-instance-002/./collection1/data/
   [junit4]   2> 5013 INFO  (coreLoadExecutor-42-thread-1) [    x:collection1] o.a.s.c.SolrCore no updateRequestProcessorChain defined as default, creating implicit default
   [junit4]   2> 5014 INFO  (coreLoadExecutor-42-thread-1) [    x:collection1] o.a.s.h.l.XMLLoader xsltCacheLifetimeSeconds=60
   [junit4]   2> 5015 INFO  (coreLoadExecutor-42-thread-1) [    x:collection1] o.a.s.h.l.XMLLoader xsltCacheLifetimeSeconds=60
   [junit4]   2> 5016 INFO  (coreLoadExecutor-42-thread-1) [    x:collection1] o.a.s.h.l.XMLLoader xsltCacheLifetimeSeconds=60
   [junit4]   2> 5017 INFO  (coreLoadExecutor-42-thread-1) [    x:collection1] o.a.s.h.l.XMLLoader xsltCacheLifetimeSeconds=60
   [junit4]   2> 5020 INFO  (coreLoadExecutor-42-thread-1) [    x:collection1] o.a.s.c.PluginBag requestHandler : 'lazy' created with startup=lazy 
   [junit4]   2> 5020 INFO  (coreLoadExecutor-42-thread-1) [    x:collection1] o.a.s.c.RequestHandlers Registered paths: /admin/mbeans,standard,lazy,/update/csv,/update/json/docs,/admin/luke,/admin/segments,/get,/admin/system,/replication,/admin/properties,defaults,/config,/schema,/admin/plugins,/admin/logging,/update/json,/admin/threads,/admin/ping,/update,/admin/file
   [junit4]   2> 5020 INFO  (coreLoadExecutor-42-thread-1) [    x:collection1] o.a.s.c.SolrCore Using default statsCache cache: org.apache.solr.search.stats.LocalStatsCache
   [junit4]   2> 5021 INFO  (coreLoadExecutor-42-thread-1) [    x:collection1] o.a.s.u.CommitTracker Hard AutoCommit: disabled
   [junit4]   2> 5022 INFO  (coreLoadExecutor-42-thread-1) [    x:collection1] o.a.s.u.CommitTracker Soft AutoCommit: disabled
   [junit4]   2> 5022 INFO  (coreLoadExecutor-42-thread-1) [    x:collection1] o.a.s.u.RandomMergePolicy RandomMergePolicy wrapping class org.apache.lucene.index.LogDocMergePolicy: [LogDocMergePolicy: minMergeSize=1000, mergeFactor=23, maxMergeSize=9223372036854775807, maxMergeSizeForForcedMerge=9223372036854775807, calibrateSizeByDeletes=true, maxMergeDocs=2147483647, maxCFSSegmentSizeMB=8.796093022207999E12, noCFSRatio=0.4349347009770239]
   [junit4]   2> 5022 INFO  (coreLoadExecutor-42-thread-1) [    x:collection1] o.a.s.c.SolrDeletionPolicy SolrDeletionPolicy.onInit: commits: num=1
   [junit4]   2> 	commit{dir=MockDirectoryWrapper(RAMDirectory@70b5e54e lockFactory=org.apache.lucene.store.SingleInstanceLockFactory@11eb0a98),segFN=segments_1,generation=1}
   [junit4]   2> 5022 INFO  (coreLoadExecutor-42-thread-1) [    x:collection1] o.a.s.c.SolrDeletionPolicy newest commit generation = 1
   [junit4]   2> 5023 INFO  (coreLoadExecutor-42-thread-1) [    x:collection1] o.a.s.s.SolrIndexSearcher Opening Searcher@155ed47[collection1] main
   [junit4]   2> 5023 INFO  (coreLoadExecutor-42-thread-1) [    x:collection1] o.a.s.r.ManagedResourceStorage File-based storage initialized to use dir: /home/jenkins/workspace/Lucene-Solr-5.5-Linux/solr/build/solr-core/test/J0/temp/solr.handler.TestReplicationHandler_9C3778951B87EB73-001/solr-instance-002/collection1/conf
   [junit4]   2> 5023 INFO  (coreLoadExecutor-42-thread-1) [    x:collection1] o.a.s.r.RestManager Initializing RestManager with initArgs: {storageDir=/home/jenkins/workspace/Lucene-Solr-5.5-Linux/solr/build/solr-core/test/J0/temp/solr.handler.TestReplicationHandler_9C3778951B87EB73-001/solr-instance-002/collection1/conf}
   [junit4]   2> 5023 INFO  (coreLoadExecutor-42-thread-1) [    x:collection1] o.a.s.r.ManagedResourceStorage Reading _rest_managed.json using file:dir=/home/jenkins/workspace/Lucene-Solr-5.5-Linux/solr/build/solr-core/test/J0/temp/solr.handler.TestReplicationHandler_9C3778951B87EB73-001/solr-instance-002/collection1/conf
   [junit4]   2> 5023 INFO  (coreLoadExecutor-42-thread-1) [    x:collection1] o.a.s.r.RestManager Initializing 0 registered ManagedResources
   [junit4]   2> 5033 INFO  (coreLoadExecutor-42-thread-1) [    x:collection1] o.a.s.h.ReplicationHandler Poll scheduled at an interval of 1000ms
   [junit4]   2> 5033 INFO  (searcherExecutor-43-thread-1-processing-x:collection1) [    x:collection1] o.a.s.c.SolrCore [collection1] Registered new searcher Searcher@155ed47[collection1] main{ExitableDirectoryReader(UninvertingDirectoryReader())}
   [junit4]   2> 5033 INFO  (coreLoadExecutor-42-thread-1) [    x:collection1] o.a.s.c.CoreContainer registering core: collection1
   [junit4]   2> 5043 INFO  (qtp1660982329-56) [    x:collection1] o.a.s.c.S.Request [collection1]  webapp=/solr path=/replication params={qt=/replication&wt=javabin&version=2&command=indexversion} status=0 QTime=0
   [junit4]   2> 5481 INFO  (TEST-TestReplicationHandler.doTestHandlerPathUnchanged-seed#[9C3778951B87EB73]) [    ] o.a.s.SolrTestCaseJ4 ###Ending doTestHandlerPathUnchanged
   [junit4]   2> 5484 INFO  (TEST-TestReplicationHandler.doTestHandlerPathUnchanged-seed#[9C3778951B87EB73]) [    ] o.e.j.s.ServerConnector Stopped ServerConnector@8764110{HTTP/1.1}{127.0.0.1:0}
   [junit4]   2> 5485 INFO  (TEST-TestReplicationHandler.doTestHandlerPathUnchanged-seed#[9C3778951B87EB73]) [    ] o.a.s.c.CoreContainer Shutting down CoreContainer instance=1942621576
   [junit4]   2> 5485 INFO  (coreCloseExecutor-48-thread-1) [    x:collection1] o.a.s.c.SolrCore [collection1]  CLOSING SolrCore org.apache.solr.core.SolrCore@687ea42
   [junit4]   2> 5485 INFO  (coreCloseExecutor-48-thread-1) [    x:collection1] o.a.s.u.DirectUpdateHandler2 closing DirectUpdateHandler2{commits=0,autocommits=0,soft autocommits=0,optimizes=0,rollbacks=0,expungeDeletes=0,docsPending=0,adds=0,deletesById=0,deletesByQuery=0,errors=0,cumulative_adds=0,cumulative_deletesById=0,cumulative_deletesByQuery=0,cumulative_errors=0}
   [junit4]   2> 5485 INFO  (coreCloseExecutor-48-thread-1) [    x:collection1] o.a.s.u.SolrCoreState Closing SolrCoreState
   [junit4]   2> 5486 INFO  (coreCloseExecutor-48-thread-1) [    x:collection1] o.a.s.u.DefaultSolrCoreState SolrCoreState ref count has reached 0 - closing IndexWriter
   [junit4]   2> 5486 INFO  (coreCloseExecutor-48-thread-1) [    x:collection1] o.a.s.u.DefaultSolrCoreState closing IndexWriter with IndexWriterCloser
   [junit4]   2> 5487 INFO  (coreCloseExecutor-48-thread-1) [    x:collection1] o.a.s.c.SolrCore [collection1] Closing main searcher on request.
   [junit4]   2> 5487 INFO  (coreCloseExecutor-48-thread-1) [    x:collection1] o.a.s.c.CachingDirectoryFactory Closing MockDirectoryFactory - 2 directories currently being tracked
   [junit4]   2> 5487 INFO  (coreCloseExecutor-48-thread-1) [    x:collection1] o.a.s.c.CachingDirectoryFactory looking to close /home/jenkins/workspace/Lucene-Solr-5.5-Linux/solr/build/solr-core/test/J0/temp/solr.handler.TestReplicationHandler_9C3778951B87EB73-001/solr-instance-001/./collection1/data [CachedDir<<refCount=0;path=/home/jenkins/workspace/Lucene-Solr-5.5-Linux/solr/build/solr-core/test/J0/temp/solr.handler.TestReplicationHandler_9C3778951B87EB73-001/solr-instance-001/./collection1/data;done=false>>]
   [junit4]   2> 5487 INFO  (coreCloseExecutor-48-thread-1) [    x:collection1] o.a.s.c.CachingDirectoryFactory Closing directory: /home/jenkins/workspace/Lucene-Solr-5.5-Linux/solr/build/solr-core/test/J0/temp/solr.handler.TestReplicationHandler_9C3778951B87EB73-001/solr-instance-001/./collection1/data
   [junit4]   2> 5487 INFO  (coreCloseExecutor-48-thread-1) [    x:collection1] o.a.s.c.CachingDirectoryFactory looking to close /home/jenkins/workspace/Lucene-Solr-5.5-Linux/solr/build/solr-core/test/J0/temp/solr.handler.TestReplicationHandler_9C3778951B87EB73-001/solr-instance-001/./collection1/data/index [CachedDir<<refCount=0;path=/home/jenkins/workspace/Lucene-Solr-5.5-Linux/solr/build/solr-core/test/J0/temp/solr.handler.TestReplicationHandler_9C3778951B87EB73-001/solr-instance-001/./collection1/data/index;done=false>>]
   [junit4]   2> 5487 INFO  (coreCloseExecutor-48-thread-1) [    x:collection1] o.a.s.c.CachingDirectoryFactory Closing directory: /home/jenkins/workspace/Lucene-Solr-5.5-Linux/solr/build/solr-core/test/J0/temp/solr.handler.TestReplicationHandler_9C3778951B87EB73-001/solr-instance-001/./collection1/data/index
   [junit4]   2> 5488 INFO  (TEST-TestReplicationHandler.doTestHandlerPathUnchanged-seed#[9C3778951B87EB73]) [    ] o.e.j.s.h.ContextHandler Stopped o.e.j.s.ServletContextHandler@5328cf96{/solr,null,UNAVAILABLE}
   [junit4]   2> 5489 INFO  (TEST-TestReplicationHandler.doTestHandlerPathUnchanged-seed#[9C3778951B87EB73]) [    ] o.e.j.s.ServerConnector Stopped ServerConnector@7fe33f4a{HTTP/1.1}{127.0.0.1:0}
   [junit4]   2> 5489 INFO  (TEST-TestReplicationHandler.doTestHandlerPathUnchanged-seed#[9C3778951B87EB73]) [    ] o.a.s.c.CoreContainer Shutting down CoreContainer instance=487851347
   [junit4]   2> 5489 INFO  (coreCloseExecutor-50-thread-1) [    x:collection1] o.a.s.c.SolrCore [collection1]  CLOSING SolrCore org.apache.solr.core.SolrCore@19a7db26
   [junit4]   2> 5490 INFO  (coreCloseExecutor-50-thread-1) [    x:collection1] o.a.s.u.DirectUpdateHandler2 closing DirectUpdateHandler2{commits=0,autocommits=0,soft autocommits=0,optimizes=0,rollbacks=0,expungeDeletes=0,docsPending=0,adds=0,deletesById=0,deletesByQuery=0,errors=0,cumulative_adds=0,cumulative_deletesById=0,cumulative_deletesByQuery=0,cumulative_errors=0}
   [junit4]   2> 5490 INFO  (coreCloseExecutor-50-thread-1) [    x:collection1] o.a.s.u.SolrCoreState Closing SolrCoreState
   [junit4]   2> 5490 INFO  (coreCloseExecutor-50-thread-1) [    x:collection1] o.a.s.u.DefaultSolrCoreState SolrCoreState ref count has reached 0 - closing IndexWriter
   [junit4]   2> 5490 INFO  (coreCloseExecutor-50-thread-1) [    x:collection1] o.a.s.u.DefaultSolrCoreState closing IndexWriter with IndexWriterCloser
   [junit4]   2> 5491 INFO  (coreCloseExecutor-50-thread-1) [    x:collection1] o.a.s.c.SolrCore [collection1] Closing main searcher on request.
   [junit4]   2> 5491 INFO  (coreCloseExecutor-50-thread-1) [    x:collection1] o.a.s.c.CachingDirectoryFactory Closing MockDirectoryFactory - 2 directories currently being tracked
   [junit4]   2> 5491 INFO  (coreCloseExecutor-50-thread-1) [    x:collection1] o.a.s.c.CachingDirectoryFactory looking to close /home/jenkins/workspace/Lucene-Solr-5.5-Linux/solr/build/solr-core/test/J0/temp/solr.handler.TestReplicationHandler_9C3778951B87EB73-001/solr-instance-002/./collection1/data [CachedDir<<refCount=0;path=/home/jenkins/workspace/Lucene-Solr-5.5-Linux/solr/build/solr-core/test/J0/temp/solr.handler.TestReplicationHandler_9C3778951B87EB73-001/solr-instance-002/./collection1/data;done=false>>]
   [junit4]   2> 5491 INFO  (coreCloseExecutor-50-thread-1) [    x:collection1] o.a.s.c.CachingDirectoryFactory Closing directory: /home/jenkins/workspace/Lucene-Solr-5.5-Linux/solr/build/solr-core/test/J0/temp/solr.handler.TestReplicationHandler_9C3778951B87EB73-001/solr-instance-002/./collection1/data
   [junit4]   2> 5491 INFO  (coreCloseExecutor-50-thread-1) [    x:collection1] o.a.s.c.CachingDirectoryFactory looking to close /home/jenkins/workspace/Lucene-Solr-5.5-Linux/solr/build/solr-core/test/J0/temp/solr.handler.TestReplicationHandler_9C3778951B87EB73-001/solr-instance-002/./collection1/data/index [CachedDir<<refCount=0;path=/home/jenkins/workspace/Lucene-Solr-5.5-Linux/solr/build/solr-core/test/J0/temp/solr.handler.TestReplicationHandler_9C3778951B87EB73-001/solr-instance-002/./collection1/data/index;done=false>>]
   [junit4]   2> 5491 INFO  (coreCloseExecutor-50-thread-1) [    x:collection1] o.a.s.c.CachingDirectoryFactory Closing directory: /home/jenkins/workspace/Lucene-Solr-5.5-Linux/solr/build/solr-core/test/J0/temp/solr.handler.TestReplicationHandler_9C3778951B87EB73-001/solr-instance-002/./collection1/data/index
   [junit4]   2> 5492 INFO  (TEST-TestReplicationHandler.doTestHandlerPathUnchanged-seed#[9C3778951B87EB73]) [    ] o.e.j.s.h.ContextHandler Stopped o.e.j.s.ServletContextHandler@29e74d0e{/solr,null,UNAVAILABLE}
   [junit4]   2> 5495 INFO  (TEST-TestReplicationHandler.doTestRepeater-seed#[9C3778951B87EB73]) [    ] o.a.s.SolrTestCaseJ4 ###Starting doTestRepeater
   [junit4]   2> 5496 INFO  (TEST-TestReplicationHandler.doTestRepeater-seed#[9C3778951B87EB73]) [    ] o.a.s.SolrTestCaseJ4 Writing core.properties file to /home/jenkins/workspace/Lucene-Solr-5.5-Linux/solr/build/solr-core/test/J0/temp/solr.handler.TestReplicationHandler_9C3778951B87EB73-001/solr-instance-003/collection1
   [junit4]   2> 5499 INFO  (TEST-TestReplicationHandler.doTestRepeater-seed#[9C3778951B87EB73]) [    ] o.e.j.s.Server jetty-9.2.13.v20150730
   [junit4]   2> 5500 INFO  (TEST-TestReplicationHandler.doTestRepeater-seed#[9C3778951B87EB73]) [    ] o.e.j.s.h.ContextHandler Started o.e.j.s.ServletContextHandler@2de6ad92{/solr,null,AVAILABLE}
   [junit4]   2> 5501 INFO  (TEST-TestReplicationHandler.doTestRepeater-seed#[9C3778951B87EB73]) [    ] o.e.j.s.ServerConnector Started ServerConnector@2c14bf5a{HTTP/1.1}{127.0.0.1:39631}
   [junit4]   2> 5501 INFO  (TEST-TestReplicationHandler.doTestRepeater-seed#[9C3778951B87EB73]) [    ] o.e.j.s.Server Started @7137ms
   [junit4]   2> 5501 INFO  (TEST-TestReplicationHandler.doTestRepeater-seed#[9C3778951B87EB73]) [    ] o.a.s.c.s.e.JettySolrRunner Jetty properties: {solr.data.dir=/home/jenkins/workspace/Lucene-Solr-5.5-Linux/solr/build/solr-core/test/J0/temp/solr.handler.TestReplicationHandler_9C3778951B87EB73-001/solr-instance-003/collection1/data, hostContext=/solr, hostPort=39631}
   [junit4]   2> 5501 INFO  (TEST-TestReplicationHandler.doTestRepeater-seed#[9C3778951B87EB73]) [    ] o.a.s.s.SolrDispatchFilter SolrDispatchFilter.init(): sun.misc.Launcher$AppClassLoader@73d16e93
   [junit4]   2> 5502 INFO  (TEST-TestReplicationHandler.doTestRepeater-seed#[9C3778951B87EB73]) [    ] o.a.s.c.SolrResourceLoader new SolrResourceLoader for directory: '/home/jenkins/workspace/Lucene-Solr-5.5-Linux/solr/build/solr-core/test/J0/temp/solr.handler.TestReplicationHandler_9C3778951B87EB73-001/solr-instance-003'
   [junit4]   2> 5502 INFO  (TEST-TestReplicationHandler.doTestRepeater-seed#[9C3778951B87EB73]) [    ] o.a.s.c.SolrResourceLoader JNDI not configured for solr (NoInitialContextEx)
   [junit4]   2> 5502 INFO  (TEST-TestReplicationHandler.doTestRepeater-seed#[9C3778951B87EB73]) [    ] o.a.s.c.SolrResourceLoader solr home defaulted to 'solr/' (could not find system property or JNDI)
   [junit4]   2> 5502 INFO  (TEST-TestReplicationHandler.doTestRepeater-seed#[9C3778951B87EB73]) [    ] o.a.s.c.SolrXmlConfig Loading container configuration from /home/jenkins/workspace/Lucene-Solr-5.5-Linux/solr/build/solr-core/test/J0/temp/solr.handler.TestReplicationHandler_9C3778951B87EB73-001/solr-instance-003/solr.xml
   [junit4]   2> 5512 INFO  (TEST-TestReplicationHandler.doTestRepeater-seed#[9C3778951B87EB73]) [    ] o.a.s.c.CorePropertiesLocator Config-defined core root directory: /home/jenkins/workspace/Lucene-Solr-5.5-Linux/solr/build/solr-core/test/J0/temp/solr.handler.TestReplicationHandler_9C3778951B87EB73-001/solr-instance-003/.
   [junit4]   2> 5513 INFO  (TEST-TestReplicationHandler.doTestRepeater-seed#[9C3778951B87EB73]) [    ] o.a.s.c.CoreContainer New CoreContainer 118670812
   [junit4]   2> 5513 INFO  (TEST-TestReplicationHandler.doTestRepeater-seed#[9C3778951B87EB73]) [    ] o.a.s.c.CoreContainer Loading cores into CoreContainer [instanceDir=/home/jenkins/workspace/Lucene-Solr-5.5-Linux/solr/build/solr-core/test/J0/temp/solr.handler.TestReplicationHandler_9C3778951B87EB73-001/solr-instance-003]
   [junit4]   2> 5513 WARN  (TEST-TestReplicationHandler.doTestRepeater-seed#[9C3778951B87EB73]) [    ] o.a.s.c.CoreContainer Couldn't add files from /home/jenkins/workspace/Lucene-Solr-5.5-Linux/solr/build/solr-core/test/J0/temp/solr.handler.TestReplicationHandler_9C3778951B87EB73-001/solr-instance-003/lib to classpath: /home/jenkins/workspace/Lucene-Solr-5.5-Linux/solr/build/solr-core/test/J0/temp/solr.handler.TestReplicationHandler_9C3778951B87EB73-001/solr-instance-003/lib
   [junit4]   2> 5513 INFO  (TEST-TestReplicationHandler.doTestRepeater-seed#[9C3778951B87EB73]) [    ] o.a.s.h.c.HttpShardHandlerFactory created with socketTimeout : 90000,urlScheme : ,connTimeout : 15000,maxConnectionsPerHost : 20,maxConnections : 10000,corePoolSize : 0,maximumPoolSize : 2147483647,maxThreadIdleTime : 5,sizeOfQueue : -1,fairnessPolicy : false,useRetries : false,connectionsEvictorSleepDelay : 5000,maxConnectionIdleTime : 40000,
   [junit4]   2> 5514 INFO  (TEST-TestReplicationHandler.doTestRepeater-seed#[9C3778951B87EB73]) [    ] o.a.s.u.UpdateShardHandler Creating UpdateShardHandler HTTP client with params: socketTimeout=340000&connTimeout=45000&retry=true
   [junit4]   2> 5515 INFO  (TEST-TestReplicationHandler.doTestRepeater-seed#[9C3778951B87EB73]) [    ] o.a.s.l.LogWatcher SLF4J impl is org.slf4j.impl.Log4jLoggerFactory
   [junit4]   2> 5515 INFO  (TEST-TestReplicationHandler.doTestRepeater-seed#[9C3778951B87EB73]) [    ] o.a.s.l.LogWatcher Registering Log Listener [Log4j (org.slf4j.impl.Log4jLoggerFactory)]
   [junit4]   2> 5515 INFO  (TEST-TestReplicationHandler.doTestRepeater-seed#[9C3778951B87EB73]) [    ] o.a.s.c.CoreContainer Security conf doesn't exist. Skipping setup for authorization module.
   [junit4]   2> 5515 INFO  (TEST-TestReplicationHandler.doTestRepeater-seed#[9C3778951B87EB73]) [    ] o.a.s.c.CoreContainer No authentication plugin used.
   [junit4]   2> 5515 INFO  (TEST-TestReplicationHandler.doTestRepeater-seed#[9C3778951B87EB73]) [    ] o.a.s.c.CorePropertiesLocator Looking for core definitions underneath /home/jenkins/workspace/Lucene-Solr-5.5-Linux/solr/build/solr-core/test/J0/temp/solr.handler.TestReplicationHandler_9C3778951B87EB73-001/solr-instance-003/.
   [junit4]   2> 5516 INFO  (TEST-TestReplicationHandler.doTestRepeater-seed#[9C3778951B87EB73]) [    ] o.a.s.c.CoreDescriptor Created CoreDescriptor: {name=collection1, config=solrconfig.xml, loadOnStartup=true, schema=schema.xml, configSetProperties=configsetprops.json, transient=false, dataDir=data/}
   [junit4]   2> 5516 INFO  (TEST-TestReplicationHandler.doTestRepeater-seed#[9C3778951B87EB73]) [    ] o.a.s.c.CorePropertiesLocator Found core collection1 in /home/jenkins/workspace/Lucene-Solr-5.5-Linux/solr/build/solr-core/test/J0/temp/solr.handler.TestReplicationHandler_9C3778951B87EB73-001/solr-instance-003/./collection1
   [junit4]   2> 5517 INFO  (TEST-TestReplicationHandler.doTestRepeater-seed#[9C3778951B87EB73]) [    ] o.a.s.c.CorePropertiesLocator Found 1 core definitions
   [junit4]   2> 5517 INFO  (TEST-TestReplicationHandler.doTestRepeater-seed#[9C3778951B87EB73]) [    ] o.a.s.s.SolrDispatchFilter user.dir=/home/jenkins/workspace/Lucene-Solr-5.5-Linux/solr/build/solr-core/test/J0
   [junit4]   2> 5517 INFO  (coreLoadExecutor-57-thread-1) [    ] o.a.s.c.SolrResourceLoader new SolrResourceLoader for directory: '/home/jenkins/workspace/Lucene-Solr-5.5-Linux/solr/build/solr-core/test/J0/temp/solr.handler.TestReplicationHandler_9C3778951B87EB73-001/solr-instance-003/collection1'
   [junit4]   2> 5517 INFO  (TEST-TestReplicationHandler.doTestRepeater-seed#[9C3778951B87EB73]) [    ] o.a.s.s.SolrDispatchFilter SolrDispatchFilter.init() done
   [junit4]   2> 5517 INFO  (coreLoadExecutor-57-thread-1) [    ] o.a.s.c.SolrResourceLoader JNDI not configured for solr (NoInitialContextEx)
   [junit4]   2> 5518 INFO  (coreLoadExecutor-57-thread-1) [    ] o.a.s.c.SolrResourceLoader solr home defaulted to 'solr/' (could not find system property or JNDI)
   [junit4]   2> 5531 INFO  (coreLoadExecutor-57-thread-1) [    ] o.a.s.c.SolrConfig current version of requestparams : -1
   [junit4]   2> 5536 INFO  (coreLoadExecutor-57-thread-1) [    ] o.a.s.c.SolrConfig Using Lucene MatchVersion: 5.5.3
   [junit4]   2> 5556 INFO  (coreLoadExecutor-57-thread-1) [    ] o.a.s.c.SolrConfig Loaded SolrConfig: solrconfig.xml
   [junit4]   2> 5561 INFO  (coreLoadExecutor-57-thread-1) [    ] o.a.s.s.IndexSchema [collection1] Schema name=test
   [junit4]   2> 5565 INFO  (coreLoadExecutor-57-thread-1) [    ] o.a.s.s.IndexSchema unique key field: id
   [junit4]   2> 5567 INFO  (coreLoadExecutor-57-thread-1) [    ] o.a.s.c.ConfigSetProperties Did not find ConfigSet properties, assuming default properties: Can't find resource 'configsetprops.json' in classpath or '/home/jenkins/workspace/Lucene-Solr-5.5-Linux/solr/build/solr-core/test/J0/temp/solr.handler.TestReplicationHandler_9C3778951B87EB73-001/solr-instance-003/collection1'
   [junit4]   2> 5568 INFO  (coreLoadExecutor-57-thread-1) [    ] o.a.s.c.CoreContainer Creating SolrCore 'collection1' using configuration from instancedir /home/jenkins/workspace/Lucene-Solr-5.5-Linux/solr/build/solr-core/test/J0/temp/solr.handler.TestReplicationHandler_9C3778951B87EB73-001/solr-instance-003/./collection1
   [junit4]   2> 5568 INFO  (coreLoadExecutor-57-thread-1) [    x:collection1] o.a.s.c.SolrCore org.apache.solr.core.MockDirectoryFactory
   [junit4]   2> 5568 INFO  (coreLoadExecutor-57-thread-1) [    x:collection1] o.a.s.c.SolrCore [[collection1] ] Opening new SolrCore at [/home/jenkins/workspace/Lucene-Solr-5.5-Linux/solr/build/solr-core/test/J0/temp/solr.handler.TestReplicationHandler_9C3778951B87EB73-001/solr-instance-003/collection1], dataDir=[/home/jenkins/workspace/Lucene-Solr-5.5-Linux/solr/build/solr-core/test/J0/temp/solr.handler.TestReplicationHandler_9C3778951B87EB73-001/solr-instance-003/./collection1/data/]
   [junit4]   2> 5568 INFO  (coreLoadExecutor-57-thread-1) [    x:collection1] o.a.s.c.SolrCore JMX monitoring not detected for core: collection1
   [junit4]   2> 5569 INFO  (coreLoadExecutor-57-thread-1) [    x:collection1] o.a.s.c.CachingDirectoryFactory return new directory for /home/jenkins/workspace/Lucene-Solr-5.5-Linux/solr/build/solr-core/test/J0/temp/solr.handler.TestReplicationHandler_9C3778951B87EB73-001/solr-instance-003/./collection1/data
   [junit4]   2> 5569 INFO  (coreLoadExecutor-57-thread-1) [    x:collection1] o.a.s.c.SolrCore New index directory detected: old=null new=/home/jenkins/workspace/Lucene-Solr-5.5-Linux/solr/build/solr-core/test/J0/temp/solr.handler.TestReplicationHandler_9C3778951B87EB73-001/solr-instance-003/./collection1/data/index/
   [junit4]   2> 5569 WARN  (coreLoadExecutor-57-thread-1) [    x:collection1] o.a.s.c.SolrCore [collection1] Solr index directory '/home/jenkins/workspace/Lucene-Solr-5.5-Linux/solr/build/solr-core/test/J0/temp/solr.handler.TestReplicationHandler_9C3778951B87EB73-001/solr-instance-003/./collection1/data/index' doesn't exist. Creating new index...
   [junit4]   2> 5569 INFO  (coreLoadExecutor-57-thread-1) [    x:collection1] o.a.s.c.CachingDirectoryFactory return new directory for /home/jenkins/workspace/Lucene-Solr-5.5-Linux/solr/build/solr-core/test/J0/temp/solr.handler.TestReplicationHandler_9C3778951B87EB73-001/solr-instance-003/./collection1/data/index
   [junit4]   2> 5571 INFO  (coreLoadExecutor-57-thread-1) [    x:collection1] o.a.s.u.RandomMergePolicy RandomMergePolicy wrapping class org.apache.lucene.index.AlcoholicMergePolicy: [AlcoholicMergePolicy: minMergeSize=0, mergeFactor=10, maxMergeSize=936859710, maxMergeSizeForForcedMerge=9223372036854775807, calibrateSizeByDeletes=true, maxMergeDocs=2147483647, maxCFSSegmentSizeMB=8.796093022207999E12, noCFSRatio=0.1]
   [junit4]   2> 5572 INFO  (coreLoadExecutor-57-thread-1) [    x:collection1] o.a.s.c.SolrDeletionPolicy SolrDeletionPolicy.onCommit: commits: num=1
   [junit4]   2> 	commit{dir=MockDirectoryWrapper(RAMDirectory@6c0a177b lockFactory=org.apache.lucene.store.SingleInstanceLockFactory@f73be9f),segFN=segments_1,generation=1}
   [junit4]   2> 5572 INFO  (coreLoadExecutor-57-thread-1) [    x:collection1] o.a.s.c.SolrDeletionPolicy newest commit generation = 1
   [junit4]   2> 5572 INFO  (OldIndexDirectoryCleanupThreadForCore-collection1) [    x:collection1] o.a.s.c.SolrCore Looking for old index directories to cleanup for core collection1 in /home/jenkins/workspace/Lucene-Solr-5.5-Linux/solr/build/solr-core/test/J0/temp/solr.handler.TestReplicationHandler_9C3778951B87EB73-001/solr-instance-003/./collection1/data/
   [junit4]   2> 5574 INFO  (coreLoadExecutor-57-thread-1) [    x:collection1] o.a.s.c.SolrCore no updateRequestProcessorChain defined as default, creating implicit default
   [junit4]   2> 5576 INFO  (coreLoadExecutor-57-thread-1) [    x:collection1] o.a.s.h.l.XMLLoader xsltCacheLifetimeSeconds=60
   [junit4]   2> 5577 INFO  (coreLoadExecutor-57-thread-1) [    x:collection1] o.a.s.h.l.XMLLoader xsltCacheLifetimeSeconds=60
   [junit4]   2> 5578 INFO  (coreLoadExecutor-57-thread-1) [    x:collection1] o.a.s.h.l.XMLLoader xsltCacheLifetimeSeconds=60
   [junit4]   2> 5579 INFO  (coreLoadExecutor-57-thread-1) [    x:collection1] o.a.s.h.l.XMLLoader xsltCacheLifetimeSeconds=60
   [junit4]   2> 5581 INFO  (coreLoadExecutor-57-thread-1) [    x:collection1] o.a.s.c.PluginBag requestHandler : 'lazy' created with startup=lazy 
   [junit4]   2> 5581 INFO  (coreLoadExecutor-57-thread-1) [    x:collection1] o.a.s.c.RequestHandlers Registered paths: /admin/mbeans,standard,lazy,/update/csv,/update/json/docs,/admin/luke,/admin/segments,/get,/admin/system,/replication,/admin/properties,defaults,/config,/schema,/admin/plugins,/admin/logging,/update/json,/admin/threads,/admin/ping,/update,/admin/file
   [junit4]   2> 5581 INFO  (coreLoadExecutor-57-thread-1) [    x:collection1] o.a.s.c.SolrCore Using default statsCache cache: org.apache.solr.search.stats.LocalStatsCache
   [junit4]   2> 5582 INFO  (coreLoadExecutor-57-thread-1) [    x:collection1] o.a.s.u.CommitTracker Hard AutoCommit: disabled
   [junit4]   2> 5582 INFO  (coreLoadExecutor-57-thread-1) [    x:collection1] o.a.s.u.CommitTracker Soft AutoCommit: disabled
   [junit4]   2> 5583 INFO  (coreLoadExecutor-57-thread-1) [    x:collection1] o.a.s.u.RandomMergePolicy RandomMergePolicy wrapping class org.apache.lucene.index.LogDocMergePolicy: [LogDocMergePolicy: minMergeSize=1000, mergeFactor=23, maxMergeSize=9223372036854775807, maxMergeSizeForForcedMerge=9223372036854775807, calibrateSizeByDeletes=true, maxMergeDocs=2147483647, maxCFSSegmentSizeMB=8.796093022207999E12, noCFSRatio=0.4349347009770239]
   [junit4]   2> 5583 INFO  (coreLoadExecutor-57-thread-1) [    x:collection1] o.a.s.c.SolrDeletionPolicy SolrDeletionPolicy.onInit: commits: num=1
   [junit4]   2> 	commit{dir=MockDirectoryWrapper(RAMDirectory@6c0a177b lockFactory=org.apache.lucene.store.SingleInstanceLockFactory@f73be9f),segFN=segments_1,generation=1}
   [junit4]   2> 5583 INFO  (coreLoadExecutor-57-thread-1) [    x:collection1] o.a.s.c.SolrDeletionPolicy newest commit generation = 1
   [junit4]   2> 5584 INFO  (coreLoadExecutor-57-thread-1) [    x:collection1] o.a.s.s.SolrIndexSearcher Opening Searcher@6a637845[collection1] main
   [junit4]   2> 5584 INFO  (coreLoadExecutor-57-thread-1) [    x:collection1] o.a.s.r.ManagedResourceStorage File-based storage initialized to use dir: /home/jenkins/workspace/Lucene-Solr-5.5-Linux/solr/build/solr-core/test/J0/temp/solr.handler.TestReplicationHandler_9C3778951B87EB73-001/solr-instance-003/collection1/conf
   [junit4]   2> 5584 INFO  (coreLoadExecutor-57-thread-1) [    x:collection1] o.a.s.r.RestManager Initializing RestManager with initArgs: {storageDir=/home/jenkins/workspace/Lucene-Solr-5.5-Linux/solr/build/solr-core/test/J0/temp/solr.handler.TestReplicationHandler_9C3778951B87EB73-001/solr-instance-003/collection1/conf}
   [junit4]   2> 5584 INFO  (coreLoadExecutor-57-thread-1) [    x:collection1] o.a.s.r.ManagedResourceStorage Reading _rest_managed.json using file:dir=/home/jenkins/workspace/Lucene-Solr-5.5-Linux/solr/build/solr-core/test/J0/temp/solr.handler.TestReplicationHandler_9C3778951B87EB73-001/solr-instance-003/collection1/conf
   [junit4]   2> 5584 INFO  (coreLoadExecutor-57-thread-1) [    x:collection1] o.a.s.r.RestManager Initializing 0 registered ManagedResources
   [junit4]   2> 5584 INFO  (coreLoadExecutor-57-thread-1) [    x:collection1] o.a.s.h.ReplicationHandler Replication enabled for following config files: schema.xml,xslt/dummy.xsl
   [junit4]   2> 5584 INFO  (coreLoadExecutor-57-thread-1) [    x:collection1] o.a.s.h.ReplicationHandler Commits will be reserved for  10000
   [junit4]   2> 5585 INFO  (coreLoadExecutor-57-thread-1) [    x:collection1] o.a.s.c.CoreContainer registering core: collection1
   [junit4]   2> 5585 INFO  (searcherExecutor-58-thread-1-processing-x:collection1) [    x:collection1] o.a.s.c.SolrCore [collection1] Registered new searcher Searcher@6a637845[collection1] main{ExitableDirectoryReader(UninvertingDirectoryReader())}
   [junit4]   2> 6019 INFO  (TEST-TestReplicationHandler.doTestRepeater-seed#[9C3778951B87EB73]) [    ] o.a.s.SolrTestCaseJ4 Writing core.properties file to /home/jenkins/workspace/Lucene-Solr-5.5-Linux/solr/build/solr-core/test/J0/temp/solr.handler.TestReplicationHandler_9C3778951B87EB73-001/solr-instance-004/collection1
   [junit4]   2> 6022 INFO  (TEST-TestReplicationHandler.doTestRepeater-seed#[9C3778951B87EB73]) [    ] o.e.j.s.Server jetty-9.2.13.v20150730
   [junit4]   2> 6024 INFO  (TEST-TestReplicationHandler.doTestRepeater-seed#[9C3778951B87EB73]) [    ] o.e.j.s.h.ContextHandler Started o.e.j.s.ServletContextHandler@58a58f32{/solr,null,AVAILABLE}
   [junit4]   2> 6024 INFO  (TEST-TestReplicationHandler.doTestRepeater-seed#[9C3778951B87EB73]) [    ] o.e.j.s.ServerConnector Started ServerConnector@394a7b51{HTTP/1.1}{127.0.0.1:38287}
   [junit4]   2> 6024 INFO  (TEST-TestReplicationHandler.doTestRepeater-seed#[9C3778951B87EB73]) [    ] o.e.j.s.Server Started @7660ms
   [junit4]   2> 6024 INFO  (TEST-TestReplicationHandler.doTestRepeater-seed#[9C3778951B87EB73]) [    ] o.a.s.c.s.e.JettySolrRunner Jetty properties: {solr.data.dir=/home/jenkins/workspace/Lucene-Solr-5.5-Linux/solr/build/solr-core/test/J0/temp/solr.handler.TestReplicationHandler_9C3778951B87EB73-001/solr-instance-004/collection1/data, hostContext=/solr, hostPort=38287}
   [junit4]   2> 6025 INFO  (TEST-TestReplicationHandler.doTestRepeater-seed#[9C3778951B87EB73]) [    ] o.a.s.s.SolrDispatchFilter SolrDispatchFilter.init(): sun.misc.Launcher$AppClassLoader@73d16e93
   [junit4]   2> 6025 INFO  (TEST-TestReplicationHandler.doTestRepeater-seed#[9C3778951B87EB73]) [    ] o.a.s.c.SolrResourceLoader new SolrResourceLoader for directory: '/home/jenkins/workspace/Lucene-Solr-5.5-Linux/solr/build/solr-core/test/J0/temp/solr.handler.TestReplicationHandler_9C3778951B87EB73-001/solr-instance-004'
   [junit4]   2> 6025 INFO  (TEST-TestReplicationHandler.doTestRepeater-seed#[9C3778951B87EB73]) [    ] o.a.s.c.SolrResourceLoader JNDI not configured for solr (NoInitialContextEx)
   [junit4]   2> 6025 INFO  (TEST-TestReplicationHandler.doTestRepeater-seed#[9C3778951B87EB73]) [    ] o.a.s.c.SolrResourceLoader solr home defaulted to 'solr/' (could not find system property or JNDI)
   [junit4]   2> 6026 INFO  (TEST-TestReplicationHandler.doTestRepeater-seed#[9C3778951B87EB73]) [    ] o.a.s.c.SolrXmlConfig Loading container configuration from /home/jenkins/workspace/Lucene-Solr-5.5-Linux/solr/build/solr-core/test/J0/temp/solr.handler.TestReplicationHandler_9C3778951B87EB73-001/solr-instance-004/solr.xml
   [junit4]   2> 6033 INFO  (TEST-TestReplicationHandler.doTestRepeater-seed#[9C3778951B87EB73]) [    ] o.a.s.c.CorePropertiesLocator Config-defined core root directory: /home/jenkins/workspace/Lucene-Solr-5.5-Linux/solr/build/solr-core/test/J0/temp/solr.handler.TestReplicationHandler_9C3778951B87EB73-001/solr-instance-004/.
   [junit4]   2> 6033 INFO  (TEST-TestReplicationHandler.doTestRepeater-seed#[9C3778951B87EB73]) [    ] o.a.s.c.CoreContainer New CoreContainer 791220280
   [junit4]   2> 6033 INFO  (TEST-TestReplicationHandler.doTestRepeater-seed#[9C3778951B87EB73]) [    ] o.a.s.c.CoreContainer Loading cores into CoreContainer [instanceDir=/home/jenkins/workspace/Lucene-Solr-5.5-Linux/solr/build/solr-core/test/J0/temp/solr.handler.TestReplicationHandler_9C3778951B87EB73-001/solr-instance-004]
   [junit4]   2> 6034 WARN  (TEST-TestReplicationHandler.doTestRepeater-seed#[9C3778951B87EB73]) [    ] o.a.s.c.CoreContainer Couldn't add files from /home/jenkins/workspace/Lucene-Solr-5.5-Linux/solr/build/solr-core/test/J0/temp/solr.handler.TestReplicationHandler_9C3778951B87EB73-001/solr-instance-004/lib to classpath: /home/jenkins/workspace/Lucene-Solr-5.5-Linux/solr/build/solr-core/test/J0/temp/solr.handler.TestReplicationHandler_9C3778951B87EB73-001/solr-instance-004/lib
   [junit4]   2> 6034 INFO  (TEST-TestReplicationHandler.doTestRepeater-seed#[9C3778951B87EB73]) [    ] o.a.s.h.c.HttpShardHandlerFactory created with socketTimeout : 90000,urlScheme : ,connTimeout : 15000,maxConnectionsPerHost : 20,maxConnections : 10000,corePoolSize : 0,maximumPoolSize : 2147483647,maxThreadIdleTime : 5,sizeOfQueue : -1,fairnessPolicy : false,useRetries : false,connectionsEvictorSleepDelay : 5000,maxConnectionIdleTime : 40000,
   [junit4]   2> 6035 INFO  (TEST-TestReplicationHandler.doTestRepeater-seed#[9C3778951B87EB73]) [    ] o.a.s.u.UpdateShardHandler Creating UpdateShardHandler HTTP client with params: socketTimeout=340000&connTimeout=45000&retry=true
   [junit4]   2> 6036 INFO  (TEST-TestReplicationHandler.doTestRepeater-seed#[9C3778951B87EB73]) [    ] o.a.s.l.LogWatcher SLF4J impl is org.slf4j.impl.Log4jLoggerFactory
   [junit4]   2> 6036 INFO  (TEST-TestReplicationHandler.doTestRepeater-seed#[9C3778951B87EB73]) [    ] o.a.s.l.LogWatcher Registering Log Listener [Log4j (org.slf4j.impl.Log4jLoggerFactory)]
   [junit4]   2> 6036 INFO  (TEST-TestReplicationHandler.doTestRepeater-seed#[9C3778951B87EB73]) [    ] o.a.s.c.CoreContainer Security conf doesn't exist. Skipping setup for authorization module.
   [junit4]   2> 6036 INFO  (TEST-TestReplicationHandler.doTestRepeater-seed#[9C3778951B87EB73]) [    ] o.a.s.c.CoreContainer No authentication plugin used.
   [junit4]   2> 6036 INFO  (TEST-TestReplicationHandler.doTestRepeater-seed#[9C3778951B87EB73]) [    ] o.a.s.c.CorePropertiesLocator Looking for core definitions underneath /home/jenkins/workspace/Lucene-Solr-5.5-Linux/solr/build/solr-core/test/J0/temp/solr.handler.TestReplicationHandler_9C3778951B87EB73-001/solr-instance-004/.
   [junit4]   2> 6039 INFO  (TEST-TestReplicationHandler.doTestRepeater-seed#[9C3778951B87EB73]) [    ] o.a.s.c.CoreDescriptor Created CoreDescriptor: {name=collection1, config=solrconfig.xml, loadOnStartup=true, schema=schema.xml, configSetProperties=configsetprops.json, transient=false, dataDir=data/}
   [junit4]   2> 6039 INFO  (TEST-TestReplicationHandler.doTestRepeater-seed#[9C3778951B87EB73]) [    ] o.a.s.c.CorePropertiesLocator Found core collection1 in /home/jenkins/workspace/Lucene-Solr-5.5-Linux/solr/build/solr-core/test/J0/temp/solr.handler.TestReplicationHandler_9C3778951B87EB73-001/solr-instance-004/./collection1
   [junit4]   2> 6039 INFO  (TEST-TestReplicationHandler.doTestRepeater-seed#[9C3778951B87EB73]) [    ] o.a.s.c.CorePropertiesLocator Found 1 core definitions
   [junit4]   2> 6039 INFO  (coreLoadExecutor-67-thread-1) [    ] o.a.s.c.SolrResourceLoader new SolrResourceLoader for directory: '/home/jenkins/workspace/Lucene-Solr-5.5-Linux/solr/build/solr-core/test/J0/temp/solr.handler.TestReplicationHandler_9C3778951B87EB73-001/solr-instance-004/collection1'
   [junit4]   2> 6040 INFO  (coreLoadExecutor-67-thread-1) [    ] o.a.s.c.SolrResourceLoader JNDI not configured for solr (NoInitialContextEx)
   [junit4]   2> 6040 INFO  (coreLoadExecutor-67-thread-1) [    ] o.a.s.c.SolrResourceLoader solr home defaulted to 'solr/' (could not find system property or JNDI)
   [junit4]   2> 6041 INFO  (TEST-TestReplicationHandler.doTestRepeater-seed#[9C3778951B87EB73]) [    ] o.a.s.s.SolrDispatchFilter user.dir=/home/jenkins/workspace/Lucene-Solr-5.5-Linux/solr/build/solr-core/test/J0
   [junit4]   2> 6041 INFO  (TEST-TestReplicationHandler.doTestRepeater-seed#[9C3778951B87EB73]) [    ] o.a.s.s.SolrDispatchFilter SolrDispatchFilter.init() done
   [junit4]   2> 6046 INFO  (coreLoadExecutor-67-thread-1) [    ] o.a.s.c.SolrConfig current version of requestparams : -1
   [junit4]   2> 6049 INFO  (coreLoadExecutor-67-thread-1) [    ] o.a.s.c.SolrConfig Using Lucene MatchVersion: 5.5.3
   [junit4]   2> 6057 INFO  (coreLoadExecutor-67-thread-1) [    ] o.a.s.c.SolrConfig Loaded SolrConfig: solrconfig.xml
   [junit4]   2> 6060 INFO  (coreLoadExecutor-67-thread-1) [    ] o.a.s.s.IndexSchema [collection1] Schema name=test
   [junit4]   2> 6064 INFO  (coreLoadExecutor-67-thread-1) [    ] o.a.s.s.IndexSchema unique key field: id
   [junit4]   2> 6064 INFO  (coreLoadExecutor-67-thread-1) [    ] o.a.s.c.ConfigSetProperties Did not find ConfigSet properties, assuming default properties: Can't find resource 'configsetprops.json' in classpath or '/home/jenkins/workspace/Lucene-Solr-5.5-Linux/solr/build/solr-core/test/J0/temp/solr.handler.TestReplicationHandler_9C3778951B87EB73-001/solr-instance-004/collection1'
   [junit4]   2> 6065 INFO  (coreLoadExecutor-67-thread-1) [    ] o.a.s.c.CoreContainer Creating SolrCore 'collection1' using configuration from instancedir /home/jenkins/workspace/Lucene-Solr-5.5-Linux/solr/build/solr-core/test/J0/temp/solr.handler.TestReplicationHandler_9C3778951B87EB73-001/solr-instance-004/./collection1
   [junit4]   2> 6065 INFO  (coreLoadExecutor-67-thread-1) [    x:collection1] o.a.s.c.SolrCore org.apache.solr.core.MockDirectoryFactory
   [junit4]   2> 6065 INFO  (coreLoadExecutor-67-thread-1) [    x:collection1] o.a.s.c.SolrCore [[collection1] ] Opening new SolrCore at [/home/jenkins/workspace/Lucene-Solr-5.5-Linux/solr/build/solr-core/test/J0/temp/solr.handler.TestReplicationHandler_9C3778951B87EB73-001/solr-instance-004/collection1], dataDir=[/home/jenkins/workspace/Lucene-Solr-5.5-Linux/solr/build/solr-core/test/J0/temp/solr.handler.TestReplicationHandler_9C3778951B87EB73-001/solr-instance-004/./collection1/data/]
   [junit4]   2> 6065 INFO  (coreLoadExecutor-67-thread-1) [    x:collection1] o.a.s.c.SolrCore JMX monitoring not detected for core: collection1
   [junit4]   2> 6065 INFO  (coreLoadExecutor-67-thread-1) [    x:collection1] o.a.s.c.CachingDirectoryFactory return new directory for /home/jenkins/workspace/Lucene-Solr-5.5-Linux/solr/build/solr-core/test/J0/temp/solr.handler.TestReplicationHandler_9C3778951B87EB73-001/solr-instance-004/./collection1/data
   [junit4]   2> 6065 INFO  (coreLoadExecutor-67-thread-1) [    x:collection1] o.a.s.c.SolrCore New index directory detected: old=null new=/home/jenkins/workspace/Lucene-Solr-5.5-Linux/solr/build/solr-core/test/J0/temp/solr.handler.TestReplicationHandler_9C3778951B87EB73-001/solr-instance-004/./collection1/data/index/
   [junit4]   2> 6065 WARN  (coreLoadExecutor-67-thread-1) [    x:collection1] o.a.s.c.SolrCore [collection1] Solr index directory '/home/jenkins/workspace/Lucene-Solr-5.5-Linux/solr/build/solr-core/test/J0/temp/solr.handler.TestReplicationHandler_9C3778951B87EB73-001/solr-instance-004/./collection1/data/index' doesn't exist. Creating new index...
   [junit4]   2> 6066 INFO  (coreLoadExecutor-67-thread-1) [    x:collection1] o.a.s.c.CachingDirectoryFactory return new directory for /home/jenkins/workspace/Lucene-Solr-5.5-Linux/solr/build/solr-core/test/J0/temp/solr.handler.TestReplicationHandler_9C3778951B87EB73-001/solr-instance-004/./collection1/data/index
   [junit4]   2> 6066 INFO  (coreLoadExecutor-67-thread-1) [    x:collection1] o.a.s.u.RandomMergePolicy RandomMergePolicy wrapping class org.apache.lucene.index.AlcoholicMergePolicy: [AlcoholicMergePolicy: minMergeSize=0, mergeFactor=10, maxMergeSize=936859710, maxMergeSizeForForcedMerge=9223372036854775807, calibrateSizeByDeletes=true, maxMergeDocs=2147483647, maxCFSSegmentSizeMB=8.796093022207999E12, noCFSRatio=0.1]
   [junit4]   2> 6067 INFO  (coreLoadExecutor-67-thread-1) [    x:collection1] o.a.s.c.SolrDeletionPolicy SolrDeletionPolicy.onCommit: commits: num=1
   [junit4]   2> 	commit{dir=MockDirectoryWrapper(RAMDirectory@5834b01 lockFactory=org.apache.lucene.store.SingleInstanceLockFactory@50b8f52e),segFN=segments_1,generation=1}
   [junit4]   2> 6067 INFO  (coreLoadExecutor-67-thread-1) [    x:collection1] o.a.s.c.SolrDeletionPolicy newest commit generation = 1
   [junit4]   2> 6067 INFO  (OldIndexDirectoryCleanupThreadForCore-collection1) [    x:collection1] o.a.s.c.SolrCore Looking for old index directories to cleanup for core collection1 in /home/jenkins/workspace/Lucene-Solr-5.5-Linux/solr/build/solr-core/test/J0/temp/solr.handler.TestReplicationHandler_9C3778951B87EB73-001/solr-instance-004/./collection1/data/
   [junit4]   2> 6069 INFO  (coreLoadExecutor-67-thread-1) [    x:collection1] o.a.s.c.SolrCore no updateRequestProcessorChain defined as default, creating implicit default
   [junit4]   2> 6070 INFO  (coreLoadExecutor-67-thread-1) [    x:collection1] o.a.s.h.l.XMLLoader xsltCacheLifetimeSeconds=60
   [junit4]   2> 6071 INFO  (coreLoadExecutor-67-thread-1) [    x:collection1] o.a.s.h.l.XMLLoader xsltCacheLifetimeSeconds=60
   [junit4]   2> 6072 INFO  (coreLoadExecutor-67-thread-1) [    x:collection1] o.a.s.h.l.XMLLoader xsltCacheLifetimeSeconds=60
   [junit4]   2> 6073 INFO  (coreLoadExecutor-67-thread-1) [    x:collection1] o.a.s.h.l.XMLLoader xsltCacheLifetimeSeconds=60
   [junit4]   2> 6075 INFO  (coreLoadExecutor-67-thread-1) [    x:collection1] o.a.s.c.PluginBag requestHandler : 'lazy' created with startup=lazy 
   [junit4]   2> 6075 INFO  (coreLoadExecutor-67-thread-1) [    x:collection1] o.a.s.c.RequestHandlers Registered paths: /admin/mbeans,standard,lazy,/update/csv,/update/json/docs,/admin/luke,/admin/segments,/get,/admin/system,/replication,/admin/properties,defaults,/config,/schema,/admin/plugins,/admin/logging,/update/json,/admin/threads,/admin/ping,/update,/admin/file
   [junit4]   2> 6076 INFO  (coreLoadExecutor-67-thread-1) [    x:collection1] o.a.s.c.SolrCore Using default statsCache cache: org.apache.solr.search.stats.LocalStatsCache
   [junit4]   2> 6076 INFO  (coreLoadExecutor-67-thread-1) [    x:collection1] o.a.s.u.CommitTracker Hard AutoCommit: disabled
   [junit4]   2> 6076 INFO  (coreLoadExecutor-67-thread-1) [    x:collection1] o.a.s.u.CommitTracker Soft AutoCommit: disabled
   [junit4]   2> 6076 INFO  (coreLoadExecutor-67-thread-1) [    x:collection1] o.a.s.u.RandomMergePolicy RandomMergePolicy wrapping class org.apache.lucene.index.LogDocMergePolicy: [LogDocMergePolicy: minMergeSize=1000, mergeFactor=23, maxMergeSize=9223372036854775807, maxMergeSizeForForcedMerge=9223372036854775807, calibrateSizeByDeletes=true, maxMergeDocs=2147483647, maxCFSSegmentSizeMB=8.796093022207999E12, noCFSRatio=0.4349347009770239]
   [junit4]   2> 6077 INFO  (coreLoadExecutor-67-thread-1) [    x:collection1] o.a.s.c.SolrDeletionPolicy SolrDeletionPolicy.onInit: commits: num=1
   [junit4]   2> 	commit{dir=MockDirectoryWrapper(RAMDirectory@5834b01 lockFactory=org.apache.lucene.store.SingleInstanceLockFactory@50b8f52e),segFN=segments_1,generation=1}
   [junit4]   2> 6077 INFO  (coreLoadExecutor-67-thread-1) [    x:collection1] o.a.s.c.SolrDeletionPolicy newest commit generation = 1
   [junit4]   2> 6077 INFO  (coreLoadExecutor-67-thread-1) [    x:collection1] o.a.s.s.SolrIndexSearcher Opening Searcher@2ede1e00[collection1] main
   [junit4]   2> 6077 INFO  (coreLoadExecutor-67-thread-1) [    x:collection1] o.a.s.r.ManagedResourceStorage File-based storage initialized to use dir: /home/jenkins/workspace/Lucene-Solr-5.5-Linux/solr/build/solr-core/test/J0/temp/solr.handler.TestReplicationHandler_9C3778951B87EB73-001/solr-instance-004/collection1/conf
   [junit4]   2> 6077 INFO  (coreLoadExecutor-67-thread-1) [    x:collection1] o.a.s.r.RestManager Initializing RestManager with initArgs: {storageDir=/home/jenkins/workspace/Lucene-Solr-5.5-Linux/solr/build/solr-core/test/J0/temp/solr.handler.TestReplicationHandler_9C3778951B87EB73-001/solr-instance-004/collection1/conf}
   [junit4]   2> 6077 INFO  (coreLoadExecutor-67-thread-1) [    x:collection1] o.a.s.r.ManagedResourceStorage Reading _rest_managed.json using file:dir=/home/jenkins/workspace/Lucene-Solr-5.5-Linux/solr/build/solr-core/test/J0/temp/solr.handler.TestReplicationHandler_9C3778951B87EB73-001/solr-instance-004/collection1/conf
   [junit4]   2> 6077 INFO  (coreLoadExecutor-67-thread-1) [    x:collection1] o.a.s.r.RestManager Initializing 0 registered ManagedResources
   [junit4]   2> 6078 INFO  (coreLoadExecutor-67-thread-1) [    x:collection1] o.a.s.h.ReplicationHandler Poll scheduled at an interval of 1000ms
   [junit4]   2> 6079 INFO  (searcherExecutor-68-thread-1-processing-x:collection1) [    x:collection1] o.a.s.c.SolrCore [collection1] Registered new searcher Searcher@2ede1e00[collection1] main{ExitableDirectoryReader(UninvertingDirectoryReader())}
   [junit4]   2> 6079 INFO  (coreLoadExecutor-67-thread-1) [    x:collection1] o.a.s.c.CoreContainer registering core: collection1
   [junit4]   2> 6083 INFO  (qtp297000017-101) [    x:collection1] o.a.s.c.S.Request [collection1]  webapp=/solr path=/replication params={qt=/replication&wt=javabin&version=2&command=indexversion} status=0 QTime=0
   [junit4]   2> 6562 INFO  (TEST-TestReplicationHandler.doTestRepeater-seed#[9C3778951B87EB73]) [    ] o.e.j.s.ServerConnector Stopped ServerConnector@394a7b51{HTTP/1.1}{127.0.0.1:0}
   [junit4]   2> 6562 INFO  (TEST-TestReplicationHandler.doTestRepeater-seed#[9C3778951B87EB73]) [    ] o.a.s.c.CoreContainer Shutting down CoreContainer instance=791220280
   [junit4]   2> 6564 INFO  (coreCloseExecutor-73-thread-1) [    x:collection1] o.a.s.c.SolrCore [collection1]  CLOSING SolrCore org.apache.solr.core.SolrCore@753724ff
   [junit4]   2> 6564 INFO  (coreCloseExecutor-73-thread-1) [    x:collection1] o.a.s.u.DirectUpdateHandler2 closing DirectUpdateHandler2{commits=0,autocommits=0,soft autocommits=0,optimizes=0,rollbacks=0,expungeDeletes=0,docsPending=0,adds=0,deletesById=0,deletesByQuery=0,errors=0,cumulative_adds=0,cumulative_deletesById=0,cumulative_deletesByQuery=0,cumulative_errors=0}
   [junit4]   2> 6564 INFO  (coreCloseExecutor-73-thread-1) [    x:collection1] o.a.s.u.SolrCoreState Closing SolrCoreState
   [junit4]   2> 6564 INFO  (coreCloseExecutor-73-thread-1) [    x:collection1] o.a.s.u.DefaultSolrCoreState SolrCoreState ref count has reached 0 - closing IndexWriter
   [junit4]   2> 6564 INFO  (coreCloseExecutor-73-thread-1) [    x:collection1] o.a.s.u.DefaultSolrCoreState closing IndexWriter with IndexWriterCloser
   [junit4]   2> 6565 INFO  (coreCloseExecutor-73-thread-1) [    x:collection1] o.a.s.c.SolrCore [collection1] Closing main searcher on request.
   [junit4]   2> 6565 INFO  (coreCloseExecutor-73-thread-1) [    x:collection1] o.a.s.c.CachingDirectoryFactory Closing MockDirectoryFactory - 2 directories currently being tracked
   [junit4]   2> 6566 INFO  (coreCloseExecutor-73-thread-1) [    x:collection1] o.a.s.c.CachingDirectoryFactory looking to close /home/jenkins/workspace/Lucene-Solr-5.5-Linux/solr/build/solr-core/test/J0/temp/solr.handler.TestReplicationHandler_9C3778951B87EB73-001/solr-instance-004/./collection1/data/index [CachedDir<<refCount=0;path=/home/jenkins/workspace/Lucene-Solr-5.5-Linux/solr/build/solr-core/test/J0/temp/solr.handler.TestReplicationHandler_9C3778951B87EB73-001/solr-instance-004/./collection1/data/index;done=false>>]
   [junit4]   2> 6566 INFO  (coreCloseExecutor-73-thread-1) [    x:collection1] o.a.s.c.CachingDirectoryFactory Closing directory: /home/jenkins/workspace/Lucene-Solr-5.5-Linux/solr/build/solr-core/test/J0/temp/solr.handler.TestReplicationHandler_9C3778951B87EB73-001/solr-instance-004/./collection1/data/index
   [junit4]   2> 6566 INFO  (coreCloseExecutor-73-thread-1) [    x:collection1] o.a.s.c.CachingDirectoryFactory looking to close /home/jenkins/workspace/Lucene-Solr-5.5-Linux/solr/build/solr-core/test/J0/temp/solr.handler.TestReplicationHandler_9C3778951B87EB73-001/solr-instance-004/./collection1/data [CachedDir<<refCount=0;path=/home/jenkins/workspace/Lucene-Solr-5.5-Linux/solr/build/solr-core/test/J0/temp/solr.handler.TestReplicationHandler_9C3778951B87EB73-001/solr-instance-004/./collection1/data;done=false>>]
   [junit4]   2> 6566 INFO  (coreCloseExecutor-73-thread-1) [    x:collection1] o.a.s.c.CachingDirectoryFactory Closing directory: /home/jenkins/workspace/Lucene-Solr-5.5-Linux/solr/build/solr-core/test/J0/temp/solr.handler.TestReplicationHandler_9C3778951B87EB73-001/solr-instance-004/./collection1/data
   [junit4]   2> 6567 INFO  (TEST-TestReplicationHandler.doTestRepeater-seed#[9C3778951B87EB73]) [    ] o.e.j.s.h.ContextHandler Stopped o.e.j.s.ServletContextHandler@58a58f32{/solr,null,UNAVAILABLE}
   [junit4]   2> 6569 INFO  (TEST-TestReplicationHandler.doTestRepeater-seed#[9C3778951B87EB73]) [    ] o.e.j.s.Server jetty-9.2.13.v20150730
   [junit4]   2> 6571 INFO  (TEST-TestReplicationHandler.doTestRepeater-seed#[9C3778951B87EB73]) [    ] o.e.j.s.h.ContextHandler Started o.e.j.s.ServletContextHandler@2fe7427a{/solr,null,AVAILABLE}
   [junit4]   2> 6572 INFO  (TEST-TestReplicationHandler.doTestRepeater-seed#[9C3778951B87EB73]) [    ] o.e.j.s.ServerConnector Started ServerConnector@48e9dfd1{HTTP/1.1}{127.0.0.1:39221}
   [junit4]   2> 6572 INFO  (TEST-TestReplicationHandler.doTestRepeater-seed#[9C3778951B87EB73]) [    ] o.e.j.s.Server Started @8208ms
   [junit4]   2> 6572 INFO  (TEST-TestReplicationHandler.doTestRepeater-seed#[9C3778951B87EB73]) [    ] o.a.s.c.s.e.JettySolrRunner Jetty properties: {solr.data.dir=/home/jenkins/workspace/Lucene-Solr-5.5-Linux/solr/build/solr-core/test/J0/temp/solr.handler.TestReplicationHandler_9C3778951B87EB73-001/solr-instance-004/collection1/data, hostContext=/solr, hostPort=39221}
   [junit4]   2> 6572 INFO  (TEST-TestReplicationHandler.doTestRepeater-seed#[9C3778951B87EB73]) [    ] o.a.s.s.SolrDispatchFilter SolrDispatchFilter.init(): sun.misc.Launcher$AppClassLoader@73d16e93
   [junit4]   2> 6573 INFO  (TEST-TestReplicationHandler.doTestRepeater-seed#[9C3778951B87EB73]) [    ] o.a.s.c.SolrResourceLoader new SolrResourceLoader for directory: '/home/jenkins/workspace/Lucene-Solr-5.5-Linux/solr/build/solr-core/test/J0/temp/solr.handler.TestReplicationHandler_9C3778951B87EB73-001/solr-instance-004'
   [junit4]   2> 6573 INFO  (TEST-TestReplicationHandler.doTestRepeater-seed#[9C3778951B87EB73]) [    ] o.a.s.c.SolrResourceLoader JNDI not configured for solr (NoInitialContextEx)
   [junit4]   2> 6573 INFO  (TEST-TestReplicationHandler.doTestRepeater-seed#[9C3778951B87EB73]) [    ] o.a.s.c.SolrResourceLoader solr home defaulted to 'solr/' (could not find system property or JNDI)
   [junit4]   2> 6573 INFO  (TEST-TestReplicationHandler.doTestRepeater-seed#[9C3778951B87EB73]) [    ] o.a.s.c.SolrXmlConfig Loading container configuration from /home/jenkins/workspace/Lucene-Solr-5.5-Linux/solr/build/solr-core/test/J0/temp/solr.handler.TestReplicationHandler_9C3778951B87EB73-001/solr-instance-004/solr.xml
   [junit4]   2> 6579 INFO  (TEST-TestReplicationHandler.doTestRepeater-seed#[9C3778951B87EB73]) [    ] o.a.s.c.CorePropertiesLocator Config-defined core root directory: /home/jenkins/workspace/Lucene-Solr-5.5-Linux/solr/build/solr-core/test/J0/temp/solr.handler.TestReplicationHandler_9C3778951B87EB73-001/solr-instance-004/.
   [junit4]   2> 6579 INFO  (TEST-TestReplicationHandler.doTestRepeater-seed#[9C3778951B87EB73]) [    ] o.a.s.c.CoreContainer New CoreContainer 1170532989
   [junit4]   2> 6579 INFO  (TEST-TestReplicationHandler.doTestRepeater-seed#[9C3778951B87EB73]) [    ] o.a.s.c.CoreContainer Loading cores into CoreContainer [instanceDir=/home/jenkins/workspace/Lucene-Solr-5.5-Linux/solr/build/solr-core/test/J0/temp/solr.handler.TestReplicationHandler_9C3778951B87EB73-001/solr-instance-004]
   [junit4]   2> 6580 WARN  (TEST-TestReplicationHandler.doTestRepeater-seed#[9C3778951B87EB73]) [    ] o.a.s.c.CoreContainer Couldn't add files from /home/jenkins/workspace/Lucene-Solr-5.5-Linux/solr/build/solr-core/test/J0/temp/solr.handler.TestReplicationHandler_9C3778951B87EB73-001/solr-instance-004/lib to classpath: /home/jenkins/workspace/Lucene-Solr-5.5-Linux/solr/build/solr-core/test/J0/temp/solr.handler.TestReplicationHandler_9C3778951B87EB73-001/solr-instance-004/lib
   [junit4]   2> 6586 INFO  (TEST-TestReplicationHandler.doTestRepeater-seed#[9C3778951B87EB73]) [    ] o.a.s.h.c.HttpShardHandlerFactory created with socketTimeout : 90000,urlScheme : ,connTimeout : 15000,maxConnectionsPerHost : 20,maxConnections : 10000,corePoolSize : 0,maximumPoolSize : 2147483647,maxThreadIdleTime : 5,sizeOfQueue : -1,fairnessPolicy : false,useRetries : false,connectionsEvictorSleepDelay : 5000,maxConnectionIdleTime : 40000,
   [junit4]   2> 6588 INFO  (TEST-TestReplicationHandler.doTestRepeater-seed#[9C3778951B87EB73]) [    ] o.a.s.u.UpdateShardHandler Creating UpdateShardHandler HTTP client with params: socketTimeout=340000&connTimeout=45000&retry=true
   [junit4]   2> 6589 INFO  (TEST-TestReplicationHandler.doTestRepeater-seed#[9C3778951B87EB73]) [    ] o.a.s.l.LogWatcher SLF4J impl is org.slf4j.impl.Log4jLoggerFactory
   [junit4]   2> 6589 INFO  (TEST-TestReplicationHandler.doTestRepeater-seed#[9C3778951B87EB73]) [    ] o.a.s.l.LogWatcher Registering Log Listener [Log4j (org.slf4j.impl.Log4jLoggerFactory)]
   [junit4]   2> 6589 INFO  (TEST-TestReplicationHandler.doTestRepeater-seed#[9C3778951B87EB73]) [    ] o.a.s.c.CoreContainer Security conf doesn't exist. Skipping setup for authorization module.
   [junit4]   2> 6589 INFO  (TEST-TestReplicationHandler.doTestRepeater-seed#[9C3778951B87EB73]) [    ] o.a.s.c.CoreContainer No authentication plugin used.
   [junit4]   2> 6591 INFO  (TEST-TestReplicationHandler.doTestRepeater-seed#[9C3778951B87EB73]) [    ] o.a.s.c.CorePropertiesLocator Looking for core definitions underneath /home/jenkins/workspace/Lucene-Solr-5.5-Linux/solr/build/solr-core/test/J0/temp/solr.handler.TestReplicationHandler_9C3778951B87EB73-001/solr-instance-004/.
   [junit4]   2> 6592 INFO  (TEST-TestReplicationHandler.doTestRepeater-seed#[9C3778951B87EB73]) [    ] o.a.s.c.CoreDescriptor Created CoreDescriptor: {name=collection1, config=solrconfig.xml, loadOnStartup=true, schema=schema.xml, configSetProperties=configsetprops.json, transient=false, dataDir=data/}
   [junit4]   2> 6592 INFO  (TEST-TestReplicationHandler.doTestRepeater-seed#[9C3778951B87EB73]) [    ] o.a.s.c.CorePropertiesLocator Found core collection1 in /home/jenkins/workspace/Lucene-Solr-5.5-Linux/solr/build/solr-core/test/J0/temp/solr.handler.TestReplicationHandler_9C3778951B87EB73-001/solr-instance-004/./collection1
   [junit4]   2> 6592 INFO  (TEST-TestReplicationHandler.doTestRepeater-seed#[9C3778951B87EB73]) [    ] o.a.s.c.CorePropertiesLocator Found 1 core definitions
   [junit4]   2> 6594 INFO  (coreLoadExecutor-80-thread-1) [    ] o.a.s.c.SolrResourceLoader new SolrResourceLoader for directory: '/home/jenkins/workspace/Lucene-Solr-5.5-Linux/solr/build/solr-core/test/J0/temp/solr.handler.TestReplicationHandler_9C3778951B87EB73-001/solr-instance-004/collection1'
   [junit4]   2> 6595 INFO  (TEST-TestReplicationHandler.doTestRepeater-seed#[9C3778951B87EB73]) [    ] o.a.s.s.SolrDispatchFilter user.dir=/home/jenkins/workspace/Lucene-Solr-5.5-Linux/solr/build/solr-core/test/J0
   [junit4]   2> 6596 INFO  (TEST-TestReplicationHandler.doTestRepeater-seed#[9C3778951B87EB73]) [    ] o.a.s.s.SolrDispatchFilter SolrDispatchFilter.init() done
   [junit4]   2> 6596 INFO  (coreLoadExecutor-80-thread-1) [    ] o.a.s.c.SolrResourceLoader JNDI not configured for solr (NoInitialContextEx)
   [junit4]   2> 6596 INFO  (coreLoadExecutor-80-thread-1) [    ] o.a.s.c.SolrResourceLoader solr home defaulted to 'solr/' (could not find system property or JNDI)
   [junit4]   2> 6611 INFO  (coreLoadExecutor-80-thread-1) [    ] o.a.s.c.SolrConfig current version of requestparams : -1
   [junit4]   2> 661

[...truncated too long message...]

ptimize=false,openSearcher=true,waitSearcher=true,expungeDeletes=false,softCommit=false,prepareCommit=false}
   [junit4]   2> 87948 INFO  (qtp247428283-1258) [    x:collection1] o.a.s.c.SolrDeletionPolicy SolrDeletionPolicy.onCommit: commits: num=2
   [junit4]   2> 	commit{dir=MockDirectoryWrapper(RAMDirectory@66dfeaa2 lockFactory=org.apache.lucene.store.SingleInstanceLockFactory@6e047d31),segFN=segments_9,generation=9}
   [junit4]   2> 	commit{dir=MockDirectoryWrapper(RAMDirectory@66dfeaa2 lockFactory=org.apache.lucene.store.SingleInstanceLockFactory@6e047d31),segFN=segments_a,generation=10}
   [junit4]   2> 87948 INFO  (qtp247428283-1258) [    x:collection1] o.a.s.c.SolrDeletionPolicy newest commit generation = 10
   [junit4]   2> 87948 INFO  (qtp247428283-1258) [    x:collection1] o.a.s.s.SolrIndexSearcher Opening Searcher@2a89b345[collection1] main
   [junit4]   2> 87948 INFO  (qtp247428283-1258) [    x:collection1] o.a.s.u.DirectUpdateHandler2 end_commit_flush
   [junit4]   2> 87948 INFO  (searcherExecutor-715-thread-1-processing-x:collection1) [    x:collection1] o.a.s.c.SolrCore [collection1] Registered new searcher Searcher@2a89b345[collection1] main{ExitableDirectoryReader(UninvertingDirectoryReader(Uninverting(_0(5.5.3):C87) Uninverting(_1(5.5.3):C190) Uninverting(_2(5.5.3):C68) Uninverting(_3(5.5.3):C91) Uninverting(_4(5.5.3):C152) Uninverting(_5(5.5.3):C164) Uninverting(_6(5.5.3):C21) Uninverting(_7(5.5.3):C118) Uninverting(_8(5.5.3):C3)))}
   [junit4]   2> 87949 INFO  (qtp247428283-1258) [    x:collection1] o.a.s.u.p.LogUpdateProcessorFactory [collection1]  webapp=/solr path=/update params={waitSearcher=true&commit=true&softCommit=false&wt=javabin&version=2}{commit=} 0 3
   [junit4]   2> 87949 INFO  (TEST-TestReplicationHandler.doTestStressReplication-seed#[9C3778951B87EB73]) [    ] o.a.s.SolrTestCaseJ4 ###Ending doTestStressReplication
   [junit4]   2> 87949 INFO  (TEST-TestReplicationHandler.doTestStressReplication-seed#[9C3778951B87EB73]) [    ] o.e.j.s.ServerConnector Stopped ServerConnector@2c2e52db{HTTP/1.1}{127.0.0.1:0}
   [junit4]   2> 87949 INFO  (TEST-TestReplicationHandler.doTestStressReplication-seed#[9C3778951B87EB73]) [    ] o.a.s.c.CoreContainer Shutting down CoreContainer instance=1250004040
   [junit4]   2> 87950 INFO  (coreCloseExecutor-720-thread-1) [    x:collection1] o.a.s.c.SolrCore [collection1]  CLOSING SolrCore org.apache.solr.core.SolrCore@599c421f
   [junit4]   2> 87950 INFO  (coreCloseExecutor-720-thread-1) [    x:collection1] o.a.s.u.DirectUpdateHandler2 closing DirectUpdateHandler2{commits=8,autocommits=0,soft autocommits=0,optimizes=0,rollbacks=0,expungeDeletes=0,docsPending=0,adds=0,deletesById=0,deletesByQuery=0,errors=0,cumulative_adds=891,cumulative_deletesById=0,cumulative_deletesByQuery=1,cumulative_errors=0}
   [junit4]   2> 87950 INFO  (coreCloseExecutor-720-thread-1) [    x:collection1] o.a.s.u.SolrCoreState Closing SolrCoreState
   [junit4]   2> 87950 INFO  (coreCloseExecutor-720-thread-1) [    x:collection1] o.a.s.u.DefaultSolrCoreState SolrCoreState ref count has reached 0 - closing IndexWriter
   [junit4]   2> 87950 INFO  (coreCloseExecutor-720-thread-1) [    x:collection1] o.a.s.u.DefaultSolrCoreState closing IndexWriter with IndexWriterCloser
   [junit4]   2> 87951 INFO  (coreCloseExecutor-720-thread-1) [    x:collection1] o.a.s.c.SolrCore [collection1] Closing main searcher on request.
   [junit4]   2> 87951 INFO  (coreCloseExecutor-720-thread-1) [    x:collection1] o.a.s.c.CachingDirectoryFactory Closing MockDirectoryFactory - 2 directories currently being tracked
   [junit4]   2> 87951 INFO  (coreCloseExecutor-720-thread-1) [    x:collection1] o.a.s.c.CachingDirectoryFactory looking to close /home/jenkins/workspace/Lucene-Solr-5.5-Linux/solr/build/solr-core/test/J0/temp/solr.handler.TestReplicationHandler_9C3778951B87EB73-001/solr-instance-031/./collection1/data [CachedDir<<refCount=0;path=/home/jenkins/workspace/Lucene-Solr-5.5-Linux/solr/build/solr-core/test/J0/temp/solr.handler.TestReplicationHandler_9C3778951B87EB73-001/solr-instance-031/./collection1/data;done=false>>]
   [junit4]   2> 87951 INFO  (coreCloseExecutor-720-thread-1) [    x:collection1] o.a.s.c.CachingDirectoryFactory Closing directory: /home/jenkins/workspace/Lucene-Solr-5.5-Linux/solr/build/solr-core/test/J0/temp/solr.handler.TestReplicationHandler_9C3778951B87EB73-001/solr-instance-031/./collection1/data
   [junit4]   2> 87951 INFO  (coreCloseExecutor-720-thread-1) [    x:collection1] o.a.s.c.CachingDirectoryFactory looking to close /home/jenkins/workspace/Lucene-Solr-5.5-Linux/solr/build/solr-core/test/J0/temp/solr.handler.TestReplicationHandler_9C3778951B87EB73-001/solr-instance-031/./collection1/data/index [CachedDir<<refCount=0;path=/home/jenkins/workspace/Lucene-Solr-5.5-Linux/solr/build/solr-core/test/J0/temp/solr.handler.TestReplicationHandler_9C3778951B87EB73-001/solr-instance-031/./collection1/data/index;done=false>>]
   [junit4]   2> 87951 INFO  (coreCloseExecutor-720-thread-1) [    x:collection1] o.a.s.c.CachingDirectoryFactory Closing directory: /home/jenkins/workspace/Lucene-Solr-5.5-Linux/solr/build/solr-core/test/J0/temp/solr.handler.TestReplicationHandler_9C3778951B87EB73-001/solr-instance-031/./collection1/data/index
   [junit4]   2> 87952 INFO  (TEST-TestReplicationHandler.doTestStressReplication-seed#[9C3778951B87EB73]) [    ] o.e.j.s.h.ContextHandler Stopped o.e.j.s.ServletContextHandler@4770cfaf{/solr,null,UNAVAILABLE}
   [junit4]   2> 87952 INFO  (TEST-TestReplicationHandler.doTestStressReplication-seed#[9C3778951B87EB73]) [    ] o.e.j.s.ServerConnector Stopped ServerConnector@72198f64{HTTP/1.1}{127.0.0.1:0}
   [junit4]   2> 87952 INFO  (TEST-TestReplicationHandler.doTestStressReplication-seed#[9C3778951B87EB73]) [    ] o.a.s.c.CoreContainer Shutting down CoreContainer instance=1723645399
   [junit4]   2> 87953 INFO  (coreCloseExecutor-722-thread-1) [    x:collection1] o.a.s.c.SolrCore [collection1]  CLOSING SolrCore org.apache.solr.core.SolrCore@4163c186
   [junit4]   2> 87953 INFO  (coreCloseExecutor-722-thread-1) [    x:collection1] o.a.s.u.DirectUpdateHandler2 closing DirectUpdateHandler2{commits=2,autocommits=0,soft autocommits=0,optimizes=0,rollbacks=0,expungeDeletes=0,docsPending=0,adds=0,deletesById=0,deletesByQuery=0,errors=0,cumulative_adds=6,cumulative_deletesById=0,cumulative_deletesByQuery=0,cumulative_errors=0}
   [junit4]   2> 87953 INFO  (coreCloseExecutor-722-thread-1) [    x:collection1] o.a.s.u.SolrCoreState Closing SolrCoreState
   [junit4]   2> 87953 INFO  (coreCloseExecutor-722-thread-1) [    x:collection1] o.a.s.u.DefaultSolrCoreState SolrCoreState ref count has reached 0 - closing IndexWriter
   [junit4]   2> 87953 INFO  (coreCloseExecutor-722-thread-1) [    x:collection1] o.a.s.u.DefaultSolrCoreState closing IndexWriter with IndexWriterCloser
   [junit4]   2> 87953 INFO  (coreCloseExecutor-722-thread-1) [    x:collection1] o.a.s.c.SolrCore [collection1] Closing main searcher on request.
   [junit4]   2> 87953 INFO  (coreCloseExecutor-722-thread-1) [    x:collection1] o.a.s.c.CachingDirectoryFactory Closing MockDirectoryFactory - 2 directories currently being tracked
   [junit4]   2> 87953 INFO  (coreCloseExecutor-722-thread-1) [    x:collection1] o.a.s.c.CachingDirectoryFactory looking to close /home/jenkins/workspace/Lucene-Solr-5.5-Linux/solr/build/solr-core/test/J0/temp/solr.handler.TestReplicationHandler_9C3778951B87EB73-001/solr-instance-032/./collection1/data [CachedDir<<refCount=0;path=/home/jenkins/workspace/Lucene-Solr-5.5-Linux/solr/build/solr-core/test/J0/temp/solr.handler.TestReplicationHandler_9C3778951B87EB73-001/solr-instance-032/./collection1/data;done=false>>]
   [junit4]   2> 87953 INFO  (coreCloseExecutor-722-thread-1) [    x:collection1] o.a.s.c.CachingDirectoryFactory Closing directory: /home/jenkins/workspace/Lucene-Solr-5.5-Linux/solr/build/solr-core/test/J0/temp/solr.handler.TestReplicationHandler_9C3778951B87EB73-001/solr-instance-032/./collection1/data
   [junit4]   2> 87953 INFO  (coreCloseExecutor-722-thread-1) [    x:collection1] o.a.s.c.CachingDirectoryFactory looking to close /home/jenkins/workspace/Lucene-Solr-5.5-Linux/solr/build/solr-core/test/J0/temp/solr.handler.TestReplicationHandler_9C3778951B87EB73-001/solr-instance-032/./collection1/data/index.20160904040734755 [CachedDir<<refCount=0;path=/home/jenkins/workspace/Lucene-Solr-5.5-Linux/solr/build/solr-core/test/J0/temp/solr.handler.TestReplicationHandler_9C3778951B87EB73-001/solr-instance-032/./collection1/data/index.20160904040734755;done=false>>]
   [junit4]   2> 87953 INFO  (coreCloseExecutor-722-thread-1) [    x:collection1] o.a.s.c.CachingDirectoryFactory Closing directory: /home/jenkins/workspace/Lucene-Solr-5.5-Linux/solr/build/solr-core/test/J0/temp/solr.handler.TestReplicationHandler_9C3778951B87EB73-001/solr-instance-032/./collection1/data/index.20160904040734755
   [junit4]   2> 87954 INFO  (TEST-TestReplicationHandler.doTestStressReplication-seed#[9C3778951B87EB73]) [    ] o.e.j.s.h.ContextHandler Stopped o.e.j.s.ServletContextHandler@29a4b253{/solr,null,UNAVAILABLE}
   [junit4]   2> 87955 INFO  (SUITE-TestReplicationHandler-seed#[9C3778951B87EB73]-worker) [    ] o.a.s.SolrTestCaseJ4 ###deleteCore
   [junit4]   2> NOTE: leaving temporary files on disk at: /home/jenkins/workspace/Lucene-Solr-5.5-Linux/solr/build/solr-core/test/J0/temp/solr.handler.TestReplicationHandler_9C3778951B87EB73-001
   [junit4]   2> NOTE: test params are: codec=CheapBastard, sim=RandomSimilarity(queryNorm=true,coord=crazy): {}, locale=es-US, timezone=America/Buenos_Aires
   [junit4]   2> NOTE: Linux 4.4.0-31-generic amd64/Oracle Corporation 1.8.0_102 (64-bit)/cpus=12,threads=1,free=352215928,total=509018112
   [junit4]   2> NOTE: All tests run in this JVM: [TestSchemaManager, TestSolrQueryParserDefaultOperatorResource, TestReplicationHandler]
   [junit4] Completed [19/575 (1!)] on J0 in 83.62s, 15 tests, 1 failure <<< FAILURES!

[...truncated 58446 lines...]


Mime
View raw message