lucene-dev mailing list archives

Site index · List index
Message view « Date » · « Thread »
Top « Date » · « Thread »
From Policeman Jenkins Server <jenk...@thetaphi.de>
Subject [JENKINS] Lucene-Solr-6.x-Linux (64bit/jdk1.8.0_102) - Build # 1702 - Still Unstable!
Date Sun, 11 Sep 2016 10:51:58 GMT
Build: http://jenkins.thetaphi.de/job/Lucene-Solr-6.x-Linux/1702/
Java: 64bit/jdk1.8.0_102 -XX:+UseCompressedOops -XX:+UseSerialGC

1 tests failed.
FAILED:  org.apache.solr.security.BasicAuthIntegrationTest.testBasicAuth

Error Message:
IOException occured when talking to server at: https://127.0.0.1:37536/solr

Stack Trace:
org.apache.solr.client.solrj.SolrServerException: IOException occured when talking to server at: https://127.0.0.1:37536/solr
	at __randomizedtesting.SeedInfo.seed([A2D8722F357B9A48:1EB6043D91281932]:0)
	at org.apache.solr.client.solrj.impl.HttpSolrClient.executeMethod(HttpSolrClient.java:606)
	at org.apache.solr.client.solrj.impl.HttpSolrClient.request(HttpSolrClient.java:261)
	at org.apache.solr.client.solrj.impl.HttpSolrClient.request(HttpSolrClient.java:250)
	at org.apache.solr.client.solrj.SolrClient.request(SolrClient.java:1219)
	at org.apache.solr.security.BasicAuthIntegrationTest.testBasicAuth(BasicAuthIntegrationTest.java:158)
	at sun.reflect.NativeMethodAccessorImpl.invoke0(Native Method)
	at sun.reflect.NativeMethodAccessorImpl.invoke(NativeMethodAccessorImpl.java:62)
	at sun.reflect.DelegatingMethodAccessorImpl.invoke(DelegatingMethodAccessorImpl.java:43)
	at java.lang.reflect.Method.invoke(Method.java:498)
	at com.carrotsearch.randomizedtesting.RandomizedRunner.invoke(RandomizedRunner.java:1764)
	at com.carrotsearch.randomizedtesting.RandomizedRunner$8.evaluate(RandomizedRunner.java:871)
	at com.carrotsearch.randomizedtesting.RandomizedRunner$9.evaluate(RandomizedRunner.java:907)
	at com.carrotsearch.randomizedtesting.RandomizedRunner$10.evaluate(RandomizedRunner.java:921)
	at com.carrotsearch.randomizedtesting.rules.SystemPropertiesRestoreRule$1.evaluate(SystemPropertiesRestoreRule.java:57)
	at org.apache.lucene.util.TestRuleSetupTeardownChained$1.evaluate(TestRuleSetupTeardownChained.java:49)
	at org.apache.lucene.util.AbstractBeforeAfterRule$1.evaluate(AbstractBeforeAfterRule.java:45)
	at org.apache.lucene.util.TestRuleThreadAndTestName$1.evaluate(TestRuleThreadAndTestName.java:48)
	at org.apache.lucene.util.TestRuleIgnoreAfterMaxFailures$1.evaluate(TestRuleIgnoreAfterMaxFailures.java:64)
	at org.apache.lucene.util.TestRuleMarkFailure$1.evaluate(TestRuleMarkFailure.java:47)
	at com.carrotsearch.randomizedtesting.rules.StatementAdapter.evaluate(StatementAdapter.java:36)
	at com.carrotsearch.randomizedtesting.ThreadLeakControl$StatementRunner.run(ThreadLeakControl.java:367)
	at com.carrotsearch.randomizedtesting.ThreadLeakControl.forkTimeoutingTask(ThreadLeakControl.java:809)
	at com.carrotsearch.randomizedtesting.ThreadLeakControl$3.evaluate(ThreadLeakControl.java:460)
	at com.carrotsearch.randomizedtesting.RandomizedRunner.runSingleTest(RandomizedRunner.java:880)
	at com.carrotsearch.randomizedtesting.RandomizedRunner$5.evaluate(RandomizedRunner.java:781)
	at com.carrotsearch.randomizedtesting.RandomizedRunner$6.evaluate(RandomizedRunner.java:816)
	at com.carrotsearch.randomizedtesting.RandomizedRunner$7.evaluate(RandomizedRunner.java:827)
	at com.carrotsearch.randomizedtesting.rules.StatementAdapter.evaluate(StatementAdapter.java:36)
	at com.carrotsearch.randomizedtesting.rules.SystemPropertiesRestoreRule$1.evaluate(SystemPropertiesRestoreRule.java:57)
	at org.apache.lucene.util.AbstractBeforeAfterRule$1.evaluate(AbstractBeforeAfterRule.java:45)
	at com.carrotsearch.randomizedtesting.rules.StatementAdapter.evaluate(StatementAdapter.java:36)
	at org.apache.lucene.util.TestRuleStoreClassName$1.evaluate(TestRuleStoreClassName.java:41)
	at com.carrotsearch.randomizedtesting.rules.NoShadowingOrOverridesOnMethodsRule$1.evaluate(NoShadowingOrOverridesOnMethodsRule.java:40)
	at com.carrotsearch.randomizedtesting.rules.NoShadowingOrOverridesOnMethodsRule$1.evaluate(NoShadowingOrOverridesOnMethodsRule.java:40)
	at com.carrotsearch.randomizedtesting.rules.StatementAdapter.evaluate(StatementAdapter.java:36)
	at com.carrotsearch.randomizedtesting.rules.StatementAdapter.evaluate(StatementAdapter.java:36)
	at com.carrotsearch.randomizedtesting.rules.StatementAdapter.evaluate(StatementAdapter.java:36)
	at org.apache.lucene.util.TestRuleAssertionsRequired$1.evaluate(TestRuleAssertionsRequired.java:53)
	at org.apache.lucene.util.TestRuleMarkFailure$1.evaluate(TestRuleMarkFailure.java:47)
	at org.apache.lucene.util.TestRuleIgnoreAfterMaxFailures$1.evaluate(TestRuleIgnoreAfterMaxFailures.java:64)
	at org.apache.lucene.util.TestRuleIgnoreTestSuites$1.evaluate(TestRuleIgnoreTestSuites.java:54)
	at com.carrotsearch.randomizedtesting.rules.StatementAdapter.evaluate(StatementAdapter.java:36)
	at com.carrotsearch.randomizedtesting.ThreadLeakControl$StatementRunner.run(ThreadLeakControl.java:367)
	at java.lang.Thread.run(Thread.java:745)
Caused by: javax.net.ssl.SSLHandshakeException: sun.security.validator.ValidatorException: PKIX path building failed: sun.security.provider.certpath.SunCertPathBuilderException: unable to find valid certification path to requested target
	at sun.security.ssl.Alerts.getSSLException(Alerts.java:192)
	at sun.security.ssl.SSLSocketImpl.fatal(SSLSocketImpl.java:1949)
	at sun.security.ssl.Handshaker.fatalSE(Handshaker.java:302)
	at sun.security.ssl.Handshaker.fatalSE(Handshaker.java:296)
	at sun.security.ssl.ClientHandshaker.serverCertificate(ClientHandshaker.java:1509)
	at sun.security.ssl.ClientHandshaker.processMessage(ClientHandshaker.java:216)
	at sun.security.ssl.Handshaker.processLoop(Handshaker.java:979)
	at sun.security.ssl.Handshaker.process_record(Handshaker.java:914)
	at sun.security.ssl.SSLSocketImpl.readRecord(SSLSocketImpl.java:1062)
	at sun.security.ssl.SSLSocketImpl.performInitialHandshake(SSLSocketImpl.java:1375)
	at sun.security.ssl.SSLSocketImpl.startHandshake(SSLSocketImpl.java:1403)
	at sun.security.ssl.SSLSocketImpl.startHandshake(SSLSocketImpl.java:1387)
	at org.apache.http.conn.ssl.SSLSocketFactory.connectSocket(SSLSocketFactory.java:543)
	at org.apache.http.conn.ssl.SSLSocketFactory.connectSocket(SSLSocketFactory.java:409)
	at org.apache.http.impl.conn.DefaultClientConnectionOperator.openConnection(DefaultClientConnectionOperator.java:177)
	at org.apache.http.impl.conn.ManagedClientConnectionImpl.open(ManagedClientConnectionImpl.java:304)
	at org.apache.http.impl.client.DefaultRequestDirector.tryConnect(DefaultRequestDirector.java:611)
	at org.apache.http.impl.client.DefaultRequestDirector.execute(DefaultRequestDirector.java:446)
	at org.apache.http.impl.client.AbstractHttpClient.doExecute(AbstractHttpClient.java:882)
	at org.apache.http.impl.client.CloseableHttpClient.execute(CloseableHttpClient.java:82)
	at org.apache.http.impl.client.CloseableHttpClient.execute(CloseableHttpClient.java:107)
	at org.apache.http.impl.client.CloseableHttpClient.execute(CloseableHttpClient.java:55)
	at org.apache.solr.client.solrj.impl.HttpSolrClient.executeMethod(HttpSolrClient.java:497)
	... 43 more
Caused by: sun.security.validator.ValidatorException: PKIX path building failed: sun.security.provider.certpath.SunCertPathBuilderException: unable to find valid certification path to requested target
	at sun.security.validator.PKIXValidator.doBuild(PKIXValidator.java:387)
	at sun.security.validator.PKIXValidator.engineValidate(PKIXValidator.java:292)
	at sun.security.validator.Validator.validate(Validator.java:260)
	at sun.security.ssl.X509TrustManagerImpl.validate(X509TrustManagerImpl.java:324)
	at sun.security.ssl.X509TrustManagerImpl.checkTrusted(X509TrustManagerImpl.java:229)
	at sun.security.ssl.X509TrustManagerImpl.checkServerTrusted(X509TrustManagerImpl.java:124)
	at sun.security.ssl.ClientHandshaker.serverCertificate(ClientHandshaker.java:1491)
	... 61 more
Caused by: sun.security.provider.certpath.SunCertPathBuilderException: unable to find valid certification path to requested target
	at sun.security.provider.certpath.SunCertPathBuilder.build(SunCertPathBuilder.java:141)
	at sun.security.provider.certpath.SunCertPathBuilder.engineBuild(SunCertPathBuilder.java:126)
	at java.security.cert.CertPathBuilder.build(CertPathBuilder.java:280)
	at sun.security.validator.PKIXValidator.doBuild(PKIXValidator.java:382)
	... 67 more




Build Log:
[...truncated 12532 lines...]
   [junit4] Suite: org.apache.solr.security.BasicAuthIntegrationTest
   [junit4]   2> Creating dataDir: /home/jenkins/workspace/Lucene-Solr-6.x-Linux/solr/build/solr-core/test/J0/temp/solr.security.BasicAuthIntegrationTest_A2D8722F357B9A48-001/init-core-data-001
   [junit4]   2> 1813543 INFO  (SUITE-BasicAuthIntegrationTest-seed#[A2D8722F357B9A48]-worker) [    ] o.a.s.SolrTestCaseJ4 Randomized ssl (true) and clientAuth (true) via: @org.apache.solr.util.RandomizeSSL(reason=, ssl=NaN, value=NaN, clientAuth=NaN)
   [junit4]   2> 1813544 INFO  (SUITE-BasicAuthIntegrationTest-seed#[A2D8722F357B9A48]-worker) [    ] o.a.s.c.ZkTestServer STARTING ZK TEST SERVER
   [junit4]   2> 1813545 INFO  (Thread-3181) [    ] o.a.s.c.ZkTestServer client port:0.0.0.0/0.0.0.0:0
   [junit4]   2> 1813545 INFO  (Thread-3181) [    ] o.a.s.c.ZkTestServer Starting server
   [junit4]   2> 1813645 INFO  (SUITE-BasicAuthIntegrationTest-seed#[A2D8722F357B9A48]-worker) [    ] o.a.s.c.ZkTestServer start zk server on port:37656
   [junit4]   2> 1813645 INFO  (SUITE-BasicAuthIntegrationTest-seed#[A2D8722F357B9A48]-worker) [    ] o.a.s.c.c.SolrZkClient Using default ZkCredentialsProvider
   [junit4]   2> 1813645 INFO  (SUITE-BasicAuthIntegrationTest-seed#[A2D8722F357B9A48]-worker) [    ] o.a.s.c.c.ConnectionManager Waiting for client to connect to ZooKeeper
   [junit4]   2> 1813646 INFO  (zkCallback-2150-thread-1) [    ] o.a.s.c.c.ConnectionManager Watcher org.apache.solr.common.cloud.ConnectionManager@6974223a name:ZooKeeperConnection Watcher:127.0.0.1:37656 got event WatchedEvent state:SyncConnected type:None path:null path:null type:None
   [junit4]   2> 1813646 INFO  (SUITE-BasicAuthIntegrationTest-seed#[A2D8722F357B9A48]-worker) [    ] o.a.s.c.c.ConnectionManager Client is connected to ZooKeeper
   [junit4]   2> 1813647 INFO  (SUITE-BasicAuthIntegrationTest-seed#[A2D8722F357B9A48]-worker) [    ] o.a.s.c.c.SolrZkClient Using default ZkACLProvider
   [junit4]   2> 1813647 INFO  (SUITE-BasicAuthIntegrationTest-seed#[A2D8722F357B9A48]-worker) [    ] o.a.s.c.c.SolrZkClient makePath: /solr/solr.xml
   [junit4]   2> 1813647 INFO  (SUITE-BasicAuthIntegrationTest-seed#[A2D8722F357B9A48]-worker) [    ] o.a.s.c.c.SolrZkClient makePath: /solr/clusterprops.json
   [junit4]   2> 1813649 INFO  (jetty-launcher-2149-thread-1) [    ] o.e.j.s.Server jetty-9.3.8.v20160314
   [junit4]   2> 1813649 INFO  (jetty-launcher-2149-thread-2) [    ] o.e.j.s.Server jetty-9.3.8.v20160314
   [junit4]   2> 1813649 INFO  (jetty-launcher-2149-thread-3) [    ] o.e.j.s.Server jetty-9.3.8.v20160314
   [junit4]   2> 1813651 INFO  (jetty-launcher-2149-thread-2) [    ] o.e.j.s.h.ContextHandler Started o.e.j.s.ServletContextHandler@54f17b7{/solr,null,AVAILABLE}
   [junit4]   2> 1813651 INFO  (jetty-launcher-2149-thread-3) [    ] o.e.j.s.h.ContextHandler Started o.e.j.s.ServletContextHandler@9ac5492{/solr,null,AVAILABLE}
   [junit4]   2> 1813651 INFO  (jetty-launcher-2149-thread-1) [    ] o.e.j.s.h.ContextHandler Started o.e.j.s.ServletContextHandler@720c170f{/solr,null,AVAILABLE}
   [junit4]   2> 1813655 INFO  (jetty-launcher-2149-thread-3) [    ] o.e.j.s.ServerConnector Started ServerConnector@28c51691{SSL,[ssl, http/1.1]}{127.0.0.1:32955}
   [junit4]   2> 1813655 INFO  (jetty-launcher-2149-thread-1) [    ] o.e.j.s.ServerConnector Started ServerConnector@229bace8{SSL,[ssl, http/1.1]}{127.0.0.1:39597}
   [junit4]   2> 1813655 INFO  (jetty-launcher-2149-thread-2) [    ] o.e.j.s.ServerConnector Started ServerConnector@755695ce{SSL,[ssl, http/1.1]}{127.0.0.1:37536}
   [junit4]   2> 1813655 INFO  (jetty-launcher-2149-thread-2) [    ] o.e.j.s.Server Started @1815186ms
   [junit4]   2> 1813655 INFO  (jetty-launcher-2149-thread-3) [    ] o.e.j.s.Server Started @1815186ms
   [junit4]   2> 1813655 INFO  (jetty-launcher-2149-thread-2) [    ] o.a.s.c.s.e.JettySolrRunner Jetty properties: {hostContext=/solr, hostPort=37536}
   [junit4]   2> 1813655 INFO  (jetty-launcher-2149-thread-3) [    ] o.a.s.c.s.e.JettySolrRunner Jetty properties: {hostContext=/solr, hostPort=32955}
   [junit4]   2> 1813655 INFO  (jetty-launcher-2149-thread-1) [    ] o.e.j.s.Server Started @1815186ms
   [junit4]   2> 1813655 INFO  (jetty-launcher-2149-thread-2) [    ] o.a.s.s.SolrDispatchFilter SolrDispatchFilter.init(): sun.misc.Launcher$AppClassLoader@73d16e93
   [junit4]   2> 1813655 INFO  (jetty-launcher-2149-thread-3) [    ] o.a.s.s.SolrDispatchFilter SolrDispatchFilter.init(): sun.misc.Launcher$AppClassLoader@73d16e93
   [junit4]   2> 1813655 INFO  (jetty-launcher-2149-thread-2) [    ] o.a.s.c.SolrResourceLoader new SolrResourceLoader for directory: '/home/jenkins/workspace/Lucene-Solr-6.x-Linux/solr/build/solr-core/test/J0/temp/solr.security.BasicAuthIntegrationTest_A2D8722F357B9A48-001/tempDir-001/node2'
   [junit4]   2> 1813655 INFO  (jetty-launcher-2149-thread-3) [    ] o.a.s.c.SolrResourceLoader new SolrResourceLoader for directory: '/home/jenkins/workspace/Lucene-Solr-6.x-Linux/solr/build/solr-core/test/J0/temp/solr.security.BasicAuthIntegrationTest_A2D8722F357B9A48-001/tempDir-001/node3'
   [junit4]   2> 1813655 INFO  (jetty-launcher-2149-thread-1) [    ] o.a.s.c.s.e.JettySolrRunner Jetty properties: {hostContext=/solr, hostPort=39597}
   [junit4]   2> 1813655 INFO  (jetty-launcher-2149-thread-2) [    ] o.a.s.c.SolrResourceLoader JNDI not configured for solr (NoInitialContextEx)
   [junit4]   2> 1813655 INFO  (jetty-launcher-2149-thread-3) [    ] o.a.s.c.SolrResourceLoader JNDI not configured for solr (NoInitialContextEx)
   [junit4]   2> 1813655 INFO  (jetty-launcher-2149-thread-2) [    ] o.a.s.c.SolrResourceLoader solr home defaulted to 'solr/' (could not find system property or JNDI)
   [junit4]   2> 1813656 INFO  (jetty-launcher-2149-thread-1) [    ] o.a.s.s.SolrDispatchFilter SolrDispatchFilter.init(): sun.misc.Launcher$AppClassLoader@73d16e93
   [junit4]   2> 1813656 INFO  (jetty-launcher-2149-thread-3) [    ] o.a.s.c.SolrResourceLoader solr home defaulted to 'solr/' (could not find system property or JNDI)
   [junit4]   2> 1813656 INFO  (jetty-launcher-2149-thread-1) [    ] o.a.s.c.SolrResourceLoader new SolrResourceLoader for directory: '/home/jenkins/workspace/Lucene-Solr-6.x-Linux/solr/build/solr-core/test/J0/temp/solr.security.BasicAuthIntegrationTest_A2D8722F357B9A48-001/tempDir-001/node1'
   [junit4]   2> 1813656 INFO  (jetty-launcher-2149-thread-2) [    ] o.a.s.c.c.SolrZkClient Using default ZkCredentialsProvider
   [junit4]   2> 1813656 INFO  (jetty-launcher-2149-thread-3) [    ] o.a.s.c.c.SolrZkClient Using default ZkCredentialsProvider
   [junit4]   2> 1813656 INFO  (jetty-launcher-2149-thread-1) [    ] o.a.s.c.SolrResourceLoader JNDI not configured for solr (NoInitialContextEx)
   [junit4]   2> 1813656 INFO  (jetty-launcher-2149-thread-1) [    ] o.a.s.c.SolrResourceLoader solr home defaulted to 'solr/' (could not find system property or JNDI)
   [junit4]   2> 1813656 INFO  (jetty-launcher-2149-thread-2) [    ] o.a.s.c.c.ConnectionManager Waiting for client to connect to ZooKeeper
   [junit4]   2> 1813656 INFO  (jetty-launcher-2149-thread-1) [    ] o.a.s.c.c.SolrZkClient Using default ZkCredentialsProvider
   [junit4]   2> 1813656 INFO  (jetty-launcher-2149-thread-3) [    ] o.a.s.c.c.ConnectionManager Waiting for client to connect to ZooKeeper
   [junit4]   2> 1813656 INFO  (jetty-launcher-2149-thread-1) [    ] o.a.s.c.c.ConnectionManager Waiting for client to connect to ZooKeeper
   [junit4]   2> 1813657 INFO  (zkCallback-2151-thread-1) [    ] o.a.s.c.c.ConnectionManager Watcher org.apache.solr.common.cloud.ConnectionManager@110699e8 name:ZooKeeperConnection Watcher:127.0.0.1:37656/solr got event WatchedEvent state:SyncConnected type:None path:null path:null type:None
   [junit4]   2> 1813657 INFO  (zkCallback-2152-thread-1) [    ] o.a.s.c.c.ConnectionManager Watcher org.apache.solr.common.cloud.ConnectionManager@53f67ad5 name:ZooKeeperConnection Watcher:127.0.0.1:37656/solr got event WatchedEvent state:SyncConnected type:None path:null path:null type:None
   [junit4]   2> 1813657 INFO  (zkCallback-2153-thread-1) [    ] o.a.s.c.c.ConnectionManager Watcher org.apache.solr.common.cloud.ConnectionManager@4071b26 name:ZooKeeperConnection Watcher:127.0.0.1:37656/solr got event WatchedEvent state:SyncConnected type:None path:null path:null type:None
   [junit4]   2> 1813657 INFO  (jetty-launcher-2149-thread-2) [    ] o.a.s.c.c.ConnectionManager Client is connected to ZooKeeper
   [junit4]   2> 1813657 INFO  (jetty-launcher-2149-thread-1) [    ] o.a.s.c.c.ConnectionManager Client is connected to ZooKeeper
   [junit4]   2> 1813657 INFO  (jetty-launcher-2149-thread-3) [    ] o.a.s.c.c.ConnectionManager Client is connected to ZooKeeper
   [junit4]   2> 1813657 INFO  (jetty-launcher-2149-thread-2) [    ] o.a.s.c.c.SolrZkClient Using default ZkACLProvider
   [junit4]   2> 1813657 INFO  (jetty-launcher-2149-thread-1) [    ] o.a.s.c.c.SolrZkClient Using default ZkACLProvider
   [junit4]   2> 1813657 INFO  (jetty-launcher-2149-thread-3) [    ] o.a.s.c.c.SolrZkClient Using default ZkACLProvider
   [junit4]   2> 1813657 INFO  (jetty-launcher-2149-thread-2) [    ] o.a.s.s.SolrDispatchFilter solr.xml found in ZooKeeper. Loading...
   [junit4]   2> 1813657 INFO  (jetty-launcher-2149-thread-1) [    ] o.a.s.s.SolrDispatchFilter solr.xml found in ZooKeeper. Loading...
   [junit4]   2> 1813657 INFO  (jetty-launcher-2149-thread-3) [    ] o.a.s.s.SolrDispatchFilter solr.xml found in ZooKeeper. Loading...
   [junit4]   2> 1813661 INFO  (jetty-launcher-2149-thread-3) [    ] o.a.s.c.CorePropertiesLocator Config-defined core root directory: /home/jenkins/workspace/Lucene-Solr-6.x-Linux/solr/build/solr-core/test/J0/temp/solr.security.BasicAuthIntegrationTest_A2D8722F357B9A48-001/tempDir-001/node3/.
   [junit4]   2> 1813661 INFO  (jetty-launcher-2149-thread-2) [    ] o.a.s.c.CorePropertiesLocator Config-defined core root directory: /home/jenkins/workspace/Lucene-Solr-6.x-Linux/solr/build/solr-core/test/J0/temp/solr.security.BasicAuthIntegrationTest_A2D8722F357B9A48-001/tempDir-001/node2/.
   [junit4]   2> 1813661 INFO  (jetty-launcher-2149-thread-3) [    ] o.a.s.c.CoreContainer New CoreContainer 1321401945
   [junit4]   2> 1813661 INFO  (jetty-launcher-2149-thread-2) [    ] o.a.s.c.CoreContainer New CoreContainer 137599722
   [junit4]   2> 1813661 INFO  (jetty-launcher-2149-thread-3) [    ] o.a.s.c.CoreContainer Loading cores into CoreContainer [instanceDir=/home/jenkins/workspace/Lucene-Solr-6.x-Linux/solr/build/solr-core/test/J0/temp/solr.security.BasicAuthIntegrationTest_A2D8722F357B9A48-001/tempDir-001/node3]
   [junit4]   2> 1813661 INFO  (jetty-launcher-2149-thread-2) [    ] o.a.s.c.CoreContainer Loading cores into CoreContainer [instanceDir=/home/jenkins/workspace/Lucene-Solr-6.x-Linux/solr/build/solr-core/test/J0/temp/solr.security.BasicAuthIntegrationTest_A2D8722F357B9A48-001/tempDir-001/node2]
   [junit4]   2> 1813661 INFO  (jetty-launcher-2149-thread-1) [    ] o.a.s.c.CorePropertiesLocator Config-defined core root directory: /home/jenkins/workspace/Lucene-Solr-6.x-Linux/solr/build/solr-core/test/J0/temp/solr.security.BasicAuthIntegrationTest_A2D8722F357B9A48-001/tempDir-001/node1/.
   [junit4]   2> 1813661 WARN  (jetty-launcher-2149-thread-3) [    ] o.a.s.c.CoreContainer Couldn't add files from /home/jenkins/workspace/Lucene-Solr-6.x-Linux/solr/build/solr-core/test/J0/temp/solr.security.BasicAuthIntegrationTest_A2D8722F357B9A48-001/tempDir-001/node3/lib to classpath: /home/jenkins/workspace/Lucene-Solr-6.x-Linux/solr/build/solr-core/test/J0/temp/solr.security.BasicAuthIntegrationTest_A2D8722F357B9A48-001/tempDir-001/node3/lib
   [junit4]   2> 1813661 INFO  (jetty-launcher-2149-thread-1) [    ] o.a.s.c.CoreContainer New CoreContainer 491642288
   [junit4]   2> 1813661 WARN  (jetty-launcher-2149-thread-2) [    ] o.a.s.c.CoreContainer Couldn't add files from /home/jenkins/workspace/Lucene-Solr-6.x-Linux/solr/build/solr-core/test/J0/temp/solr.security.BasicAuthIntegrationTest_A2D8722F357B9A48-001/tempDir-001/node2/lib to classpath: /home/jenkins/workspace/Lucene-Solr-6.x-Linux/solr/build/solr-core/test/J0/temp/solr.security.BasicAuthIntegrationTest_A2D8722F357B9A48-001/tempDir-001/node2/lib
   [junit4]   2> 1813661 INFO  (jetty-launcher-2149-thread-1) [    ] o.a.s.c.CoreContainer Loading cores into CoreContainer [instanceDir=/home/jenkins/workspace/Lucene-Solr-6.x-Linux/solr/build/solr-core/test/J0/temp/solr.security.BasicAuthIntegrationTest_A2D8722F357B9A48-001/tempDir-001/node1]
   [junit4]   2> 1813662 INFO  (jetty-launcher-2149-thread-2) [    ] o.a.s.h.c.HttpShardHandlerFactory created with socketTimeout : 90000,urlScheme : https,connTimeout : 15000,maxConnectionsPerHost : 20,maxConnections : 10000,corePoolSize : 0,maximumPoolSize : 2147483647,maxThreadIdleTime : 5,sizeOfQueue : -1,fairnessPolicy : false,useRetries : false,connectionsEvictorSleepDelay : 5000,maxConnectionIdleTime : 40000,
   [junit4]   2> 1813662 WARN  (jetty-launcher-2149-thread-1) [    ] o.a.s.c.CoreContainer Couldn't add files from /home/jenkins/workspace/Lucene-Solr-6.x-Linux/solr/build/solr-core/test/J0/temp/solr.security.BasicAuthIntegrationTest_A2D8722F357B9A48-001/tempDir-001/node1/lib to classpath: /home/jenkins/workspace/Lucene-Solr-6.x-Linux/solr/build/solr-core/test/J0/temp/solr.security.BasicAuthIntegrationTest_A2D8722F357B9A48-001/tempDir-001/node1/lib
   [junit4]   2> 1813661 WARN  (NIOServerCxn.Factory:0.0.0.0/0.0.0.0:0) [    ] o.a.z.s.NIOServerCnxn caught end of stream exception
   [junit4]   2> EndOfStreamException: Unable to read additional data from client sessionid 0x15718cdcd930002, likely client has closed socket
   [junit4]   2> 	at org.apache.zookeeper.server.NIOServerCnxn.doIO(NIOServerCnxn.java:228)
   [junit4]   2> 	at org.apache.zookeeper.server.NIOServerCnxnFactory.run(NIOServerCnxnFactory.java:208)
   [junit4]   2> 	at java.lang.Thread.run(Thread.java:745)
   [junit4]   2> 1813662 INFO  (jetty-launcher-2149-thread-1) [    ] o.a.s.h.c.HttpShardHandlerFactory created with socketTimeout : 90000,urlScheme : https,connTimeout : 15000,maxConnectionsPerHost : 20,maxConnections : 10000,corePoolSize : 0,maximumPoolSize : 2147483647,maxThreadIdleTime : 5,sizeOfQueue : -1,fairnessPolicy : false,useRetries : false,connectionsEvictorSleepDelay : 5000,maxConnectionIdleTime : 40000,
   [junit4]   2> 1813662 INFO  (jetty-launcher-2149-thread-3) [    ] o.a.s.h.c.HttpShardHandlerFactory created with socketTimeout : 90000,urlScheme : https,connTimeout : 15000,maxConnectionsPerHost : 20,maxConnections : 10000,corePoolSize : 0,maximumPoolSize : 2147483647,maxThreadIdleTime : 5,sizeOfQueue : -1,fairnessPolicy : false,useRetries : false,connectionsEvictorSleepDelay : 5000,maxConnectionIdleTime : 40000,
   [junit4]   2> 1813663 WARN  (NIOServerCxn.Factory:0.0.0.0/0.0.0.0:0) [    ] o.a.z.s.NIOServerCnxn caught end of stream exception
   [junit4]   2> EndOfStreamException: Unable to read additional data from client sessionid 0x15718cdcd930003, likely client has closed socket
   [junit4]   2> 	at org.apache.zookeeper.server.NIOServerCnxn.doIO(NIOServerCnxn.java:228)
   [junit4]   2> 	at org.apache.zookeeper.server.NIOServerCnxnFactory.run(NIOServerCnxnFactory.java:208)
   [junit4]   2> 	at java.lang.Thread.run(Thread.java:745)
   [junit4]   2> 1813664 INFO  (jetty-launcher-2149-thread-2) [    ] o.a.s.u.UpdateShardHandler Creating UpdateShardHandler HTTP client with params: socketTimeout=340000&connTimeout=45000&retry=true
   [junit4]   2> 1813664 INFO  (jetty-launcher-2149-thread-3) [    ] o.a.s.u.UpdateShardHandler Creating UpdateShardHandler HTTP client with params: socketTimeout=340000&connTimeout=45000&retry=true
   [junit4]   2> 1813664 INFO  (jetty-launcher-2149-thread-1) [    ] o.a.s.u.UpdateShardHandler Creating UpdateShardHandler HTTP client with params: socketTimeout=340000&connTimeout=45000&retry=true
   [junit4]   2> 1813664 INFO  (jetty-launcher-2149-thread-2) [    ] o.a.s.l.LogWatcher SLF4J impl is org.slf4j.impl.Log4jLoggerFactory
   [junit4]   2> 1813664 INFO  (jetty-launcher-2149-thread-2) [    ] o.a.s.l.LogWatcher Registering Log Listener [Log4j (org.slf4j.impl.Log4jLoggerFactory)]
   [junit4]   2> 1813664 INFO  (jetty-launcher-2149-thread-3) [    ] o.a.s.l.LogWatcher SLF4J impl is org.slf4j.impl.Log4jLoggerFactory
   [junit4]   2> 1813664 INFO  (jetty-launcher-2149-thread-3) [    ] o.a.s.l.LogWatcher Registering Log Listener [Log4j (org.slf4j.impl.Log4jLoggerFactory)]
   [junit4]   2> 1813664 INFO  (jetty-launcher-2149-thread-2) [    ] o.a.s.c.ZkContainer Zookeeper client=127.0.0.1:37656/solr
   [junit4]   2> 1813664 INFO  (jetty-launcher-2149-thread-1) [    ] o.a.s.l.LogWatcher SLF4J impl is org.slf4j.impl.Log4jLoggerFactory
   [junit4]   2> 1813664 INFO  (jetty-launcher-2149-thread-2) [    ] o.a.s.c.ZkController zkHost includes chroot
   [junit4]   2> 1813664 INFO  (jetty-launcher-2149-thread-1) [    ] o.a.s.l.LogWatcher Registering Log Listener [Log4j (org.slf4j.impl.Log4jLoggerFactory)]
   [junit4]   2> 1813664 INFO  (jetty-launcher-2149-thread-2) [    ] o.a.s.c.c.SolrZkClient Using default ZkCredentialsProvider
   [junit4]   2> 1813664 INFO  (jetty-launcher-2149-thread-3) [    ] o.a.s.c.ZkContainer Zookeeper client=127.0.0.1:37656/solr
   [junit4]   2> 1813664 INFO  (jetty-launcher-2149-thread-1) [    ] o.a.s.c.ZkContainer Zookeeper client=127.0.0.1:37656/solr
   [junit4]   2> 1813664 INFO  (jetty-launcher-2149-thread-3) [    ] o.a.s.c.ZkController zkHost includes chroot
   [junit4]   2> 1813665 INFO  (jetty-launcher-2149-thread-1) [    ] o.a.s.c.ZkController zkHost includes chroot
   [junit4]   2> 1813665 INFO  (jetty-launcher-2149-thread-2) [    ] o.a.s.c.c.ConnectionManager Waiting for client to connect to ZooKeeper
   [junit4]   2> 1813665 INFO  (jetty-launcher-2149-thread-1) [    ] o.a.s.c.c.SolrZkClient Using default ZkCredentialsProvider
   [junit4]   2> 1813665 INFO  (jetty-launcher-2149-thread-3) [    ] o.a.s.c.c.SolrZkClient Using default ZkCredentialsProvider
   [junit4]   2> 1813665 INFO  (jetty-launcher-2149-thread-1) [    ] o.a.s.c.c.ConnectionManager Waiting for client to connect to ZooKeeper
   [junit4]   2> 1813665 INFO  (jetty-launcher-2149-thread-3) [    ] o.a.s.c.c.ConnectionManager Waiting for client to connect to ZooKeeper
   [junit4]   2> 1813665 INFO  (zkCallback-2160-thread-1) [    ] o.a.s.c.c.ConnectionManager Watcher org.apache.solr.common.cloud.ConnectionManager@707a46c0 name:ZooKeeperConnection Watcher:127.0.0.1:37656 got event WatchedEvent state:SyncConnected type:None path:null path:null type:None
   [junit4]   2> 1813665 INFO  (jetty-launcher-2149-thread-2) [    ] o.a.s.c.c.ConnectionManager Client is connected to ZooKeeper
   [junit4]   2> 1813665 INFO  (zkCallback-2162-thread-1) [    ] o.a.s.c.c.ConnectionManager Watcher org.apache.solr.common.cloud.ConnectionManager@2a72ad8c name:ZooKeeperConnection Watcher:127.0.0.1:37656 got event WatchedEvent state:SyncConnected type:None path:null path:null type:None
   [junit4]   2> 1813665 INFO  (jetty-launcher-2149-thread-1) [    ] o.a.s.c.c.ConnectionManager Client is connected to ZooKeeper
   [junit4]   2> 1813665 INFO  (jetty-launcher-2149-thread-2) [    ] o.a.s.c.c.SolrZkClient Using default ZkACLProvider
   [junit4]   2> 1813665 INFO  (zkCallback-2161-thread-1) [    ] o.a.s.c.c.ConnectionManager Watcher org.apache.solr.common.cloud.ConnectionManager@6bdb5817 name:ZooKeeperConnection Watcher:127.0.0.1:37656 got event WatchedEvent state:SyncConnected type:None path:null path:null type:None
   [junit4]   2> 1813666 INFO  (jetty-launcher-2149-thread-3) [    ] o.a.s.c.c.ConnectionManager Client is connected to ZooKeeper
   [junit4]   2> 1813666 INFO  (jetty-launcher-2149-thread-1) [    ] o.a.s.c.c.SolrZkClient Using default ZkACLProvider
   [junit4]   2> 1813666 INFO  (jetty-launcher-2149-thread-3) [    ] o.a.s.c.c.SolrZkClient Using default ZkACLProvider
   [junit4]   2> 1813666 INFO  (jetty-launcher-2149-thread-1) [n:127.0.0.1:39597_solr    ] o.a.s.c.ZkController Added new OnReconnect listener org.apache.solr.cloud.ZkController$$Lambda$78/758547493@a418a88
   [junit4]   2> 1813666 INFO  (jetty-launcher-2149-thread-2) [n:127.0.0.1:37536_solr    ] o.a.s.c.ZkController Added new OnReconnect listener org.apache.solr.cloud.ZkController$$Lambda$78/758547493@1790290d
   [junit4]   2> 1813666 INFO  (jetty-launcher-2149-thread-3) [n:127.0.0.1:32955_solr    ] o.a.s.c.ZkController Added new OnReconnect listener org.apache.solr.cloud.ZkController$$Lambda$78/758547493@1b101c3f
   [junit4]   2> 1813666 INFO  (jetty-launcher-2149-thread-1) [n:127.0.0.1:39597_solr    ] o.a.s.c.c.ConnectionManager Waiting for client to connect to ZooKeeper
   [junit4]   2> 1813666 INFO  (jetty-launcher-2149-thread-2) [n:127.0.0.1:37536_solr    ] o.a.s.c.c.ConnectionManager Waiting for client to connect to ZooKeeper
   [junit4]   2> 1813666 INFO  (jetty-launcher-2149-thread-3) [n:127.0.0.1:32955_solr    ] o.a.s.c.c.ConnectionManager Waiting for client to connect to ZooKeeper
   [junit4]   2> 1813667 INFO  (zkCallback-2163-thread-1-processing-n:127.0.0.1:39597_solr) [n:127.0.0.1:39597_solr    ] o.a.s.c.c.ConnectionManager Watcher org.apache.solr.common.cloud.ConnectionManager@361a8b91 name:ZooKeeperConnection Watcher:127.0.0.1:37656/solr got event WatchedEvent state:SyncConnected type:None path:null path:null type:None
   [junit4]   2> 1813667 INFO  (jetty-launcher-2149-thread-1) [n:127.0.0.1:39597_solr    ] o.a.s.c.c.ConnectionManager Client is connected to ZooKeeper
   [junit4]   2> 1813667 INFO  (zkCallback-2164-thread-1-processing-n:127.0.0.1:37536_solr) [n:127.0.0.1:37536_solr    ] o.a.s.c.c.ConnectionManager Watcher org.apache.solr.common.cloud.ConnectionManager@6e48928 name:ZooKeeperConnection Watcher:127.0.0.1:37656/solr got event WatchedEvent state:SyncConnected type:None path:null path:null type:None
   [junit4]   2> 1813667 INFO  (jetty-launcher-2149-thread-2) [n:127.0.0.1:37536_solr    ] o.a.s.c.c.ConnectionManager Client is connected to ZooKeeper
   [junit4]   2> 1813667 INFO  (zkCallback-2165-thread-1-processing-n:127.0.0.1:32955_solr) [n:127.0.0.1:32955_solr    ] o.a.s.c.c.ConnectionManager Watcher org.apache.solr.common.cloud.ConnectionManager@3ff8fde6 name:ZooKeeperConnection Watcher:127.0.0.1:37656/solr got event WatchedEvent state:SyncConnected type:None path:null path:null type:None
   [junit4]   2> 1813667 INFO  (jetty-launcher-2149-thread-3) [n:127.0.0.1:32955_solr    ] o.a.s.c.c.ConnectionManager Client is connected to ZooKeeper
   [junit4]   2> 1813667 INFO  (jetty-launcher-2149-thread-1) [n:127.0.0.1:39597_solr    ] o.a.s.c.c.SolrZkClient makePath: /overseer/queue
   [junit4]   2> 1813667 INFO  (jetty-launcher-2149-thread-2) [n:127.0.0.1:37536_solr    ] o.a.s.c.c.SolrZkClient makePath: /overseer/queue
   [junit4]   2> 1813667 INFO  (jetty-launcher-2149-thread-3) [n:127.0.0.1:32955_solr    ] o.a.s.c.c.SolrZkClient makePath: /overseer/queue
   [junit4]   2> 1813668 INFO  (jetty-launcher-2149-thread-2) [n:127.0.0.1:37536_solr    ] o.a.s.c.c.SolrZkClient makePath: /overseer/collection-queue-work
   [junit4]   2> 1813668 INFO  (jetty-launcher-2149-thread-1) [n:127.0.0.1:39597_solr    ] o.a.s.c.c.SolrZkClient makePath: /overseer/collection-queue-work
   [junit4]   2> 1813668 INFO  (jetty-launcher-2149-thread-3) [n:127.0.0.1:32955_solr    ] o.a.s.c.c.SolrZkClient makePath: /overseer/collection-queue-work
   [junit4]   2> 1813669 INFO  (jetty-launcher-2149-thread-1) [n:127.0.0.1:39597_solr    ] o.a.s.c.c.SolrZkClient makePath: /overseer/collection-map-running
   [junit4]   2> 1813669 INFO  (jetty-launcher-2149-thread-2) [n:127.0.0.1:37536_solr    ] o.a.s.c.c.SolrZkClient makePath: /overseer/collection-map-running
   [junit4]   2> 1813669 INFO  (jetty-launcher-2149-thread-3) [n:127.0.0.1:32955_solr    ] o.a.s.c.c.SolrZkClient makePath: /overseer/collection-map-running
   [junit4]   2> 1813669 INFO  (jetty-launcher-2149-thread-2) [n:127.0.0.1:37536_solr    ] o.a.s.c.c.SolrZkClient makePath: /overseer/collection-map-completed
   [junit4]   2> 1813669 INFO  (jetty-launcher-2149-thread-1) [n:127.0.0.1:39597_solr    ] o.a.s.c.c.SolrZkClient makePath: /overseer/collection-map-completed
   [junit4]   2> 1813670 INFO  (jetty-launcher-2149-thread-3) [n:127.0.0.1:32955_solr    ] o.a.s.c.c.SolrZkClient makePath: /overseer/collection-map-completed
   [junit4]   2> 1813670 INFO  (jetty-launcher-2149-thread-1) [n:127.0.0.1:39597_solr    ] o.a.s.c.c.SolrZkClient makePath: /overseer/collection-map-failure
   [junit4]   2> 1813670 INFO  (jetty-launcher-2149-thread-2) [n:127.0.0.1:37536_solr    ] o.a.s.c.c.SolrZkClient makePath: /overseer/collection-map-failure
   [junit4]   2> 1813670 INFO  (jetty-launcher-2149-thread-3) [n:127.0.0.1:32955_solr    ] o.a.s.c.c.SolrZkClient makePath: /live_nodes
   [junit4]   2> 1813670 INFO  (jetty-launcher-2149-thread-1) [n:127.0.0.1:39597_solr    ] o.a.s.c.c.SolrZkClient makePath: /live_nodes
   [junit4]   2> 1813670 INFO  (jetty-launcher-2149-thread-2) [n:127.0.0.1:37536_solr    ] o.a.s.c.c.SolrZkClient makePath: /live_nodes
   [junit4]   2> 1813671 INFO  (jetty-launcher-2149-thread-1) [n:127.0.0.1:39597_solr    ] o.a.s.c.c.SolrZkClient makePath: /collections
   [junit4]   2> 1813671 INFO  (jetty-launcher-2149-thread-2) [n:127.0.0.1:37536_solr    ] o.a.s.c.c.SolrZkClient makePath: /collections
   [junit4]   2> 1813671 INFO  (jetty-launcher-2149-thread-3) [n:127.0.0.1:32955_solr    ] o.a.s.c.c.SolrZkClient makePath: /collections
   [junit4]   2> 1813671 INFO  (jetty-launcher-2149-thread-1) [n:127.0.0.1:39597_solr    ] o.a.s.c.c.SolrZkClient makePath: /aliases.json
   [junit4]   2> 1813671 INFO  (jetty-launcher-2149-thread-2) [n:127.0.0.1:37536_solr    ] o.a.s.c.c.SolrZkClient makePath: /aliases.json
   [junit4]   2> 1813671 INFO  (jetty-launcher-2149-thread-3) [n:127.0.0.1:32955_solr    ] o.a.s.c.c.SolrZkClient makePath: /aliases.json
   [junit4]   2> 1813672 INFO  (jetty-launcher-2149-thread-1) [n:127.0.0.1:39597_solr    ] o.a.s.c.c.SolrZkClient makePath: /clusterstate.json
   [junit4]   2> 1813672 INFO  (jetty-launcher-2149-thread-2) [n:127.0.0.1:37536_solr    ] o.a.s.c.c.SolrZkClient makePath: /clusterstate.json
   [junit4]   2> 1813672 INFO  (jetty-launcher-2149-thread-3) [n:127.0.0.1:32955_solr    ] o.a.s.c.c.SolrZkClient makePath: /clusterstate.json
   [junit4]   2> 1813672 INFO  (jetty-launcher-2149-thread-2) [n:127.0.0.1:37536_solr    ] o.a.s.c.c.SolrZkClient makePath: /security.json
   [junit4]   2> 1813672 INFO  (jetty-launcher-2149-thread-1) [n:127.0.0.1:39597_solr    ] o.a.s.c.c.SolrZkClient makePath: /security.json
   [junit4]   2> 1813672 INFO  (jetty-launcher-2149-thread-3) [n:127.0.0.1:32955_solr    ] o.a.s.c.c.SolrZkClient makePath: /security.json
   [junit4]   2> 1813672 INFO  (jetty-launcher-2149-thread-1) [n:127.0.0.1:39597_solr    ] o.a.s.c.c.ZkStateReader Updating cluster state from ZooKeeper... 
   [junit4]   2> 1813672 INFO  (jetty-launcher-2149-thread-2) [n:127.0.0.1:37536_solr    ] o.a.s.c.c.ZkStateReader Updating cluster state from ZooKeeper... 
   [junit4]   2> 1813672 INFO  (jetty-launcher-2149-thread-3) [n:127.0.0.1:32955_solr    ] o.a.s.c.c.ZkStateReader Updating cluster state from ZooKeeper... 
   [junit4]   2> 1813672 INFO  (jetty-launcher-2149-thread-1) [n:127.0.0.1:39597_solr    ] o.a.s.c.c.ZkStateReader Loaded cluster properties: {urlScheme=https}
   [junit4]   2> 1813672 INFO  (jetty-launcher-2149-thread-2) [n:127.0.0.1:37536_solr    ] o.a.s.c.c.ZkStateReader Loaded cluster properties: {urlScheme=https}
   [junit4]   2> 1813672 INFO  (jetty-launcher-2149-thread-1) [n:127.0.0.1:39597_solr    ] o.a.s.c.c.ZkStateReader Updated live nodes from ZooKeeper... (0) -> (0)
   [junit4]   2> 1813673 INFO  (jetty-launcher-2149-thread-2) [n:127.0.0.1:37536_solr    ] o.a.s.c.c.ZkStateReader Updated live nodes from ZooKeeper... (0) -> (0)
   [junit4]   2> 1813673 INFO  (jetty-launcher-2149-thread-3) [n:127.0.0.1:32955_solr    ] o.a.s.c.c.ZkStateReader Loaded cluster properties: {urlScheme=https}
   [junit4]   2> 1813673 INFO  (jetty-launcher-2149-thread-3) [n:127.0.0.1:32955_solr    ] o.a.s.c.c.ZkStateReader Updated live nodes from ZooKeeper... (0) -> (0)
   [junit4]   2> 1813673 INFO  (jetty-launcher-2149-thread-2) [n:127.0.0.1:37536_solr    ] o.a.s.c.c.SolrZkClient makePath: /overseer_elect
   [junit4]   2> 1813673 INFO  (jetty-launcher-2149-thread-1) [n:127.0.0.1:39597_solr    ] o.a.s.c.c.SolrZkClient makePath: /overseer_elect
   [junit4]   2> 1813674 INFO  (jetty-launcher-2149-thread-1) [n:127.0.0.1:39597_solr    ] o.a.s.c.c.SolrZkClient makePath: /overseer_elect/election
   [junit4]   2> 1813674 INFO  (jetty-launcher-2149-thread-2) [n:127.0.0.1:37536_solr    ] o.a.s.c.c.SolrZkClient makePath: /overseer_elect/election
   [junit4]   2> 1813674 INFO  (jetty-launcher-2149-thread-3) [n:127.0.0.1:32955_solr    ] o.a.s.c.c.SolrZkClient makePath: /overseer_elect/election
   [junit4]   2> 1813675 INFO  (jetty-launcher-2149-thread-1) [n:127.0.0.1:39597_solr    ] o.a.s.c.Overseer Overseer (id=null) closing
   [junit4]   2> 1813675 INFO  (jetty-launcher-2149-thread-2) [n:127.0.0.1:37536_solr    ] o.a.s.c.Overseer Overseer (id=null) closing
   [junit4]   2> 1813675 INFO  (jetty-launcher-2149-thread-3) [n:127.0.0.1:32955_solr    ] o.a.s.c.Overseer Overseer (id=null) closing
   [junit4]   2> 1813675 INFO  (jetty-launcher-2149-thread-1) [n:127.0.0.1:39597_solr    ] o.a.s.c.LeaderElector Joined leadership election with path: /overseer_elect/election/96573189208080391-127.0.0.1:39597_solr-n_0000000000
   [junit4]   2> 1813675 INFO  (jetty-launcher-2149-thread-2) [n:127.0.0.1:37536_solr    ] o.a.s.c.LeaderElector Joined leadership election with path: /overseer_elect/election/96573189208080392-127.0.0.1:37536_solr-n_0000000001
   [junit4]   2> 1813676 INFO  (jetty-launcher-2149-thread-3) [n:127.0.0.1:32955_solr    ] o.a.s.c.LeaderElector Joined leadership election with path: /overseer_elect/election/96573189208080393-127.0.0.1:32955_solr-n_0000000002
   [junit4]   2> 1813676 INFO  (jetty-launcher-2149-thread-1) [n:127.0.0.1:39597_solr    ] o.a.s.c.OverseerElectionContext I am going to be the leader 127.0.0.1:39597_solr
   [junit4]   2> 1813676 INFO  (jetty-launcher-2149-thread-1) [n:127.0.0.1:39597_solr    ] o.a.s.c.c.SolrZkClient makePath: /overseer_elect/leader
   [junit4]   2> 1813676 INFO  (jetty-launcher-2149-thread-2) [n:127.0.0.1:37536_solr    ] o.a.s.c.LeaderElector Watching path /overseer_elect/election/96573189208080391-127.0.0.1:39597_solr-n_0000000000 to know if I could be the leader
   [junit4]   2> 1813676 INFO  (jetty-launcher-2149-thread-3) [n:127.0.0.1:32955_solr    ] o.a.s.c.LeaderElector Watching path /overseer_elect/election/96573189208080392-127.0.0.1:37536_solr-n_0000000001 to know if I could be the leader
   [junit4]   2> 1813676 INFO  (jetty-launcher-2149-thread-2) [n:127.0.0.1:37536_solr    ] o.a.s.c.ZkController Register node as live in ZooKeeper:/live_nodes/127.0.0.1:37536_solr
   [junit4]   2> 1813676 INFO  (jetty-launcher-2149-thread-3) [n:127.0.0.1:32955_solr    ] o.a.s.c.ZkController Register node as live in ZooKeeper:/live_nodes/127.0.0.1:32955_solr
   [junit4]   2> 1813676 INFO  (jetty-launcher-2149-thread-2) [n:127.0.0.1:37536_solr    ] o.a.s.c.c.SolrZkClient makePath: /live_nodes/127.0.0.1:37536_solr
   [junit4]   2> 1813676 INFO  (jetty-launcher-2149-thread-3) [n:127.0.0.1:32955_solr    ] o.a.s.c.c.SolrZkClient makePath: /live_nodes/127.0.0.1:32955_solr
   [junit4]   2> 1813676 INFO  (jetty-launcher-2149-thread-1) [n:127.0.0.1:39597_solr    ] o.a.s.c.Overseer Overseer (id=96573189208080391-127.0.0.1:39597_solr-n_0000000000) starting
   [junit4]   2> 1813676 INFO  (zkCallback-2164-thread-1-processing-n:127.0.0.1:37536_solr) [n:127.0.0.1:37536_solr    ] o.a.s.c.c.ZkStateReader A live node change: [WatchedEvent state:SyncConnected type:NodeChildrenChanged path:/live_nodes], has occurred - updating... (live nodes size: [0])
   [junit4]   2> 1813676 INFO  (zkCallback-2163-thread-1-processing-n:127.0.0.1:39597_solr) [n:127.0.0.1:39597_solr    ] o.a.s.c.c.ZkStateReader A live node change: [WatchedEvent state:SyncConnected type:NodeChildrenChanged path:/live_nodes], has occurred - updating... (live nodes size: [0])
   [junit4]   2> 1813676 INFO  (zkCallback-2165-thread-1-processing-n:127.0.0.1:32955_solr) [n:127.0.0.1:32955_solr    ] o.a.s.c.c.ZkStateReader A live node change: [WatchedEvent state:SyncConnected type:NodeChildrenChanged path:/live_nodes], has occurred - updating... (live nodes size: [0])
   [junit4]   2> 1813677 INFO  (zkCallback-2164-thread-1-processing-n:127.0.0.1:37536_solr) [n:127.0.0.1:37536_solr    ] o.a.s.c.c.ZkStateReader Updated live nodes from ZooKeeper... (0) -> (2)
   [junit4]   2> 1813677 INFO  (zkCallback-2163-thread-1-processing-n:127.0.0.1:39597_solr) [n:127.0.0.1:39597_solr    ] o.a.s.c.c.ZkStateReader Updated live nodes from ZooKeeper... (0) -> (2)
   [junit4]   2> 1813677 INFO  (zkCallback-2165-thread-1-processing-n:127.0.0.1:32955_solr) [n:127.0.0.1:32955_solr    ] o.a.s.c.c.ZkStateReader Updated live nodes from ZooKeeper... (0) -> (2)
   [junit4]   2> 1813677 INFO  (jetty-launcher-2149-thread-1) [n:127.0.0.1:39597_solr    ] o.a.s.c.c.SolrZkClient makePath: /overseer/queue-work
   [junit4]   2> 1813679 INFO  (jetty-launcher-2149-thread-1) [n:127.0.0.1:39597_solr    ] o.a.s.c.OverseerAutoReplicaFailoverThread Starting OverseerAutoReplicaFailoverThread autoReplicaFailoverWorkLoopDelay=10000 autoReplicaFailoverWaitAfterExpiration=30000 autoReplicaFailoverBadNodeExpiration=60000
   [junit4]   2> 1813679 INFO  (OverseerCollectionConfigSetProcessor-96573189208080391-127.0.0.1:39597_solr-n_0000000000) [n:127.0.0.1:39597_solr    ] o.a.s.c.OverseerTaskProcessor Process current queue of overseer operations
   [junit4]   2> 1813679 INFO  (OverseerStateUpdate-96573189208080391-127.0.0.1:39597_solr-n_0000000000) [n:127.0.0.1:39597_solr    ] o.a.s.c.Overseer Starting to work on the main queue
   [junit4]   2> 1813680 INFO  (jetty-launcher-2149-thread-1) [n:127.0.0.1:39597_solr    ] o.a.s.c.ZkController Publish node=127.0.0.1:39597_solr as DOWN
   [junit4]   2> 1813680 INFO  (OverseerStateUpdate-96573189208080391-127.0.0.1:39597_solr-n_0000000000) [n:127.0.0.1:39597_solr    ] o.a.s.c.c.ZkStateReader Updated live nodes from ZooKeeper... (2) -> (2)
   [junit4]   2> 1813680 INFO  (jetty-launcher-2149-thread-1) [n:127.0.0.1:39597_solr    ] o.a.s.c.ZkController Register node as live in ZooKeeper:/live_nodes/127.0.0.1:39597_solr
   [junit4]   2> 1813680 INFO  (jetty-launcher-2149-thread-1) [n:127.0.0.1:39597_solr    ] o.a.s.c.c.SolrZkClient makePath: /live_nodes/127.0.0.1:39597_solr
   [junit4]   2> 1813680 INFO  (OverseerStateUpdate-96573189208080391-127.0.0.1:39597_solr-n_0000000000) [n:127.0.0.1:39597_solr    ] o.a.s.c.Overseer processMessage: queueSize: 1, message = {
   [junit4]   2>   "operation":"downnode",
   [junit4]   2>   "node_name":"127.0.0.1:39597_solr"} current state version: 0
   [junit4]   2> 1813680 INFO  (OverseerStateUpdate-96573189208080391-127.0.0.1:39597_solr-n_0000000000) [n:127.0.0.1:39597_solr    ] o.a.s.c.o.NodeMutator DownNode state invoked for node: 127.0.0.1:39597_solr
   [junit4]   2> 1813680 INFO  (zkCallback-2164-thread-1-processing-n:127.0.0.1:37536_solr) [n:127.0.0.1:37536_solr    ] o.a.s.c.c.ZkStateReader A live node change: [WatchedEvent state:SyncConnected type:NodeChildrenChanged path:/live_nodes], has occurred - updating... (live nodes size: [2])
   [junit4]   2> 1813681 INFO  (zkCallback-2163-thread-1-processing-n:127.0.0.1:39597_solr) [n:127.0.0.1:39597_solr    ] o.a.s.c.c.ZkStateReader A live node change: [WatchedEvent state:SyncConnected type:NodeChildrenChanged path:/live_nodes], has occurred - updating... (live nodes size: [2])
   [junit4]   2> 1813680 INFO  (zkCallback-2165-thread-1-processing-n:127.0.0.1:32955_solr) [n:127.0.0.1:32955_solr    ] o.a.s.c.c.ZkStateReader A live node change: [WatchedEvent state:SyncConnected type:NodeChildrenChanged path:/live_nodes], has occurred - updating... (live nodes size: [2])
   [junit4]   2> 1813681 INFO  (zkCallback-2164-thread-1-processing-n:127.0.0.1:37536_solr) [n:127.0.0.1:37536_solr    ] o.a.s.c.c.ZkStateReader Updated live nodes from ZooKeeper... (2) -> (3)
   [junit4]   2> 1813681 INFO  (zkCallback-2163-thread-1-processing-n:127.0.0.1:39597_solr) [n:127.0.0.1:39597_solr    ] o.a.s.c.c.ZkStateReader Updated live nodes from ZooKeeper... (2) -> (3)
   [junit4]   2> 1813681 INFO  (zkCallback-2165-thread-1-processing-n:127.0.0.1:32955_solr) [n:127.0.0.1:32955_solr    ] o.a.s.c.c.ZkStateReader Updated live nodes from ZooKeeper... (2) -> (3)
   [junit4]   2> 1813706 INFO  (jetty-launcher-2149-thread-2) [n:127.0.0.1:37536_solr    ] o.a.s.c.CoreContainer Security conf doesn't exist. Skipping setup for authorization module.
   [junit4]   2> 1813706 INFO  (jetty-launcher-2149-thread-2) [n:127.0.0.1:37536_solr    ] o.a.s.c.CoreContainer No authentication plugin used.
   [junit4]   2> 1813706 INFO  (jetty-launcher-2149-thread-2) [n:127.0.0.1:37536_solr    ] o.a.s.c.CorePropertiesLocator Looking for core definitions underneath /home/jenkins/workspace/Lucene-Solr-6.x-Linux/solr/build/solr-core/test/J0/temp/solr.security.BasicAuthIntegrationTest_A2D8722F357B9A48-001/tempDir-001/node2/.
   [junit4]   2> 1813706 INFO  (jetty-launcher-2149-thread-2) [n:127.0.0.1:37536_solr    ] o.a.s.c.CorePropertiesLocator Found 0 core definitions
   [junit4]   2> 1813707 INFO  (jetty-launcher-2149-thread-2) [n:127.0.0.1:37536_solr    ] o.a.s.s.SolrDispatchFilter user.dir=/home/jenkins/workspace/Lucene-Solr-6.x-Linux/solr/build/solr-core/test/J0
   [junit4]   2> 1813707 INFO  (jetty-launcher-2149-thread-2) [n:127.0.0.1:37536_solr    ] o.a.s.s.SolrDispatchFilter SolrDispatchFilter.init() done
   [junit4]   2> 1813711 INFO  (jetty-launcher-2149-thread-1) [n:127.0.0.1:39597_solr    ] o.a.s.c.CoreContainer Security conf doesn't exist. Skipping setup for authorization module.
   [junit4]   2> 1813711 INFO  (jetty-launcher-2149-thread-1) [n:127.0.0.1:39597_solr    ] o.a.s.c.CoreContainer No authentication plugin used.
   [junit4]   2> 1813712 INFO  (jetty-launcher-2149-thread-1) [n:127.0.0.1:39597_solr    ] o.a.s.c.CorePropertiesLocator Looking for core definitions underneath /home/jenkins/workspace/Lucene-Solr-6.x-Linux/solr/build/solr-core/test/J0/temp/solr.security.BasicAuthIntegrationTest_A2D8722F357B9A48-001/tempDir-001/node1/.
   [junit4]   2> 1813712 INFO  (jetty-launcher-2149-thread-1) [n:127.0.0.1:39597_solr    ] o.a.s.c.CorePropertiesLocator Found 0 core definitions
   [junit4]   2> 1813712 INFO  (jetty-launcher-2149-thread-1) [n:127.0.0.1:39597_solr    ] o.a.s.s.SolrDispatchFilter user.dir=/home/jenkins/workspace/Lucene-Solr-6.x-Linux/solr/build/solr-core/test/J0
   [junit4]   2> 1813712 INFO  (jetty-launcher-2149-thread-1) [n:127.0.0.1:39597_solr    ] o.a.s.s.SolrDispatchFilter SolrDispatchFilter.init() done
   [junit4]   2> 1813713 INFO  (jetty-launcher-2149-thread-3) [n:127.0.0.1:32955_solr    ] o.a.s.c.CoreContainer Security conf doesn't exist. Skipping setup for authorization module.
   [junit4]   2> 1813713 INFO  (jetty-launcher-2149-thread-3) [n:127.0.0.1:32955_solr    ] o.a.s.c.CoreContainer No authentication plugin used.
   [junit4]   2> 1813713 INFO  (jetty-launcher-2149-thread-3) [n:127.0.0.1:32955_solr    ] o.a.s.c.CorePropertiesLocator Looking for core definitions underneath /home/jenkins/workspace/Lucene-Solr-6.x-Linux/solr/build/solr-core/test/J0/temp/solr.security.BasicAuthIntegrationTest_A2D8722F357B9A48-001/tempDir-001/node3/.
   [junit4]   2> 1813713 INFO  (jetty-launcher-2149-thread-3) [n:127.0.0.1:32955_solr    ] o.a.s.c.CorePropertiesLocator Found 0 core definitions
   [junit4]   2> 1813714 INFO  (jetty-launcher-2149-thread-3) [n:127.0.0.1:32955_solr    ] o.a.s.s.SolrDispatchFilter user.dir=/home/jenkins/workspace/Lucene-Solr-6.x-Linux/solr/build/solr-core/test/J0
   [junit4]   2> 1813714 INFO  (jetty-launcher-2149-thread-3) [n:127.0.0.1:32955_solr    ] o.a.s.s.SolrDispatchFilter SolrDispatchFilter.init() done
   [junit4]   2> 1813714 INFO  (SUITE-BasicAuthIntegrationTest-seed#[A2D8722F357B9A48]-worker) [    ] o.a.s.c.c.SolrZkClient Using default ZkCredentialsProvider
   [junit4]   2> 1813714 INFO  (SUITE-BasicAuthIntegrationTest-seed#[A2D8722F357B9A48]-worker) [    ] o.a.s.c.c.ConnectionManager Waiting for client to connect to ZooKeeper
   [junit4]   2> 1813715 INFO  (zkCallback-2169-thread-1) [    ] o.a.s.c.c.ConnectionManager Watcher org.apache.solr.common.cloud.ConnectionManager@50cac20f name:ZooKeeperConnection Watcher:127.0.0.1:37656 got event WatchedEvent state:SyncConnected type:None path:null path:null type:None
   [junit4]   2> 1813715 INFO  (SUITE-BasicAuthIntegrationTest-seed#[A2D8722F357B9A48]-worker) [    ] o.a.s.c.c.ConnectionManager Client is connected to ZooKeeper
   [junit4]   2> 1813715 INFO  (SUITE-BasicAuthIntegrationTest-seed#[A2D8722F357B9A48]-worker) [    ] o.a.s.c.c.SolrZkClient Using default ZkACLProvider
   [junit4]   2> 1813716 INFO  (SUITE-BasicAuthIntegrationTest-seed#[A2D8722F357B9A48]-worker) [    ] o.a.s.c.c.SolrZkClient Using default ZkCredentialsProvider
   [junit4]   2> 1813716 INFO  (SUITE-BasicAuthIntegrationTest-seed#[A2D8722F357B9A48]-worker) [    ] o.a.s.c.c.ConnectionManager Waiting for client to connect to ZooKeeper
   [junit4]   2> 1813716 INFO  (zkCallback-2172-thread-1) [    ] o.a.s.c.c.ConnectionManager Watcher org.apache.solr.common.cloud.ConnectionManager@23846cf6 name:ZooKeeperConnection Watcher:127.0.0.1:37656/solr got event WatchedEvent state:SyncConnected type:None path:null path:null type:None
   [junit4]   2> 1813716 INFO  (SUITE-BasicAuthIntegrationTest-seed#[A2D8722F357B9A48]-worker) [    ] o.a.s.c.c.ConnectionManager Client is connected to ZooKeeper
   [junit4]   2> 1813716 INFO  (SUITE-BasicAuthIntegrationTest-seed#[A2D8722F357B9A48]-worker) [    ] o.a.s.c.c.SolrZkClient Using default ZkACLProvider
   [junit4]   2> 1813716 INFO  (SUITE-BasicAuthIntegrationTest-seed#[A2D8722F357B9A48]-worker) [    ] o.a.s.c.c.ZkStateReader Updating cluster state from ZooKeeper... 
   [junit4]   2> 1813717 INFO  (SUITE-BasicAuthIntegrationTest-seed#[A2D8722F357B9A48]-worker) [    ] o.a.s.c.c.ZkStateReader Loaded cluster properties: {urlScheme=https}
   [junit4]   2> 1813717 INFO  (SUITE-BasicAuthIntegrationTest-seed#[A2D8722F357B9A48]-worker) [    ] o.a.s.c.c.ZkStateReader Updated live nodes from ZooKeeper... (0) -> (3)
   [junit4]   2> 1813717 INFO  (SUITE-BasicAuthIntegrationTest-seed#[A2D8722F357B9A48]-worker) [    ] o.a.s.c.c.SolrZkClient makePath: /configs/conf/solrconfig.xml
   [junit4]   2> 1813718 INFO  (SUITE-BasicAuthIntegrationTest-seed#[A2D8722F357B9A48]-worker) [    ] o.a.s.c.c.SolrZkClient makePath: /configs/conf/schema.xml
   [junit4]   2> 1813774 INFO  (qtp1730975146-12827) [n:127.0.0.1:32955_solr    ] o.a.s.h.a.CollectionsHandler Invoked Collection Action :create with params replicationFactor=1&collection.configName=conf&name=authCollection&action=CREATE&numShards=3&wt=javabin&version=2 and sendToOCPQueue=true
   [junit4]   2> 1813775 INFO  (OverseerCollectionConfigSetProcessor-96573189208080391-127.0.0.1:39597_solr-n_0000000000) [n:127.0.0.1:39597_solr    ] o.a.s.c.OverseerTaskProcessor Overseer Collection Message Handler: Get the message id:/overseer/collection-queue-work/qn-0000000000 message:{
   [junit4]   2>   "name":"authCollection",
   [junit4]   2>   "fromApi":"true",
   [junit4]   2>   "replicationFactor":"1",
   [junit4]   2>   "collection.configName":"conf",
   [junit4]   2>   "numShards":"3",
   [junit4]   2>   "stateFormat":"2",
   [junit4]   2>   "operation":"create"}
   [junit4]   2> 1813776 INFO  (OverseerThreadFactory-6564-thread-1-processing-n:127.0.0.1:39597_solr) [n:127.0.0.1:39597_solr    ] o.a.s.c.OverseerCollectionMessageHandler OverseerCollectionMessageHandler.processMessage : create , {
   [junit4]   2>   "name":"authCollection",
   [junit4]   2>   "fromApi":"true",
   [junit4]   2>   "replicationFactor":"1",
   [junit4]   2>   "collection.configName":"conf",
   [junit4]   2>   "numShards":"3",
   [junit4]   2>   "stateFormat":"2",
   [junit4]   2>   "operation":"create"}
   [junit4]   2> 1813776 INFO  (OverseerThreadFactory-6564-thread-1-processing-n:127.0.0.1:39597_solr) [n:127.0.0.1:39597_solr    ] o.a.s.c.CreateCollectionCmd Create collection authCollection
   [junit4]   2> 1813777 INFO  (OverseerThreadFactory-6564-thread-1-processing-n:127.0.0.1:39597_solr) [n:127.0.0.1:39597_solr    ] o.a.s.c.OverseerCollectionMessageHandler creating collections conf node /collections/authCollection 
   [junit4]   2> 1813777 INFO  (OverseerThreadFactory-6564-thread-1-processing-n:127.0.0.1:39597_solr) [n:127.0.0.1:39597_solr    ] o.a.s.c.c.SolrZkClient makePath: /collections/authCollection
   [junit4]   2> 1813777 INFO  (zkCallback-2163-thread-1-processing-n:127.0.0.1:39597_solr) [n:127.0.0.1:39597_solr    ] o.a.s.c.c.ZkStateReader A collections change: [WatchedEvent state:SyncConnected type:NodeChildrenChanged path:/collections], has occurred - updating...
   [junit4]   2> 1813777 INFO  (zkCallback-2172-thread-1) [    ] o.a.s.c.c.ZkStateReader A collections change: [WatchedEvent state:SyncConnected type:NodeChildrenChanged path:/collections], has occurred - updating...
   [junit4]   2> 1813777 INFO  (zkCallback-2165-thread-1-processing-n:127.0.0.1:32955_solr) [n:127.0.0.1:32955_solr    ] o.a.s.c.c.ZkStateReader A collections change: [WatchedEvent state:SyncConnected type:NodeChildrenChanged path:/collections], has occurred - updating...
   [junit4]   2> 1813777 INFO  (zkCallback-2164-thread-1-processing-n:127.0.0.1:37536_solr) [n:127.0.0.1:37536_solr    ] o.a.s.c.c.ZkStateReader A collections change: [WatchedEvent state:SyncConnected type:NodeChildrenChanged path:/collections], has occurred - updating...
   [junit4]   2> 1813778 INFO  (OverseerStateUpdate-96573189208080391-127.0.0.1:39597_solr-n_0000000000) [n:127.0.0.1:39597_solr    ] o.a.s.c.Overseer processMessage: queueSize: 1, message = {
   [junit4]   2>   "name":"authCollection",
   [junit4]   2>   "fromApi":"true",
   [junit4]   2>   "replicationFactor":"1",
   [junit4]   2>   "collection.configName":"conf",
   [junit4]   2>   "numShards":"3",
   [junit4]   2>   "stateFormat":"2",
   [junit4]   2>   "operation":"create"} current state version: 0
   [junit4]   2> 1813779 INFO  (OverseerStateUpdate-96573189208080391-127.0.0.1:39597_solr-n_0000000000) [n:127.0.0.1:39597_solr    ] o.a.s.c.o.ClusterStateMutator building a new cName: authCollection
   [junit4]   2> 1813780 INFO  (OverseerStateUpdate-96573189208080391-127.0.0.1:39597_solr-n_0000000000) [n:127.0.0.1:39597_solr    ] o.a.s.c.o.ZkStateWriter going to create_collection /collections/authCollection/state.json
   [junit4]   2> 1813879 INFO  (OverseerThreadFactory-6564-thread-1-processing-n:127.0.0.1:39597_solr) [n:127.0.0.1:39597_solr    ] o.a.s.c.CreateCollectionCmd Creating SolrCores for new collection authCollection, shardNames [shard1, shard2, shard3] , replicationFactor : 1
   [junit4]   2> 1813879 INFO  (OverseerThreadFactory-6564-thread-1-processing-n:127.0.0.1:39597_solr) [n:127.0.0.1:39597_solr    ] o.a.s.c.CreateCollectionCmd Creating core authCollection_shard2_replica1 as part of shard shard2 of collection authCollection on 127.0.0.1:32955_solr
   [junit4]   2> 1813879 INFO  (OverseerThreadFactory-6564-thread-1-processing-n:127.0.0.1:39597_solr) [n:127.0.0.1:39597_solr    ] o.a.s.c.CreateCollectionCmd Creating core authCollection_shard1_replica1 as part of shard shard1 of collection authCollection on 127.0.0.1:37536_solr
   [junit4]   2> 1813879 INFO  (OverseerThreadFactory-6564-thread-1-processing-n:127.0.0.1:39597_solr) [n:127.0.0.1:39597_solr    ] o.a.s.c.CreateCollectionCmd Creating core authCollection_shard3_replica1 as part of shard shard3 of collection authCollection on 127.0.0.1:39597_solr
   [junit4]   2> 1813886 INFO  (qtp1730975146-12846) [n:127.0.0.1:32955_solr    ] o.a.s.h.a.CoreAdminOperation core create command qt=/admin/cores&collection.configName=conf&name=authCollection_shard2_replica1&action=CREATE&numShards=3&collection=authCollection&shard=shard2&wt=javabin&version=2
   [junit4]   2> 1813886 INFO  (qtp1730975146-12846) [n:127.0.0.1:32955_solr    ] o.a.s.c.CoreDescriptor Created CoreDescriptor: {name=authCollection_shard2_replica1, collection.configName=conf, config=solrconfig.xml, transient=false, schema=schema.xml, loadOnStartup=true, configSetProperties=configsetprops.json, collection=authCollection, numShards=3, dataDir=data/, shard=shard2}
   [junit4]   2> 1813887 INFO  (qtp1730975146-12846) [n:127.0.0.1:32955_solr c:authCollection s:shard2  x:authCollection_shard2_replica1] o.a.s.c.ZkController publishing state=down
   [junit4]   2> 1813887 INFO  (qtp1730975146-12846) [n:127.0.0.1:32955_solr c:authCollection s:shard2  x:authCollection_shard2_replica1] o.a.s.c.ZkController Registering watch for collection authCollection
   [junit4]   2> 1813887 INFO  (OverseerStateUpdate-96573189208080391-127.0.0.1:39597_solr-n_0000000000) [n:127.0.0.1:39597_solr    ] o.a.s.c.Overseer processMessage: queueSize: 1, message = {
   [junit4]   2>   "core":"authCollection_shard2_replica1",
   [junit4]   2>   "roles":null,
   [junit4]   2>   "base_url":"https://127.0.0.1:32955/solr",
   [junit4]   2>   "node_name":"127.0.0.1:32955_solr",
   [junit4]   2>   "numShards":"3",
   [junit4]   2>   "state":"down",
   [junit4]   2>   "shard":"shard2",
   [junit4]   2>   "collection":"authCollection",
   [junit4]   2>   "operation":"state"} current state version: 0
   [junit4]   2> 1813887 INFO  (qtp1730975146-12846) [n:127.0.0.1:32955_solr c:authCollection s:shard2  x:authCollection_shard2_replica1] o.a.s.c.c.ZkStateReader Add data for [authCollection] ver [0]
   [junit4]   2> 1813887 INFO  (OverseerStateUpdate-96573189208080391-127.0.0.1:39597_solr-n_0000000000) [n:127.0.0.1:39597_solr    ] o.a.s.c.o.ReplicaMutator Update state numShards=3 message={
   [junit4]   2>   "core":"authCollection_shard2_replica1",
   [junit4]   2>   "roles":null,
   [junit4]   2>   "base_url":"https://127.0.0.1:32955/solr",
   [junit4]   2>   "node_name":"127.0.0.1:32955_solr",
   [junit4]   2>   "numShards":"3",
   [junit4]   2>   "state":"down",
   [junit4]   2>   "shard":"shard2",
   [junit4]   2>   "collection":"authCollection",
   [junit4]   2>   "operation":"state"}
   [junit4]   2> 1813888 INFO  (qtp1730975146-12846) [n:127.0.0.1:32955_solr c:authCollection s:shard2  x:authCollection_shard2_replica1] o.a.s.c.ZkController look for our core node name
   [junit4]   2> 1813937 INFO  (qtp749647919-12824) [n:127.0.0.1:39597_solr    ] o.a.s.h.a.CoreAdminOperation core create command qt=/admin/cores&collection.configName=conf&name=authCollection_shard3_replica1&action=CREATE&numShards=3&collection=authCollection&shard=shard3&wt=javabin&version=2
   [junit4]   2> 1813937 INFO  (qtp749647919-12824) [n:127.0.0.1:39597_solr    ] o.a.s.c.CoreDescriptor Created CoreDescriptor: {name=authCollection_shard3_replica1, collection.configName=conf, config=solrconfig.xml, transient=false, schema=schema.xml, loadOnStartup=true, configSetProperties=configsetprops.json, collection=authCollection, numShards=3, dataDir=data/, shard=shard3}
   [junit4]   2> 1813937 INFO  (qtp749647919-12824) [n:127.0.0.1:39597_solr c:authCollection s:shard3  x:authCollection_shard3_replica1] o.a.s.c.ZkController publishing state=down
   [junit4]   2> 1813938 INFO  (qtp749647919-12824) [n:127.0.0.1:39597_solr c:authCollection s:shard3  x:authCollection_shard3_replica1] o.a.s.c.ZkController Registering watch for collection authCollection
   [junit4]   2> 1813938 INFO  (OverseerStateUpdate-96573189208080391-127.0.0.1:39597_solr-n_0000000000) [n:127.0.0.1:39597_solr    ] o.a.s.c.Overseer processMessage: queueSize: 1, message = {
   [junit4]   2>   "core":"authCollection_shard3_replica1",
   [junit4]   2>   "roles":null,
   [junit4]   2>   "base_url":"https://127.0.0.1:39597/solr",
   [junit4]   2>   "node_name":"127.0.0.1:39597_solr",
   [junit4]   2>   "numShards":"3",
   [junit4]   2>   "state":"down",
   [junit4]   2>   "shard":"shard3",
   [junit4]   2>   "collection":"authCollection",
   [junit4]   2>   "operation":"state"} current state version: 0
   [junit4]   2> 1813938 INFO  (qtp749647919-12824) [n:127.0.0.1:39597_solr c:authCollection s:shard3  x:authCollection_shard3_replica1] o.a.s.c.c.ZkStateReader Add data for [authCollection] ver [0]
   [junit4]   2> 1813938 INFO  (OverseerStateUpdate-96573189208080391-127.0.0.1:39597_solr-n_0000000000) [n:127.0.0.1:39597_solr    ] o.a.s.c.o.ReplicaMutator Update state numShards=3 message={
   [junit4]   2>   "core":"authCollection_shard3_replica1",
   [junit4]   2>   "roles":null,
   [junit4]   2>   "base_url":"https://127.0.0.1:39597/solr",
   [junit4]   2>   "node_name":"127.0.0.1:39597_solr",
   [junit4]   2>   "numShards":"3",
   [junit4]   2>   "state":"down",
   [junit4]   2>   "shard":"shard3",
   [junit4]   2>   "collection":"authCollection",
   [junit4]   2>   "operation":"state"}
   [junit4]   2> 1813939 INFO  (qtp749647919-12824) [n:127.0.0.1:39597_solr c:authCollection s:shard3  x:authCollection_shard3_replica1] o.a.s.c.ZkController look for our core node name
   [junit4]   2> 1813941 INFO  (qtp583492739-12825) [n:127.0.0.1:37536_solr    ] o.a.s.h.a.CoreAdminOperation core create command qt=/admin/cores&collection.configName=conf&name=authCollection_shard1_replica1&action=CREATE&numShards=3&collection=authCollection&shard=shard1&wt=javabin&version=2
   [junit4]   2> 1813941 INFO  (qtp583492739-12825) [n:127.0.0.1:37536_solr    ] o.a.s.c.CoreDescriptor Created CoreDescriptor: {name=authCollection_shard1_replica1, collection.configName=conf, config=solrconfig.xml, transient=false, schema=schema.xml, loadOnStartup=true, configSetProperties=configsetprops.json, collection=authCollection, numShards=3, dataDir=data/, shard=shard1}
   [junit4]   2> 1813942 INFO  (qtp583492739-12825) [n:127.0.0.1:37536_solr c:authCollection s:shard1  x:authCollection_shard1_replica1] o.a.s.c.ZkController publishing state=down
   [junit4]   2> 1813942 INFO  (qtp583492739-12825) [n:127.0.0.1:37536_solr c:authCollection s:shard1  x:authCollection_shard1_replica1] o.a.s.c.ZkController Registering watch for collection authCollection
   [junit4]   2> 1813943 INFO  (qtp583492739-12825) [n:127.0.0.1:37536_solr c:authCollection s:shard1  x:authCollection_shard1_replica1] o.a.s.c.c.ZkStateReader Add data for [authCollection] ver [0]
   [junit4]   2> 1813943 INFO  (OverseerStateUpdate-96573189208080391-127.0.0.1:39597_solr-n_0000000000) [n:127.0.0.1:39597_solr    ] o.a.s.c.Overseer processMessage: queueSize: 1, message = {
   [junit4]   2>   "core":"authCollection_shard1_replica1",
   [junit4]   2>   "roles":null,
   [junit4]   2>   "base_url":"https://127.0.0.1:37536/solr",
   [junit4]   2>   "node_name":"127.0.0.1:37536_solr",
   [junit4]   2>   "numShards":"3",
   [junit4]   2>   "state":"down",
   [junit4]   2>   "shard":"shard1",
   [junit4]   2>   "collection":"authCollection",
   [junit4]   2>   "operation":"state"} current state version: 0
   [junit4]   2> 1813943 INFO  (OverseerStateUpdate-96573189208080391-127.0.0.1:39597_solr-n_0000000000) [n:127.0.0.1:39597_solr    ] o.a.s.c.o.ReplicaMutator Update state numShards=3 message={
   [junit4]   2>   "core":"authCollection_shard1_replica1",
   [junit4]   2>   "roles":null,
   [junit4]   2>   "base_url":"https://127.0.0.1:37536/solr",
   [junit4]   2>   "node_name":"127.0.0.1:37536_solr",
   [junit4]   2>   "numShards":"3",
   [junit4]   2>   "state":"down",
   [junit4]   2>   "shard":"shard1",
   [junit4]   2>   "collection":"authCollection",
   [junit4]   2>   "operation":"state"}
   [junit4]   2> 1813943 INFO  (qtp583492739-12825) [n:127.0.0.1:37536_solr c:authCollection s:shard1  x:authCollection_shard1_replica1] o.a.s.c.ZkController look for our core node name
   [junit4]   2> 1814044 INFO  (OverseerStateUpdate-96573189208080391-127.0.0.1:39597_solr-n_0000000000) [n:127.0.0.1:39597_solr    ] o.a.s.c.o.ZkStateWriter going to update_collection /collections/authCollection/state.json version: 0
   [junit4]   2> 1814045 INFO  (zkCallback-2164-thread-1-processing-n:127.0.0.1:37536_solr) [n:127.0.0.1:37536_solr    ] o.a.s.c.c.ZkStateReader A cluster state change: [WatchedEvent state:SyncConnected type:NodeDataChanged path:/collections/authCollection/state.json] for collection [authCollection] has occurred - updating... (live nodes size: [3])
   [junit4]   2> 1814045 INFO  (zkCallback-2163-thread-2-processing-n:127.0.0.1:39597_solr) [n:127.0.0.1:39597_solr    ] o.a.s.c.c.ZkStateReader A cluster state change: [WatchedEvent state:SyncConnected type:NodeDataChanged path:/collections/authCollection/state.json] for collection [authCollection] has occurred - updating... (live nodes size: [3])
   [junit4]   2> 1814045 INFO  (zkCallback-2165-thread-1-processing-n:127.0.0.1:32955_solr) [n:127.0.0.1:32955_solr    ] o.a.s.c.c.ZkStateReader A cluster state change: [WatchedEvent state:SyncConnected type:NodeDataChanged path:/collections/authCollection/state.json] for collection [authCollection] has occurred - updating... (live nodes size: [3])
   [junit4]   2> 1814045 INFO  (zkCallback-2163-thread-2-processing-n:127.0.0.1:39597_solr) [n:127.0.0.1:39597_solr    ] o.a.s.c.c.ZkStateReader Updating data for [authCollection] from [0] to [1]
   [junit4]   2> 1814045 INFO  (zkCallback-2164-thread-1-processing-n:127.0.0.1:37536_solr) [n:127.0.0.1:37536_solr    ] o.a.s.c.c.ZkStateReader Updating data for [authCollection] from [0] to [1]
   [junit4]   2> 1814045 INFO  (zkCallback-2165-thread-1-processing-n:127.0.0.1:32955_solr) [n:127.0.0.1:32955_solr    ] o.a.s.c.c.ZkStateReader Updating data for [authCollection] from [0] to [1]
   [junit4]   2> 1814888 INFO  (qtp1730975146-12846) [n:127.0.0.1:32955_solr c:authCollection s:shard2  x:authCollection_shard2_replica1] o.a.s.c.ZkController waiting to find shard id in clusterstate for authCollection_shard2_replica1
   [junit4]   2> 1814888 INFO  (qtp1730975146-12846) [n:127.0.0.1:32955_solr c:authCollection s:shard2  x:authCollection_shard2_replica1] o.a.s.c.ZkController Check for collection zkNode:authCollection
   [junit4]   2> 1814888 INFO  (qtp1730975146-12846) [n:127.0.0.1:32955_solr c:authCollection s:shard2  x:authCollection_shard2_replica1] o.a.s.c.ZkController Collection zkNode exists
   [junit4]   2> 1814888 INFO  (qtp1730975146-12846) [n:127.0.0.1:32955_solr c:authCollection s:shard2  x:authCollection_shard2_replica1] o.a.s.c.c.ZkStateReader Load collection config from: [/collections/authCollection]
   [junit4]   2> 1814889 INFO  (qtp1730975146-12846) [n:127.0.0.1:32955_solr c:authCollection s:shard2  x:authCollection_shard2_replica1] o.a.s.c.c.ZkStateReader path=[/collections/authCollection] [configName]=[conf] specified config exists in ZooKeeper
   [junit4]   2> 1814889 INFO  (qtp1730975146-12846) [n:127.0.0.1:32955_solr c:authCollection s:shard2  x:authCollection_shard2_replica1] o.a.s.c.SolrResourceLoader new SolrResourceLoader for directory: '/home/jenkins/workspace/Lucene-Solr-6.x-Linux/solr/build/solr-core/test/J0/temp/solr.security.BasicAuthIntegrationTest_A2D8722F357B9A48-001/tempDir-001/node3/authCollection_shard2_replica1'
   [junit4]   2> 1814889 INFO  (qtp1730975146-12846) [n:127.0.0.1:32955_solr c:authCollection s:shard2  x:authCollection_shard2_replica1] o.a.s.c.SolrResourceLoader JNDI not configured for solr (NoInitialContextEx)
   [junit4]   2> 1814889 INFO  (qtp1730975146-12846) [n:127.0.0.1:32955_solr c:authCollection s:shard2  x:authCollection_shard2_replica1] o.a.s.c.SolrResourceLoader solr home defaulted to 'solr/' (could not find system property or JNDI)
   [junit4]   2> 1814890 INFO  (qtp1730975146-12846) [n:127.0.0.1:32955_solr c:authCollection s:shard2  x:authCollection_shard2_replica1] o.a.s.c.Config loaded config solrconfig.xml with version 0 
   [junit4]   2> 1814892 INFO  (qtp1730975146-12846) [n:127.0.0.1:32955_solr c:authCollection s:shard2  x:authCollection_shard2_replica1] o.a.s.c.SolrConfig current version of requestparams : -1
   [junit4]   2> 1814893 INFO  (qtp1730975146-12846) [n:127.0.0.1:32955_solr c:authCollection s:shard2  x:authCollection_shard2_replica1] o.a.s.c.SolrConfig Using Lucene MatchVersion: 6.3.0
   [junit4]   2> 1814896 INFO  (qtp1730975146-12846) [n:127.0.0.1:32955_solr c:authCollection s:shard2  x:authCollection_shard2_replica1] o.a.s.c.SolrConfig Loaded SolrConfig: solrconfig.xml
   [junit4]   2> 1814899 INFO  (qtp1730975146-12846) [n:127.0.0.1:32955_solr c:authCollection s:shard2  x:authCollection_shard2_replica1] o.a.s.s.IndexSchema [authCollection_shard2_replica1] Schema name=minimal
   [junit4]   2> 1814901 INFO  (qtp1730975146-12846) [n:127.0.0.1:32955_solr c:authCollection s:shard2  x:authCollection_shard2_replica1] o.a.s.s.IndexSchema unique key field: id
   [junit4]   2> 1814901 INFO  (qtp1730975146-12846) [n:127.0.0.1:32955_solr c:authCollection s:shard2  x:authCollection_shard2_replica1] o.a.s.c.ConfigSetProperties Did not find ConfigSet properties, assuming default properties: Can't find resource 'configsetprops.json' in classpath or '/configs/conf', cwd=/home/jenkins/workspace/Lucene-Solr-6.x-Linux/solr/build/solr-core/test/J0
   [junit4]   2> 1814901 INFO  (qtp1730975146-12846) [n:127.0.0.1:32955_solr c:authCollection s:shard2  x:authCollection_shard2_replica1] o.a.s.c.CoreContainer Creating SolrCore 'authCollection_shard2_replica1' using configuration from collection authCollection
   [junit4]   2> 1814902 INFO  (qtp1730975146-12846) [n:127.0.0.1:32955_solr c:authCollection s:shard2 r:core_node1 x:authCollection_shard2_replica1] o.a.s.c.SolrCore org.apache.solr.core.MockDirectoryFactory
   [junit4]   2> 1814902 INFO  (qtp1730975146-12846) [n:127.0.0.1:32955_solr c:authCollection s:shard2 r:core_node1 x:authCollection_shard2_replica1] o.a.s.c.SolrCore [[authCollection_shard2_replica1] ] Opening new SolrCore at [/home/jenkins/workspace/Lucene-Solr-6.x-Linux/solr/build/solr-core/test/J0/temp/solr.security.BasicAuthIntegrationTest_A2D8722F357B9A48-001/tempDir-001/node3/authCollection_shard2_replica1], dataDir=[/home/jenkins/workspace/Lucene-Solr-6.x-Linux/solr/build/solr-core/test/J0/temp/solr.security.BasicAuthIntegrationTest_A2D8722F357B9A48-001/tempDir-001/node3/./authCollection_shard2_replica1/data/]
   [junit4]   2> 1814902 INFO  (qtp1730975146-12846) [n:127.0.0.1:32955_solr c:authCollection s:shard2 r:core_node1 x:authCollection_shard2_replica1] o.a.s.c.SolrCore JMX monitoring not detected for core: authCollection_shard2_replica1
   [junit4]   2> 1814902 INFO  (qtp1730975146-12846) [n:127.0.0.1:32955_solr c:authCollection s:shard2 r:core_node1 x:authCollection_shard2_replica1] o.a.s.c.CachingDirectoryFactory return new directory for /home/jenkins/workspace/Lucene-Solr-6.x-Linux/solr/build/solr-core/test/J0/temp/solr.security.BasicAuthIntegrationTest_A2D8722F357B9A48-001/tempDir-001/node3/./authCollection_shard2_replica1/data/snapshot_metadata
   [junit4]   2> 1814902 INFO  (qtp1730975146-12846) [n:127.0.0.1:32955_solr c:authCollection s:shard2 r:core_node1 x:authCollection_shard2_replica1] o.a.s.c.s.SolrSnapshotMetaDataManager Loading from snapshot metadata file...
   [junit4]   2> 1814903 INFO  (qtp1730975146-12846) [n:127.0.0.1:32955_solr c:authCollection s:shard2 r:core_node1 x:authCollection_shard2_replica1] o.a.s.c.CachingDirectoryFactory return new directory for /home/jenkins/workspace/Lucene-Solr-6.x-Linux/solr/build/solr-core/test/J0/temp/solr.security.BasicAuthIntegrationTest_A2D8722F357B9A48-001/tempDir-001/node3/./authCollection_shard2_replica1/data
   [junit4]   2> 1814903 INFO  (qtp1730975146-12846) [n:127.0.0.1:32955_solr c:authCollection s:shard2 r:core_node1 x:authCollection_shard2_replica1] o.a.s.c.SolrCore New index directory detected: old=null new=/home/jenkins/workspace/Lucene-Solr-6.x-Linux/solr/build/solr-core/test/J0/temp/solr.security.BasicAuthIntegrationTest_A2D8722F357B9A48-001/tempDir-001/node3/./authCollection_shard2_replica1/data/index/
   [junit4]   2> 1814903 WARN  (qtp1730975146-12846) [n:127.0.0.1:32955_solr c:authCollection s:shard2 r:core_node1 x:authCollection_shard2_replica1] o.a.s.c.SolrCore [authCollection_shard2_replica1] Solr index directory '/home/jenkins/workspace/Lucene-Solr-6.x-Linux/solr/build/solr-core/test/J0/temp/solr.security.BasicAuthIntegrationTest_A2D8722F357B9A48-001/tempDir-001/node3/./authCollection_shard2_replica1/data/index' doesn't exist. Creating new index...
   [junit4]   2> 1814903 INFO  (qtp1730975146-12846) [n:127.0.0.1:32955_solr c:authCollection s:shard2 r:core_node1 x:authCollection_shard2_replica1] o.a.s.c.CachingDirectoryFactory return new directory for /home/jenkins/workspace/Lucene-Solr-6.x-Linux/solr/build/solr-core/test/J0/temp/solr.security.BasicAuthIntegrationTest_A2D8722F357B9A48-001/tempDir-001/node3/./authCollection_shard2_replica1/data/index
   [junit4]   2> 1814903 INFO  (qtp1730975146-12846) [n:127.0.0.1:32955_solr c:authCollection s:shard2 r:core_node1 x:authCollection_shard2_replica1] o.a.s.c.SolrDeletionPolicy SolrDeletionPolicy.onCommit: commits: num=1
   [junit4]   2> 	commit{dir=MockDirectoryWrapper(RAMDirectory@28728387 lockFactory=org.apache.lucene.store.SingleInstanceLockFactory@41f9a649),segFN=segments_1,generation=1}
   [junit4]   2> 1814904 INFO  (qtp1730975146-12846) [n:127.0.0.1:32955_solr c:authCollection s:shard2 r:core_node1 x:authCollection_shard2_replica1] o.a.s.c.SolrDeletionPolicy newest commit generation = 1
   [junit4]   2> 1814904 INFO  (OldIndexDirectoryCleanupThreadForCore-authCollection_shard2_replica1) [n:127.0.0.1:32955_solr c:authCollection s:shard2 r:core_node1 x:authCollection_shard2_replica1] o.a.s.c.SolrCore Looking for old index directories to cleanup for core authCollection_shard2_replica1 in /home/jenkins/workspace/Lucene-Solr-6.x-Linux/solr/build/solr-core/test/J0/temp/solr.security.BasicAuthIntegrationTest_A2D8722F357B9A48-001/tempDir-001/node3/./authCollection_shard2_replica1/data/
   [junit4]   2> 1814904 WARN  (OldIndexDirectoryCleanupThreadForCore-authCollection_shard2_replica1) [n:127.0.0.1:32955_solr c:authCollection s:shard2 r:core_node1 x:authCollection_shard2_replica1] o.a.s.c.DirectoryFactory /home/jenkins/workspace/Lucene-Solr-6.x-Linux/solr/build/solr-core/test/J0/temp/solr.security.BasicAuthIntegrationTest_A2D8722F357B9A48-001/tempDir-001/node3/./authCollection_shard2_replica1/data/ does not point to a valid data directory; skipping clean-up of old index directories.
   [junit4]   2> 1814905 INFO  (qtp1730975146-12846) [n:127.0.0.1:32955_solr c:authCollection s:shard2 r:core_node1 x:authCollection_shard2_replica1] o.a.s.c.SolrCore no updateRequestProcessorChain defined as default, creating implicit default
   [junit4]   2> 1814906 INFO  (qtp1730975146-12846) [n:127.0.0.1:32955_solr c:authCollection s:shard2 r:core_node1 x:authCollection_shard2_replica1] o.a.s.h.l.XMLLoader xsltCacheLifetimeSeconds=60
   [junit4]   2> 1814906 INFO  (qtp1730975146-12846) [n:127.0.0.1:32955_solr c:authCollection s:shard2 r:core_node1 x:authCollection_shard2_replica1] o.a.s.h.l.XMLLoader xsltCacheLifetimeSeconds=60
   [junit4]   2> 1814907 INFO  (qtp1730975146-12846) [n:127.0.0.1:32955_solr c:authCollection s:shard2 r:core_node1 x:authCollection_shard2_replica1] o.a.s.h.l.XMLLoader xsltCacheLifetimeSeconds=60
   [junit4]   2> 1814907 INFO  (qtp1730975146-12846) [n:127.0.0.1:32955_solr c:authCollection s:shard2 r:core_node1 x:authCollection_shard2_replica1] o.a.s.h.l.XMLLoader xsltCacheLifetimeSeconds=60
   [junit4]   2> 1814908 INFO  (qtp1730975146-12846) [n:127.0.0.1:32955_solr c:authCollection s:shard2 r:core_node1 x:authCollection_shard2_replica1] o.a.s.c.RequestHandlers Registered paths: /admin/mbeans,/update/json/docs,/admin/luke,/export,/get,/admin/properties,/update/json,/admin/threads,/update/csv,/sql,/graph,/select,/admin/segments,/admin/system,/replication,/config,/stream,/schema,/admin/plugins,/admin/logging,/admin/ping,/update,/admin/file,/terms
   [junit4]   2> 1814908 INFO  (qtp1730975146-12846) [n:127.0.0.1:32955_solr c:authCollection s:shard2 r:core_node1 x:authCollection_shard2_replica1] o.a.s.c.SolrCore Using default statsCache cache: org.apache.solr.search.stats.LocalStatsCache
   [junit4]   2> 1814908 INFO  (qtp1730975146-12846) [n:127.0.0.1:32955_solr c:authCollection s:shard2 r:core_node1 x:authCollection_shard2_replica1] o.a.s.u.UpdateHandler Using UpdateLog implementation: org.apache.solr.update.UpdateLog
   [junit4]   2> 1814908 INFO  (qtp1730975146-12846) [n:127.0.0.1:32955_solr c:authCollection s:shard2 r:core_node1 x:authCollection_shard2_replica1] o.a.s.u.UpdateLog Initializing UpdateLog: dataDir=null defaultSyncLevel=FLUSH numRecordsToKeep=100 maxNumLogsToKeep=10 numVersionBuckets=65536
   [junit4]   2> 1814909 INFO  (qtp1730975146-12846) [n:127.0.0.1:32955_solr c:authCollection s:shard2 r:core_node1 x:authCollection_shard2_replica1] o.a.s.u.CommitTracker Hard AutoCommit: disabled
   [junit4]   2> 1814909 INFO  (qtp1730975146-12846) [n:127.0.0.1:32955_solr c:authCollection s:shard2 r:core_node1 x:authCollection_shard2_replica1] o.a.s.u.CommitTracker Soft AutoCommit: disabled
   [junit4]   2> 1814909 INFO  (qtp1730975146-12846) [n:127.0.0.1:32955_solr c:authCollection s:shard2 r:core_node1 x:authCollection_shard2_replica1] o.a.s.c.SolrDeletionPolicy SolrDeletionPolicy.onInit: commits: num=1
   [junit4]   2> 	commit{dir=MockDirectoryWrapper(RAMDirectory@28728387 lockFactory=org.apache.lucene.store.SingleInstanceLockFactory@41f9a649),segFN=segments_1,generation=1}
   [junit4]   2> 1814909 INFO  (qtp1730975146-12846) [n:127.0.0.1:32955_solr c:authCollection s:shard2 r:core_node1 x:authCollection_shard2_replica1] o.a.s.c.SolrDeletionPolicy newest commit generation = 1
   [junit4]   2> 1814910 INFO  (qtp1730975146-12846) [n:127.0.0.1:32955_solr c:authCollection s:shard2 r:core_node1 x:authCollection_shard2_replica1] o.a.s.s.SolrIndexSearcher Opening [Searcher@1ef4c512[authCollection_shard2_replica1] main]
   [junit4]   2> 1814910 INFO  (qtp1730975146-12846) [n:127.0.0.1:32955_solr c:authCollection s:shard2 r:core_node1 x:authCollection_shard2_replica1] o.a.s.c.c.ZkStateReader Load collection config from: [/collections/authCollection]
   [junit4]   2> 1814910 INFO  (qtp1730975146-12846) [n:127.0.0.1:32955_solr c:authCollection s:shard2 r:core_node1 x:authCollection_shard2_replica1] o.a.s.c.c.ZkStateReader path=[/collections/authCollection] [configName]=[conf] specified config exists in ZooKeeper
   [junit4]   2> 1814910 INFO  (qtp1730975146-12846) [n:127.0.0.1:32955_solr c:authCollection s:shard2 r:core_node1 x:authCollection_shard2_replica1] o.a.s.r.ManagedResourceStorage Setting up ZooKeeper-based storage for the RestManager with znodeBase: /configs/conf
   [junit4]   2> 1814911 INFO  (qtp1730975146-12846) [n:127.0.0.1:32955_solr c:authCollection s:shard2 r:core_node1 x:authCollection_shard2_replica1] o.a.s.r.ManagedResourceStorage Configured ZooKeeperStorageIO with znodeBase: /configs/conf
   [junit4]   2> 1814911 INFO  (qtp1730975146-12846) [n:127.0.0.1:32955_solr c:authCollection s:shard2 r:core_node1 x:authCollection_shard2_replica1] o.a.s.r.RestManager Initializing RestManager with initArgs: {}
   [junit4]   2> 1814911 INFO  (qtp1730975146-12846) [n:127.0.0.1:32955_solr c:authCollection s:shard2 r:core_node1 x:authCollection_shard2_replica1] o.a.s.r.ManagedResourceStorage Reading _rest_managed.json using ZooKeeperStorageIO:path=/configs/conf
   [junit4]   2> 1814911 INFO  (qtp1730975146-12846) [n:127.0.0.1:32955_solr c:authCollection s:shard2 r:core_node1 x:authCollection_shard2_replica1] o.a.s.r.ManagedResourceStorage No data found for znode /configs/conf/_rest_managed.json
   [junit4]   2> 1814911 INFO  (qtp1730975146-12846) [n:127.0.0.1:32955_solr c:authCollection s:shard2 r:core_node1 x:authCollection_shard2_replica1] o.a.s.r.ManagedResourceStorage Loaded null at path _rest_managed.json using ZooKeeperStorageIO:path=/configs/conf
   [junit4]   2> 1814911 INFO  (qtp1730975146-12846) [n:127.0.0.1:32955_solr c:authCollection s:shard2 r:core_node1 x:authCollection_shard2_replica1] o.a.s.r.RestManager Initializing 0 registered ManagedResources
   [junit4]   2> 1814911 INFO  (qtp1730975146-12846) [n:127.0.0.1:32955_solr c:authCollection s:shard2 r:core_node1 x:authCollection_shard2_replica1] o.a.s.h.ReplicationHandler Commits will be reserved for  10000
   [junit4]   2> 1814911 INFO  (searcherExecutor-6571-thread-1-processing-n:127.0.0.1:32955_solr x:authCollection_shard2_replica1 s:shard2 c:authCollection r:core_node1) [n:127.0.0.1:32955_solr c:authCollection s:shard2 r:core_node1 x:authCollection_shard2_replica1] o.a.s.c.SolrCore [authCollection_shard2_replica1] Registered new searcher Searcher@1ef4c512[authCollection_shard2_replica1] main{ExitableDirectoryReader(UninvertingDirectoryReader())}
   [junit4]   2> 1814911 INFO  (qtp1730975146-12846) [n:127.0.0.1:32955_solr c:authCollection s:shard2 r:core_node1 x:authCollection_shard2_replica1] o.a.s.u.UpdateLog Looking up max value of version field to seed version buckets
   [junit4]   2> 1814911 INFO  (qtp1730975146-12846) [n:127.0.0.1:32955_solr c:authCollection s:shard2 r:core_node1 x:authCollection_shard2_replica1] o.a.s.u.VersionInfo Refreshing highest value of _version_ for 65536 version buckets from index
   [junit4]   2> 1814911 INFO  (qtp1730975146-12846) [n:127.0.0.1:32955_solr c:authCollection s:shard2 r:core_node1 x:authCollection_shard2_replica1] o.a.s.u.VersionInfo No terms found for _version_, cannot seed version bucket highest value from index
   [junit4]   2> 1814911 INFO  (qtp1730975146-12846) [n:127.0.0.1:32955_solr c:authCollection s:shard2 r:core_node1 x:authCollection_shard2_replica1] o.a.s.u.UpdateLog Could not find max version in index or recent updates, using new clock 1545171028761640960
   [junit4]   2> 1814913 INFO  (qtp1730975146-12846) [n:127.0.0.1:32955_solr c:authCollection s:shard2 r:core_node1 x:authCollection_shard2_replica1] o.a.s.u.UpdateLog Took 1.0ms to seed version buckets with highest version 1545171028761640960
   [junit4]   2> 1814913 INFO  (qtp1730975146-12846) [n:127.0.0.1:32955_solr c:authCollection s:shard2 r:core_node1 x:authCollection_shard2_replica1] o.a.s.c.ZkController watch zkdir /configs/conf
   [junit4]   2> 1814913 INFO  (qtp1730975146-12846) [n:127.0.0.1:32955_solr c:authCollection s:shard2 r:core_node1 x:authCollection_shard2_replica1] o.a.s.c.CoreContainer registering core: authCollection_shard2_replica1
   [junit4]   2> 1814913 INFO  (qtp1730975146-12846) [n:127.0.0.1:32955_solr c:authCollection s:shard2 r:core_node1 x:authCollection_shard2_replica1] o.a.s.c.ZkController Register replica - core:authCollection_shard2_replica1 address:https://127.0.0.1:32955/solr collection:authCollection shard:shard2
   [junit4]   2> 1814914 INFO  (qtp1730975146-12846) [n:127.0.0.1:32955_solr c:authCollection s:shard2 r:core_node1 x:authCollection_shard2_replica1] o.a.s.c.c.SolrZkClient makePath: /collections/authCollection/leader_elect/shard2/election
   [junit4]   2> 1814915 INFO  (qtp1730975146-12846) [n:127.0.0.1:32955_solr c:authCollection s:shard2 r:core_node1 x:authCollection_shard2_replica1] o.a.s.c.LeaderElector Joined leadership election with path: /collections/authCollection/leader_elect/shard2/election/96573189208080393-core_node1-n_0000000000
   [junit4]   2> 1814915 INFO  (qtp1730975146-12846) [n:127.0.0.1:32955_solr c:authCollection s:shard2 r:core_node1 x:authCollection_shard2_replica1] o.a.s.c.ShardLeaderElectionContext Running the leader process for shard=shard2 and weAreReplacement=false and leaderVoteWait=10000
   [junit4]   2> 1814915 INFO  (qtp1730975146-12846) [n:127.0.0.1:32955_solr c:authCollection s:shard2 r:core_node1 x:authCollection_shard2_replica1] o.a.s.c.ShardLeaderElectionContext Enough replicas found to continue.
   [junit4]   2> 1814916 INFO  (qtp1730975146-12846) [n:127.0.0.1:32955_solr c:authCollection s:shard2 r:core_node1 x:authCollection_shard2_replica1] o.a.s.c.ShardLeaderElectionContext I may be the new leader - try and sync
   [junit4]   2> 1814916 INFO  (qtp1730975146-12846) [n:127.0.0.1:32955_solr c:authCollection s:shard2 r:core_node1 x:authCollection_shard2_replica1] o.a.s.c.SyncStrategy Sync replicas to https://127.0.0.1:32955/solr/authCollection_shard2_replica1/
   [junit4]   2> 1814916 INFO  (OverseerStateUpdate-96573189208080391-127.0.0.1:39597_solr-n_0000000000) [n:127.0.0.1:39597_solr    ] o.a.s.c.Overseer processMessage: queueSize: 1, message = {
   [junit4]   2>   "operation":"leader",
   [junit4]   2>   "shard":"shard2",
   [junit4]   2>   "collection":"authCollection"} current state version: 0
   [junit4]   2> 1814916 INFO  (qtp1730975146-12846) [n:127.0.0.1:32955_solr c:authCollection s:shard2 r:core_node1 x:authCollection_shard2_replica1] o.a.s.c.SyncStrategy Sync Success - now sync replicas to me
   [junit4]   2> 1814916 INFO  (qtp1730975146-12846) [n:127.0.0.1:32955_solr c:authCollection s:shard2 r:core_node1 x:authCollection_shard2_replica1] o.a.s.c.SyncStrategy https://127.0.0.1:32955/solr/authCollection_shard2_replica1/ has no replicas
   [junit4]   2> 1814916 INFO  (qtp1730975146-12846) [n:127.0.0.1:32955_solr c:authCollection s:shard2 r:core_node1 x:authCollection_shard2_replica1] o.a.s.c.c.SolrZkClient makePath: /collections/authCollection/leaders/shard2
   [junit4]   2> 1814917 INFO  (qtp1730975146-12846) [n:127.0.0.1:32955_solr c:authCollection s:shard2 r:core_node1 x:authCollection_shard2_replica1] o.a.s.c.ShardLeaderElectionContextBase Creating leader registration node /collections/authCollection/leaders/shard2/leader after winning as /collections/authCollection/leader_elect/shard2/election/96573189208080393-core_node1-n_0000000000
   [junit4]   2> 1814917 INFO  (qtp1730975146-12846) [n:127.0.0.1:32955_solr c:authCollection s:shard2 r:core_node1 x:authCollection_shard2_replica1] o.a.s.c.ShardLeaderElectionContext I am the new leader: https://127.0.0.1:32955/solr/authCollection_shard2_replica1/ shard2
   [junit4]   2> 1814918 INFO  (OverseerStateUpdate-96573189208080391-127.0.0.1:39597_solr-n_0000000000) [n:127.0.0.1:39597_solr    ] o.a.s.c.Overseer processMessage: queueSize: 1, message = {
   [junit4]   2>   "operation":"leader",
   [junit4]   2>   "shard":"shard2",
   [junit4]   2>   "collection":"authCollection",
   [junit4]   2>   "base_url":"https://127.0.0.1:32955/solr",
   [junit4]   2>   "core":"authCollection_shard2_replica1",
   [junit4]   2>   "state":"active"} current state version: 0
   [junit4]   2> 1814939 INFO  (qtp749647919-12824) [n:127.0.0.1:39597_solr c:authCollection s:shard3  x:authCollection_shard3_replica1] o.a.s.c.ZkController waiting to find shard id in clusterstate for authCollection_shard3_replica1
   [junit4]   2> 1814939 INFO  (qtp749647919-12824) [n:127.0.0.1:39597_solr c:authCollection s:shard3  x:authCollection_shard3_replica1] o.a.s.c.ZkController Check for collection zkNode:authCollection
   [junit4]   2> 1814939 INFO  (qtp749647919-12824) [n:127.0.0.1:39597_solr c:authCollection s:shard3  x:authCollection_shard3_replica1] o.a.s.c.ZkController Collection zkNode exists
   [junit4]   2> 1814939 INFO  (qtp749647919-12824) [n:127.0.0.1:39597_solr c:authCollection s:shard3  x:authCollection_shard3_replica1] o.a.s.c.c.ZkStateReader Load collection config from: [/collections/authCollection]
   [junit4]   2> 1814940 INFO  (qtp749647919-12824) [n:127.0.0.1:39597_solr c:authCollection s:shard3  x:authCollection_shard3_replica1] o.a.s.c.c.ZkStateReader path=[/collections/authCollection] [configName]=[conf] specified config exists in ZooKeeper
   [junit4]   2> 1814940 INFO  (qtp749647919-12824) [n:127.0.0.1:39597_solr c:authCollection s:shard3  x:authCollection_shard3_replica1] o.a.s.c.SolrResourceLoader new SolrResourceLoader for directory: '/home/jenkins/workspace/Lucene-Solr-6.x-Linux/solr/build/solr-core/test/J0/temp/solr.security.BasicAuthIntegrationTest_A2D8722F357B9A48-001/tempDir-001/node1/authCollection_shard3_replica1'
   [junit4]   2> 1814940 INFO  (qtp749647919-12824) [n:127.0.0.1:39597_solr c:authCollection s:shard3  x:authCollection_shard3_replica1] o.a.s.c.SolrResourceLoader JNDI not configured for solr (NoInitialContextEx)
   [junit4]   2> 1814940 INFO  (qtp749647919-12824) [n:127.0.0.1:39597_solr c:authCollection s:shard3  x:authCollection_shard3_replica1] o.a.s.c.SolrResourceLoader solr home defaulted to 'solr/' (could not find system property or JNDI)
   [junit4]   2> 1814941 INFO  (qtp749647919-12824) [n:127.0.0.1:39597_solr c:authCollection s:shard3  x:authCollection_shard3_replica1] o.a.s.c.Config loaded config solrconfig.xml with version 0 
   [junit4]   2> 1814943 INFO  (qtp583492739-12825) [n:127.0.0.1:37536_solr c:authCollection s:shard1  x:authCollection_shard1_replica1] o.a.s.c.ZkController waiting to find shard id in clusterstate for authCollection_shard1_replica1
   [junit4]   2> 1814943 INFO  (qtp583492739-12825) [n:127.0.0.1:37536_solr c:authCollection s:shard1  x:authCollection_shard1_replica1] o.a.s.c.ZkController Check for collection zkNode:authCollection
   [junit4]   2> 1814943 INFO  (qtp749647919-12824) [n:127.0.0.1:39597_solr c:authCollection s:shard3  x:authCollection_shard3_replica1] o.a.s.c.SolrConfig current version of requestparams : -1
   [junit4]   2> 1814943 INFO  (qtp583492739-12825) [n:127.0.0.1:37536_solr c:authCollection s:shard1  x:authCollection_shard1_replica1] o.a.s.c.ZkController Collection zkNode exists
   [junit4]   2> 1814943 INFO  (qtp583492739-12825) [n:127.0.0.1:37536_solr c:authCollection s:shard1  x:authCollection_shard1_replica1] o.a.s.c.c.ZkStateReader Load collection config from: [/collections/authCollection]
   [junit4]   2> 1814944 I

[...truncated too long message...]

:46365_solr    ] o.a.s.c.OverseerElectionContext I am going to be the leader 127.0.0.1:46365_solr
   [junit4]   2> 1819388 INFO  (jetty-launcher-2149-thread-3) [    ] o.e.j.s.h.ContextHandler Stopped o.e.j.s.ServletContextHandler@54f17b7{/solr,null,UNAVAILABLE}
   [junit4]   2> 1819388 INFO  (zkCallback-2177-thread-1-processing-n:127.0.0.1:46365_solr) [n:127.0.0.1:46365_solr    ] o.a.s.c.c.SolrZkClient makePath: /overseer_elect/leader
   [junit4]   2> 1819390 INFO  (zkCallback-2177-thread-2-processing-n:127.0.0.1:46365_solr) [n:127.0.0.1:46365_solr    ] o.a.s.c.c.ZkStateReader Updated live nodes from ZooKeeper... (3) -> (1)
   [junit4]   2> 1819390 INFO  (zkCallback-2177-thread-2-processing-n:127.0.0.1:46365_solr) [n:127.0.0.1:46365_solr    ] o.a.s.c.c.ZkStateReader A live node change: [WatchedEvent state:SyncConnected type:NodeChildrenChanged path:/live_nodes], has occurred - updating... (live nodes size: [1])
   [junit4]   2> 1820891 WARN  (zkCallback-2177-thread-1-processing-n:127.0.0.1:46365_solr) [n:127.0.0.1:46365_solr    ] o.a.s.c.LeaderElector 
   [junit4]   2> org.apache.zookeeper.KeeperException$SessionExpiredException: KeeperErrorCode = Session expired for /overseer_elect/leader
   [junit4]   2> 	at org.apache.zookeeper.KeeperException.create(KeeperException.java:127)
   [junit4]   2> 	at org.apache.zookeeper.KeeperException.create(KeeperException.java:51)
   [junit4]   2> 	at org.apache.zookeeper.ZooKeeper.exists(ZooKeeper.java:1045)
   [junit4]   2> 	at org.apache.solr.common.cloud.SolrZkClient$4.execute(SolrZkClient.java:297)
   [junit4]   2> 	at org.apache.solr.common.cloud.SolrZkClient$4.execute(SolrZkClient.java:294)
   [junit4]   2> 	at org.apache.solr.common.cloud.ZkCmdExecutor.retryOperation(ZkCmdExecutor.java:60)
   [junit4]   2> 	at org.apache.solr.common.cloud.SolrZkClient.exists(SolrZkClient.java:294)
   [junit4]   2> 	at org.apache.solr.common.cloud.SolrZkClient.makePath(SolrZkClient.java:488)
   [junit4]   2> 	at org.apache.solr.common.cloud.SolrZkClient.makePath(SolrZkClient.java:458)
   [junit4]   2> 	at org.apache.solr.common.cloud.SolrZkClient.makePath(SolrZkClient.java:445)
   [junit4]   2> 	at org.apache.solr.cloud.OverseerElectionContext.runLeaderProcess(ElectionContext.java:724)
   [junit4]   2> 	at org.apache.solr.cloud.LeaderElector.runIamLeaderProcess(LeaderElector.java:170)
   [junit4]   2> 	at org.apache.solr.cloud.LeaderElector.checkIfIamLeader(LeaderElector.java:135)
   [junit4]   2> 	at org.apache.solr.cloud.LeaderElector.access$200(LeaderElector.java:56)
   [junit4]   2> 	at org.apache.solr.cloud.LeaderElector$ElectionWatcher.process(LeaderElector.java:348)
   [junit4]   2> 	at org.apache.solr.common.cloud.SolrZkClient$3.lambda$process$0(SolrZkClient.java:266)
   [junit4]   2> 	at java.util.concurrent.Executors$RunnableAdapter.call(Executors.java:511)
   [junit4]   2> 	at java.util.concurrent.FutureTask.run(FutureTask.java:266)
   [junit4]   2> 	at org.apache.solr.common.util.ExecutorUtil$MDCAwareThreadPoolExecutor.lambda$execute$0(ExecutorUtil.java:229)
   [junit4]   2> 	at java.util.concurrent.ThreadPoolExecutor.runWorker(ThreadPoolExecutor.java:1142)
   [junit4]   2> 	at java.util.concurrent.ThreadPoolExecutor$Worker.run(ThreadPoolExecutor.java:617)
   [junit4]   2> 	at java.lang.Thread.run(Thread.java:745)
   [junit4]   2> 1820891 WARN  (zkCallback-2177-thread-2-processing-n:127.0.0.1:46365_solr) [n:127.0.0.1:46365_solr    ] o.a.s.c.c.ZkStateReader ZooKeeper watch triggered, but Solr cannot talk to ZK: [KeeperErrorCode = Session expired for /live_nodes]
   [junit4]   2> 1820891 INFO  (jetty-launcher-2149-thread-1) [    ] o.e.j.s.h.ContextHandler Stopped o.e.j.s.ServletContextHandler@763adc46{/solr,null,UNAVAILABLE}
   [junit4]   2> 1820892 INFO  (SUITE-BasicAuthIntegrationTest-seed#[A2D8722F357B9A48]-worker) [    ] o.a.s.c.ZkTestServer connecting to 127.0.0.1:37656 37656
   [junit4]   2> 1820947 INFO  (Thread-3181) [    ] o.a.s.c.ZkTestServer connecting to 127.0.0.1:37656 37656
   [junit4]   2> 1820947 WARN  (Thread-3181) [    ] o.a.s.c.ZkTestServer Watch limit violations: 
   [junit4]   2> Maximum concurrent create/delete watches above limit:
   [junit4]   2> 
   [junit4]   2> 	5	/solr/aliases.json
   [junit4]   2> 	4	/solr/security.json
   [junit4]   2> 	4	/solr/configs/conf
   [junit4]   2> 
   [junit4]   2> Maximum concurrent data watches above limit:
   [junit4]   2> 
   [junit4]   2> 	5	/solr/clusterstate.json
   [junit4]   2> 	5	/solr/clusterprops.json
   [junit4]   2> 	4	/solr/collections/authCollection/state.json
   [junit4]   2> 	2	/solr/overseer_elect/election/96573189208080392-127.0.0.1:37536_solr-n_0000000001
   [junit4]   2> 
   [junit4]   2> Maximum concurrent children watches above limit:
   [junit4]   2> 
   [junit4]   2> 	11	/solr/overseer/queue
   [junit4]   2> 	6	/solr/overseer/collection-queue-work
   [junit4]   2> 	5	/solr/collections
   [junit4]   2> 	4	/solr/live_nodes
   [junit4]   2> 	2	/solr/overseer/queue-work
   [junit4]   2> 
   [junit4]   2> 1820947 INFO  (SUITE-BasicAuthIntegrationTest-seed#[A2D8722F357B9A48]-worker) [    ] o.a.s.SolrTestCaseJ4 ###deleteCore
   [junit4]   2> NOTE: leaving temporary files on disk at: /home/jenkins/workspace/Lucene-Solr-6.x-Linux/solr/build/solr-core/test/J0/temp/solr.security.BasicAuthIntegrationTest_A2D8722F357B9A48-001
   [junit4]   2> Sep 11, 2016 10:32:10 AM com.carrotsearch.randomizedtesting.ThreadLeakControl checkThreadLeaks
   [junit4]   2> WARNING: Will linger awaiting termination of 1 leaked thread(s).
   [junit4]   2> NOTE: test params are: codec=Asserting(Lucene62): {}, docValues:{}, maxPointsInLeafNode=1623, maxMBSortInHeap=6.28593429209288, sim=RandomSimilarity(queryNorm=true,coord=yes): {}, locale=ko-KR, timezone=ROK
   [junit4]   2> NOTE: Linux 4.4.0-36-generic amd64/Oracle Corporation 1.8.0_102 (64-bit)/cpus=12,threads=1,free=127318784,total=518979584
   [junit4]   2> NOTE: All tests run in this JVM: [TestPerFieldSimilarityClassic, TestRemoteStreaming, TestNumericTerms64, TestManagedResource, TestSolrDynamicMBean, TestDocSet, TestExactStatsCache, TestHdfsBackupRestoreCore, TestPivotHelperCode, HdfsDirectoryFactoryTest, TestMacros, TestFieldSortValues, TestXmlQParserPlugin, VersionInfoTest, ChaosMonkeyNothingIsSafeTest, SignatureUpdateProcessorFactoryTest, TestUseDocValuesAsStored2, TestFieldCacheSort, TestSolr4Spatial, ReturnFieldsTest, TestComponentsName, TestSolrConfigHandlerConcurrent, LeaderInitiatedRecoveryOnShardRestartTest, NotRequiredUniqueKeyTest, TestCrossCoreJoin, TestAtomicUpdateErrorCases, LeaderElectionIntegrationTest, TestSchemaSimilarityResource, DeleteReplicaTest, AsyncCallRequestStatusResponseTest, FullHLLTest, SyncSliceTest, HdfsSyncSliceTest, CursorPagingTest, AlternateDirectoryTest, HdfsChaosMonkeySafeLeaderTest, ClusterStateTest, ExternalFileFieldSortTest, TestRuleBasedAuthorizationPlugin, TestReloadAndDeleteDocs, TestManagedStopFilterFactory, TestStressUserVersions, DisMaxRequestHandlerTest, TestReplicationHandler, TestSolrQueryResponse, FileBasedSpellCheckerTest, TestFoldingMultitermQuery, TestQuerySenderNoQuery, SolrCoreTest, TestInfoStreamLogging, AnalysisErrorHandlingTest, PeerSyncTest, TestDistributedSearch, TestBinaryResponseWriter, ConnectionManagerTest, ConnectionReuseTest, TestStressRecovery, TestRandomFlRTGCloud, TestSubQueryTransformer, DistribCursorPagingTest, BlockJoinFacetDistribTest, HdfsBasicDistributedZk2Test, TestCodecSupport, AnalysisAfterCoreReloadTest, GraphQueryTest, HttpPartitionTest, XsltUpdateRequestHandlerTest, HighlighterMaxOffsetTest, TestFaceting, DocValuesMissingTest, TestNamedUpdateProcessors, DistributedQueryComponentCustomSortTest, TestCloudPseudoReturnFields, TestSolr4Spatial2, TestStressLucene, SolrCloudExampleTest, TestSolrCoreProperties, PKIAuthenticationIntegrationTest, ScriptEngineTest, SparseHLLTest, HdfsUnloadDistributedZkTest, TestHighlightDedupGrouping, TestRangeQuery, BasicZkTest, TestSolrDeletionPolicy2, TestFastWriter, QueryEqualityTest, TestFunctionQuery, CursorMarkTest, SharedFSAutoReplicaFailoverUtilsTest, TestFieldCollectionResource, HighlighterConfigTest, TestOrdValues, ActionThrottleTest, RegexBoostProcessorTest, PathHierarchyTokenizerFactoryTest, TestJmxIntegration, SynonymTokenizerTest, BlobRepositoryCloudTest, TestFieldTypeResource, TestConfigSetsAPIExclusivity, SuggesterTSTTest, TestCSVLoader, NoCacheHeaderTest, TestPseudoReturnFields, DefaultValueUpdateProcessorTest, SortByFunctionTest, IndexBasedSpellCheckerTest, DocumentAnalysisRequestHandlerTest, TermsComponentTest, TestValueSourceCache, FieldAnalysisRequestHandlerTest, TestCSVResponseWriter, UniqFieldsUpdateProcessorFactoryTest, BinaryUpdateRequestHandlerTest, PingRequestHandlerTest, TestSimpleTrackingShardHandler, TestTolerantSearch, AsyncMigrateRouteKeyTest, CollectionStateFormat2Test, CreateCollectionCleanupTest, DeleteInactiveReplicaTest, DeleteLastCustomShardedReplicaTest, DistribDocExpirationUpdateProcessorTest, ForceLeaderTest, ReplaceNodeTest, SSLMigrationTest, SaslZkACLProviderTest, ShardSplitTest, JavabinLoaderTest, CheckHdfsIndexTest, TestIntervalFaceting, TestManagedResourceStorage, TestBulkSchemaAPI, TestSerializedLuceneMatchVersion, BooleanFieldTest, SpatialRPTFieldTypeTest, TestCloudManagedSchema, TestManagedSchema, TestManagedSchemaAPI, AnalyticsMergeStrategyTest, AnalyticsQueryTest, SortSpecParsingTest, TestCollapseQParserPlugin, TestComplexPhraseQParserPlugin, TestCustomSort, TestGraphTermsQParserPlugin, TestHashQParserPlugin, TestMissingGroups, TestNoOpRegenerator, TestOverriddenPrefixQueryForCustomFieldType, TestQueryWrapperFilter, TestRandomCollapseQParserPlugin, TestMinMaxOnMultiValuedField, BJQParserTest, BlockJoinFacetRandomTest, TestScoreJoinQPScore, TestJsonRequest, SimpleMLTQParserTest, TestClassicSimilarityFactory, TestNonDefinedSimilarityFactory, TestDefaultStatsCache, TestDistribIDF, BasicAuthIntegrationTest]
   [junit4] Completed [593/630 (1!)] on J0 in 7.92s, 1 test, 1 error <<< FAILURES!

[...truncated 60354 lines...]


Mime
View raw message