lucene-dev mailing list archives

Site index · List index
Message view « Date » · « Thread »
Top « Date » · « Thread »
From Policeman Jenkins Server <jenk...@thetaphi.de>
Subject [JENKINS] Lucene-Solr-5.5-Windows (32bit/jdk1.8.0_102) - Build # 108 - Unstable!
Date Fri, 02 Sep 2016 06:12:40 GMT
Build: http://jenkins.thetaphi.de/job/Lucene-Solr-5.5-Windows/108/
Java: 32bit/jdk1.8.0_102 -client -XX:+UseConcMarkSweepGC

1 tests failed.
FAILED:  junit.framework.TestSuite.org.apache.solr.handler.TestSolrConfigHandlerCloud

Error Message:
2 threads leaked from SUITE scope at org.apache.solr.handler.TestSolrConfigHandlerCloud:     1) Thread[id=47485, name=SolrConfigHandler-refreshconf, state=TIMED_WAITING, group=TGRP-TestSolrConfigHandlerCloud]         at java.lang.Thread.sleep(Native Method)         at org.apache.solr.cloud.ZkSolrResourceLoader.openResource(ZkSolrResourceLoader.java:101)         at org.apache.solr.core.SolrResourceLoader.openSchema(SolrResourceLoader.java:355)         at org.apache.solr.schema.IndexSchemaFactory.create(IndexSchemaFactory.java:48)         at org.apache.solr.schema.IndexSchemaFactory.buildIndexSchema(IndexSchemaFactory.java:70)         at org.apache.solr.core.ConfigSetService.createIndexSchema(ConfigSetService.java:108)         at org.apache.solr.core.ConfigSetService.getConfig(ConfigSetService.java:79)         at org.apache.solr.core.CoreContainer.reload(CoreContainer.java:920)         at org.apache.solr.core.SolrCore$11.run(SolrCore.java:2623)         at org.apache.solr.handler.SolrConfigHandler$Command$1.run(SolrConfigHandler.java:211)    2) Thread[id=48518, name=Thread-7022, state=TIMED_WAITING, group=TGRP-TestSolrConfigHandlerCloud]         at java.lang.Thread.sleep(Native Method)         at org.apache.solr.cloud.ZkSolrResourceLoader.openResource(ZkSolrResourceLoader.java:101)         at org.apache.solr.core.SolrResourceLoader.openSchema(SolrResourceLoader.java:355)         at org.apache.solr.schema.IndexSchemaFactory.create(IndexSchemaFactory.java:48)         at org.apache.solr.schema.IndexSchemaFactory.buildIndexSchema(IndexSchemaFactory.java:70)         at org.apache.solr.core.ConfigSetService.createIndexSchema(ConfigSetService.java:108)         at org.apache.solr.core.ConfigSetService.getConfig(ConfigSetService.java:79)         at org.apache.solr.core.CoreContainer.reload(CoreContainer.java:920)         at org.apache.solr.core.SolrCore$11.run(SolrCore.java:2623)         at org.apache.solr.cloud.ZkController$5.run(ZkController.java:2480)

Stack Trace:
com.carrotsearch.randomizedtesting.ThreadLeakError: 2 threads leaked from SUITE scope at org.apache.solr.handler.TestSolrConfigHandlerCloud: 
   1) Thread[id=47485, name=SolrConfigHandler-refreshconf, state=TIMED_WAITING, group=TGRP-TestSolrConfigHandlerCloud]
        at java.lang.Thread.sleep(Native Method)
        at org.apache.solr.cloud.ZkSolrResourceLoader.openResource(ZkSolrResourceLoader.java:101)
        at org.apache.solr.core.SolrResourceLoader.openSchema(SolrResourceLoader.java:355)
        at org.apache.solr.schema.IndexSchemaFactory.create(IndexSchemaFactory.java:48)
        at org.apache.solr.schema.IndexSchemaFactory.buildIndexSchema(IndexSchemaFactory.java:70)
        at org.apache.solr.core.ConfigSetService.createIndexSchema(ConfigSetService.java:108)
        at org.apache.solr.core.ConfigSetService.getConfig(ConfigSetService.java:79)
        at org.apache.solr.core.CoreContainer.reload(CoreContainer.java:920)
        at org.apache.solr.core.SolrCore$11.run(SolrCore.java:2623)
        at org.apache.solr.handler.SolrConfigHandler$Command$1.run(SolrConfigHandler.java:211)
   2) Thread[id=48518, name=Thread-7022, state=TIMED_WAITING, group=TGRP-TestSolrConfigHandlerCloud]
        at java.lang.Thread.sleep(Native Method)
        at org.apache.solr.cloud.ZkSolrResourceLoader.openResource(ZkSolrResourceLoader.java:101)
        at org.apache.solr.core.SolrResourceLoader.openSchema(SolrResourceLoader.java:355)
        at org.apache.solr.schema.IndexSchemaFactory.create(IndexSchemaFactory.java:48)
        at org.apache.solr.schema.IndexSchemaFactory.buildIndexSchema(IndexSchemaFactory.java:70)
        at org.apache.solr.core.ConfigSetService.createIndexSchema(ConfigSetService.java:108)
        at org.apache.solr.core.ConfigSetService.getConfig(ConfigSetService.java:79)
        at org.apache.solr.core.CoreContainer.reload(CoreContainer.java:920)
        at org.apache.solr.core.SolrCore$11.run(SolrCore.java:2623)
        at org.apache.solr.cloud.ZkController$5.run(ZkController.java:2480)
	at __randomizedtesting.SeedInfo.seed([B0490D26DBB83059]:0)




Build Log:
[...truncated 12232 lines...]
   [junit4] Suite: org.apache.solr.handler.TestSolrConfigHandlerCloud
   [junit4]   2> Creating dataDir: C:\Users\jenkins\workspace\Lucene-Solr-5.5-Windows\solr\build\solr-core\test\J1\temp\solr.handler.TestSolrConfigHandlerCloud_B0490D26DBB83059-001\init-core-data-001
   [junit4]   2> 2816601 INFO  (SUITE-TestSolrConfigHandlerCloud-seed#[B0490D26DBB83059]-worker) [    ] o.a.s.SolrTestCaseJ4 Randomized ssl (false) and clientAuth (true)
   [junit4]   2> 2816601 INFO  (SUITE-TestSolrConfigHandlerCloud-seed#[B0490D26DBB83059]-worker) [    ] o.a.s.BaseDistributedSearchTestCase Setting hostContext system property: /
   [junit4]   2> 2816607 INFO  (TEST-TestSolrConfigHandlerCloud.test-seed#[B0490D26DBB83059]) [    ] o.a.s.c.ZkTestServer STARTING ZK TEST SERVER
   [junit4]   2> 2816608 INFO  (Thread-6679) [    ] o.a.s.c.ZkTestServer client port:0.0.0.0/0.0.0.0:0
   [junit4]   2> 2816609 INFO  (Thread-6679) [    ] o.a.s.c.ZkTestServer Starting server
   [junit4]   2> 2816708 INFO  (TEST-TestSolrConfigHandlerCloud.test-seed#[B0490D26DBB83059]) [    ] o.a.s.c.ZkTestServer start zk server on port:51166
   [junit4]   2> 2816708 INFO  (TEST-TestSolrConfigHandlerCloud.test-seed#[B0490D26DBB83059]) [    ] o.a.s.c.c.SolrZkClient Using default ZkCredentialsProvider
   [junit4]   2> 2816713 INFO  (TEST-TestSolrConfigHandlerCloud.test-seed#[B0490D26DBB83059]) [    ] o.a.s.c.c.ConnectionManager Waiting for client to connect to ZooKeeper
   [junit4]   2> 2816724 INFO  (zkCallback-9985-thread-1) [    ] o.a.s.c.c.ConnectionManager Watcher org.apache.solr.common.cloud.ConnectionManager@42f00d name:ZooKeeperConnection Watcher:127.0.0.1:51166 got event WatchedEvent state:SyncConnected type:None path:null path:null type:None
   [junit4]   2> 2816725 INFO  (TEST-TestSolrConfigHandlerCloud.test-seed#[B0490D26DBB83059]) [    ] o.a.s.c.c.ConnectionManager Client is connected to ZooKeeper
   [junit4]   2> 2816725 INFO  (TEST-TestSolrConfigHandlerCloud.test-seed#[B0490D26DBB83059]) [    ] o.a.s.c.c.SolrZkClient Using default ZkACLProvider
   [junit4]   2> 2816725 INFO  (TEST-TestSolrConfigHandlerCloud.test-seed#[B0490D26DBB83059]) [    ] o.a.s.c.c.SolrZkClient makePath: /solr
   [junit4]   2> 2816734 INFO  (TEST-TestSolrConfigHandlerCloud.test-seed#[B0490D26DBB83059]) [    ] o.a.s.c.c.SolrZkClient Using default ZkCredentialsProvider
   [junit4]   2> 2816736 INFO  (TEST-TestSolrConfigHandlerCloud.test-seed#[B0490D26DBB83059]) [    ] o.a.s.c.c.ConnectionManager Waiting for client to connect to ZooKeeper
   [junit4]   2> 2816740 INFO  (zkCallback-9986-thread-1) [    ] o.a.s.c.c.ConnectionManager Watcher org.apache.solr.common.cloud.ConnectionManager@1fcdaf7 name:ZooKeeperConnection Watcher:127.0.0.1:51166/solr got event WatchedEvent state:SyncConnected type:None path:null path:null type:None
   [junit4]   2> 2816740 INFO  (TEST-TestSolrConfigHandlerCloud.test-seed#[B0490D26DBB83059]) [    ] o.a.s.c.c.ConnectionManager Client is connected to ZooKeeper
   [junit4]   2> 2816740 INFO  (TEST-TestSolrConfigHandlerCloud.test-seed#[B0490D26DBB83059]) [    ] o.a.s.c.c.SolrZkClient Using default ZkACLProvider
   [junit4]   2> 2816741 INFO  (TEST-TestSolrConfigHandlerCloud.test-seed#[B0490D26DBB83059]) [    ] o.a.s.c.c.SolrZkClient makePath: /collections/collection1
   [junit4]   2> 2816746 INFO  (TEST-TestSolrConfigHandlerCloud.test-seed#[B0490D26DBB83059]) [    ] o.a.s.c.c.SolrZkClient makePath: /collections/collection1/shards
   [junit4]   2> 2816753 INFO  (TEST-TestSolrConfigHandlerCloud.test-seed#[B0490D26DBB83059]) [    ] o.a.s.c.c.SolrZkClient makePath: /collections/control_collection
   [junit4]   2> 2816755 INFO  (TEST-TestSolrConfigHandlerCloud.test-seed#[B0490D26DBB83059]) [    ] o.a.s.c.c.SolrZkClient makePath: /collections/control_collection/shards
   [junit4]   2> 2816762 INFO  (TEST-TestSolrConfigHandlerCloud.test-seed#[B0490D26DBB83059]) [    ] o.a.s.c.AbstractZkTestCase put C:\Users\jenkins\workspace\Lucene-Solr-5.5-Windows\solr\core\src\test-files\solr\collection1\conf\solrconfig-tlog.xml to /configs/conf1/solrconfig.xml
   [junit4]   2> 2816763 INFO  (TEST-TestSolrConfigHandlerCloud.test-seed#[B0490D26DBB83059]) [    ] o.a.s.c.c.SolrZkClient makePath: /configs/conf1/solrconfig.xml
   [junit4]   2> 2816774 INFO  (TEST-TestSolrConfigHandlerCloud.test-seed#[B0490D26DBB83059]) [    ] o.a.s.c.AbstractZkTestCase put C:\Users\jenkins\workspace\Lucene-Solr-5.5-Windows\solr\core\src\test-files\solr\collection1\conf\schema.xml to /configs/conf1/schema.xml
   [junit4]   2> 2816774 INFO  (TEST-TestSolrConfigHandlerCloud.test-seed#[B0490D26DBB83059]) [    ] o.a.s.c.c.SolrZkClient makePath: /configs/conf1/schema.xml
   [junit4]   2> 2816784 INFO  (TEST-TestSolrConfigHandlerCloud.test-seed#[B0490D26DBB83059]) [    ] o.a.s.c.AbstractZkTestCase put C:\Users\jenkins\workspace\Lucene-Solr-5.5-Windows\solr\core\src\test-files\solr\collection1\conf\solrconfig.snippet.randomindexconfig.xml to /configs/conf1/solrconfig.snippet.randomindexconfig.xml
   [junit4]   2> 2816784 INFO  (TEST-TestSolrConfigHandlerCloud.test-seed#[B0490D26DBB83059]) [    ] o.a.s.c.c.SolrZkClient makePath: /configs/conf1/solrconfig.snippet.randomindexconfig.xml
   [junit4]   2> 2816791 INFO  (TEST-TestSolrConfigHandlerCloud.test-seed#[B0490D26DBB83059]) [    ] o.a.s.c.AbstractZkTestCase put C:\Users\jenkins\workspace\Lucene-Solr-5.5-Windows\solr\core\src\test-files\solr\collection1\conf\stopwords.txt to /configs/conf1/stopwords.txt
   [junit4]   2> 2816792 INFO  (TEST-TestSolrConfigHandlerCloud.test-seed#[B0490D26DBB83059]) [    ] o.a.s.c.c.SolrZkClient makePath: /configs/conf1/stopwords.txt
   [junit4]   2> 2816799 INFO  (TEST-TestSolrConfigHandlerCloud.test-seed#[B0490D26DBB83059]) [    ] o.a.s.c.AbstractZkTestCase put C:\Users\jenkins\workspace\Lucene-Solr-5.5-Windows\solr\core\src\test-files\solr\collection1\conf\protwords.txt to /configs/conf1/protwords.txt
   [junit4]   2> 2816800 INFO  (TEST-TestSolrConfigHandlerCloud.test-seed#[B0490D26DBB83059]) [    ] o.a.s.c.c.SolrZkClient makePath: /configs/conf1/protwords.txt
   [junit4]   2> 2816807 INFO  (TEST-TestSolrConfigHandlerCloud.test-seed#[B0490D26DBB83059]) [    ] o.a.s.c.AbstractZkTestCase put C:\Users\jenkins\workspace\Lucene-Solr-5.5-Windows\solr\core\src\test-files\solr\collection1\conf\currency.xml to /configs/conf1/currency.xml
   [junit4]   2> 2816807 INFO  (TEST-TestSolrConfigHandlerCloud.test-seed#[B0490D26DBB83059]) [    ] o.a.s.c.c.SolrZkClient makePath: /configs/conf1/currency.xml
   [junit4]   2> 2816825 INFO  (TEST-TestSolrConfigHandlerCloud.test-seed#[B0490D26DBB83059]) [    ] o.a.s.c.AbstractZkTestCase put C:\Users\jenkins\workspace\Lucene-Solr-5.5-Windows\solr\core\src\test-files\solr\collection1\conf\enumsConfig.xml to /configs/conf1/enumsConfig.xml
   [junit4]   2> 2816825 INFO  (TEST-TestSolrConfigHandlerCloud.test-seed#[B0490D26DBB83059]) [    ] o.a.s.c.c.SolrZkClient makePath: /configs/conf1/enumsConfig.xml
   [junit4]   2> 2816832 INFO  (TEST-TestSolrConfigHandlerCloud.test-seed#[B0490D26DBB83059]) [    ] o.a.s.c.AbstractZkTestCase put C:\Users\jenkins\workspace\Lucene-Solr-5.5-Windows\solr\core\src\test-files\solr\collection1\conf\open-exchange-rates.json to /configs/conf1/open-exchange-rates.json
   [junit4]   2> 2816832 INFO  (TEST-TestSolrConfigHandlerCloud.test-seed#[B0490D26DBB83059]) [    ] o.a.s.c.c.SolrZkClient makePath: /configs/conf1/open-exchange-rates.json
   [junit4]   2> 2816838 INFO  (TEST-TestSolrConfigHandlerCloud.test-seed#[B0490D26DBB83059]) [    ] o.a.s.c.AbstractZkTestCase put C:\Users\jenkins\workspace\Lucene-Solr-5.5-Windows\solr\core\src\test-files\solr\collection1\conf\mapping-ISOLatin1Accent.txt to /configs/conf1/mapping-ISOLatin1Accent.txt
   [junit4]   2> 2816838 INFO  (TEST-TestSolrConfigHandlerCloud.test-seed#[B0490D26DBB83059]) [    ] o.a.s.c.c.SolrZkClient makePath: /configs/conf1/mapping-ISOLatin1Accent.txt
   [junit4]   2> 2816852 INFO  (TEST-TestSolrConfigHandlerCloud.test-seed#[B0490D26DBB83059]) [    ] o.a.s.c.AbstractZkTestCase put C:\Users\jenkins\workspace\Lucene-Solr-5.5-Windows\solr\core\src\test-files\solr\collection1\conf\old_synonyms.txt to /configs/conf1/old_synonyms.txt
   [junit4]   2> 2816853 INFO  (TEST-TestSolrConfigHandlerCloud.test-seed#[B0490D26DBB83059]) [    ] o.a.s.c.c.SolrZkClient makePath: /configs/conf1/old_synonyms.txt
   [junit4]   2> 2816858 INFO  (TEST-TestSolrConfigHandlerCloud.test-seed#[B0490D26DBB83059]) [    ] o.a.s.c.AbstractZkTestCase put C:\Users\jenkins\workspace\Lucene-Solr-5.5-Windows\solr\core\src\test-files\solr\collection1\conf\synonyms.txt to /configs/conf1/synonyms.txt
   [junit4]   2> 2816859 INFO  (TEST-TestSolrConfigHandlerCloud.test-seed#[B0490D26DBB83059]) [    ] o.a.s.c.c.SolrZkClient makePath: /configs/conf1/synonyms.txt
   [junit4]   2> 2817638 INFO  (TEST-TestSolrConfigHandlerCloud.test-seed#[B0490D26DBB83059]) [    ] o.a.s.SolrTestCaseJ4 Writing core.properties file to C:\Users\jenkins\workspace\Lucene-Solr-5.5-Windows\solr\build\solr-core\test\J1\temp\solr.handler.TestSolrConfigHandlerCloud_B0490D26DBB83059-001\control-001\cores\collection1
   [junit4]   2> 2817641 INFO  (TEST-TestSolrConfigHandlerCloud.test-seed#[B0490D26DBB83059]) [    ] o.e.j.s.Server jetty-9.2.13.v20150730
   [junit4]   2> 2817643 INFO  (TEST-TestSolrConfigHandlerCloud.test-seed#[B0490D26DBB83059]) [    ] o.e.j.s.h.ContextHandler Started o.e.j.s.ServletContextHandler@18634e8{/,null,AVAILABLE}
   [junit4]   2> 2817648 INFO  (TEST-TestSolrConfigHandlerCloud.test-seed#[B0490D26DBB83059]) [    ] o.e.j.s.ServerConnector Started ServerConnector@1706814{HTTP/1.1}{127.0.0.1:51173}
   [junit4]   2> 2817649 INFO  (TEST-TestSolrConfigHandlerCloud.test-seed#[B0490D26DBB83059]) [    ] o.e.j.s.Server Started @2822423ms
   [junit4]   2> 2817649 INFO  (TEST-TestSolrConfigHandlerCloud.test-seed#[B0490D26DBB83059]) [    ] o.a.s.c.s.e.JettySolrRunner Jetty properties: {solr.data.dir=C:\Users\jenkins\workspace\Lucene-Solr-5.5-Windows\solr\build\solr-core\test\J1\temp\solr.handler.TestSolrConfigHandlerCloud_B0490D26DBB83059-001\tempDir-001/control/data, hostContext=/, hostPort=51173, coreRootDirectory=C:\Users\jenkins\workspace\Lucene-Solr-5.5-Windows\solr\build\solr-core\test\J1\..\..\..\..\..\..\..\..\..\Users\jenkins\workspace\Lucene-Solr-5.5-Windows\solr\build\solr-core\test\J1\temp\solr.handler.TestSolrConfigHandlerCloud_B0490D26DBB83059-001\control-001\cores}
   [junit4]   2> 2817650 INFO  (TEST-TestSolrConfigHandlerCloud.test-seed#[B0490D26DBB83059]) [    ] o.a.s.s.SolrDispatchFilter SolrDispatchFilter.init(): sun.misc.Launcher$AppClassLoader@1d16e93
   [junit4]   2> 2817650 INFO  (TEST-TestSolrConfigHandlerCloud.test-seed#[B0490D26DBB83059]) [    ] o.a.s.c.SolrResourceLoader new SolrResourceLoader for directory: 'C:\Users\jenkins\workspace\Lucene-Solr-5.5-Windows\solr\build\solr-core\test\J1\temp\solr.handler.TestSolrConfigHandlerCloud_B0490D26DBB83059-001\control-001'
   [junit4]   2> 2817650 INFO  (TEST-TestSolrConfigHandlerCloud.test-seed#[B0490D26DBB83059]) [    ] o.a.s.c.SolrResourceLoader JNDI not configured for solr (NoInitialContextEx)
   [junit4]   2> 2817650 INFO  (TEST-TestSolrConfigHandlerCloud.test-seed#[B0490D26DBB83059]) [    ] o.a.s.c.SolrResourceLoader solr home defaulted to 'solr/' (could not find system property or JNDI)
   [junit4]   2> 2817652 INFO  (TEST-TestSolrConfigHandlerCloud.test-seed#[B0490D26DBB83059]) [    ] o.a.s.c.c.SolrZkClient Using default ZkCredentialsProvider
   [junit4]   2> 2817653 INFO  (TEST-TestSolrConfigHandlerCloud.test-seed#[B0490D26DBB83059]) [    ] o.a.s.c.c.ConnectionManager Waiting for client to connect to ZooKeeper
   [junit4]   2> 2817664 INFO  (zkCallback-9987-thread-1) [    ] o.a.s.c.c.ConnectionManager Watcher org.apache.solr.common.cloud.ConnectionManager@c001a0 name:ZooKeeperConnection Watcher:127.0.0.1:51166/solr got event WatchedEvent state:SyncConnected type:None path:null path:null type:None
   [junit4]   2> 2817665 INFO  (TEST-TestSolrConfigHandlerCloud.test-seed#[B0490D26DBB83059]) [    ] o.a.s.c.c.ConnectionManager Client is connected to ZooKeeper
   [junit4]   2> 2817666 INFO  (TEST-TestSolrConfigHandlerCloud.test-seed#[B0490D26DBB83059]) [    ] o.a.s.c.c.SolrZkClient Using default ZkACLProvider
   [junit4]   2> 2817668 INFO  (TEST-TestSolrConfigHandlerCloud.test-seed#[B0490D26DBB83059]) [    ] o.a.s.s.SolrDispatchFilter Loading solr.xml from SolrHome (not found in ZooKeeper)
   [junit4]   2> 2817669 INFO  (TEST-TestSolrConfigHandlerCloud.test-seed#[B0490D26DBB83059]) [    ] o.a.s.c.SolrXmlConfig Loading container configuration from C:\Users\jenkins\workspace\Lucene-Solr-5.5-Windows\solr\build\solr-core\test\J1\temp\solr.handler.TestSolrConfigHandlerCloud_B0490D26DBB83059-001\control-001\solr.xml
   [junit4]   2> 2817704 INFO  (TEST-TestSolrConfigHandlerCloud.test-seed#[B0490D26DBB83059]) [    ] o.a.s.c.CorePropertiesLocator Config-defined core root directory: C:\Users\jenkins\workspace\Lucene-Solr-5.5-Windows\solr\build\solr-core\test\J1\..\..\..\..\..\..\..\..\..\Users\jenkins\workspace\Lucene-Solr-5.5-Windows\solr\build\solr-core\test\J1\temp\solr.handler.TestSolrConfigHandlerCloud_B0490D26DBB83059-001\control-001\cores
   [junit4]   2> 2817704 INFO  (TEST-TestSolrConfigHandlerCloud.test-seed#[B0490D26DBB83059]) [    ] o.a.s.c.CoreContainer New CoreContainer 30759723
   [junit4]   2> 2817704 INFO  (TEST-TestSolrConfigHandlerCloud.test-seed#[B0490D26DBB83059]) [    ] o.a.s.c.CoreContainer Loading cores into CoreContainer [instanceDir=C:\Users\jenkins\workspace\Lucene-Solr-5.5-Windows\solr\build\solr-core\test\J1\temp\solr.handler.TestSolrConfigHandlerCloud_B0490D26DBB83059-001\control-001]
   [junit4]   2> 2817705 WARN  (TEST-TestSolrConfigHandlerCloud.test-seed#[B0490D26DBB83059]) [    ] o.a.s.c.CoreContainer Couldn't add files from C:\Users\jenkins\workspace\Lucene-Solr-5.5-Windows\solr\build\solr-core\test\J1\temp\solr.handler.TestSolrConfigHandlerCloud_B0490D26DBB83059-001\control-001\lib to classpath: C:\Users\jenkins\workspace\Lucene-Solr-5.5-Windows\solr\build\solr-core\test\J1\temp\solr.handler.TestSolrConfigHandlerCloud_B0490D26DBB83059-001\control-001\lib
   [junit4]   2> 2817705 INFO  (TEST-TestSolrConfigHandlerCloud.test-seed#[B0490D26DBB83059]) [    ] o.a.s.h.c.HttpShardHandlerFactory created with socketTimeout : 90000,urlScheme : ,connTimeout : 15000,maxConnectionsPerHost : 20,maxConnections : 10000,corePoolSize : 0,maximumPoolSize : 2147483647,maxThreadIdleTime : 5,sizeOfQueue : -1,fairnessPolicy : false,useRetries : false,connectionsEvictorSleepDelay : 5000,maxConnectionIdleTime : 40000,
   [junit4]   2> 2817712 INFO  (TEST-TestSolrConfigHandlerCloud.test-seed#[B0490D26DBB83059]) [    ] o.a.s.u.UpdateShardHandler Creating UpdateShardHandler HTTP client with params: socketTimeout=340000&connTimeout=45000&retry=true
   [junit4]   2> 2817713 INFO  (TEST-TestSolrConfigHandlerCloud.test-seed#[B0490D26DBB83059]) [    ] o.a.s.l.LogWatcher SLF4J impl is org.slf4j.impl.Log4jLoggerFactory
   [junit4]   2> 2817713 INFO  (TEST-TestSolrConfigHandlerCloud.test-seed#[B0490D26DBB83059]) [    ] o.a.s.l.LogWatcher Registering Log Listener [Log4j (org.slf4j.impl.Log4jLoggerFactory)]
   [junit4]   2> 2817714 INFO  (TEST-TestSolrConfigHandlerCloud.test-seed#[B0490D26DBB83059]) [    ] o.a.s.c.ZkContainer Zookeeper client=127.0.0.1:51166/solr
   [junit4]   2> 2817714 INFO  (TEST-TestSolrConfigHandlerCloud.test-seed#[B0490D26DBB83059]) [    ] o.a.s.c.ZkController zkHost includes chroot
   [junit4]   2> 2817714 INFO  (TEST-TestSolrConfigHandlerCloud.test-seed#[B0490D26DBB83059]) [    ] o.a.s.c.c.SolrZkClient Using default ZkCredentialsProvider
   [junit4]   2> 2817715 INFO  (TEST-TestSolrConfigHandlerCloud.test-seed#[B0490D26DBB83059]) [    ] o.a.s.c.c.ConnectionManager Waiting for client to connect to ZooKeeper
   [junit4]   2> 2817718 INFO  (zkCallback-9990-thread-1) [    ] o.a.s.c.c.ConnectionManager Watcher org.apache.solr.common.cloud.ConnectionManager@74dd63 name:ZooKeeperConnection Watcher:127.0.0.1:51166 got event WatchedEvent state:SyncConnected type:None path:null path:null type:None
   [junit4]   2> 2817718 INFO  (TEST-TestSolrConfigHandlerCloud.test-seed#[B0490D26DBB83059]) [    ] o.a.s.c.c.ConnectionManager Client is connected to ZooKeeper
   [junit4]   2> 2817719 INFO  (TEST-TestSolrConfigHandlerCloud.test-seed#[B0490D26DBB83059]) [    ] o.a.s.c.c.SolrZkClient Using default ZkACLProvider
   [junit4]   2> 2817724 INFO  (TEST-TestSolrConfigHandlerCloud.test-seed#[B0490D26DBB83059]) [n:127.0.0.1:51173_    ] o.a.s.c.ZkController Added new OnReconnect listener org.apache.solr.cloud.ZkController$6@1dc8fba
   [junit4]   2> 2817725 INFO  (TEST-TestSolrConfigHandlerCloud.test-seed#[B0490D26DBB83059]) [n:127.0.0.1:51173_    ] o.a.s.c.c.ConnectionManager Waiting for client to connect to ZooKeeper
   [junit4]   2> 2817728 INFO  (zkCallback-9991-thread-1-processing-n:127.0.0.1:51173_) [n:127.0.0.1:51173_    ] o.a.s.c.c.ConnectionManager Watcher org.apache.solr.common.cloud.ConnectionManager@c08e44 name:ZooKeeperConnection Watcher:127.0.0.1:51166/solr got event WatchedEvent state:SyncConnected type:None path:null path:null type:None
   [junit4]   2> 2817728 INFO  (TEST-TestSolrConfigHandlerCloud.test-seed#[B0490D26DBB83059]) [n:127.0.0.1:51173_    ] o.a.s.c.c.ConnectionManager Client is connected to ZooKeeper
   [junit4]   2> 2817731 INFO  (TEST-TestSolrConfigHandlerCloud.test-seed#[B0490D26DBB83059]) [n:127.0.0.1:51173_    ] o.a.s.c.c.SolrZkClient makePath: /overseer/queue
   [junit4]   2> 2817736 INFO  (TEST-TestSolrConfigHandlerCloud.test-seed#[B0490D26DBB83059]) [n:127.0.0.1:51173_    ] o.a.s.c.c.SolrZkClient makePath: /overseer/collection-queue-work
   [junit4]   2> 2817746 INFO  (TEST-TestSolrConfigHandlerCloud.test-seed#[B0490D26DBB83059]) [n:127.0.0.1:51173_    ] o.a.s.c.c.SolrZkClient makePath: /overseer/collection-map-running
   [junit4]   2> 2817750 INFO  (TEST-TestSolrConfigHandlerCloud.test-seed#[B0490D26DBB83059]) [n:127.0.0.1:51173_    ] o.a.s.c.c.SolrZkClient makePath: /overseer/collection-map-completed
   [junit4]   2> 2817755 INFO  (TEST-TestSolrConfigHandlerCloud.test-seed#[B0490D26DBB83059]) [n:127.0.0.1:51173_    ] o.a.s.c.c.SolrZkClient makePath: /overseer/collection-map-failure
   [junit4]   2> 2817761 INFO  (TEST-TestSolrConfigHandlerCloud.test-seed#[B0490D26DBB83059]) [n:127.0.0.1:51173_    ] o.a.s.c.c.SolrZkClient makePath: /live_nodes
   [junit4]   2> 2817765 INFO  (TEST-TestSolrConfigHandlerCloud.test-seed#[B0490D26DBB83059]) [n:127.0.0.1:51173_    ] o.a.s.c.c.SolrZkClient makePath: /aliases.json
   [junit4]   2> 2817771 INFO  (TEST-TestSolrConfigHandlerCloud.test-seed#[B0490D26DBB83059]) [n:127.0.0.1:51173_    ] o.a.s.c.c.SolrZkClient makePath: /clusterstate.json
   [junit4]   2> 2817782 INFO  (TEST-TestSolrConfigHandlerCloud.test-seed#[B0490D26DBB83059]) [n:127.0.0.1:51173_    ] o.a.s.c.c.SolrZkClient makePath: /security.json
   [junit4]   2> 2817787 INFO  (TEST-TestSolrConfigHandlerCloud.test-seed#[B0490D26DBB83059]) [n:127.0.0.1:51173_    ] o.a.s.c.ZkController Register node as live in ZooKeeper:/live_nodes/127.0.0.1:51173_
   [junit4]   2> 2817796 INFO  (TEST-TestSolrConfigHandlerCloud.test-seed#[B0490D26DBB83059]) [n:127.0.0.1:51173_    ] o.a.s.c.c.SolrZkClient makePath: /live_nodes/127.0.0.1:51173_
   [junit4]   2> 2817806 INFO  (TEST-TestSolrConfigHandlerCloud.test-seed#[B0490D26DBB83059]) [n:127.0.0.1:51173_    ] o.a.s.c.c.SolrZkClient makePath: /overseer_elect
   [junit4]   2> 2817809 INFO  (TEST-TestSolrConfigHandlerCloud.test-seed#[B0490D26DBB83059]) [n:127.0.0.1:51173_    ] o.a.s.c.c.SolrZkClient makePath: /overseer_elect/election
   [junit4]   2> 2817813 INFO  (TEST-TestSolrConfigHandlerCloud.test-seed#[B0490D26DBB83059]) [n:127.0.0.1:51173_    ] o.a.s.c.Overseer Overseer (id=null) closing
   [junit4]   2> 2817818 INFO  (TEST-TestSolrConfigHandlerCloud.test-seed#[B0490D26DBB83059]) [n:127.0.0.1:51173_    ] o.a.s.c.LeaderElector Joined leadership election with path: /overseer_elect/election/96521115603763204-127.0.0.1:51173_-n_0000000000
   [junit4]   2> 2817819 INFO  (TEST-TestSolrConfigHandlerCloud.test-seed#[B0490D26DBB83059]) [n:127.0.0.1:51173_    ] o.a.s.c.OverseerElectionContext I am going to be the leader 127.0.0.1:51173_
   [junit4]   2> 2817819 INFO  (TEST-TestSolrConfigHandlerCloud.test-seed#[B0490D26DBB83059]) [n:127.0.0.1:51173_    ] o.a.s.c.c.SolrZkClient makePath: /overseer_elect/leader
   [junit4]   2> 2817824 INFO  (TEST-TestSolrConfigHandlerCloud.test-seed#[B0490D26DBB83059]) [n:127.0.0.1:51173_    ] o.a.s.c.Overseer Overseer (id=96521115603763204-127.0.0.1:51173_-n_0000000000) starting
   [junit4]   2> 2817832 INFO  (TEST-TestSolrConfigHandlerCloud.test-seed#[B0490D26DBB83059]) [n:127.0.0.1:51173_    ] o.a.s.c.c.SolrZkClient makePath: /overseer/queue-work
   [junit4]   2> 2817869 INFO  (TEST-TestSolrConfigHandlerCloud.test-seed#[B0490D26DBB83059]) [n:127.0.0.1:51173_    ] o.a.s.c.OverseerAutoReplicaFailoverThread Starting OverseerAutoReplicaFailoverThread autoReplicaFailoverWorkLoopDelay=10000 autoReplicaFailoverWaitAfterExpiration=30000 autoReplicaFailoverBadNodeExpiration=60000
   [junit4]   2> 2817870 INFO  (TEST-TestSolrConfigHandlerCloud.test-seed#[B0490D26DBB83059]) [n:127.0.0.1:51173_    ] o.a.s.c.c.ZkStateReader Updating cluster state from ZooKeeper... 
   [junit4]   2> 2817870 INFO  (OverseerCollectionConfigSetProcessor-96521115603763204-127.0.0.1:51173_-n_0000000000) [n:127.0.0.1:51173_    ] o.a.s.c.OverseerTaskProcessor Process current queue of overseer operations
   [junit4]   2> 2817871 INFO  (OverseerStateUpdate-96521115603763204-127.0.0.1:51173_-n_0000000000) [n:127.0.0.1:51173_    ] o.a.s.c.Overseer Starting to work on the main queue
   [junit4]   2> 2818017 INFO  (TEST-TestSolrConfigHandlerCloud.test-seed#[B0490D26DBB83059]) [n:127.0.0.1:51173_    ] o.a.s.c.CoreContainer Security conf doesn't exist. Skipping setup for authorization module.
   [junit4]   2> 2818017 INFO  (TEST-TestSolrConfigHandlerCloud.test-seed#[B0490D26DBB83059]) [n:127.0.0.1:51173_    ] o.a.s.c.CoreContainer No authentication plugin used.
   [junit4]   2> 2818021 INFO  (TEST-TestSolrConfigHandlerCloud.test-seed#[B0490D26DBB83059]) [n:127.0.0.1:51173_    ] o.a.s.c.CorePropertiesLocator Looking for core definitions underneath C:\Users\jenkins\workspace\Lucene-Solr-5.5-Windows\solr\build\solr-core\test\J1\..\..\..\..\..\..\..\..\..\Users\jenkins\workspace\Lucene-Solr-5.5-Windows\solr\build\solr-core\test\J1\temp\solr.handler.TestSolrConfigHandlerCloud_B0490D26DBB83059-001\control-001\cores
   [junit4]   2> 2818026 INFO  (TEST-TestSolrConfigHandlerCloud.test-seed#[B0490D26DBB83059]) [n:127.0.0.1:51173_    ] o.a.s.c.CoreDescriptor Created CoreDescriptor: {name=collection1, config=solrconfig.xml, transient=false, schema=schema.xml, loadOnStartup=true, configSetProperties=configsetprops.json, collection=control_collection, coreNodeName=, dataDir=data\, shard=}
   [junit4]   2> 2818026 INFO  (TEST-TestSolrConfigHandlerCloud.test-seed#[B0490D26DBB83059]) [n:127.0.0.1:51173_    ] o.a.s.c.CorePropertiesLocator Found core collection1 in C:\Users\jenkins\workspace\Lucene-Solr-5.5-Windows\solr\build\solr-core\test\J1\..\..\..\..\..\..\..\..\..\Users\jenkins\workspace\Lucene-Solr-5.5-Windows\solr\build\solr-core\test\J1\temp\solr.handler.TestSolrConfigHandlerCloud_B0490D26DBB83059-001\control-001\cores\collection1
   [junit4]   2> 2818026 INFO  (TEST-TestSolrConfigHandlerCloud.test-seed#[B0490D26DBB83059]) [n:127.0.0.1:51173_    ] o.a.s.c.CorePropertiesLocator Found 1 core definitions
   [junit4]   2> 2818028 INFO  (TEST-TestSolrConfigHandlerCloud.test-seed#[B0490D26DBB83059]) [n:127.0.0.1:51173_    ] o.a.s.s.SolrDispatchFilter user.dir=C:\Users\jenkins\workspace\Lucene-Solr-5.5-Windows\solr\build\solr-core\test\J1
   [junit4]   2> 2818028 INFO  (TEST-TestSolrConfigHandlerCloud.test-seed#[B0490D26DBB83059]) [n:127.0.0.1:51173_    ] o.a.s.s.SolrDispatchFilter SolrDispatchFilter.init() done
   [junit4]   2> 2818031 INFO  (coreLoadExecutor-9868-thread-1-processing-n:127.0.0.1:51173_) [n:127.0.0.1:51173_ c:control_collection   x:collection1] o.a.s.c.ZkController publishing state=down
   [junit4]   2> 2818031 INFO  (coreLoadExecutor-9868-thread-1-processing-n:127.0.0.1:51173_) [n:127.0.0.1:51173_ c:control_collection   x:collection1] o.a.s.c.ZkController numShards not found on descriptor - reading it from system property
   [junit4]   2> 2818043 INFO  (coreLoadExecutor-9868-thread-1-processing-n:127.0.0.1:51173_) [n:127.0.0.1:51173_ c:control_collection   x:collection1] o.a.s.c.ZkController Collection control_collection not visible yet, but flagging it so a watch is registered when it becomes visible
   [junit4]   2> 2818044 INFO  (coreLoadExecutor-9868-thread-1-processing-n:127.0.0.1:51173_) [n:127.0.0.1:51173_ c:control_collection   x:collection1] o.a.s.c.c.ZkStateReader addZkWatch [control_collection]
   [junit4]   2> 2818044 INFO  (OverseerStateUpdate-96521115603763204-127.0.0.1:51173_-n_0000000000) [n:127.0.0.1:51173_    ] o.a.s.c.Overseer processMessage: queueSize: 1, message = {
   [junit4]   2>   "core":"collection1",
   [junit4]   2>   "roles":null,
   [junit4]   2>   "base_url":"http://127.0.0.1:51173",
   [junit4]   2>   "node_name":"127.0.0.1:51173_",
   [junit4]   2>   "numShards":"1",
   [junit4]   2>   "state":"down",
   [junit4]   2>   "shard":null,
   [junit4]   2>   "collection":"control_collection",
   [junit4]   2>   "operation":"state"} current state version: 0
   [junit4]   2> 2818045 INFO  (OverseerStateUpdate-96521115603763204-127.0.0.1:51173_-n_0000000000) [n:127.0.0.1:51173_    ] o.a.s.c.o.ReplicaMutator Update state numShards=1 message={
   [junit4]   2>   "core":"collection1",
   [junit4]   2>   "roles":null,
   [junit4]   2>   "base_url":"http://127.0.0.1:51173",
   [junit4]   2>   "node_name":"127.0.0.1:51173_",
   [junit4]   2>   "numShards":"1",
   [junit4]   2>   "state":"down",
   [junit4]   2>   "shard":null,
   [junit4]   2>   "collection":"control_collection",
   [junit4]   2>   "operation":"state"}
   [junit4]   2> 2818047 INFO  (coreLoadExecutor-9868-thread-1-processing-n:127.0.0.1:51173_) [n:127.0.0.1:51173_ c:control_collection   x:collection1] o.a.s.c.c.ZkStateReader Deleting data for [control_collection]
   [junit4]   2> 2818047 INFO  (OverseerStateUpdate-96521115603763204-127.0.0.1:51173_-n_0000000000) [n:127.0.0.1:51173_    ] o.a.s.c.o.ClusterStateMutator building a new cName: control_collection
   [junit4]   2> 2818049 INFO  (OverseerStateUpdate-96521115603763204-127.0.0.1:51173_-n_0000000000) [n:127.0.0.1:51173_    ] o.a.s.c.o.ReplicaMutator Assigning new node to shard shard=shard1
   [junit4]   2> 2818052 INFO  (coreLoadExecutor-9868-thread-1-processing-n:127.0.0.1:51173_) [n:127.0.0.1:51173_ c:control_collection   x:collection1] o.a.s.c.ZkController look for our core node name
   [junit4]   2> 2818053 INFO  (zkCallback-9991-thread-1-processing-n:127.0.0.1:51173_) [n:127.0.0.1:51173_    ] o.a.s.c.c.ZkStateReader A cluster state change: [WatchedEvent state:SyncConnected type:NodeDataChanged path:/clusterstate.json], has occurred - updating... (live nodes size: [1])
   [junit4]   2> 2819055 INFO  (coreLoadExecutor-9868-thread-1-processing-n:127.0.0.1:51173_) [n:127.0.0.1:51173_ c:control_collection   x:collection1] o.a.s.c.ZkController waiting to find shard id in clusterstate for collection1
   [junit4]   2> 2819055 INFO  (coreLoadExecutor-9868-thread-1-processing-n:127.0.0.1:51173_) [n:127.0.0.1:51173_ c:control_collection   x:collection1] o.a.s.c.ZkController Check for collection zkNode:control_collection
   [junit4]   2> 2819056 INFO  (coreLoadExecutor-9868-thread-1-processing-n:127.0.0.1:51173_) [n:127.0.0.1:51173_ c:control_collection   x:collection1] o.a.s.c.ZkController Collection zkNode exists
   [junit4]   2> 2819056 INFO  (coreLoadExecutor-9868-thread-1-processing-n:127.0.0.1:51173_) [n:127.0.0.1:51173_ c:control_collection   x:collection1] o.a.s.c.c.ZkStateReader Load collection config from: [/collections/control_collection]
   [junit4]   2> 2819058 INFO  (coreLoadExecutor-9868-thread-1-processing-n:127.0.0.1:51173_) [n:127.0.0.1:51173_ c:control_collection   x:collection1] o.a.s.c.c.ZkStateReader path=[/collections/control_collection] [configName]=[conf1] specified config exists in ZooKeeper
   [junit4]   2> 2819058 INFO  (coreLoadExecutor-9868-thread-1-processing-n:127.0.0.1:51173_) [n:127.0.0.1:51173_ c:control_collection   x:collection1] o.a.s.c.SolrResourceLoader new SolrResourceLoader for directory: 'C:\Users\jenkins\workspace\Lucene-Solr-5.5-Windows\solr\build\solr-core\test\J1\temp\solr.handler.TestSolrConfigHandlerCloud_B0490D26DBB83059-001\control-001\cores\collection1'
   [junit4]   2> 2819058 INFO  (coreLoadExecutor-9868-thread-1-processing-n:127.0.0.1:51173_) [n:127.0.0.1:51173_ c:control_collection   x:collection1] o.a.s.c.SolrResourceLoader JNDI not configured for solr (NoInitialContextEx)
   [junit4]   2> 2819058 INFO  (coreLoadExecutor-9868-thread-1-processing-n:127.0.0.1:51173_) [n:127.0.0.1:51173_ c:control_collection   x:collection1] o.a.s.c.SolrResourceLoader solr home defaulted to 'solr/' (could not find system property or JNDI)
   [junit4]   2> 2819066 INFO  (coreLoadExecutor-9868-thread-1-processing-n:127.0.0.1:51173_) [n:127.0.0.1:51173_ c:control_collection   x:collection1] o.a.s.c.Config loaded config solrconfig.xml with version 0 
   [junit4]   2> 2819095 INFO  (coreLoadExecutor-9868-thread-1-processing-n:127.0.0.1:51173_) [n:127.0.0.1:51173_ c:control_collection   x:collection1] o.a.s.c.SolrConfig current version of requestparams : -1
   [junit4]   2> 2819101 INFO  (coreLoadExecutor-9868-thread-1-processing-n:127.0.0.1:51173_) [n:127.0.0.1:51173_ c:control_collection   x:collection1] o.a.s.c.SolrConfig Using Lucene MatchVersion: 5.5.3
   [junit4]   2> 2819128 INFO  (coreLoadExecutor-9868-thread-1-processing-n:127.0.0.1:51173_) [n:127.0.0.1:51173_ c:control_collection   x:collection1] o.a.s.c.SolrConfig Loaded SolrConfig: solrconfig.xml
   [junit4]   2> 2819192 INFO  (coreLoadExecutor-9868-thread-1-processing-n:127.0.0.1:51173_) [n:127.0.0.1:51173_ c:control_collection   x:collection1] o.a.s.s.IndexSchema [collection1] Schema name=test
   [junit4]   2> 2819407 INFO  (coreLoadExecutor-9868-thread-1-processing-n:127.0.0.1:51173_) [n:127.0.0.1:51173_ c:control_collection   x:collection1] o.a.s.s.OpenExchangeRatesOrgProvider Initialized with rates=open-exchange-rates.json, refreshInterval=1440.
   [junit4]   2> 2819435 INFO  (coreLoadExecutor-9868-thread-1-processing-n:127.0.0.1:51173_) [n:127.0.0.1:51173_ c:control_collection   x:collection1] o.a.s.s.IndexSchema default search field in schema is text
   [junit4]   2> 2819437 INFO  (coreLoadExecutor-9868-thread-1-processing-n:127.0.0.1:51173_) [n:127.0.0.1:51173_ c:control_collection   x:collection1] o.a.s.s.IndexSchema unique key field: id
   [junit4]   2> 2819464 INFO  (coreLoadExecutor-9868-thread-1-processing-n:127.0.0.1:51173_) [n:127.0.0.1:51173_ c:control_collection   x:collection1] o.a.s.s.FileExchangeRateProvider Reloading exchange rates from file currency.xml
   [junit4]   2> 2819469 INFO  (coreLoadExecutor-9868-thread-1-processing-n:127.0.0.1:51173_) [n:127.0.0.1:51173_ c:control_collection   x:collection1] o.a.s.s.FileExchangeRateProvider Reloading exchange rates from file currency.xml
   [junit4]   2> 2819475 INFO  (coreLoadExecutor-9868-thread-1-processing-n:127.0.0.1:51173_) [n:127.0.0.1:51173_ c:control_collection   x:collection1] o.a.s.s.OpenExchangeRatesOrgProvider Reloading exchange rates from open-exchange-rates.json
   [junit4]   2> 2819477 INFO  (coreLoadExecutor-9868-thread-1-processing-n:127.0.0.1:51173_) [n:127.0.0.1:51173_ c:control_collection   x:collection1] o.a.s.s.OpenExchangeRatesOrgProvider Reloading exchange rates from open-exchange-rates.json
   [junit4]   2> 2819486 INFO  (coreLoadExecutor-9868-thread-1-processing-n:127.0.0.1:51173_) [n:127.0.0.1:51173_ c:control_collection   x:collection1] o.a.s.c.ConfigSetProperties Did not find ConfigSet properties, assuming default properties: Can't find resource 'configsetprops.json' in classpath or '/configs/conf1', cwd=C:\Users\jenkins\workspace\Lucene-Solr-5.5-Windows\solr\build\solr-core\test\J1
   [junit4]   2> 2819487 INFO  (coreLoadExecutor-9868-thread-1-processing-n:127.0.0.1:51173_) [n:127.0.0.1:51173_ c:control_collection   x:collection1] o.a.s.c.CoreContainer Creating SolrCore 'collection1' using configuration from collection control_collection
   [junit4]   2> 2819488 INFO  (coreLoadExecutor-9868-thread-1-processing-n:127.0.0.1:51173_) [n:127.0.0.1:51173_ c:control_collection s:shard1 r:core_node1 x:collection1] o.a.s.c.SolrCore org.apache.solr.core.MockDirectoryFactory
   [junit4]   2> 2819488 INFO  (coreLoadExecutor-9868-thread-1-processing-n:127.0.0.1:51173_) [n:127.0.0.1:51173_ c:control_collection s:shard1 r:core_node1 x:collection1] o.a.s.c.SolrCore [[collection1] ] Opening new SolrCore at [C:\Users\jenkins\workspace\Lucene-Solr-5.5-Windows\solr\build\solr-core\test\J1\temp\solr.handler.TestSolrConfigHandlerCloud_B0490D26DBB83059-001\control-001\cores\collection1], dataDir=[C:\Users\jenkins\workspace\Lucene-Solr-5.5-Windows\solr\build\solr-core\test\J1\..\..\..\..\..\..\..\..\..\Users\jenkins\workspace\Lucene-Solr-5.5-Windows\solr\build\solr-core\test\J1\temp\solr.handler.TestSolrConfigHandlerCloud_B0490D26DBB83059-001\control-001\cores\collection1\data\]
   [junit4]   2> 2819489 INFO  (coreLoadExecutor-9868-thread-1-processing-n:127.0.0.1:51173_) [n:127.0.0.1:51173_ c:control_collection s:shard1 r:core_node1 x:collection1] o.a.s.c.JmxMonitoredMap JMX monitoring is enabled. Adding Solr mbeans to JMX Server: com.sun.jmx.mbeanserver.JmxMBeanServer@16160f7
   [junit4]   2> 2819490 INFO  (coreLoadExecutor-9868-thread-1-processing-n:127.0.0.1:51173_) [n:127.0.0.1:51173_ c:control_collection s:shard1 r:core_node1 x:collection1] o.a.s.c.CachingDirectoryFactory return new directory for C:\Users\jenkins\workspace\Lucene-Solr-5.5-Windows\solr\build\solr-core\test\J1\..\..\..\..\..\..\..\..\..\Users\jenkins\workspace\Lucene-Solr-5.5-Windows\solr\build\solr-core\test\J1\temp\solr.handler.TestSolrConfigHandlerCloud_B0490D26DBB83059-001\control-001\cores\collection1\data\
   [junit4]   2> 2819490 INFO  (coreLoadExecutor-9868-thread-1-processing-n:127.0.0.1:51173_) [n:127.0.0.1:51173_ c:control_collection s:shard1 r:core_node1 x:collection1] o.a.s.c.SolrCore New index directory detected: old=null new=C:\Users\jenkins\workspace\Lucene-Solr-5.5-Windows\solr\build\solr-core\test\J1\..\..\..\..\..\..\..\..\..\Users\jenkins\workspace\Lucene-Solr-5.5-Windows\solr\build\solr-core\test\J1\temp\solr.handler.TestSolrConfigHandlerCloud_B0490D26DBB83059-001\control-001\cores\collection1\data\index/
   [junit4]   2> 2819491 WARN  (coreLoadExecutor-9868-thread-1-processing-n:127.0.0.1:51173_) [n:127.0.0.1:51173_ c:control_collection s:shard1 r:core_node1 x:collection1] o.a.s.c.SolrCore [collection1] Solr index directory 'C:\Users\jenkins\workspace\Lucene-Solr-5.5-Windows\solr\build\solr-core\test\J1\..\..\..\..\..\..\..\..\..\Users\jenkins\workspace\Lucene-Solr-5.5-Windows\solr\build\solr-core\test\J1\temp\solr.handler.TestSolrConfigHandlerCloud_B0490D26DBB83059-001\control-001\cores\collection1\data\index' doesn't exist. Creating new index...
   [junit4]   2> 2819493 INFO  (coreLoadExecutor-9868-thread-1-processing-n:127.0.0.1:51173_) [n:127.0.0.1:51173_ c:control_collection s:shard1 r:core_node1 x:collection1] o.a.s.c.CachingDirectoryFactory return new directory for C:\Users\jenkins\workspace\Lucene-Solr-5.5-Windows\solr\build\solr-core\test\J1\..\..\..\..\..\..\..\..\..\Users\jenkins\workspace\Lucene-Solr-5.5-Windows\solr\build\solr-core\test\J1\temp\solr.handler.TestSolrConfigHandlerCloud_B0490D26DBB83059-001\control-001\cores\collection1\data\index
   [junit4]   2> 2819493 INFO  (coreLoadExecutor-9868-thread-1-processing-n:127.0.0.1:51173_) [n:127.0.0.1:51173_ c:control_collection s:shard1 r:core_node1 x:collection1] o.a.s.u.RandomMergePolicy RandomMergePolicy wrapping class org.apache.lucene.index.LogDocMergePolicy: [LogDocMergePolicy: minMergeSize=1000, mergeFactor=48, maxMergeSize=9223372036854775807, maxMergeSizeForForcedMerge=9223372036854775807, calibrateSizeByDeletes=true, maxMergeDocs=2147483647, maxCFSSegmentSizeMB=8.796093022207999E12, noCFSRatio=1.0]
   [junit4]   2> 2819495 INFO  (coreLoadExecutor-9868-thread-1-processing-n:127.0.0.1:51173_) [n:127.0.0.1:51173_ c:control_collection s:shard1 r:core_node1 x:collection1] o.a.s.c.SolrDeletionPolicy SolrDeletionPolicy.onCommit: commits: num=1
   [junit4]   2> 	commit{dir=MockDirectoryWrapper(RAMDirectory@18116d7 lockFactory=org.apache.lucene.store.SingleInstanceLockFactory@1e647c6),segFN=segments_1,generation=1}
   [junit4]   2> 2819495 INFO  (coreLoadExecutor-9868-thread-1-processing-n:127.0.0.1:51173_) [n:127.0.0.1:51173_ c:control_collection s:shard1 r:core_node1 x:collection1] o.a.s.c.SolrDeletionPolicy newest commit generation = 1
   [junit4]   2> 2819496 INFO  (OldIndexDirectoryCleanupThreadForCore-collection1) [n:127.0.0.1:51173_ c:control_collection s:shard1 r:core_node1 x:collection1] o.a.s.c.SolrCore Looking for old index directories to cleanup for core collection1 in C:\Users\jenkins\workspace\Lucene-Solr-5.5-Windows\solr\build\solr-core\test\J1\..\..\..\..\..\..\..\..\..\Users\jenkins\workspace\Lucene-Solr-5.5-Windows\solr\build\solr-core\test\J1\temp\solr.handler.TestSolrConfigHandlerCloud_B0490D26DBB83059-001\control-001\cores\collection1\data\
   [junit4]   2> 2819496 WARN  (OldIndexDirectoryCleanupThreadForCore-collection1) [n:127.0.0.1:51173_ c:control_collection s:shard1 r:core_node1 x:collection1] o.a.s.c.DirectoryFactory C:\Users\jenkins\workspace\Lucene-Solr-5.5-Windows\solr\build\solr-core\test\J1\..\..\..\..\..\..\..\..\..\Users\jenkins\workspace\Lucene-Solr-5.5-Windows\solr\build\solr-core\test\J1\temp\solr.handler.TestSolrConfigHandlerCloud_B0490D26DBB83059-001\control-001\cores\collection1\data\ does not point to a valid data directory; skipping clean-up of old index directories.
   [junit4]   2> 2819505 INFO  (coreLoadExecutor-9868-thread-1-processing-n:127.0.0.1:51173_) [n:127.0.0.1:51173_ c:control_collection s:shard1 r:core_node1 x:collection1] o.a.s.u.p.UpdateRequestProcessorChain creating updateRequestProcessorChain "nodistrib"
   [junit4]   2> 2819505 INFO  (coreLoadExecutor-9868-thread-1-processing-n:127.0.0.1:51173_) [n:127.0.0.1:51173_ c:control_collection s:shard1 r:core_node1 x:collection1] o.a.s.u.p.UpdateRequestProcessorChain creating updateRequestProcessorChain "dedupe"
   [junit4]   2> 2819506 INFO  (coreLoadExecutor-9868-thread-1-processing-n:127.0.0.1:51173_) [n:127.0.0.1:51173_ c:control_collection s:shard1 r:core_node1 x:collection1] o.a.s.u.p.UpdateRequestProcessorChain inserting DistributedUpdateProcessorFactory into updateRequestProcessorChain "dedupe"
   [junit4]   2> 2819506 INFO  (coreLoadExecutor-9868-thread-1-processing-n:127.0.0.1:51173_) [n:127.0.0.1:51173_ c:control_collection s:shard1 r:core_node1 x:collection1] o.a.s.u.p.UpdateRequestProcessorChain creating updateRequestProcessorChain "stored_sig"
   [junit4]   2> 2819506 INFO  (coreLoadExecutor-9868-thread-1-processing-n:127.0.0.1:51173_) [n:127.0.0.1:51173_ c:control_collection s:shard1 r:core_node1 x:collection1] o.a.s.u.p.UpdateRequestProcessorChain inserting DistributedUpdateProcessorFactory into updateRequestProcessorChain "stored_sig"
   [junit4]   2> 2819507 INFO  (coreLoadExecutor-9868-thread-1-processing-n:127.0.0.1:51173_) [n:127.0.0.1:51173_ c:control_collection s:shard1 r:core_node1 x:collection1] o.a.s.u.p.UpdateRequestProcessorChain creating updateRequestProcessorChain "distrib-dup-test-chain-explicit"
   [junit4]   2> 2819507 INFO  (coreLoadExecutor-9868-thread-1-processing-n:127.0.0.1:51173_) [n:127.0.0.1:51173_ c:control_collection s:shard1 r:core_node1 x:collection1] o.a.s.u.p.UpdateRequestProcessorChain creating updateRequestProcessorChain "distrib-dup-test-chain-implicit"
   [junit4]   2> 2819508 INFO  (coreLoadExecutor-9868-thread-1-processing-n:127.0.0.1:51173_) [n:127.0.0.1:51173_ c:control_collection s:shard1 r:core_node1 x:collection1] o.a.s.u.p.UpdateRequestProcessorChain inserting DistributedUpdateProcessorFactory into updateRequestProcessorChain "distrib-dup-test-chain-implicit"
   [junit4]   2> 2819508 INFO  (coreLoadExecutor-9868-thread-1-processing-n:127.0.0.1:51173_) [n:127.0.0.1:51173_ c:control_collection s:shard1 r:core_node1 x:collection1] o.a.s.c.SolrCore no updateRequestProcessorChain defined as default, creating implicit default
   [junit4]   2> 2819508 WARN  (coreLoadExecutor-9868-thread-1-processing-n:127.0.0.1:51173_) [n:127.0.0.1:51173_ c:control_collection s:shard1 r:core_node1 x:collection1] o.a.s.c.RequestHandlers INVALID paramSet a in requestHandler {type = requestHandler,name = /dump,class = DumpRequestHandler,args = {defaults={a=A,b=B}}}
   [junit4]   2> 2819520 INFO  (coreLoadExecutor-9868-thread-1-processing-n:127.0.0.1:51173_) [n:127.0.0.1:51173_ c:control_collection s:shard1 r:core_node1 x:collection1] o.a.s.h.l.XMLLoader xsltCacheLifetimeSeconds=60
   [junit4]   2> 2819524 INFO  (coreLoadExecutor-9868-thread-1-processing-n:127.0.0.1:51173_) [n:127.0.0.1:51173_ c:control_collection s:shard1 r:core_node1 x:collection1] o.a.s.h.l.XMLLoader xsltCacheLifetimeSeconds=60
   [junit4]   2> 2819528 INFO  (coreLoadExecutor-9868-thread-1-processing-n:127.0.0.1:51173_) [n:127.0.0.1:51173_ c:control_collection s:shard1 r:core_node1 x:collection1] o.a.s.h.l.XMLLoader xsltCacheLifetimeSeconds=60
   [junit4]   2> 2819533 INFO  (coreLoadExecutor-9868-thread-1-processing-n:127.0.0.1:51173_) [n:127.0.0.1:51173_ c:control_collection s:shard1 r:core_node1 x:collection1] o.a.s.h.l.XMLLoader xsltCacheLifetimeSeconds=60
   [junit4]   2> 2819548 INFO  (coreLoadExecutor-9868-thread-1-processing-n:127.0.0.1:51173_) [n:127.0.0.1:51173_ c:control_collection s:shard1 r:core_node1 x:collection1] o.a.s.c.RequestHandlers Registered paths: /admin/mbeans,standard,/dump,/update/csv,/update/json/docs,/admin/luke,/admin/segments,/get,/admin/system,/replication,/admin/properties,/config,/schema,/admin/plugins,/admin/logging,/update/json,/admin/threads,/admin/ping,/update,/admin/file
   [junit4]   2> 2819550 INFO  (coreLoadExecutor-9868-thread-1-processing-n:127.0.0.1:51173_) [n:127.0.0.1:51173_ c:control_collection s:shard1 r:core_node1 x:collection1] o.a.s.c.SolrCore Using default statsCache cache: org.apache.solr.search.stats.LocalStatsCache
   [junit4]   2> 2819552 INFO  (coreLoadExecutor-9868-thread-1-processing-n:127.0.0.1:51173_) [n:127.0.0.1:51173_ c:control_collection s:shard1 r:core_node1 x:collection1] o.a.s.u.UpdateHandler Using UpdateLog implementation: org.apache.solr.update.UpdateLog
   [junit4]   2> 2819552 INFO  (coreLoadExecutor-9868-thread-1-processing-n:127.0.0.1:51173_) [n:127.0.0.1:51173_ c:control_collection s:shard1 r:core_node1 x:collection1] o.a.s.u.UpdateLog Initializing UpdateLog: dataDir= defaultSyncLevel=FLUSH numRecordsToKeep=100 maxNumLogsToKeep=10 numVersionBuckets=65536
   [junit4]   2> 2819557 INFO  (coreLoadExecutor-9868-thread-1-processing-n:127.0.0.1:51173_) [n:127.0.0.1:51173_ c:control_collection s:shard1 r:core_node1 x:collection1] o.a.s.u.CommitTracker Hard AutoCommit: disabled
   [junit4]   2> 2819557 INFO  (coreLoadExecutor-9868-thread-1-processing-n:127.0.0.1:51173_) [n:127.0.0.1:51173_ c:control_collection s:shard1 r:core_node1 x:collection1] o.a.s.u.CommitTracker Soft AutoCommit: disabled
   [junit4]   2> 2819558 INFO  (coreLoadExecutor-9868-thread-1-processing-n:127.0.0.1:51173_) [n:127.0.0.1:51173_ c:control_collection s:shard1 r:core_node1 x:collection1] o.a.s.u.RandomMergePolicy RandomMergePolicy wrapping class org.apache.lucene.index.TieredMergePolicy: [TieredMergePolicy: maxMergeAtOnce=29, maxMergeAtOnceExplicit=19, maxMergedSegmentMB=82.58203125, floorSegmentMB=0.68359375, forceMergeDeletesPctAllowed=17.00231346894304, segmentsPerTier=10.0, maxCFSSegmentSizeMB=8.796093022207999E12, noCFSRatio=0.11180316029547255
   [junit4]   2> 2819558 INFO  (coreLoadExecutor-9868-thread-1-processing-n:127.0.0.1:51173_) [n:127.0.0.1:51173_ c:control_collection s:shard1 r:core_node1 x:collection1] o.a.s.c.SolrDeletionPolicy SolrDeletionPolicy.onInit: commits: num=1
   [junit4]   2> 	commit{dir=MockDirectoryWrapper(RAMDirectory@18116d7 lockFactory=org.apache.lucene.store.SingleInstanceLockFactory@1e647c6),segFN=segments_1,generation=1}
   [junit4]   2> 2819558 INFO  (coreLoadExecutor-9868-thread-1-processing-n:127.0.0.1:51173_) [n:127.0.0.1:51173_ c:control_collection s:shard1 r:core_node1 x:collection1] o.a.s.c.SolrDeletionPolicy newest commit generation = 1
   [junit4]   2> 2819558 INFO  (coreLoadExecutor-9868-thread-1-processing-n:127.0.0.1:51173_) [n:127.0.0.1:51173_ c:control_collection s:shard1 r:core_node1 x:collection1] o.a.s.s.SolrIndexSearcher Opening Searcher@edd9fa[collection1] main
   [junit4]   2> 2819559 INFO  (coreLoadExecutor-9868-thread-1-processing-n:127.0.0.1:51173_) [n:127.0.0.1:51173_ c:control_collection s:shard1 r:core_node1 x:collection1] o.a.s.c.c.ZkStateReader Load collection config from: [/collections/control_collection]
   [junit4]   2> 2819560 INFO  (coreLoadExecutor-9868-thread-1-processing-n:127.0.0.1:51173_) [n:127.0.0.1:51173_ c:control_collection s:shard1 r:core_node1 x:collection1] o.a.s.c.c.ZkStateReader path=[/collections/control_collection] [configName]=[conf1] specified config exists in ZooKeeper
   [junit4]   2> 2819560 INFO  (coreLoadExecutor-9868-thread-1-processing-n:127.0.0.1:51173_) [n:127.0.0.1:51173_ c:control_collection s:shard1 r:core_node1 x:collection1] o.a.s.r.ManagedResourceStorage Setting up ZooKeeper-based storage for the RestManager with znodeBase: /configs/conf1
   [junit4]   2> 2819563 INFO  (coreLoadExecutor-9868-thread-1-processing-n:127.0.0.1:51173_) [n:127.0.0.1:51173_ c:control_collection s:shard1 r:core_node1 x:collection1] o.a.s.r.ManagedResourceStorage Configured ZooKeeperStorageIO with znodeBase: /configs/conf1
   [junit4]   2> 2819563 INFO  (coreLoadExecutor-9868-thread-1-processing-n:127.0.0.1:51173_) [n:127.0.0.1:51173_ c:control_collection s:shard1 r:core_node1 x:collection1] o.a.s.r.RestManager Initializing RestManager with initArgs: {}
   [junit4]   2> 2819563 INFO  (coreLoadExecutor-9868-thread-1-processing-n:127.0.0.1:51173_) [n:127.0.0.1:51173_ c:control_collection s:shard1 r:core_node1 x:collection1] o.a.s.r.ManagedResourceStorage Reading _rest_managed.json using ZooKeeperStorageIO:path=/configs/conf1
   [junit4]   2> 2819565 INFO  (coreLoadExecutor-9868-thread-1-processing-n:127.0.0.1:51173_) [n:127.0.0.1:51173_ c:control_collection s:shard1 r:core_node1 x:collection1] o.a.s.r.ManagedResourceStorage No data found for znode /configs/conf1/_rest_managed.json
   [junit4]   2> 2819565 INFO  (coreLoadExecutor-9868-thread-1-processing-n:127.0.0.1:51173_) [n:127.0.0.1:51173_ c:control_collection s:shard1 r:core_node1 x:collection1] o.a.s.r.ManagedResourceStorage Loaded null at path _rest_managed.json using ZooKeeperStorageIO:path=/configs/conf1
   [junit4]   2> 2819565 INFO  (coreLoadExecutor-9868-thread-1-processing-n:127.0.0.1:51173_) [n:127.0.0.1:51173_ c:control_collection s:shard1 r:core_node1 x:collection1] o.a.s.r.RestManager Initializing 0 registered ManagedResources
   [junit4]   2> 2819565 INFO  (coreLoadExecutor-9868-thread-1-processing-n:127.0.0.1:51173_) [n:127.0.0.1:51173_ c:control_collection s:shard1 r:core_node1 x:collection1] o.a.s.h.ReplicationHandler Commits will be reserved for  10000
   [junit4]   2> 2819569 INFO  (searcherExecutor-9869-thread-1-processing-n:127.0.0.1:51173_ x:collection1 s:shard1 c:control_collection r:core_node1) [n:127.0.0.1:51173_ c:control_collection s:shard1 r:core_node1 x:collection1] o.a.s.c.SolrCore [collection1] Registered new searcher Searcher@edd9fa[collection1] main{ExitableDirectoryReader(UninvertingDirectoryReader())}
   [junit4]   2> 2819570 INFO  (coreLoadExecutor-9868-thread-1-processing-n:127.0.0.1:51173_) [n:127.0.0.1:51173_ c:control_collection s:shard1 r:core_node1 x:collection1] o.a.s.u.UpdateLog Looking up max value of version field to seed version buckets
   [junit4]   2> 2819570 INFO  (coreLoadExecutor-9868-thread-1-processing-n:127.0.0.1:51173_) [n:127.0.0.1:51173_ c:control_collection s:shard1 r:core_node1 x:collection1] o.a.s.u.VersionInfo Refreshing highest value of _version_ for 65536 version buckets from index
   [junit4]   2> 2819570 INFO  (coreLoadExecutor-9868-thread-1-processing-n:127.0.0.1:51173_) [n:127.0.0.1:51173_ c:control_collection s:shard1 r:core_node1 x:collection1] o.a.s.u.VersionInfo No terms found for _version_, cannot seed version bucket highest value from index
   [junit4]   2> 2819570 INFO  (coreLoadExecutor-9868-thread-1-processing-n:127.0.0.1:51173_) [n:127.0.0.1:51173_ c:control_collection s:shard1 r:core_node1 x:collection1] o.a.s.u.UpdateLog Could not find max version in index or recent updates, using new clock 1544337852760850432
   [junit4]   2> 2819573 INFO  (coreLoadExecutor-9868-thread-1-processing-n:127.0.0.1:51173_) [n:127.0.0.1:51173_ c:control_collection s:shard1 r:core_node1 x:collection1] o.a.s.u.UpdateLog Took 3.0ms to seed version buckets with highest version 1544337852760850432
   [junit4]   2> 2819574 INFO  (coreLoadExecutor-9868-thread-1-processing-n:127.0.0.1:51173_) [n:127.0.0.1:51173_ c:control_collection s:shard1 r:core_node1 x:collection1] o.a.s.c.ZkController watch zkdir /configs/conf1
   [junit4]   2> 2819575 INFO  (coreLoadExecutor-9868-thread-1-processing-n:127.0.0.1:51173_) [n:127.0.0.1:51173_ c:control_collection s:shard1 r:core_node1 x:collection1] o.a.s.c.CoreContainer registering core: collection1
   [junit4]   2> 2819576 INFO  (coreZkRegister-9862-thread-1-processing-n:127.0.0.1:51173_ x:collection1 s:shard1 c:control_collection r:core_node1) [n:127.0.0.1:51173_ c:control_collection s:shard1 r:core_node1 x:collection1] o.a.s.c.ZkController Register replica - core:collection1 address:http://127.0.0.1:51173 collection:control_collection shard:shard1
   [junit4]   2> 2819579 INFO  (coreZkRegister-9862-thread-1-processing-n:127.0.0.1:51173_ x:collection1 s:shard1 c:control_collection r:core_node1) [n:127.0.0.1:51173_ c:control_collection s:shard1 r:core_node1 x:collection1] o.a.s.c.c.SolrZkClient makePath: /collections/control_collection/leader_elect/shard1/election
   [junit4]   2> 2819598 INFO  (coreZkRegister-9862-thread-1-processing-n:127.0.0.1:51173_ x:collection1 s:shard1 c:control_collection r:core_node1) [n:127.0.0.1:51173_ c:control_collection s:shard1 r:core_node1 x:collection1] o.a.s.c.LeaderElector Joined leadership election with path: /collections/control_collection/leader_elect/shard1/election/96521115603763204-core_node1-n_0000000000
   [junit4]   2> 2819599 INFO  (coreZkRegister-9862-thread-1-processing-n:127.0.0.1:51173_ x:collection1 s:shard1 c:control_collection r:core_node1) [n:127.0.0.1:51173_ c:control_collection s:shard1 r:core_node1 x:collection1] o.a.s.c.ShardLeaderElectionContext Running the leader process for shard=shard1 and weAreReplacement=false and leaderVoteWait=10000
   [junit4]   2> 2819603 INFO  (coreZkRegister-9862-thread-1-processing-n:127.0.0.1:51173_ x:collection1 s:shard1 c:control_collection r:core_node1) [n:127.0.0.1:51173_ c:control_collection s:shard1 r:core_node1 x:collection1] o.a.s.c.ShardLeaderElectionContext Enough replicas found to continue.
   [junit4]   2> 2819604 INFO  (coreZkRegister-9862-thread-1-processing-n:127.0.0.1:51173_ x:collection1 s:shard1 c:control_collection r:core_node1) [n:127.0.0.1:51173_ c:control_collection s:shard1 r:core_node1 x:collection1] o.a.s.c.ShardLeaderElectionContext I may be the new leader - try and sync
   [junit4]   2> 2819604 INFO  (coreZkRegister-9862-thread-1-processing-n:127.0.0.1:51173_ x:collection1 s:shard1 c:control_collection r:core_node1) [n:127.0.0.1:51173_ c:control_collection s:shard1 r:core_node1 x:collection1] o.a.s.c.SyncStrategy Sync replicas to http://127.0.0.1:51173/collection1/
   [junit4]   2> 2819604 INFO  (coreZkRegister-9862-thread-1-processing-n:127.0.0.1:51173_ x:collection1 s:shard1 c:control_collection r:core_node1) [n:127.0.0.1:51173_ c:control_collection s:shard1 r:core_node1 x:collection1] o.a.s.c.SyncStrategy Sync Success - now sync replicas to me
   [junit4]   2> 2819604 INFO  (coreZkRegister-9862-thread-1-processing-n:127.0.0.1:51173_ x:collection1 s:shard1 c:control_collection r:core_node1) [n:127.0.0.1:51173_ c:control_collection s:shard1 r:core_node1 x:collection1] o.a.s.c.SyncStrategy http://127.0.0.1:51173/collection1/ has no replicas
   [junit4]   2> 2819605 INFO  (OverseerStateUpdate-96521115603763204-127.0.0.1:51173_-n_0000000000) [n:127.0.0.1:51173_    ] o.a.s.c.Overseer processMessage: queueSize: 1, message = {
   [junit4]   2>   "operation":"leader",
   [junit4]   2>   "shard":"shard1",
   [junit4]   2>   "collection":"control_collection"} current state version: 1
   [junit4]   2> 2819607 INFO  (coreZkRegister-9862-thread-1-processing-n:127.0.0.1:51173_ x:collection1 s:shard1 c:control_collection r:core_node1) [n:127.0.0.1:51173_ c:control_collection s:shard1 r:core_node1 x:collection1] o.a.s.c.c.SolrZkClient makePath: /collections/control_collection/leaders/shard1
   [junit4]   2> 2819608 INFO  (zkCallback-9991-thread-2-processing-n:127.0.0.1:51173_) [n:127.0.0.1:51173_    ] o.a.s.c.c.ZkStateReader A cluster state change: [WatchedEvent state:SyncConnected type:NodeDataChanged path:/clusterstate.json], has occurred - updating... (live nodes size: [1])
   [junit4]   2> 2819615 INFO  (coreZkRegister-9862-thread-1-processing-n:127.0.0.1:51173_ x:collection1 s:shard1 c:control_collection r:core_node1) [n:127.0.0.1:51173_ c:control_collection s:shard1 r:core_node1 x:collection1] o.a.s.c.ShardLeaderElectionContextBase Creating leader registration node /collections/control_collection/leaders/shard1/leader after winning as /collections/control_collection/leader_elect/shard1/election/96521115603763204-core_node1-n_0000000000
   [junit4]   2> 2819618 INFO  (coreZkRegister-9862-thread-1-processing-n:127.0.0.1:51173_ x:collection1 s:shard1 c:control_collection r:core_node1) [n:127.0.0.1:51173_ c:control_collection s:shard1 r:core_node1 x:collection1] o.a.s.c.ShardLeaderElectionContext I am the new leader: http://127.0.0.1:51173/collection1/ shard1
   [junit4]   2> 2819620 INFO  (OverseerStateUpdate-96521115603763204-127.0.0.1:51173_-n_0000000000) [n:127.0.0.1:51173_    ] o.a.s.c.Overseer processMessage: queueSize: 1, message = {
   [junit4]   2>   "operation":"leader",
   [junit4]   2>   "shard":"shard1",
   [junit4]   2>   "collection":"control_collection",
   [junit4]   2>   "base_url":"http://127.0.0.1:51173",
   [junit4]   2>   "core":"collection1",
   [junit4]   2>   "state":"active"} current state version: 2
   [junit4]   2> 2819727 INFO  (zkCallback-9991-thread-1-processing-n:127.0.0.1:51173_) [n:127.0.0.1:51173_    ] o.a.s.c.c.ZkStateReader A cluster state change: [WatchedEvent state:SyncConnected type:NodeDataChanged path:/clusterstate.json], has occurred - updating... (live nodes size: [1])
   [junit4]   2> 2819774 INFO  (coreZkRegister-9862-thread-1-processing-n:127.0.0.1:51173_ x:collection1 s:shard1 c:control_collection r:core_node1) [n:127.0.0.1:51173_ c:control_collection s:shard1 r:core_node1 x:collection1] o.a.s.c.ZkController We are http://127.0.0.1:51173/collection1/ and leader is http://127.0.0.1:51173/collection1/
   [junit4]   2> 2819774 INFO  (coreZkRegister-9862-thread-1-processing-n:127.0.0.1:51173_ x:collection1 s:shard1 c:control_collection r:core_node1) [n:127.0.0.1:51173_ c:control_collection s:shard1 r:core_node1 x:collection1] o.a.s.c.ZkController No LogReplay needed for core=collection1 baseURL=http://127.0.0.1:51173
   [junit4]   2> 2819774 INFO  (coreZkRegister-9862-thread-1-processing-n:127.0.0.1:51173_ x:collection1 s:shard1 c:control_collection r:core_node1) [n:127.0.0.1:51173_ c:control_collection s:shard1 r:core_node1 x:collection1] o.a.s.c.ZkController I am the leader, no recovery necessary
   [junit4]   2> 2819774 INFO  (coreZkRegister-9862-thread-1-processing-n:127.0.0.1:51173_ x:collection1 s:shard1 c:control_collection r:core_node1) [n:127.0.0.1:51173_ c:control_collection s:shard1 r:core_node1 x:collection1] o.a.s.c.ZkController publishing state=active
   [junit4]   2> 2819774 INFO  (coreZkRegister-9862-thread-1-processing-n:127.0.0.1:51173_ x:collection1 s:shard1 c:control_collection r:core_node1) [n:127.0.0.1:51173_ c:control_collection s:shard1 r:core_node1 x:collection1] o.a.s.c.ZkController numShards not found on descriptor - reading it from system property
   [junit4]   2> 2819795 INFO  (OverseerStateUpdate-96521115603763204-127.0.0.1:51173_-n_0000000000) [n:127.0.0.1:51173_    ] o.a.s.c.Overseer processMessage: queueSize: 1, message = {
   [junit4]   2>   "core":"collection1",
   [junit4]   2>   "core_node_name":"core_node1",
   [junit4]   2>   "roles":null,
   [junit4]   2>   "base_url":"http://127.0.0.1:51173",
   [junit4]   2>   "node_name":"127.0.0.1:51173_",
   [junit4]   2>   "numShards":"1",
   [junit4]   2>   "state":"active",
   [junit4]   2>   "shard":"shard1",
   [junit4]   2>   "collection":"control_collection",
   [junit4]   2>   "operation":"state"} current state version: 3
   [junit4]   2> 2819796 INFO  (OverseerStateUpdate-96521115603763204-127.0.0.1:51173_-n_0000000000) [n:127.0.0.1:51173_    ] o.a.s.c.o.ReplicaMutator Update state numShards=1 message={
   [junit4]   2>   "core":"collection1",
   [junit4]   2>   "core_node_name":"core_node1",
   [junit4]   2>   "roles":null,
   [junit4]   2>   "base_url":"http://127.0.0.1:51173",
   [junit4]   2>   "node_name":"127.0.0.1:51173_",
   [junit4]   2>   "numShards":"1",
   [junit4]   2>   "state":"active",
   [junit4]   2>   "shard":"shard1",
   [junit4]   2>   "collection":"control_collection",
   [junit4]   2>   "operation":"state"}
   [junit4]   2> 2819903 INFO  (zkCallback-9991-thread-3-processing-n:127.0.0.1:51173_) [n:127.0.0.1:51173_    ] o.a.s.c.c.ZkStateReader A cluster state change: [WatchedEvent state:SyncConnected type:NodeDataChanged path:/clusterstate.json], has occurred - updating... (live nodes size: [1])
   [junit4]   2> 2820035 INFO  (TEST-TestSolrConfigHandlerCloud.test-seed#[B0490D26DBB83059]) [    ] o.a.s.c.c.SolrZkClient Using default ZkCredentialsProvider
   [junit4]   2> 2820050 INFO  (TEST-TestSolrConfigHandlerCloud.test-seed#[B0490D26DBB83059]) [    ] o.a.s.c.c.ConnectionManager Waiting for client to connect to ZooKeeper
   [junit4]   2> 2820051 INFO  (zkCallback-9993-thread-1) [    ] o.a.s.c.c.ConnectionManager Watcher org.apache.solr.common.cloud.ConnectionManager@d6a986 name:ZooKeeperConnection Watcher:127.0.0.1:51166/solr got event WatchedEvent state:SyncConnected type:None path:null path:null type:None
   [junit4]   2> 2820051 INFO  (TEST-TestSolrConfigHandlerCloud.test-seed#[B0490D26DBB83059]) [    ] o.a.s.c.c.ConnectionManager Client is connected to ZooKeeper
   [junit4]   2> 2820051 INFO  (TEST-TestSolrConfigHandlerCloud.test-seed#[B0490D26DBB83059]) [    ] o.a.s.c.c.SolrZkClient Using default ZkACLProvider
   [junit4]   2> 2820051 INFO  (TEST-TestSolrConfigHandlerCloud.test-seed#[B0490D26DBB83059]) [    ] o.a.s.c.c.ZkStateReader Updating cluster state from ZooKeeper... 
   [junit4]   2> 2820059 INFO  (TEST-TestSolrConfigHandlerCloud.test-seed#[B0490D26DBB83059]) [    ] o.a.s.c.ChaosMonkey monkey: init - expire sessions:false cause connection loss:false
   [junit4]   2> 2820717 INFO  (TEST-TestSolrConfigHandlerCloud.test-seed#[B0490D26DBB83059]) [    ] o.a.s.SolrTestCaseJ4 Writing core.properties file to C:\Users\jenkins\workspace\Lucene-Solr-5.5-Windows\solr\build\solr-core\test\J1\temp\solr.handler.TestSolrConfigHandlerCloud_B0490D26DBB83059-001\shard-1-001\cores\collection1
   [junit4]   2> 2820722 INFO  (TEST-TestSolrConfigHandlerCloud.test-seed#[B0490D26DBB83059]) [    ] o.a.s.c.AbstractFullDistribZkTestBase create jetty 1 in directory C:\Users\jenkins\workspace\Lucene-Solr-5.5-Windows\solr\build\solr-core\test\J1\temp\solr.handler.TestSolrConfigHandlerCloud_B0490D26DBB83059-001\shard-1-001
   [junit4]   2> 2820723 INFO  (TEST-TestSolrConfigHandlerCloud.test-seed#[B0490D26DBB83059]) [    ] o.e.j.s.Server jetty-9.2.13.v20150730
   [junit4]   2> 2820725 INFO  (TEST-TestSolrConfigHandlerCloud.test-seed#[B0490D26DBB83059]) [    ] o.e.j.s.h.ContextHandler Started o.e.j.s.ServletContextHandler@1792d67{/,null,AVAILABLE}
   [junit4]   2> 2820726 INFO  (TEST-TestSolrConfigHandlerCloud.test-seed#[B0490D26DBB83059]) [    ] o.e.j.s.ServerConnector Started ServerConnector@d72185{HTTP/1.1}{127.0.0.1:51188}
   [junit4]   2> 2820726 INFO  (TEST-TestSolrConfigHandlerCloud.test-seed#[B0490D26DBB83059]) [    ] o.e.j.s.Server Started @2825501ms
   [junit4]   2> 2820726 INFO  (TEST-TestSolrConfigHandlerCloud.test-seed#[B0490D26DBB83059]) [    ] o.a.s.c.s.e.JettySolrRunner Jetty properties: {solr.data.dir=C:\Users\jenkins\workspace\Lucene-Solr-5.5-Windows\solr\build\solr-core\test\J1\temp\solr.handler.TestSolrConfigHandlerCloud_B0490D26DBB83059-001\tempDir-001/jetty1, solrconfig=solrconfig.xml, hostContext=/, hostPort=51188, coreRootDirectory=C:\Users\jenkins\workspace\Lucene-Solr-5.5-Windows\solr\build\solr-core\test\J1\temp\solr.handler.TestSolrConfigHandlerCloud_B0490D26DBB83059-001\shard-1-001\cores}
   [junit4]   2> 2820728 INFO  (TEST-TestSolrConfigHandlerCloud.test-seed#[B0490D26DBB83059]) [    ] o.a.s.s.SolrDispatchFilter SolrDispatchFilter.init(): sun.misc.Launcher$AppClassLoader@1d16e93
   [junit4]   2> 2820728 INFO  (TEST-TestSolrConfigHandlerCloud.test-seed#[B0490D26DBB83059]) [    ] o.a.s.c.SolrResourceLoader new SolrResourceLoader for directory: 'C:\Users\jenkins\workspace\Lucene-Solr-5.5-Windows\solr\build\solr-core\test\J1\temp\solr.handler.TestSolrConfigHandlerCloud_B0490D26DBB83059-001\shard-1-001'
   [junit4]   2> 2820728 INFO  (TEST-TestSolrConfigHandlerCloud.test-seed#[B0490D26DBB83059]) [    ] o.a.s.c.SolrResourceLoader JNDI not configured for solr (NoInitialContextEx)
   [junit4]   2> 2820728 INFO  (TEST-TestSolrConfigHandlerCloud.test-seed#[B0490D26DBB83059]) [    ] o.a.s.c.SolrResourceLoader solr home defaulted to 'solr/' (could not find system property or JNDI)
   [junit4]   2> 2820731 INFO  (TEST-TestSolrConfigHandlerCloud.test-seed#[B0490D26DBB83059]) [    ] o.a.s.c.c.SolrZkClient Using default ZkCredentialsProvider
   [junit4]   2> 2820733 INFO  (TEST-TestSolrConfigHandlerCloud.test-seed#[B0490D26DBB83059]) [    ] o.a.s.c.c.ConnectionManager Waiting for client to connect to ZooKeeper
   [junit4]   2> 2820735 INFO  (zkCallback-9994-thread-1) [    ] o.a.s.c.c.ConnectionManager Watcher org.apache.solr.common.cloud.ConnectionManager@4f6c54 name:ZooKeeperConnection Watcher:127.0.0.1:51166/solr got event WatchedEvent state:SyncConnected type:None path:null path:null type:None
   [junit4]   2> 2820736 INFO  (TEST-TestSolrConfigHandlerCloud.test-seed#[B0490D26DBB83059]) [    ] o.a.s.c.c.ConnectionManager Client is connected to ZooKeeper
   [junit4]   2> 2820736 INFO  (TEST-TestSolrConfigHandlerCloud.test-seed#[B0490D26DBB83059]) [    ] o.a.s.c.c.SolrZkClient Using default ZkACLProvider
   [junit4]   2> 2820743 INFO  (TEST-TestSolrConfigHandlerCloud.test-seed#[B0490D26DBB83059]) [    ] o.a.s.s.SolrDispatchFilter Loading solr.xml from SolrHome (not found in ZooKeeper)
   [junit4]   2> 2820743 INFO  (TEST-TestSolrConfigHandlerCloud.test-seed#[B0490D26DBB83059]) [    ] o.a.s.c.SolrXmlConfig Loading container configuration from C:\Users\jenkins\workspace\Lucene-Solr-5.5-Windows\solr\build\solr-core\test\J1\temp\solr.handler.TestSolrConfigHandlerCloud_B0490D26DBB83059-001\shard-1-001\solr.xml
   [junit4]   2> 2820769 INFO  (TEST-TestSolrConfigHandlerCloud.test-seed#[B0490D26DBB83059]) [    ] o.a.s.c.CorePropertiesLocator Config-defined core root directory: C:\Users\jenkins\workspace\Lucene-Solr-5.5-Windows\solr\build\solr-core\test\J1\temp\solr.handler.TestSolrConfigHandlerCloud_B0490D26DBB83059-001\shard-1-001\cores
   [junit4]   2> 2820770 INFO  (TEST-TestSolrConfigHandlerCloud.test-seed#[B0490D26DBB83059]) [    ] o.a.s.c.CoreContainer New CoreContainer 30870963
   [junit4]   2> 2820770 INFO  (TEST-TestSolrConfigHandlerCloud.test-seed#[B0490D26DBB83059]) [    ] o.a.s.c.CoreContainer Loading cores into CoreContainer [instanceDir=C:\Users\jenkins\workspace\Lucene-Solr-5.5-Windows\solr\build\solr-core\test\J1\temp\solr.handler.TestSolrConfigHandlerCloud_B0490D26DBB83059-001\shard-1-001]
   [junit4]   2> 2820770 WARN  (TEST-TestSolrConfigHandlerCloud.test-seed#[B0490D26DBB83059]) [    ] o.a.s.c.CoreContainer Couldn't add files from C:\Users\jenkins\workspace\Lucene-Solr-5.5-Windows\solr\build\solr-core\test\J1\temp\solr.handler.TestSolrConfigHandlerCloud_B0490D26DBB83059-001\shard-1-001\lib to classpath: C:\Users\jenkins\workspace\Lucene-Solr-5.5-Windows\solr\build\solr-core\test\J1\temp\solr.handler.TestSolrConfigHandlerCloud_B0490D26DBB83059-001\shard-1-001\lib
   [junit4]   2> 2820771 INFO  (TEST-TestSolrConfigHandlerCloud.test-seed#[B0490D26DBB83059]) [    ] o.a.s.h.c.HttpShardHandlerFactory created with socketTimeout : 90000,urlScheme : ,connTimeout : 15000,maxConnectionsPerHost : 20,maxConnections : 10000,corePoolSize : 0,maximumPoolSize : 2147483647,maxThreadIdleTime : 5,sizeOfQueue : -1,fairnessPolicy : false,useRetries : false,connectionsEvictorSleepDelay : 5000,maxConnectionIdleTime : 40000,
   [junit4]   2> 2820777 INFO  (TEST-TestSolrConfigHandlerCloud.test-seed#[B0490D26DBB83059]) [    ] o.a.s.u.UpdateShardHandler Creating UpdateShardHandler HTTP client with params: socketTimeout=340000&connTimeout=45000&retry=true
   [junit4]   2> 2820779 INFO  (TEST-TestSolrConfigHandlerCloud.test-seed#[B0490D26DBB83059]) [    ] o.a.s.l.LogWatcher SLF4J impl is org.slf4j.impl.Log4jLoggerFactory
   [junit4]   2> 2820779 INFO  (TEST-TestSolrConfigHandlerCloud.test-seed#[B0490D26DBB83059]) [    ] o.a.s.l.LogWatcher Registering Log Listener [Log4j (org.slf4j.impl.Log4jLoggerFactory)]
   [junit4]   2> 2820779 INFO  (TEST-TestSolrConfigHandlerCloud.test-seed#[B0490D26DBB83059]) [    ] o.a.s.c.ZkContainer Zookeeper client=127.0.0.1:51166/solr
   [junit4]   2> 2820779 INFO  (TEST-TestSolrConfigHandlerCloud.test-seed#[B0490D26DBB83059]) [    ] o.a.s.c.ZkController zkHost includes chroot
   [junit4]   2> 2820779 INFO  (TEST-TestSolrConfigHandlerCloud.test-seed#[B0490D26DBB83059]) [    ] o.a.s.c.c.SolrZkClient Using default ZkCredentialsProvider
   [junit4]   2> 2820780 INFO  (TEST-TestSolrConfigHandlerCloud.test-seed#[B0490D26DBB83059]) [    ] o.a.s.c.c.ConnectionManager Waiting for client to connect to ZooKeeper
   [junit4]   2> 2820784 INFO  (zkCallback-9997-thread-1) [    ] o.a.s.c.c.ConnectionManager Watcher org.apache.solr.common.cloud.ConnectionManager@b324f9 name:ZooKeeperConnection Watcher:127.0.0.1:51166 got event WatchedEvent state:SyncConnected type:None path:null path:null type:None
   [junit4]   2> 2820786 INFO  (TEST-TestSolrConfigHandlerCloud.test-seed#[B0490D26DBB83059]) [    ] o.a.s.c.c.ConnectionManager Client is connected to ZooKeeper
   [junit4]   2> 2820786 INFO  (TEST-TestSolrConfigHandlerCloud.test-seed#[B0490D26DBB83059]) [    ] o.a.s.c.c.SolrZkClient Using default ZkACLProvider
   [junit4]   2> 2820787 INFO  (TEST-TestSolrConfigHandlerCloud.test-seed#[B0490D26DBB83059]) [n:127.0.0.1:51188_    ] o.a.s.c.ZkController Added new OnReconnect listener org.apache.solr.cloud.ZkController$6@95de
   [junit4]   2> 2820791 INFO  (TEST-TestSolrConfigHandlerCloud.test-seed#[B0490D26DBB83059]) [n:127.0.0.1:51188_    ] o.a.s.c.c.ConnectionManager Waiting for client to connect to ZooKeeper
   [junit4]   2> 2820794 INFO  (zkCallback-9998-thread-1-processing-n:127.0.0.1:51188_) [n:127.0.0.1:51188_    ] o.a.s.c.c.ConnectionManager Watcher org.apache.solr.common.cloud.ConnectionManager@180e6c4 name:ZooKeeperConnection Watcher:127.0.0.1:51166/solr got event WatchedEvent state:SyncConnected type:None path:null path:null type:None
   [junit4]   2> 2820798 INFO  (TEST-TestSolrConfigHandlerCloud.test-seed#[B0490D26DBB83059]) [n:127.0.0.1:51188_    ] o.a.s.c.c.ConnectionManager Client is connected to ZooKeeper
   [junit4]   2> 2820812 INFO  (TEST-TestSolrConfigHandlerCloud.test-seed#[B0490D26DBB83059]) [n:127.0.0.1:51188_    ] o.a.s.c.c.ZkStateReader Updating cluster state from ZooKeeper... 
   [junit4]   2> 2821848 INFO  (TEST-TestSolrConfigHandlerCloud.test-seed#[B0490D26DBB83059]) [n:127.0.0.1:51188_    ] o.a.s.c.ZkController Register node as live in ZooKeeper:/live_nodes/127.0.0.1:51188_
   [junit4]   2> 2821849 INFO  (TEST-TestSolrConfigHandlerCloud.test-seed#[B0490D26DBB83059]) [n:127.0.0.1:51188_    ] o.a.s.c.c.SolrZkClient makePath: /live_nodes/127.0.0.1:51188_
   [junit4]   2> 2821865 INFO  (zkCallback-9991-thread-2-processing-n:127.0.0.1:51173_) [n:127.0.0.1:51173_    ] o.a.s.c.c.ZkStateReader A live node change: [WatchedEvent state:SyncConnected type:NodeChildrenChanged path:/live_nodes], has occurred - updating... (live nodes size: [1])
   [junit4]   2> 2821866 INFO  (zkCallback-9993-thread-1) [    ] o.a.s.c.c.ZkStateReader A live node change: [WatchedEvent state:SyncConnected type:NodeChildrenChanged path:/live_nodes], has occurred - updating... (live nodes size: [1])
   [junit4]   2> 2821866 INFO  (zkCallback-9998-thread-1-processing-n:127.0.0.1:51188_) [n:127.0.0.1:51188_    ] o.a.s.c.c.ZkStateReader A live node change: [WatchedEvent state:SyncConnected type:NodeChildrenChanged path:/live_nodes], has occurred - updating... (live nodes size: [1])
   [junit4]   2> 2821872 INFO  (TEST-TestSolrConfigHandlerCloud.test-seed#[B0490D26DBB83059]) [n:127.0.0.1:51188_    ] o.a.s.c.Overseer Overseer (id=null) closing
   [junit4]   2> 2821874 INFO  (TEST-TestSolrConfigHandlerCloud.test-seed#[B0490D26DBB83059]) [n:127.0.0.1:51188_    ] o.a.s.c.LeaderElector Joined leadership election with path: /overseer_elect/election/96521115603763208-127.0.0.1:51188_-n_0000000001
   [junit4]   2> 2821875 INFO  (TEST-TestSolrConfigHandlerCloud.test-seed#[B0490D26DBB83059]) [n:127.0.0.1:51188_    ] o.a.s.c.LeaderElector Watching path /overseer_elect/election/96521115603763204-127.0.0.1:51173_-n_0000000000 to know if I could be the leader
   [junit4]   2> 2821916 INFO  (TEST-TestSolrConfigHandlerCloud.test-seed#[B0490D26DBB83059]) [n:127.0.0.1:51188_    ] o.a.s.c.CoreContainer Security conf doesn't exist. Skipping setup for authorization module.
   [junit4]   2> 2821916 INFO  (TEST-TestSolrConfigHandlerCloud.test-seed#[B0490D26DBB83059]) [n:127.0.0.1:51188_    ] o.a.s.c.CoreContainer No authentication plugin used.
   [junit4]   2> 2821919 INFO  (TEST-TestSolrConfigHandlerCloud.test-seed#[B0490D26DBB83059]) [n:127.0.0.1:51188_    ] o.a.s.c.CorePropertiesLocator Looking for core definitions underneath C:\Users\jenkins\workspace\Lucene-Solr-5.5-Windows\solr\build\solr-core\test\J1\temp\solr.handler.TestSolrConfigHandlerCloud_B0490D26DBB83059-001\shard-1-001\cores
   [junit4]   2> 2821922 INFO  (TEST-TestSolrConfigHandlerCloud.test-seed#[B0490D26DBB83059]) [n:127.0.0.1:51188_    ] o.a.s.c.CoreDescriptor Created CoreDescriptor: {name=collection1, config=solrconfig.xml, transient=false, schema=schema.xml, loadOnStartup=true, configSetProperties=configsetprops.json, collection=collection1, coreNodeName=, dataDir=data\, shard=}
   [junit4]   2> 2821927 INFO  (TEST-TestSolrConfigHandlerCloud.test-seed#[B0490D26DBB83059]) [n:127.0.0.1:51188_    ] o.a.s.c.CorePropertiesLocator Found core collection1 in C:\Users\jenkins\workspace\Lucene-Solr-5.5-Windows\solr\build\solr-core\test\J1\temp\solr.handler.TestSolrConfigHandlerCloud_B0490D26DBB83059-001\shard-1-001\cores\collection1
   [junit4]   2> 2821928 INFO  (TEST-TestSolrConfigHandlerCloud.test-seed#[B0490D26DBB83059]) [n:127.0.0.1:51188_    ] o.a.s.c.CorePropertiesLocator Found 1 core definitions
   [junit4]   2> 2821929 INFO  (TEST-TestSolrConfigHandlerCloud.test-seed#[B0490D26DBB83059]) [n:127.0.0.1:51188_    ] o.a.s.s.SolrDispatchFilter user.dir=C:\Users\jenkins\workspace\Lucene-Solr-5.5-Windows\solr\build\solr-core\test\J1
   [junit4]   2> 2821929 INFO  (TEST-TestSolrConfigHandlerCloud.test-seed#[B0490D26DBB83059]) [n:127.0.0.1:51188_    ] o.a.s.s.SolrDispatchFilter SolrDispatchFilter.init() done
   [junit4]   2> 2821936 INFO  (coreLoadExecutor-9879-thread-1-processing-n:127.0.0.1:51188_) [n:127.0.0.1:51188_ c:collection1   x:collection1] o.a.s.c.ZkController publishing state=down
   [junit4]   2> 2821936 INFO  (coreLoadExecutor-9879-thread-1-processing-n:127.0.0.1:51188_) [n:127.0.0.1:51188_ c:collection1   x:collection1] o.a.s.c.ZkController numShards not found on descriptor - reading it from system property
   [junit4]   2> 2821939 INFO  (coreLoadExecutor-9879-thread-1-processing-n:127.0.0.1:51188_) [n:127.0.0.1:51188_ c:collection1   x:collection1] o.a.s.c.ZkController Collection collection1 not visible yet, but flagging it so a watch is registered when it becomes visible
   [junit4]   2> 2821939 INFO  (coreLoadExecutor-9879-thread-1-processing-n:127.0.0.1:51188_) [n:127.0.0.1:51188_ c:collection1   x:collection1] o.a.s.c.c.ZkStateReader addZkWatch [collection1]
   [junit4]   2> 2821940 INFO  (OverseerStateUpdate-96521115603763204-127.0.0.1:51173_-n_0000000000) [n:127.0.0.1:51173_    ] o.a.s.c.Overseer processMessage: queueSize: 1, message = {
   [junit4]   2>   "core":"collection1",
   [junit4]   2>   "roles":null,
   [junit4]   2>   "base_url":"http://127.0.0.1:51188",
   [junit4]   2>   "node_name":"127.0.0.1:51188_",
   [junit4]   2>   "numShards":"2",
   [junit4]   2>   "state":"down",
   [junit4]   2>   "shard":null,
   [junit4]   2>   "collection":"collection1",
   [junit4]   2>   "operation":"state"} current state version: 4
   [junit4]   2> 2821940 INFO  (coreLoadExecutor-9879-thread-1-processing-n:127.0.0.1:51188_) [n:127.0.0.1:51188_ c:collection1   x:collection1] o.a.s.c.c.ZkStateReader Deleting data for [collection1]
   [junit4]   2> 2821941 INFO  (OverseerStateUpdate-96521115603763204-127.0.0.1:51173_-n_0000000000) [n:127.0.0.1:51173_    ] o.a.s.c.o.ReplicaMutator Update state numShards=2 message={
   [junit4]   2>   "core":"collection1",
   [junit4]   2>   "roles":null,
   [junit4]   2>   "base_url":"http://127.0.0.1:51188",
   [junit4]   2>   "node_name":"127.0.0.1:51188_",
   [junit4]   2>   "numShards":"2",
   [junit4]   2>   "state":"down",
   [junit4]   2>   "shard":null,
   [junit4]   2>   "collection":"collection1",
   [junit4]   2>   "operation":"state"}
   [junit4]   2> 2821943 INFO  (OverseerStateUpdate-96521115603763204-127.0.0.1:51173_-n_0000000000) [n:127.0.0.1:51173_    ] o.a.s.c.o.ClusterStateMutator building a new cName: collection1
   [junit4]   2> 2821943 INFO  (OverseerStateUpdate-96521115603763204-127.0.0.1:51173_-n_0000000000) [n:127.0.0.1:51173_    ] o.a.s.c.o.ReplicaMutator Assigning new node to shard shard=shard2
   [junit4]   2> 2821944 INFO  (coreLoadExecutor-9879-thread-1-processing-n:127.0.0.1:51188_) [n:127.0.0.1:51188_ c:collection1   x:collection1] o.a.s.c.ZkController look for our core node name
   [junit4]   2> 2821944 INFO  (zkCallback-9991-thread-3-processing-n:127.0.0.1:51173_) [n:127.0.0.1:51173_    ] o.a.s.c.c.ZkStateReader A cluster state change: [WatchedEvent state:SyncConnected type:NodeDataChanged path:/clusterstate.json], has occurred - updating... (live nodes size: [2])
   [junit4]   2> 2821945 INFO  (zkCallback-9993-thread-1) [    ] o.a.s.c.c.ZkStateReader A cluster state change: [WatchedEvent state:SyncConnected type:NodeDataChanged path:/clusterstate.json], has occurred - updating... (live nodes size: [2])
   [junit4]   2> 2821945 INFO  (zkCallback-9998-thread-1-processing-n:127.0.0.1:51188_) [n:127.0.0.1:51188_    ] o.a.s.c.c.ZkStateReader A cluster state change: [WatchedEvent state:SyncConnected type:NodeDataChanged path:/clusterstate.json], has occurred - updating... (live nodes size: [2])
   [junit4]   2> 2822946 INFO  (coreLoadExecutor-9879-thread-1-processing-n:127.0.0.1:51188_) [n:127.0.0.1:51188_ c:collection1   x:collection1] o.a.s.c.ZkController waiting to find shard id in clusterstate for collection1
   [junit4]   2> 2822946 INFO  (coreLoadExecutor-9879-thread-1-processing-n:127.0.0.1:51188_) [n:127.0.0.1:51188_ c:collection1   x:collection1] o.a.s.c.ZkController Check for collection zkNode:collection1
   [junit4]   2> 2822947 INFO  (coreLoadExecutor-9879-thread-1-processing-n:127.0.0.1:51188_) [n:127.0.0.1:51188_ c:collection1   x:collection1] o.a.s.c.ZkController Collection zkNode exists
   [junit4]   2> 2822947 INFO  (coreLoadExecutor-9879-thread-1-processing-n:127.0.0.1:51188_) [n:127.0.0.1:51188_ c:collection1   x:collection1] o.a.s.c.c.ZkStateReader Load collection config from: [/collections/collection1]
   [junit4]   2> 2822949 INFO  (coreLoadExecutor-9879-thread-1-processing-n:127.0.0.1:51188_) [n:127.0.0.1:51188_ c:collection1   x:collection1] o.a.s.c.c.ZkStateReader path=[/collections/collection1] [configName]=[conf1] specified config exists in ZooKeeper
   [junit4]   2> 2822949 INFO  (coreLoadExecutor-9879-thread-1-processing-n:127.0.0.1:51188_) [n:127.0.0.1:51188_ c:collection1   x:collection1] o.a.s.c.SolrResourceLoader new SolrResourceLoader for directory: 'C:\Users\jenkins\workspace\Lucene-Solr-5.5-Windows\solr\build\solr-core\test\J1\temp\solr.handler.TestSolrConfigHandlerCloud_B0490D26DBB83059-001\shard-1-001\cores\collection1'
   [junit4]   2> 2822949 INFO  (coreLoadExecutor-9879-thread-1-processing-n:127.0.0.1:51188_) [n:127.0.0.1:51188_ c:collection1   x:collection1] o.a.s.c.SolrResourceLoader JNDI not configured for solr (NoInitialContextEx)
   [junit4]   2> 2822949 INFO  (coreLoadExecutor-9879-thread-1-processing-n:127.0.0.1:51188_) [n:127.0.0.1:51188_ c:collection1   x:collection1] o.a.s.c.SolrResourceLoader solr home defaulted to 'solr/' (could not find system property or JNDI)
   [junit4]   2> 2822966 INFO  (coreLoadExecutor-9879-thread-1-processing-n:127.0.0.1:51188_) [n:127.0.0.1:51188_ c:collection1   x:collection1] o.a.s.c.Config loaded config solrconfig.xml with version 0 
   [junit4]   2> 2822984 INFO  (coreLoadExecutor-9879-thread-1-processing-n:127.0.0.1:51188_) [n:127.0.0.1:51188_ c:collection1   x:collection1] o.a.s.c.SolrConfig current version of requestparams : -1
   [junit4]   2> 2822992 INFO  (coreLoadExecutor-9879-thread-1-processing-n:127.0.0.1:51188_) [n:127.0.0.1:51188_ c:collection1   x:collection1] o.a.s.c.SolrConfig Using Lucene MatchVersion: 5.5.3
   [junit4]   2> 2823006 INFO  (coreLoadExecutor-9879-thread-1-processing-n:127.0.0.1:51188_) [n:127.0.0.1:51188_ c:collection1   x:collection1] o.a.s.c.SolrConfig Loaded SolrConfig: solrconfig.xml
   [junit4]   2> 2823030 INFO  (coreLoadExecutor-9879-thread-1-processing-n:127.0.0.1:51188_) [n:127.0.0.1:51188_ c:collection1   x:collection1] o.a.s.s.IndexSchema [collection1] Schema name=test
   [junit4]   2> 2823238 INFO  (coreLoadExecutor-9879-thread-1-processing-n:127.0.0.1:51188_) [n:127.0.0.1:51188_ c:collection1   x:collection1] o.a.s.s.OpenExchangeRatesOrgProvider Initialized with rates=open-exchange-rates.json, refreshInterval=1440.
   [junit4]   2> 2823256 INFO  (coreLoadExecutor-9879-thread-1-processing-n:127.0.0.1:51188_) [n:127.0.0.1:51188_ c:collection1   x:collection1] o.a.s.s.IndexSchema default search field in schema is text
   [junit4]   2> 2823258 INFO  (coreLoadExecutor-9879-thread-1-processing-n:127.0.0.1:51188_) [n:127.0.0.1:51188_ c:collection1   x:collection1] o.a.s.s.IndexSchema unique key field: id
   [junit4]   2> 2823305 INFO  (coreLoadExecutor-9879-thread-1-processing-n:127.0.0.1:51188_) [n:127.0.0.1:51188_ c:collection1   x:collection1] o.a.s.s.FileExchangeRateProvider Reloading exchange rates from file currency.xml
   [junit4]   2> 2823323 INFO  (coreLoadExecutor-9879-thread-1-processing-n:127.0.0.1:51188_) [n:127.0.0.1:51188_ c:collection1   x:collection1] o.a.s.s.FileExchangeRateProvider Reloading exchange rates from file currency.xml
   [junit4]   2> 2823328 INFO  (coreLoadExecutor-9879-thread-1-processing-n:127.0.0.1:51188_) [n:127.0.0.1:51188_ c:collection1   x:collection1] o.a.s.s.OpenExchangeRatesOrgProvider Reloading exchange rates from open-exchange-rates.json
   [junit4]   2> 2823330 INFO  (coreLoadExecutor-9879-thread-1-processing-n:127.0.0.1:51188_) [n:127.0.0.1:51188_ c:collection1   x:collection1] o.a.s.s.OpenExchangeRatesOrgProvider Reloading exchange rates from open-exchange-rates.json
   [junit4]   2> 2823339 INFO  (coreLoadExecutor-9879-thread-1-processing-n:127.0.0.1:51188_) [n:127.0.0.1:51188_ c:collection1   x:collection1] o.a.s.c.ConfigSetProperties Did not find ConfigSet properties, assuming default properties: Can't find resource 'configsetprops.json' in classpath or '/configs/conf1', cwd=C:\Users\jenkins\workspace\Lucene-Solr-5.5-Windows\solr\build\solr-core\test\J1
   [junit4]   2> 2823339 INFO  (coreLoadExecutor-9879-thread-1-processing-n:127.0.0.1:51188_) [n:127.0.0.1:51188_ c:collection1   x:collection1] o.a.s.c.CoreContainer Creating SolrCore 'collection1' using configuration from collection collection1
   [junit4]   2> 2823340 INFO  (coreLoadExecutor-9879-thread-1-processing-n:127.0.0.1:51188_) [n:127.0.0.1:51188_ c:collection1 s:shard2 r:core_node1 x:collection1] o.a.s.c.SolrCore org.apache.solr.core.MockDirectoryFactory
   [junit4]   2> 2823340 INFO  (coreLoadExecutor-9879-thread-1-processing-n:127.0.0.1:51188_) [n:127.0.0.1:51188_ c:collection1 s:shard2 r:core_node1 x:collection1] o.a.s.c.SolrCore [[collection1] ] Opening new SolrCore at [C:\Users\jenkins\workspace\Lucene-Solr-5.5-Windows\solr\build\solr-core\test\J1\temp\solr.handler.TestSolrConfigHandlerCloud_B0490D26DBB83059-001\shard-1-001\cores\collection1], dataDir=[C:\Users\jenkins\workspace\Lucene-Solr-5.5-Windows\solr\build\solr-core\test\J1\temp\solr.handler.TestSolrConfigHandlerCloud_B0490D26DBB83059-001\shard-1-001\cores\collection1\data\]
   [junit4]   2> 2823340 INFO  (coreLoadExecutor-9879-thread-1-processing-n:127.0.0.1:51188_) [n:127.0.0.1:51188_ c:collection1 s:shard2 r:core_node1 x:collection1] o.a.s.c.JmxMonitoredMap JMX monitoring is enabled. Adding Solr mbeans to JMX Server: com.sun.jmx.mbeanserver.JmxMBeanServer@16160f7
   [junit4]   2> 2823342 INFO  (coreLoadExecutor-9879-thread-1-processing-n:127.0.0.1:51188_) [n:127.0.0.1:51188_ c:collection1 s:shard2 r:core_node1 x:collection1] o.a.s.c.CachingDirectoryFactory return new directory for C:\Users\jenkins\workspace\Lucene-Solr-5.5-Windows\solr\build\solr-core\test\J1\temp\solr.handler.TestSolrConfigHandlerCloud_B0490D26DBB83059-001\shard-1-001\cores\collection1\data\
   [junit4]   2> 2823343 INFO  (coreLoadExecutor-9879-thread-1-processing-n:127.0.0.1:51188_) [n:127.0.0.1:51188_ c:collection1 s:shard2 r:core_node1 x:collection1] o.a.s.c.SolrCore New index directory detected: old=null new=C:\Users\jenkins\workspace\Lucene-Solr-5.5-Windows\solr\build\solr-core\test\J1\temp\solr.handler.TestSolrConfigHandlerCloud_B0490D26DBB83059-001\shard-1-001\cores\collection1\data\index/
   [junit4]   2> 2823343 WARN  (coreLoadExecutor-9879-thread-1-processing-n:127.0.0.1:51188_) [n:127.0.0.1:51188_ c:collection1 s:shard2 r:core_node1 x:collection1] o.a.s.c.SolrCore [collection1] Solr index directory 'C:\Users\jenkins\workspace\Lucene-Solr-5.5-Windows\solr\build\solr-core\test\J1\temp\solr.handler.TestSolrConfigHandlerCloud_B0490D26DBB83059-001\shard-1-001\cores\collection1\data\index' doesn't exist. Creating new index...
   [junit4]   2> 2823344 INFO  (coreLoadExecutor-9879-thread-1-processing-n:127.0.0.1:51188_) [n:127.0.0.1:51188_ c:collection1 s:shard2 r:core_node1 x:collection1] o.a.s.c.CachingDirectoryFactory return new directory for C:\Users\jenkins\workspace\Lucene-Solr-5.5-Windows\solr\build\solr-core\test\J1\temp\solr.handler.TestSolrConfigHandlerCloud_B0490D26DBB83059-001\shard-1-001\cores\collection1\data\index
   [junit4]   2> 2823344 INFO  (coreLoadExecutor-9879-thread-1-processing-n:127.0.0.1:51188_) [n:127.0.0.1:51188_ c:collection1 s:shard2 r:core_node1 x:collection1] o.a.s.u.RandomMergePolicy RandomMergePolicy wrapping class org.apache.lucene.index.LogDocMergePolicy: [LogDocMergePolicy: minMergeSize=1000, mergeFactor=48, maxMergeSize=9223372036854775807, maxMergeSizeForForcedMerge=9223372036854775807, calibrateSizeByDeletes=true, maxMergeDocs=2147483647, maxCFSSegmentSizeMB=8.796093022207999E12, noCFSRatio=1.0]
   [junit4]   2> 2823345 INFO  (coreLoadExecutor-9879-thread-1-processing-n:127.0.0.1:51188_) [n:127.0.0.1:51188_ c:collection1 s:shard2 r:core_node1 x:collection1] o.a.s.c.SolrDeletionPolicy SolrDeletionPolicy.onCommit: commits: num=1
   [junit4]   2> 	commit{dir=MockDirectoryWrapper(RAMDirectory@b3c61e lockFactory=org.apache.lucene.store.SingleInstanceLockFactory@e25ca0),segFN=segments_1,generation=1}
   [junit4]   2> 2823345 INFO  (coreLoadExecutor-9879-thread-1-processing-n:127.0.0.1:51188_) [n:127.0.0.1:51188_ c:collection1 s:shard2 r:core_node1 x:collection1] o.a.s.c.SolrDeletionPolicy newest commit generation = 1
   [junit4]   2> 2823347 INFO  (OldIndexDirectoryCleanupThreadForCore-collection1) [

[...truncated too long message...]

sed by: java.io.IOException: Could not load resource=schema.xml
   [junit4]   2> 	at org.apache.solr.cloud.ZkSolrResourceLoader.openResource(ZkSolrResourceLoader.java:105)
   [junit4]   2> 	at org.apache.solr.core.SolrResourceLoader.openSchema(SolrResourceLoader.java:355)
   [junit4]   2> 	at org.apache.solr.schema.IndexSchemaFactory.create(IndexSchemaFactory.java:48)
   [junit4]   2> 	... 6 more
   [junit4]   2> Caused by: java.lang.InterruptedException: sleep interrupted
   [junit4]   2> 	at java.lang.Thread.sleep(Native Method)
   [junit4]   2> 	at org.apache.solr.cloud.ZkSolrResourceLoader.openResource(ZkSolrResourceLoader.java:101)
   [junit4]   2> 	... 8 more
   [junit4]   2> Sep 02, 2016 5:50:52 AM com.carrotsearch.randomizedtesting.ThreadLeakControl tryToInterruptAll
   [junit4]   2> INFO: All leaked threads terminated.
   [junit4]   2> NOTE: test params are: codec=Asserting(Lucene54): {}, docValues:{}, sim=DefaultSimilarity, locale=zh-HK, timezone=Africa/Freetown
   [junit4]   2> NOTE: Windows 10 10.0 x86/Oracle Corporation 1.8.0_102 (32-bit)/cpus=3,threads=1,free=107729088,total=338866176
   [junit4]   2> NOTE: All tests run in this JVM: [DistributedVersionInfoTest, TestCryptoKeys, TestCustomDocTransformer, TestReversedWildcardFilterFactory, SSLMigrationTest, CurrencyFieldOpenExchangeTest, TestSolrDynamicMBean, AsyncCallRequestStatusResponseTest, TestNoOpRegenerator, TestWriterPerf, TestLMJelinekMercerSimilarityFactory, TestCopyFieldCollectionResource, WrapperMergePolicyFactoryTest, LoggingHandlerTest, TestCollapseQParserPlugin, TestDistributedMissingSort, SignatureUpdateProcessorFactoryTest, BasicDistributedZk2Test, MinimalSchemaTest, TestMacros, BinaryUpdateRequestHandlerTest, TestDistribIDF, TestManagedResourceStorage, TestNonDefinedSimilarityFactory, TestFileDictionaryLookup, TestTestInjection, DistributedFacetPivotLargeTest, BasicFunctionalityTest, BlockDirectoryTest, HdfsUnloadDistributedZkTest, IndexSchemaRuntimeFieldTest, TestDistributedStatsComponentCardinality, TestAtomicUpdateErrorCases, TestFiltering, DirectUpdateHandlerOptimizeTest, CoreAdminHandlerTest, TestUtils, TestScoreJoinQPScore, NumericFieldsTest, TestMiniSolrCloudCluster, TestRandomCollapseQParserPlugin, FullSolrCloudDistribCmdsTest, UniqFieldsUpdateProcessorFactoryTest, DistributedMLTComponentTest, TestCustomSort, LukeRequestHandlerTest, TestJoin, TestPHPSerializedResponseWriter, TestRTGBase, DistributedIntervalFacetingTest, SpellingQueryConverterTest, TermVectorComponentTest, CacheHeaderTest, PeerSyncReplicationTest, OpenCloseCoreStressTest, TestFastWriter, HdfsDirectoryTest, AtomicUpdatesTest, DebugComponentTest, AliasIntegrationTest, TermVectorComponentDistributedTest, DefaultValueUpdateProcessorTest, DateRangeFieldTest, TestRebalanceLeaders, OutputWriterTest, TestReqParamsAPI, TestAnalyzeInfixSuggestions, ShowFileRequestHandlerTest, CursorMarkTest, SolrCloudExampleTest, TestAuthorizationFramework, ResourceLoaderTest, TestIndexingPerformance, TestRuleBasedAuthorizationPlugin, SpellPossibilityIteratorTest, ConnectionReuseTest, TestDownShardTolerantSearch, ZkSolrClientTest, DataDrivenBlockJoinTest, DistanceFunctionTest, FileUtilsTest, TestBM25SimilarityFactory, SharedFSAutoReplicaFailoverUtilsTest, TestNamedUpdateProcessors, DeleteLastCustomShardedReplicaTest, TestFoldingMultitermQuery, TestConfigOverlay, TestTrie, TestSimpleTrackingShardHandler, TestSolrJ, TestZkChroot, OverseerStatusTest, ConnectionManagerTest, NotRequiredUniqueKeyTest, TestExactStatsCache, DistributedDebugComponentTest, DateMathParserTest, SolrPluginUtilsTest, DirectoryFactoryTest, ZkNodePropsTest, TestBinaryField, DistribCursorPagingTest, TestIndexSearcher, TestCollectionAPI, CustomCollectionTest, TestRTimerTree, LeaderElectionIntegrationTest, SuggesterTest, HdfsSyncSliceTest, DirectSolrConnectionTest, CollectionsAPIAsyncDistributedZkTest, SecurityConfHandlerTest, TestBinaryResponseWriter, TestRandomFaceting, RequestLoggingTest, TestRawTransformer, OpenExchangeRatesOrgProviderTest, SparseHLLTest, TestSolrQueryParserResource, SuggesterTSTTest, TestHighFrequencyDictionaryFactory, TestAddFieldRealTimeGet, SpellCheckComponentTest, HLLSerializationTest, SuggesterWFSTTest, TestBulkSchemaAPI, BadCopyFieldTest, TestBulkSchemaConcurrent, TestQueryUtils, TestSuggestSpellingConverter, JavabinLoaderTest, TestQueryTypes, BasicAuthIntegrationTest, TestSortByMinMaxFunction, TestFuzzyAnalyzedSuggestions, TestRequestForwarding, ExplicitHLLTest, TestConfigSetsAPIExclusivity, UpdateRequestProcessorFactoryTest, HttpPartitionTest, OverseerTest, BasicZkTest, RecoveryZkTest, ClusterStateUpdateTest, LeaderElectionTest, TestRandomDVFaceting, ShardRoutingCustomTest, TestDistributedSearch, DistributedTermsComponentTest, TestGroupingSearch, SolrCmdDistributorTest, QueryElevationComponentTest, BadIndexSchemaTest, TestSort, HighlighterTest, SolrIndexSplitterTest, TestCoreDiscovery, AnalysisAfterCoreReloadTest, SpellCheckCollatorTest, SolrRequestParserTest, SpatialFilterTest, TestCSVLoader, PolyFieldTest, NoCacheHeaderTest, WordBreakSolrSpellCheckerTest, SchemaVersionSpecificBehaviorTest, SolrCoreCheckLockOnStartupTest, TestUpdate, FieldMutatingUpdateProcessorTest, QueryEqualityTest, SortByFunctionTest, TestRemoteStreaming, DisMaxRequestHandlerTest, DirectSolrSpellCheckerTest, TestOmitPositions, TermsComponentTest, DocumentBuilderTest, MoreLikeThisHandlerTest, TestSolrQueryParser, TestCollationField, TestCSVResponseWriter, PingRequestHandlerTest, HighlighterConfigTest, SOLR749Test, TestQuerySenderListener, UpdateParamsTest, AlternateDirectoryTest, TestSolrIndexConfig, CopyFieldTest, BadComponentTest, TestStressRecovery, TestSolrDeletionPolicy2, MultiTermTest, TestSearchPerf, ExternalFileFieldSortTest, TestLuceneMatchVersion, SynonymTokenizerTest, EchoParamsTest, TestPerFieldSimilarity, TimeZoneUtilsTest, ScriptEngineTest, PreAnalyzedFieldTest, TestSystemIdResolver, DateFieldTest, RAMDirectoryFactoryTest, ClusterStateTest, TestLRUCache, CircularListTest, CursorPagingTest, TestCrossCoreJoin, TestCursorMarkWithoutUniqueKey, TestHighlightDedupGrouping, TestTolerantSearch, TestJettySolrRunner, ActionThrottleTest, AssignTest, CloudExitableDirectoryReaderTest, CollectionStateFormat2Test, CollectionTooManyReplicasTest, DeleteReplicaTest, DistribJoinFromCollectionTest, DistributedQueueTest, LeaderInitiatedRecoveryOnCommitTest, LeaderInitiatedRecoveryOnShardRestartTest, MigrateRouteKeyTest, MultiThreadedOCPTest, RestartWhileUpdatingTest, SaslZkACLProviderTest, ShardSplitTest, TestLeaderElectionZkExpiry, TestLeaderInitiatedRecoveryThread, TestReplicaProperties, TestStressLiveNodes, CachingDirectoryFactoryTest, CoreSorterTest, ExitableDirectoryReaderTest, HdfsDirectoryFactoryTest, QueryResultKeyTest, TestConfigSetImmutable, TestConfigSetProperties, TestDynamicLoading, TestImplicitCoreProperties, TestInfoStreamLogging, TestNRTOpen, TestReloadAndDeleteDocs, TestShardHandlerFactory, TestSolrConfigHandler, TestReplicationHandlerBackup, TestRestoreCore, TestSolrConfigHandlerCloud]
   [junit4]   2> NOTE: reproduce with: ant test  -Dtestcase=TestSolrConfigHandlerCloud -Dtests.seed=B0490D26DBB83059 -Dtests.slow=true -Dtests.locale=zh-HK -Dtests.timezone=Africa/Freetown -Dtests.asserts=true -Dtests.file.encoding=US-ASCII
   [junit4] ERROR   0.00s J1 | TestSolrConfigHandlerCloud (suite) <<<
   [junit4]    > Throwable #1: com.carrotsearch.randomizedtesting.ThreadLeakError: 2 threads leaked from SUITE scope at org.apache.solr.handler.TestSolrConfigHandlerCloud: 
   [junit4]    >    1) Thread[id=47485, name=SolrConfigHandler-refreshconf, state=TIMED_WAITING, group=TGRP-TestSolrConfigHandlerCloud]
   [junit4]    >         at java.lang.Thread.sleep(Native Method)
   [junit4]    >         at org.apache.solr.cloud.ZkSolrResourceLoader.openResource(ZkSolrResourceLoader.java:101)
   [junit4]    >         at org.apache.solr.core.SolrResourceLoader.openSchema(SolrResourceLoader.java:355)
   [junit4]    >         at org.apache.solr.schema.IndexSchemaFactory.create(IndexSchemaFactory.java:48)
   [junit4]    >         at org.apache.solr.schema.IndexSchemaFactory.buildIndexSchema(IndexSchemaFactory.java:70)
   [junit4]    >         at org.apache.solr.core.ConfigSetService.createIndexSchema(ConfigSetService.java:108)
   [junit4]    >         at org.apache.solr.core.ConfigSetService.getConfig(ConfigSetService.java:79)
   [junit4]    >         at org.apache.solr.core.CoreContainer.reload(CoreContainer.java:920)
   [junit4]    >         at org.apache.solr.core.SolrCore$11.run(SolrCore.java:2623)
   [junit4]    >         at org.apache.solr.handler.SolrConfigHandler$Command$1.run(SolrConfigHandler.java:211)
   [junit4]    >    2) Thread[id=48518, name=Thread-7022, state=TIMED_WAITING, group=TGRP-TestSolrConfigHandlerCloud]
   [junit4]    >         at java.lang.Thread.sleep(Native Method)
   [junit4]    >         at org.apache.solr.cloud.ZkSolrResourceLoader.openResource(ZkSolrResourceLoader.java:101)
   [junit4]    >         at org.apache.solr.core.SolrResourceLoader.openSchema(SolrResourceLoader.java:355)
   [junit4]    >         at org.apache.solr.schema.IndexSchemaFactory.create(IndexSchemaFactory.java:48)
   [junit4]    >         at org.apache.solr.schema.IndexSchemaFactory.buildIndexSchema(IndexSchemaFactory.java:70)
   [junit4]    >         at org.apache.solr.core.ConfigSetService.createIndexSchema(ConfigSetService.java:108)
   [junit4]    >         at org.apache.solr.core.ConfigSetService.getConfig(ConfigSetService.java:79)
   [junit4]    >         at org.apache.solr.core.CoreContainer.reload(CoreContainer.java:920)
   [junit4]    >         at org.apache.solr.core.SolrCore$11.run(SolrCore.java:2623)
   [junit4]    >         at org.apache.solr.cloud.ZkController$5.run(ZkController.java:2480)
   [junit4]    > 	at __randomizedtesting.SeedInfo.seed([B0490D26DBB83059]:0)
   [junit4] Completed [509/575 (1!)] on J1 in 109.68s, 1 test, 1 error <<< FAILURES!

[...truncated 49365 lines...]


Mime
View raw message