lucene-dev mailing list archives

Site index · List index
Message view « Date » · « Thread »
Top « Date » · « Thread »
From Policeman Jenkins Server <jenk...@thetaphi.de>
Subject [JENKINS] Lucene-Solr-master-Windows (32bit/jdk1.8.0_102) - Build # 6109 - Still Unstable!
Date Sat, 10 Sep 2016 12:05:00 GMT
Build: http://jenkins.thetaphi.de/job/Lucene-Solr-master-Windows/6109/
Java: 32bit/jdk1.8.0_102 -client -XX:+UseG1GC

2 tests failed.
FAILED:  junit.framework.TestSuite.org.apache.solr.schema.TestManagedSchemaAPI

Error Message:
ObjectTracker found 10 object(s) that were not released!!! [MockDirectoryWrapper, MockDirectoryWrapper, MDCAwareThreadPoolExecutor, TransactionLog, MockDirectoryWrapper, MockDirectoryWrapper, MockDirectoryWrapper, TransactionLog, MDCAwareThreadPoolExecutor, MockDirectoryWrapper]

Stack Trace:
java.lang.AssertionError: ObjectTracker found 10 object(s) that were not released!!! [MockDirectoryWrapper, MockDirectoryWrapper, MDCAwareThreadPoolExecutor, TransactionLog, MockDirectoryWrapper, MockDirectoryWrapper, MockDirectoryWrapper, TransactionLog, MDCAwareThreadPoolExecutor, MockDirectoryWrapper]
	at __randomizedtesting.SeedInfo.seed([85D8B94A0B941025]:0)
	at org.junit.Assert.fail(Assert.java:93)
	at org.junit.Assert.assertTrue(Assert.java:43)
	at org.junit.Assert.assertNull(Assert.java:551)
	at org.apache.solr.SolrTestCaseJ4.teardownTestCases(SolrTestCaseJ4.java:257)
	at sun.reflect.GeneratedMethodAccessor18.invoke(Unknown Source)
	at sun.reflect.DelegatingMethodAccessorImpl.invoke(DelegatingMethodAccessorImpl.java:43)
	at java.lang.reflect.Method.invoke(Method.java:498)
	at com.carrotsearch.randomizedtesting.RandomizedRunner.invoke(RandomizedRunner.java:1764)
	at com.carrotsearch.randomizedtesting.RandomizedRunner$7.evaluate(RandomizedRunner.java:834)
	at com.carrotsearch.randomizedtesting.rules.StatementAdapter.evaluate(StatementAdapter.java:36)
	at com.carrotsearch.randomizedtesting.rules.SystemPropertiesRestoreRule$1.evaluate(SystemPropertiesRestoreRule.java:57)
	at org.apache.lucene.util.AbstractBeforeAfterRule$1.evaluate(AbstractBeforeAfterRule.java:45)
	at com.carrotsearch.randomizedtesting.rules.StatementAdapter.evaluate(StatementAdapter.java:36)
	at org.apache.lucene.util.TestRuleStoreClassName$1.evaluate(TestRuleStoreClassName.java:41)
	at com.carrotsearch.randomizedtesting.rules.NoShadowingOrOverridesOnMethodsRule$1.evaluate(NoShadowingOrOverridesOnMethodsRule.java:40)
	at com.carrotsearch.randomizedtesting.rules.NoShadowingOrOverridesOnMethodsRule$1.evaluate(NoShadowingOrOverridesOnMethodsRule.java:40)
	at com.carrotsearch.randomizedtesting.rules.StatementAdapter.evaluate(StatementAdapter.java:36)
	at com.carrotsearch.randomizedtesting.rules.StatementAdapter.evaluate(StatementAdapter.java:36)
	at com.carrotsearch.randomizedtesting.rules.StatementAdapter.evaluate(StatementAdapter.java:36)
	at org.apache.lucene.util.TestRuleAssertionsRequired$1.evaluate(TestRuleAssertionsRequired.java:53)
	at org.apache.lucene.util.TestRuleMarkFailure$1.evaluate(TestRuleMarkFailure.java:47)
	at org.apache.lucene.util.TestRuleIgnoreAfterMaxFailures$1.evaluate(TestRuleIgnoreAfterMaxFailures.java:64)
	at org.apache.lucene.util.TestRuleIgnoreTestSuites$1.evaluate(TestRuleIgnoreTestSuites.java:54)
	at com.carrotsearch.randomizedtesting.rules.StatementAdapter.evaluate(StatementAdapter.java:36)
	at com.carrotsearch.randomizedtesting.ThreadLeakControl$StatementRunner.run(ThreadLeakControl.java:367)
	at java.lang.Thread.run(Thread.java:745)


FAILED:  junit.framework.TestSuite.org.apache.solr.schema.TestManagedSchemaAPI

Error Message:
Could not remove the following files (in the order of attempts):    C:\Users\jenkins\workspace\Lucene-Solr-master-Windows\solr\build\solr-core\test\J0\temp\solr.schema.TestManagedSchemaAPI_85D8B94A0B941025-001\tempDir-001\node2\testschemaapi_shard1_replica1\data\tlog\tlog.0000000000000000000: java.nio.file.FileSystemException: C:\Users\jenkins\workspace\Lucene-Solr-master-Windows\solr\build\solr-core\test\J0\temp\solr.schema.TestManagedSchemaAPI_85D8B94A0B941025-001\tempDir-001\node2\testschemaapi_shard1_replica1\data\tlog\tlog.0000000000000000000: The process cannot access the file because it is being used by another process.     C:\Users\jenkins\workspace\Lucene-Solr-master-Windows\solr\build\solr-core\test\J0\temp\solr.schema.TestManagedSchemaAPI_85D8B94A0B941025-001\tempDir-001\node2\testschemaapi_shard1_replica1\data\tlog: java.nio.file.DirectoryNotEmptyException: C:\Users\jenkins\workspace\Lucene-Solr-master-Windows\solr\build\solr-core\test\J0\temp\solr.schema.TestManagedSchemaAPI_85D8B94A0B941025-001\tempDir-001\node2\testschemaapi_shard1_replica1\data\tlog    C:\Users\jenkins\workspace\Lucene-Solr-master-Windows\solr\build\solr-core\test\J0\temp\solr.schema.TestManagedSchemaAPI_85D8B94A0B941025-001\tempDir-001\node2\testschemaapi_shard1_replica1\data: java.nio.file.DirectoryNotEmptyException: C:\Users\jenkins\workspace\Lucene-Solr-master-Windows\solr\build\solr-core\test\J0\temp\solr.schema.TestManagedSchemaAPI_85D8B94A0B941025-001\tempDir-001\node2\testschemaapi_shard1_replica1\data    C:\Users\jenkins\workspace\Lucene-Solr-master-Windows\solr\build\solr-core\test\J0\temp\solr.schema.TestManagedSchemaAPI_85D8B94A0B941025-001\tempDir-001\node2\testschemaapi_shard1_replica1: java.nio.file.DirectoryNotEmptyException: C:\Users\jenkins\workspace\Lucene-Solr-master-Windows\solr\build\solr-core\test\J0\temp\solr.schema.TestManagedSchemaAPI_85D8B94A0B941025-001\tempDir-001\node2\testschemaapi_shard1_replica1    C:\Users\jenkins\workspace\Lucene-Solr-master-Windows\solr\build\solr-core\test\J0\temp\solr.schema.TestManagedSchemaAPI_85D8B94A0B941025-001\tempDir-001\node2: java.nio.file.DirectoryNotEmptyException: C:\Users\jenkins\workspace\Lucene-Solr-master-Windows\solr\build\solr-core\test\J0\temp\solr.schema.TestManagedSchemaAPI_85D8B94A0B941025-001\tempDir-001\node2    C:\Users\jenkins\workspace\Lucene-Solr-master-Windows\solr\build\solr-core\test\J0\temp\solr.schema.TestManagedSchemaAPI_85D8B94A0B941025-001\tempDir-001: java.nio.file.DirectoryNotEmptyException: C:\Users\jenkins\workspace\Lucene-Solr-master-Windows\solr\build\solr-core\test\J0\temp\solr.schema.TestManagedSchemaAPI_85D8B94A0B941025-001\tempDir-001 

Stack Trace:
java.io.IOException: Could not remove the following files (in the order of attempts):
   C:\Users\jenkins\workspace\Lucene-Solr-master-Windows\solr\build\solr-core\test\J0\temp\solr.schema.TestManagedSchemaAPI_85D8B94A0B941025-001\tempDir-001\node2\testschemaapi_shard1_replica1\data\tlog\tlog.0000000000000000000: java.nio.file.FileSystemException: C:\Users\jenkins\workspace\Lucene-Solr-master-Windows\solr\build\solr-core\test\J0\temp\solr.schema.TestManagedSchemaAPI_85D8B94A0B941025-001\tempDir-001\node2\testschemaapi_shard1_replica1\data\tlog\tlog.0000000000000000000: The process cannot access the file because it is being used by another process.

   C:\Users\jenkins\workspace\Lucene-Solr-master-Windows\solr\build\solr-core\test\J0\temp\solr.schema.TestManagedSchemaAPI_85D8B94A0B941025-001\tempDir-001\node2\testschemaapi_shard1_replica1\data\tlog: java.nio.file.DirectoryNotEmptyException: C:\Users\jenkins\workspace\Lucene-Solr-master-Windows\solr\build\solr-core\test\J0\temp\solr.schema.TestManagedSchemaAPI_85D8B94A0B941025-001\tempDir-001\node2\testschemaapi_shard1_replica1\data\tlog
   C:\Users\jenkins\workspace\Lucene-Solr-master-Windows\solr\build\solr-core\test\J0\temp\solr.schema.TestManagedSchemaAPI_85D8B94A0B941025-001\tempDir-001\node2\testschemaapi_shard1_replica1\data: java.nio.file.DirectoryNotEmptyException: C:\Users\jenkins\workspace\Lucene-Solr-master-Windows\solr\build\solr-core\test\J0\temp\solr.schema.TestManagedSchemaAPI_85D8B94A0B941025-001\tempDir-001\node2\testschemaapi_shard1_replica1\data
   C:\Users\jenkins\workspace\Lucene-Solr-master-Windows\solr\build\solr-core\test\J0\temp\solr.schema.TestManagedSchemaAPI_85D8B94A0B941025-001\tempDir-001\node2\testschemaapi_shard1_replica1: java.nio.file.DirectoryNotEmptyException: C:\Users\jenkins\workspace\Lucene-Solr-master-Windows\solr\build\solr-core\test\J0\temp\solr.schema.TestManagedSchemaAPI_85D8B94A0B941025-001\tempDir-001\node2\testschemaapi_shard1_replica1
   C:\Users\jenkins\workspace\Lucene-Solr-master-Windows\solr\build\solr-core\test\J0\temp\solr.schema.TestManagedSchemaAPI_85D8B94A0B941025-001\tempDir-001\node2: java.nio.file.DirectoryNotEmptyException: C:\Users\jenkins\workspace\Lucene-Solr-master-Windows\solr\build\solr-core\test\J0\temp\solr.schema.TestManagedSchemaAPI_85D8B94A0B941025-001\tempDir-001\node2
   C:\Users\jenkins\workspace\Lucene-Solr-master-Windows\solr\build\solr-core\test\J0\temp\solr.schema.TestManagedSchemaAPI_85D8B94A0B941025-001\tempDir-001: java.nio.file.DirectoryNotEmptyException: C:\Users\jenkins\workspace\Lucene-Solr-master-Windows\solr\build\solr-core\test\J0\temp\solr.schema.TestManagedSchemaAPI_85D8B94A0B941025-001\tempDir-001

	at org.apache.lucene.util.IOUtils.rm(IOUtils.java:323)
	at org.apache.lucene.util.TestRuleTemporaryFilesCleanup.afterAlways(TestRuleTemporaryFilesCleanup.java:216)
	at com.carrotsearch.randomizedtesting.rules.TestRuleAdapter$1.afterAlways(TestRuleAdapter.java:31)
	at com.carrotsearch.randomizedtesting.rules.StatementAdapter.evaluate(StatementAdapter.java:43)
	at com.carrotsearch.randomizedtesting.rules.StatementAdapter.evaluate(StatementAdapter.java:36)
	at org.apache.lucene.util.TestRuleAssertionsRequired$1.evaluate(TestRuleAssertionsRequired.java:53)
	at org.apache.lucene.util.TestRuleMarkFailure$1.evaluate(TestRuleMarkFailure.java:47)
	at org.apache.lucene.util.TestRuleIgnoreAfterMaxFailures$1.evaluate(TestRuleIgnoreAfterMaxFailures.java:64)
	at org.apache.lucene.util.TestRuleIgnoreTestSuites$1.evaluate(TestRuleIgnoreTestSuites.java:54)
	at com.carrotsearch.randomizedtesting.rules.StatementAdapter.evaluate(StatementAdapter.java:36)
	at com.carrotsearch.randomizedtesting.ThreadLeakControl$StatementRunner.run(ThreadLeakControl.java:367)
	at java.lang.Thread.run(Thread.java:745)




Build Log:
[...truncated 12329 lines...]
   [junit4] Suite: org.apache.solr.schema.TestManagedSchemaAPI
   [junit4]   2> Creating dataDir: C:\Users\jenkins\workspace\Lucene-Solr-master-Windows\solr\build\solr-core\test\J0\temp\solr.schema.TestManagedSchemaAPI_85D8B94A0B941025-001\init-core-data-001
   [junit4]   2> 2939368 INFO  (SUITE-TestManagedSchemaAPI-seed#[85D8B94A0B941025]-worker) [    ] o.a.s.SolrTestCaseJ4 Randomized ssl (false) and clientAuth (false) via: @org.apache.solr.util.RandomizeSSL(reason=, value=NaN, ssl=NaN, clientAuth=NaN)
   [junit4]   2> 2939370 INFO  (SUITE-TestManagedSchemaAPI-seed#[85D8B94A0B941025]-worker) [    ] o.a.s.c.ZkTestServer STARTING ZK TEST SERVER
   [junit4]   2> 2939371 INFO  (Thread-4847) [    ] o.a.s.c.ZkTestServer client port:0.0.0.0/0.0.0.0:0
   [junit4]   2> 2939371 INFO  (Thread-4847) [    ] o.a.s.c.ZkTestServer Starting server
   [junit4]   2> 2939470 INFO  (SUITE-TestManagedSchemaAPI-seed#[85D8B94A0B941025]-worker) [    ] o.a.s.c.ZkTestServer start zk server on port:59355
   [junit4]   2> 2939470 INFO  (SUITE-TestManagedSchemaAPI-seed#[85D8B94A0B941025]-worker) [    ] o.a.s.c.c.SolrZkClient Using default ZkCredentialsProvider
   [junit4]   2> 2939471 INFO  (SUITE-TestManagedSchemaAPI-seed#[85D8B94A0B941025]-worker) [    ] o.a.s.c.c.ConnectionManager Waiting for client to connect to ZooKeeper
   [junit4]   2> 2939477 INFO  (zkCallback-9437-thread-1) [    ] o.a.s.c.c.ConnectionManager Watcher org.apache.solr.common.cloud.ConnectionManager@11e9430 name:ZooKeeperConnection Watcher:127.0.0.1:59355 got event WatchedEvent state:SyncConnected type:None path:null path:null type:None
   [junit4]   2> 2939477 INFO  (SUITE-TestManagedSchemaAPI-seed#[85D8B94A0B941025]-worker) [    ] o.a.s.c.c.ConnectionManager Client is connected to ZooKeeper
   [junit4]   2> 2939478 INFO  (SUITE-TestManagedSchemaAPI-seed#[85D8B94A0B941025]-worker) [    ] o.a.s.c.c.SolrZkClient Using default ZkACLProvider
   [junit4]   2> 2939478 INFO  (SUITE-TestManagedSchemaAPI-seed#[85D8B94A0B941025]-worker) [    ] o.a.s.c.c.SolrZkClient makePath: /solr/solr.xml
   [junit4]   2> 2939492 INFO  (jetty-launcher-9436-thread-2) [    ] o.e.j.s.Server jetty-9.3.8.v20160314
   [junit4]   2> 2939493 INFO  (jetty-launcher-9436-thread-2) [    ] o.e.j.s.h.ContextHandler Started o.e.j.s.ServletContextHandler@36d9f7{/solr,null,AVAILABLE}
   [junit4]   2> 2939495 INFO  (jetty-launcher-9436-thread-2) [    ] o.e.j.s.ServerConnector Started ServerConnector@af5640{HTTP/1.1,[http/1.1]}{127.0.0.1:59361}
   [junit4]   2> 2939495 INFO  (jetty-launcher-9436-thread-2) [    ] o.e.j.s.Server Started @2944429ms
   [junit4]   2> 2939495 INFO  (jetty-launcher-9436-thread-2) [    ] o.a.s.c.s.e.JettySolrRunner Jetty properties: {hostContext=/solr, hostPort=59361}
   [junit4]   2> 2939496 INFO  (jetty-launcher-9436-thread-2) [    ] o.a.s.s.SolrDispatchFilter SolrDispatchFilter.init(): sun.misc.Launcher$AppClassLoader@1d16e93
   [junit4]   2> 2939497 INFO  (jetty-launcher-9436-thread-2) [    ] o.a.s.c.SolrResourceLoader new SolrResourceLoader for directory: 'C:\Users\jenkins\workspace\Lucene-Solr-master-Windows\solr\build\solr-core\test\J0\temp\solr.schema.TestManagedSchemaAPI_85D8B94A0B941025-001\tempDir-001\node2'
   [junit4]   2> 2939497 INFO  (jetty-launcher-9436-thread-2) [    ] o.a.s.c.SolrResourceLoader JNDI not configured for solr (NoInitialContextEx)
   [junit4]   2> 2939497 INFO  (jetty-launcher-9436-thread-2) [    ] o.a.s.c.SolrResourceLoader solr home defaulted to 'solr/' (could not find system property or JNDI)
   [junit4]   2> 2939498 INFO  (jetty-launcher-9436-thread-2) [    ] o.a.s.c.c.SolrZkClient Using default ZkCredentialsProvider
   [junit4]   2> 2939499 INFO  (jetty-launcher-9436-thread-2) [    ] o.a.s.c.c.ConnectionManager Waiting for client to connect to ZooKeeper
   [junit4]   2> 2939501 INFO  (jetty-launcher-9436-thread-1) [    ] o.e.j.s.Server jetty-9.3.8.v20160314
   [junit4]   2> 2939506 INFO  (jetty-launcher-9436-thread-1) [    ] o.e.j.s.h.ContextHandler Started o.e.j.s.ServletContextHandler@5ff429{/solr,null,AVAILABLE}
   [junit4]   2> 2939507 INFO  (jetty-launcher-9436-thread-1) [    ] o.e.j.s.ServerConnector Started ServerConnector@b6ff63{HTTP/1.1,[http/1.1]}{127.0.0.1:59367}
   [junit4]   2> 2939507 INFO  (jetty-launcher-9436-thread-1) [    ] o.e.j.s.Server Started @2944441ms
   [junit4]   2> 2939507 INFO  (jetty-launcher-9436-thread-1) [    ] o.a.s.c.s.e.JettySolrRunner Jetty properties: {hostContext=/solr, hostPort=59367}
   [junit4]   2> 2939507 INFO  (zkCallback-9438-thread-1) [    ] o.a.s.c.c.ConnectionManager Watcher org.apache.solr.common.cloud.ConnectionManager@92ef11 name:ZooKeeperConnection Watcher:127.0.0.1:59355/solr got event WatchedEvent state:SyncConnected type:None path:null path:null type:None
   [junit4]   2> 2939507 INFO  (jetty-launcher-9436-thread-1) [    ] o.a.s.s.SolrDispatchFilter SolrDispatchFilter.init(): sun.misc.Launcher$AppClassLoader@1d16e93
   [junit4]   2> 2939507 INFO  (jetty-launcher-9436-thread-2) [    ] o.a.s.c.c.ConnectionManager Client is connected to ZooKeeper
   [junit4]   2> 2939507 INFO  (jetty-launcher-9436-thread-1) [    ] o.a.s.c.SolrResourceLoader new SolrResourceLoader for directory: 'C:\Users\jenkins\workspace\Lucene-Solr-master-Windows\solr\build\solr-core\test\J0\temp\solr.schema.TestManagedSchemaAPI_85D8B94A0B941025-001\tempDir-001\node1'
   [junit4]   2> 2939507 INFO  (jetty-launcher-9436-thread-1) [    ] o.a.s.c.SolrResourceLoader JNDI not configured for solr (NoInitialContextEx)
   [junit4]   2> 2939507 INFO  (jetty-launcher-9436-thread-1) [    ] o.a.s.c.SolrResourceLoader solr home defaulted to 'solr/' (could not find system property or JNDI)
   [junit4]   2> 2939507 INFO  (jetty-launcher-9436-thread-2) [    ] o.a.s.c.c.SolrZkClient Using default ZkACLProvider
   [junit4]   2> 2939509 INFO  (jetty-launcher-9436-thread-2) [    ] o.a.s.s.SolrDispatchFilter solr.xml found in ZooKeeper. Loading...
   [junit4]   2> 2939509 INFO  (jetty-launcher-9436-thread-1) [    ] o.a.s.c.c.SolrZkClient Using default ZkCredentialsProvider
   [junit4]   2> 2939510 INFO  (jetty-launcher-9436-thread-1) [    ] o.a.s.c.c.ConnectionManager Waiting for client to connect to ZooKeeper
   [junit4]   2> 2939512 INFO  (zkCallback-9439-thread-1) [    ] o.a.s.c.c.ConnectionManager Watcher org.apache.solr.common.cloud.ConnectionManager@1b13f11 name:ZooKeeperConnection Watcher:127.0.0.1:59355/solr got event WatchedEvent state:SyncConnected type:None path:null path:null type:None
   [junit4]   2> 2939512 INFO  (jetty-launcher-9436-thread-1) [    ] o.a.s.c.c.ConnectionManager Client is connected to ZooKeeper
   [junit4]   2> 2939512 INFO  (jetty-launcher-9436-thread-1) [    ] o.a.s.c.c.SolrZkClient Using default ZkACLProvider
   [junit4]   2> 2939513 INFO  (jetty-launcher-9436-thread-1) [    ] o.a.s.s.SolrDispatchFilter solr.xml found in ZooKeeper. Loading...
   [junit4]   2> 2939522 INFO  (jetty-launcher-9436-thread-2) [    ] o.a.s.c.CorePropertiesLocator Config-defined core root directory: C:\Users\jenkins\workspace\Lucene-Solr-master-Windows\solr\build\solr-core\test\J0\temp\solr.schema.TestManagedSchemaAPI_85D8B94A0B941025-001\tempDir-001\node2\.
   [junit4]   2> 2939522 INFO  (jetty-launcher-9436-thread-2) [    ] o.a.s.c.CoreContainer New CoreContainer 17404778
   [junit4]   2> 2939522 INFO  (jetty-launcher-9436-thread-2) [    ] o.a.s.c.CoreContainer Loading cores into CoreContainer [instanceDir=C:\Users\jenkins\workspace\Lucene-Solr-master-Windows\solr\build\solr-core\test\J0\temp\solr.schema.TestManagedSchemaAPI_85D8B94A0B941025-001\tempDir-001\node2]
   [junit4]   2> 2939523 WARN  (jetty-launcher-9436-thread-2) [    ] o.a.s.c.CoreContainer Couldn't add files from C:\Users\jenkins\workspace\Lucene-Solr-master-Windows\solr\build\solr-core\test\J0\temp\solr.schema.TestManagedSchemaAPI_85D8B94A0B941025-001\tempDir-001\node2\lib to classpath: C:\Users\jenkins\workspace\Lucene-Solr-master-Windows\solr\build\solr-core\test\J0\temp\solr.schema.TestManagedSchemaAPI_85D8B94A0B941025-001\tempDir-001\node2\lib
   [junit4]   2> 2939523 INFO  (jetty-launcher-9436-thread-2) [    ] o.a.s.h.c.HttpShardHandlerFactory created with socketTimeout : 90000,urlScheme : ,connTimeout : 15000,maxConnectionsPerHost : 20,maxConnections : 10000,corePoolSize : 0,maximumPoolSize : 2147483647,maxThreadIdleTime : 5,sizeOfQueue : -1,fairnessPolicy : false,
   [junit4]   2> 2939524 INFO  (jetty-launcher-9436-thread-1) [    ] o.a.s.c.CorePropertiesLocator Config-defined core root directory: C:\Users\jenkins\workspace\Lucene-Solr-master-Windows\solr\build\solr-core\test\J0\temp\solr.schema.TestManagedSchemaAPI_85D8B94A0B941025-001\tempDir-001\node1\.
   [junit4]   2> 2939524 INFO  (jetty-launcher-9436-thread-1) [    ] o.a.s.c.CoreContainer New CoreContainer 13669459
   [junit4]   2> 2939524 INFO  (jetty-launcher-9436-thread-1) [    ] o.a.s.c.CoreContainer Loading cores into CoreContainer [instanceDir=C:\Users\jenkins\workspace\Lucene-Solr-master-Windows\solr\build\solr-core\test\J0\temp\solr.schema.TestManagedSchemaAPI_85D8B94A0B941025-001\tempDir-001\node1]
   [junit4]   2> 2939524 WARN  (jetty-launcher-9436-thread-1) [    ] o.a.s.c.CoreContainer Couldn't add files from C:\Users\jenkins\workspace\Lucene-Solr-master-Windows\solr\build\solr-core\test\J0\temp\solr.schema.TestManagedSchemaAPI_85D8B94A0B941025-001\tempDir-001\node1\lib to classpath: C:\Users\jenkins\workspace\Lucene-Solr-master-Windows\solr\build\solr-core\test\J0\temp\solr.schema.TestManagedSchemaAPI_85D8B94A0B941025-001\tempDir-001\node1\lib
   [junit4]   2> 2939524 INFO  (jetty-launcher-9436-thread-1) [    ] o.a.s.h.c.HttpShardHandlerFactory created with socketTimeout : 90000,urlScheme : ,connTimeout : 15000,maxConnectionsPerHost : 20,maxConnections : 10000,corePoolSize : 0,maximumPoolSize : 2147483647,maxThreadIdleTime : 5,sizeOfQueue : -1,fairnessPolicy : false,
   [junit4]   2> 2939529 INFO  (jetty-launcher-9436-thread-1) [    ] o.a.s.u.UpdateShardHandler Created UpdateShardHandler HTTP client with params: socketTimeout=340000&connTimeout=45000&maxConnections=100000&maxConnectionsPerHost=100000
   [junit4]   2> 2939529 INFO  (jetty-launcher-9436-thread-2) [    ] o.a.s.u.UpdateShardHandler Created UpdateShardHandler HTTP client with params: socketTimeout=340000&connTimeout=45000&maxConnections=100000&maxConnectionsPerHost=100000
   [junit4]   2> 2939529 INFO  (jetty-launcher-9436-thread-1) [    ] o.a.s.l.LogWatcher SLF4J impl is org.slf4j.impl.Log4jLoggerFactory
   [junit4]   2> 2939529 INFO  (jetty-launcher-9436-thread-2) [    ] o.a.s.l.LogWatcher SLF4J impl is org.slf4j.impl.Log4jLoggerFactory
   [junit4]   2> 2939530 INFO  (jetty-launcher-9436-thread-2) [    ] o.a.s.l.LogWatcher Registering Log Listener [Log4j (org.slf4j.impl.Log4jLoggerFactory)]
   [junit4]   2> 2939530 INFO  (jetty-launcher-9436-thread-1) [    ] o.a.s.l.LogWatcher Registering Log Listener [Log4j (org.slf4j.impl.Log4jLoggerFactory)]
   [junit4]   2> 2939530 INFO  (jetty-launcher-9436-thread-2) [    ] o.a.s.c.ZkContainer Zookeeper client=127.0.0.1:59355/solr
   [junit4]   2> 2939530 INFO  (jetty-launcher-9436-thread-2) [    ] o.a.s.c.ZkController zkHost includes chroot
   [junit4]   2> 2939530 INFO  (jetty-launcher-9436-thread-1) [    ] o.a.s.c.ZkContainer Zookeeper client=127.0.0.1:59355/solr
   [junit4]   2> 2939530 INFO  (jetty-launcher-9436-thread-2) [    ] o.a.s.c.c.SolrZkClient Using default ZkCredentialsProvider
   [junit4]   2> 2939530 INFO  (jetty-launcher-9436-thread-1) [    ] o.a.s.c.ZkController zkHost includes chroot
   [junit4]   2> 2939531 INFO  (jetty-launcher-9436-thread-1) [    ] o.a.s.c.c.SolrZkClient Using default ZkCredentialsProvider
   [junit4]   2> 2939532 INFO  (jetty-launcher-9436-thread-2) [    ] o.a.s.c.c.ConnectionManager Waiting for client to connect to ZooKeeper
   [junit4]   2> 2939532 INFO  (jetty-launcher-9436-thread-1) [    ] o.a.s.c.c.ConnectionManager Waiting for client to connect to ZooKeeper
   [junit4]   2> 2939533 INFO  (zkCallback-9444-thread-1) [    ] o.a.s.c.c.ConnectionManager Watcher org.apache.solr.common.cloud.ConnectionManager@6022f3 name:ZooKeeperConnection Watcher:127.0.0.1:59355 got event WatchedEvent state:SyncConnected type:None path:null path:null type:None
   [junit4]   2> 2939533 INFO  (jetty-launcher-9436-thread-2) [    ] o.a.s.c.c.ConnectionManager Client is connected to ZooKeeper
   [junit4]   2> 2939533 INFO  (zkCallback-9445-thread-1) [    ] o.a.s.c.c.ConnectionManager Watcher org.apache.solr.common.cloud.ConnectionManager@37d142 name:ZooKeeperConnection Watcher:127.0.0.1:59355 got event WatchedEvent state:SyncConnected type:None path:null path:null type:None
   [junit4]   2> 2939533 INFO  (jetty-launcher-9436-thread-2) [    ] o.a.s.c.c.SolrZkClient Using default ZkACLProvider
   [junit4]   2> 2939533 INFO  (jetty-launcher-9436-thread-1) [    ] o.a.s.c.c.ConnectionManager Client is connected to ZooKeeper
   [junit4]   2> 2939533 INFO  (jetty-launcher-9436-thread-1) [    ] o.a.s.c.c.SolrZkClient Using default ZkACLProvider
   [junit4]   2> 2939534 WARN  (NIOServerCxn.Factory:0.0.0.0/0.0.0.0:0) [    ] o.a.z.s.NIOServerCnxn caught end of stream exception
   [junit4]   2> EndOfStreamException: Unable to read additional data from client sessionid 0x15713dfdb4d0004, likely client has closed socket
   [junit4]   2> 	at org.apache.zookeeper.server.NIOServerCnxn.doIO(NIOServerCnxn.java:228)
   [junit4]   2> 	at org.apache.zookeeper.server.NIOServerCnxnFactory.run(NIOServerCnxnFactory.java:208)
   [junit4]   2> 	at java.lang.Thread.run(Thread.java:745)
   [junit4]   2> 2939534 INFO  (jetty-launcher-9436-thread-1) [n:127.0.0.1:59367_solr    ] o.a.s.c.ZkController Added new OnReconnect listener org.apache.solr.cloud.ZkController$$Lambda$78/10071607@1ae10d4
   [junit4]   2> 2939536 INFO  (jetty-launcher-9436-thread-2) [n:127.0.0.1:59361_solr    ] o.a.s.c.ZkController Added new OnReconnect listener org.apache.solr.cloud.ZkController$$Lambda$78/10071607@60e389
   [junit4]   2> 2939536 INFO  (jetty-launcher-9436-thread-1) [n:127.0.0.1:59367_solr    ] o.a.s.c.c.ConnectionManager Waiting for client to connect to ZooKeeper
   [junit4]   2> 2939537 INFO  (jetty-launcher-9436-thread-2) [n:127.0.0.1:59361_solr    ] o.a.s.c.c.ConnectionManager Waiting for client to connect to ZooKeeper
   [junit4]   2> 2939538 INFO  (zkCallback-9446-thread-1-processing-n:127.0.0.1:59367_solr) [n:127.0.0.1:59367_solr    ] o.a.s.c.c.ConnectionManager Watcher org.apache.solr.common.cloud.ConnectionManager@227c8 name:ZooKeeperConnection Watcher:127.0.0.1:59355/solr got event WatchedEvent state:SyncConnected type:None path:null path:null type:None
   [junit4]   2> 2939538 INFO  (jetty-launcher-9436-thread-1) [n:127.0.0.1:59367_solr    ] o.a.s.c.c.ConnectionManager Client is connected to ZooKeeper
   [junit4]   2> 2939538 INFO  (zkCallback-9447-thread-1-processing-n:127.0.0.1:59361_solr) [n:127.0.0.1:59361_solr    ] o.a.s.c.c.ConnectionManager Watcher org.apache.solr.common.cloud.ConnectionManager@90e028 name:ZooKeeperConnection Watcher:127.0.0.1:59355/solr got event WatchedEvent state:SyncConnected type:None path:null path:null type:None
   [junit4]   2> 2939539 INFO  (jetty-launcher-9436-thread-2) [n:127.0.0.1:59361_solr    ] o.a.s.c.c.ConnectionManager Client is connected to ZooKeeper
   [junit4]   2> 2939539 INFO  (jetty-launcher-9436-thread-1) [n:127.0.0.1:59367_solr    ] o.a.s.c.c.SolrZkClient makePath: /overseer/queue
   [junit4]   2> 2939539 INFO  (jetty-launcher-9436-thread-2) [n:127.0.0.1:59361_solr    ] o.a.s.c.c.SolrZkClient makePath: /overseer/queue
   [junit4]   2> 2939542 INFO  (jetty-launcher-9436-thread-1) [n:127.0.0.1:59367_solr    ] o.a.s.c.c.SolrZkClient makePath: /overseer/collection-queue-work
   [junit4]   2> 2939542 INFO  (jetty-launcher-9436-thread-2) [n:127.0.0.1:59361_solr    ] o.a.s.c.c.SolrZkClient makePath: /overseer/collection-queue-work
   [junit4]   2> 2939546 INFO  (jetty-launcher-9436-thread-1) [n:127.0.0.1:59367_solr    ] o.a.s.c.c.SolrZkClient makePath: /overseer/collection-map-running
   [junit4]   2> 2939547 INFO  (jetty-launcher-9436-thread-2) [n:127.0.0.1:59361_solr    ] o.a.s.c.c.SolrZkClient makePath: /overseer/collection-map-running
   [junit4]   2> 2939549 INFO  (jetty-launcher-9436-thread-1) [n:127.0.0.1:59367_solr    ] o.a.s.c.c.SolrZkClient makePath: /overseer/collection-map-completed
   [junit4]   2> 2939549 INFO  (jetty-launcher-9436-thread-2) [n:127.0.0.1:59361_solr    ] o.a.s.c.c.SolrZkClient makePath: /overseer/collection-map-completed
   [junit4]   2> 2939552 INFO  (jetty-launcher-9436-thread-1) [n:127.0.0.1:59367_solr    ] o.a.s.c.c.SolrZkClient makePath: /overseer/collection-map-failure
   [junit4]   2> 2939552 INFO  (jetty-launcher-9436-thread-2) [n:127.0.0.1:59361_solr    ] o.a.s.c.c.SolrZkClient makePath: /overseer/collection-map-failure
   [junit4]   2> 2939554 INFO  (jetty-launcher-9436-thread-2) [n:127.0.0.1:59361_solr    ] o.a.s.c.c.SolrZkClient makePath: /live_nodes
   [junit4]   2> 2939554 INFO  (jetty-launcher-9436-thread-1) [n:127.0.0.1:59367_solr    ] o.a.s.c.c.SolrZkClient makePath: /live_nodes
   [junit4]   2> 2939555 INFO  (jetty-launcher-9436-thread-2) [n:127.0.0.1:59361_solr    ] o.a.s.c.c.SolrZkClient makePath: /collections
   [junit4]   2> 2939555 INFO  (jetty-launcher-9436-thread-1) [n:127.0.0.1:59367_solr    ] o.a.s.c.c.SolrZkClient makePath: /collections
   [junit4]   2> 2939557 INFO  (jetty-launcher-9436-thread-1) [n:127.0.0.1:59367_solr    ] o.a.s.c.c.SolrZkClient makePath: /aliases.json
   [junit4]   2> 2939558 INFO  (jetty-launcher-9436-thread-2) [n:127.0.0.1:59361_solr    ] o.a.s.c.c.SolrZkClient makePath: /aliases.json
   [junit4]   2> 2939559 INFO  (jetty-launcher-9436-thread-1) [n:127.0.0.1:59367_solr    ] o.a.s.c.c.SolrZkClient makePath: /clusterstate.json
   [junit4]   2> 2939559 INFO  (jetty-launcher-9436-thread-2) [n:127.0.0.1:59361_solr    ] o.a.s.c.c.SolrZkClient makePath: /clusterstate.json
   [junit4]   2> 2939561 INFO  (jetty-launcher-9436-thread-2) [n:127.0.0.1:59361_solr    ] o.a.s.c.c.SolrZkClient makePath: /security.json
   [junit4]   2> 2939561 INFO  (jetty-launcher-9436-thread-1) [n:127.0.0.1:59367_solr    ] o.a.s.c.c.SolrZkClient makePath: /security.json
   [junit4]   2> 2939562 INFO  (jetty-launcher-9436-thread-1) [n:127.0.0.1:59367_solr    ] o.a.s.c.c.ZkStateReader Updating cluster state from ZooKeeper... 
   [junit4]   2> 2939562 INFO  (jetty-launcher-9436-thread-2) [n:127.0.0.1:59361_solr    ] o.a.s.c.c.ZkStateReader Updating cluster state from ZooKeeper... 
   [junit4]   2> 2939563 INFO  (jetty-launcher-9436-thread-1) [n:127.0.0.1:59367_solr    ] o.a.s.c.c.ZkStateReader Loaded empty cluster properties
   [junit4]   2> 2939563 INFO  (jetty-launcher-9436-thread-2) [n:127.0.0.1:59361_solr    ] o.a.s.c.c.ZkStateReader Loaded empty cluster properties
   [junit4]   2> 2939563 INFO  (jetty-launcher-9436-thread-1) [n:127.0.0.1:59367_solr    ] o.a.s.c.c.ZkStateReader Updated live nodes from ZooKeeper... (0) -> (0)
   [junit4]   2> 2939564 INFO  (jetty-launcher-9436-thread-2) [n:127.0.0.1:59361_solr    ] o.a.s.c.c.ZkStateReader Updated live nodes from ZooKeeper... (0) -> (0)
   [junit4]   2> 2939567 INFO  (jetty-launcher-9436-thread-1) [n:127.0.0.1:59367_solr    ] o.a.s.c.c.SolrZkClient makePath: /overseer_elect
   [junit4]   2> 2939568 INFO  (jetty-launcher-9436-thread-2) [n:127.0.0.1:59361_solr    ] o.a.s.c.c.SolrZkClient makePath: /overseer_elect
   [junit4]   2> 2939569 INFO  (jetty-launcher-9436-thread-1) [n:127.0.0.1:59367_solr    ] o.a.s.c.c.SolrZkClient makePath: /overseer_elect/election
   [junit4]   2> 2939570 INFO  (jetty-launcher-9436-thread-2) [n:127.0.0.1:59361_solr    ] o.a.s.c.c.SolrZkClient makePath: /overseer_elect/election
   [junit4]   2> 2939571 INFO  (jetty-launcher-9436-thread-1) [n:127.0.0.1:59367_solr    ] o.a.s.c.Overseer Overseer (id=null) closing
   [junit4]   2> 2939572 INFO  (jetty-launcher-9436-thread-2) [n:127.0.0.1:59361_solr    ] o.a.s.c.Overseer Overseer (id=null) closing
   [junit4]   2> 2939572 INFO  (jetty-launcher-9436-thread-1) [n:127.0.0.1:59367_solr    ] o.a.s.c.LeaderElector Joined leadership election with path: /overseer_elect/election/96567769189646341-127.0.0.1:59367_solr-n_0000000000
   [junit4]   2> 2939572 INFO  (jetty-launcher-9436-thread-2) [n:127.0.0.1:59361_solr    ] o.a.s.c.LeaderElector Joined leadership election with path: /overseer_elect/election/96567769189646342-127.0.0.1:59361_solr-n_0000000001
   [junit4]   2> 2939572 INFO  (jetty-launcher-9436-thread-1) [n:127.0.0.1:59367_solr    ] o.a.s.c.OverseerElectionContext I am going to be the leader 127.0.0.1:59367_solr
   [junit4]   2> 2939572 INFO  (jetty-launcher-9436-thread-1) [n:127.0.0.1:59367_solr    ] o.a.s.c.c.SolrZkClient makePath: /overseer_elect/leader
   [junit4]   2> 2939573 INFO  (jetty-launcher-9436-thread-2) [n:127.0.0.1:59361_solr    ] o.a.s.c.LeaderElector Watching path /overseer_elect/election/96567769189646341-127.0.0.1:59367_solr-n_0000000000 to know if I could be the leader
   [junit4]   2> 2939574 INFO  (jetty-launcher-9436-thread-2) [n:127.0.0.1:59361_solr    ] o.a.s.c.ZkController Register node as live in ZooKeeper:/live_nodes/127.0.0.1:59361_solr
   [junit4]   2> 2939574 INFO  (jetty-launcher-9436-thread-2) [n:127.0.0.1:59361_solr    ] o.a.s.c.c.SolrZkClient makePath: /live_nodes/127.0.0.1:59361_solr
   [junit4]   2> 2939574 INFO  (jetty-launcher-9436-thread-1) [n:127.0.0.1:59367_solr    ] o.a.s.c.Overseer Overseer (id=96567769189646341-127.0.0.1:59367_solr-n_0000000000) starting
   [junit4]   2> 2939575 INFO  (zkCallback-9447-thread-1-processing-n:127.0.0.1:59361_solr) [n:127.0.0.1:59361_solr    ] o.a.s.c.c.ZkStateReader A live node change: [WatchedEvent state:SyncConnected type:NodeChildrenChanged path:/live_nodes], has occurred - updating... (live nodes size: [0])
   [junit4]   2> 2939576 INFO  (zkCallback-9446-thread-1-processing-n:127.0.0.1:59367_solr) [n:127.0.0.1:59367_solr    ] o.a.s.c.c.ZkStateReader A live node change: [WatchedEvent state:SyncConnected type:NodeChildrenChanged path:/live_nodes], has occurred - updating... (live nodes size: [0])
   [junit4]   2> 2939576 INFO  (zkCallback-9447-thread-1-processing-n:127.0.0.1:59361_solr) [n:127.0.0.1:59361_solr    ] o.a.s.c.c.ZkStateReader Updated live nodes from ZooKeeper... (0) -> (1)
   [junit4]   2> 2939577 INFO  (zkCallback-9446-thread-1-processing-n:127.0.0.1:59367_solr) [n:127.0.0.1:59367_solr    ] o.a.s.c.c.ZkStateReader Updated live nodes from ZooKeeper... (0) -> (1)
   [junit4]   2> 2939577 INFO  (jetty-launcher-9436-thread-1) [n:127.0.0.1:59367_solr    ] o.a.s.c.c.SolrZkClient makePath: /overseer/queue-work
   [junit4]   2> 2939585 INFO  (jetty-launcher-9436-thread-1) [n:127.0.0.1:59367_solr    ] o.a.s.c.OverseerAutoReplicaFailoverThread Starting OverseerAutoReplicaFailoverThread autoReplicaFailoverWorkLoopDelay=10000 autoReplicaFailoverWaitAfterExpiration=30000 autoReplicaFailoverBadNodeExpiration=60000
   [junit4]   2> 2939586 INFO  (jetty-launcher-9436-thread-1) [n:127.0.0.1:59367_solr    ] o.a.s.c.ZkController Publish node=127.0.0.1:59367_solr as DOWN
   [junit4]   2> 2939587 INFO  (jetty-launcher-9436-thread-1) [n:127.0.0.1:59367_solr    ] o.a.s.c.ZkController Register node as live in ZooKeeper:/live_nodes/127.0.0.1:59367_solr
   [junit4]   2> 2939587 INFO  (jetty-launcher-9436-thread-1) [n:127.0.0.1:59367_solr    ] o.a.s.c.c.SolrZkClient makePath: /live_nodes/127.0.0.1:59367_solr
   [junit4]   2> 2939589 INFO  (zkCallback-9447-thread-1-processing-n:127.0.0.1:59361_solr) [n:127.0.0.1:59361_solr    ] o.a.s.c.c.ZkStateReader A live node change: [WatchedEvent state:SyncConnected type:NodeChildrenChanged path:/live_nodes], has occurred - updating... (live nodes size: [1])
   [junit4]   2> 2939590 INFO  (zkCallback-9446-thread-1-processing-n:127.0.0.1:59367_solr) [n:127.0.0.1:59367_solr    ] o.a.s.c.c.ZkStateReader A live node change: [WatchedEvent state:SyncConnected type:NodeChildrenChanged path:/live_nodes], has occurred - updating... (live nodes size: [1])
   [junit4]   2> 2939590 INFO  (zkCallback-9447-thread-1-processing-n:127.0.0.1:59361_solr) [n:127.0.0.1:59361_solr    ] o.a.s.c.c.ZkStateReader Updated live nodes from ZooKeeper... (1) -> (2)
   [junit4]   2> 2939590 INFO  (zkCallback-9446-thread-1-processing-n:127.0.0.1:59367_solr) [n:127.0.0.1:59367_solr    ] o.a.s.c.c.ZkStateReader Updated live nodes from ZooKeeper... (1) -> (2)
   [junit4]   2> 2939593 INFO  (OverseerStateUpdate-96567769189646341-127.0.0.1:59367_solr-n_0000000000) [n:127.0.0.1:59367_solr    ] o.a.s.c.Overseer Starting to work on the main queue
   [junit4]   2> 2939594 INFO  (OverseerStateUpdate-96567769189646341-127.0.0.1:59367_solr-n_0000000000) [n:127.0.0.1:59367_solr    ] o.a.s.c.c.ZkStateReader Updated live nodes from ZooKeeper... (2) -> (2)
   [junit4]   2> 2939595 INFO  (OverseerStateUpdate-96567769189646341-127.0.0.1:59367_solr-n_0000000000) [n:127.0.0.1:59367_solr    ] o.a.s.c.Overseer processMessage: queueSize: 1, message = {
   [junit4]   2>   "operation":"downnode",
   [junit4]   2>   "node_name":"127.0.0.1:59367_solr"} current state version: 0
   [junit4]   2> 2939595 INFO  (OverseerStateUpdate-96567769189646341-127.0.0.1:59367_solr-n_0000000000) [n:127.0.0.1:59367_solr    ] o.a.s.c.o.NodeMutator DownNode state invoked for node: 127.0.0.1:59367_solr
   [junit4]   2> 2939598 INFO  (OverseerCollectionConfigSetProcessor-96567769189646341-127.0.0.1:59367_solr-n_0000000000) [n:127.0.0.1:59367_solr    ] o.a.s.c.OverseerTaskProcessor Process current queue of overseer operations
   [junit4]   2> 2939617 INFO  (jetty-launcher-9436-thread-2) [n:127.0.0.1:59361_solr    ] o.a.s.c.CoreContainer Security conf doesn't exist. Skipping setup for authorization module.
   [junit4]   2> 2939617 INFO  (jetty-launcher-9436-thread-2) [n:127.0.0.1:59361_solr    ] o.a.s.c.CoreContainer No authentication plugin used.
   [junit4]   2> 2939618 INFO  (jetty-launcher-9436-thread-2) [n:127.0.0.1:59361_solr    ] o.a.s.c.CorePropertiesLocator Looking for core definitions underneath C:\Users\jenkins\workspace\Lucene-Solr-master-Windows\solr\build\solr-core\test\J0\temp\solr.schema.TestManagedSchemaAPI_85D8B94A0B941025-001\tempDir-001\node2\.
   [junit4]   2> 2939619 INFO  (jetty-launcher-9436-thread-2) [n:127.0.0.1:59361_solr    ] o.a.s.c.CorePropertiesLocator Found 0 core definitions
   [junit4]   2> 2939620 INFO  (jetty-launcher-9436-thread-2) [n:127.0.0.1:59361_solr    ] o.a.s.s.SolrDispatchFilter user.dir=C:\Users\jenkins\workspace\Lucene-Solr-master-Windows\solr\build\solr-core\test\J0
   [junit4]   2> 2939620 INFO  (jetty-launcher-9436-thread-2) [n:127.0.0.1:59361_solr    ] o.a.s.s.SolrDispatchFilter SolrDispatchFilter.init() done
   [junit4]   2> 2939652 INFO  (jetty-launcher-9436-thread-1) [n:127.0.0.1:59367_solr    ] o.a.s.c.CoreContainer Security conf doesn't exist. Skipping setup for authorization module.
   [junit4]   2> 2939653 INFO  (jetty-launcher-9436-thread-1) [n:127.0.0.1:59367_solr    ] o.a.s.c.CoreContainer No authentication plugin used.
   [junit4]   2> 2939654 INFO  (jetty-launcher-9436-thread-1) [n:127.0.0.1:59367_solr    ] o.a.s.c.CorePropertiesLocator Looking for core definitions underneath C:\Users\jenkins\workspace\Lucene-Solr-master-Windows\solr\build\solr-core\test\J0\temp\solr.schema.TestManagedSchemaAPI_85D8B94A0B941025-001\tempDir-001\node1\.
   [junit4]   2> 2939654 INFO  (jetty-launcher-9436-thread-1) [n:127.0.0.1:59367_solr    ] o.a.s.c.CorePropertiesLocator Found 0 core definitions
   [junit4]   2> 2939655 INFO  (jetty-launcher-9436-thread-1) [n:127.0.0.1:59367_solr    ] o.a.s.s.SolrDispatchFilter user.dir=C:\Users\jenkins\workspace\Lucene-Solr-master-Windows\solr\build\solr-core\test\J0
   [junit4]   2> 2939655 INFO  (jetty-launcher-9436-thread-1) [n:127.0.0.1:59367_solr    ] o.a.s.s.SolrDispatchFilter SolrDispatchFilter.init() done
   [junit4]   2> 2939655 INFO  (SUITE-TestManagedSchemaAPI-seed#[85D8B94A0B941025]-worker) [    ] o.a.s.c.c.SolrZkClient Using default ZkCredentialsProvider
   [junit4]   2> 2939656 INFO  (SUITE-TestManagedSchemaAPI-seed#[85D8B94A0B941025]-worker) [    ] o.a.s.c.c.ConnectionManager Waiting for client to connect to ZooKeeper
   [junit4]   2> 2939657 INFO  (zkCallback-9450-thread-1) [    ] o.a.s.c.c.ConnectionManager Watcher org.apache.solr.common.cloud.ConnectionManager@15b4029 name:ZooKeeperConnection Watcher:127.0.0.1:59355 got event WatchedEvent state:SyncConnected type:None path:null path:null type:None
   [junit4]   2> 2939659 INFO  (SUITE-TestManagedSchemaAPI-seed#[85D8B94A0B941025]-worker) [    ] o.a.s.c.c.ConnectionManager Client is connected to ZooKeeper
   [junit4]   2> 2939659 INFO  (SUITE-TestManagedSchemaAPI-seed#[85D8B94A0B941025]-worker) [    ] o.a.s.c.c.SolrZkClient Using default ZkACLProvider
   [junit4]   2> 2939662 INFO  (SUITE-TestManagedSchemaAPI-seed#[85D8B94A0B941025]-worker) [    ] o.a.s.c.c.SolrZkClient Using default ZkCredentialsProvider
   [junit4]   2> 2939663 INFO  (SUITE-TestManagedSchemaAPI-seed#[85D8B94A0B941025]-worker) [    ] o.a.s.c.c.ConnectionManager Waiting for client to connect to ZooKeeper
   [junit4]   2> 2939664 INFO  (zkCallback-9453-thread-1) [    ] o.a.s.c.c.ConnectionManager Watcher org.apache.solr.common.cloud.ConnectionManager@29f975 name:ZooKeeperConnection Watcher:127.0.0.1:59355/solr got event WatchedEvent state:SyncConnected type:None path:null path:null type:None
   [junit4]   2> 2939664 INFO  (SUITE-TestManagedSchemaAPI-seed#[85D8B94A0B941025]-worker) [    ] o.a.s.c.c.ConnectionManager Client is connected to ZooKeeper
   [junit4]   2> 2939665 INFO  (SUITE-TestManagedSchemaAPI-seed#[85D8B94A0B941025]-worker) [    ] o.a.s.c.c.SolrZkClient Using default ZkACLProvider
   [junit4]   2> 2939665 INFO  (SUITE-TestManagedSchemaAPI-seed#[85D8B94A0B941025]-worker) [    ] o.a.s.c.c.ZkStateReader Updating cluster state from ZooKeeper... 
   [junit4]   2> 2939666 INFO  (SUITE-TestManagedSchemaAPI-seed#[85D8B94A0B941025]-worker) [    ] o.a.s.c.c.ZkStateReader Loaded empty cluster properties
   [junit4]   2> 2939667 INFO  (SUITE-TestManagedSchemaAPI-seed#[85D8B94A0B941025]-worker) [    ] o.a.s.c.c.ZkStateReader Updated live nodes from ZooKeeper... (0) -> (2)
   [junit4]   2> 2939670 INFO  (SUITE-TestManagedSchemaAPI-seed#[85D8B94A0B941025]-worker) [    ] o.a.s.c.c.SolrZkClient makePath: /configs/conf1/managed-schema
   [junit4]   2> 2939674 INFO  (SUITE-TestManagedSchemaAPI-seed#[85D8B94A0B941025]-worker) [    ] o.a.s.c.c.SolrZkClient makePath: /configs/conf1/solrconfig.xml
   [junit4]   2> 2939692 INFO  (TEST-TestManagedSchemaAPI.test-seed#[85D8B94A0B941025]) [    ] o.a.s.SolrTestCaseJ4 ###Starting test
   [junit4]   2> 2939696 INFO  (qtp4245224-43216) [n:127.0.0.1:59367_solr    ] o.a.s.h.a.CollectionsHandler Invoked Collection Action :create with params replicationFactor=2&collection.configName=conf1&name=testschemaapi&action=CREATE&numShards=1&wt=javabin&version=2 and sendToOCPQueue=true
   [junit4]   2> 2939698 INFO  (OverseerCollectionConfigSetProcessor-96567769189646341-127.0.0.1:59367_solr-n_0000000000) [n:127.0.0.1:59367_solr    ] o.a.s.c.OverseerTaskProcessor Overseer Collection Message Handler: Get the message id:/overseer/collection-queue-work/qn-0000000000 message:{
   [junit4]   2>   "name":"testschemaapi",
   [junit4]   2>   "fromApi":"true",
   [junit4]   2>   "replicationFactor":"2",
   [junit4]   2>   "collection.configName":"conf1",
   [junit4]   2>   "numShards":"1",
   [junit4]   2>   "stateFormat":"2",
   [junit4]   2>   "operation":"create"}
   [junit4]   2> 2939699 INFO  (OverseerThreadFactory-11003-thread-1-processing-n:127.0.0.1:59367_solr) [n:127.0.0.1:59367_solr    ] o.a.s.c.OverseerCollectionMessageHandler OverseerCollectionMessageHandler.processMessage : create , {
   [junit4]   2>   "name":"testschemaapi",
   [junit4]   2>   "fromApi":"true",
   [junit4]   2>   "replicationFactor":"2",
   [junit4]   2>   "collection.configName":"conf1",
   [junit4]   2>   "numShards":"1",
   [junit4]   2>   "stateFormat":"2",
   [junit4]   2>   "operation":"create"}
   [junit4]   2> 2939699 INFO  (OverseerThreadFactory-11003-thread-1-processing-n:127.0.0.1:59367_solr) [n:127.0.0.1:59367_solr    ] o.a.s.c.CreateCollectionCmd Create collection testschemaapi
   [junit4]   2> 2939700 INFO  (OverseerThreadFactory-11003-thread-1-processing-n:127.0.0.1:59367_solr) [n:127.0.0.1:59367_solr    ] o.a.s.c.OverseerCollectionMessageHandler creating collections conf node /collections/testschemaapi 
   [junit4]   2> 2939701 INFO  (OverseerThreadFactory-11003-thread-1-processing-n:127.0.0.1:59367_solr) [n:127.0.0.1:59367_solr    ] o.a.s.c.c.SolrZkClient makePath: /collections/testschemaapi
   [junit4]   2> 2939702 INFO  (zkCallback-9447-thread-1-processing-n:127.0.0.1:59361_solr) [n:127.0.0.1:59361_solr    ] o.a.s.c.c.ZkStateReader A collections change: [WatchedEvent state:SyncConnected type:NodeChildrenChanged path:/collections], has occurred - updating...
   [junit4]   2> 2939702 INFO  (zkCallback-9446-thread-1-processing-n:127.0.0.1:59367_solr) [n:127.0.0.1:59367_solr    ] o.a.s.c.c.ZkStateReader A collections change: [WatchedEvent state:SyncConnected type:NodeChildrenChanged path:/collections], has occurred - updating...
   [junit4]   2> 2939703 INFO  (zkCallback-9453-thread-1) [    ] o.a.s.c.c.ZkStateReader A collections change: [WatchedEvent state:SyncConnected type:NodeChildrenChanged path:/collections], has occurred - updating...
   [junit4]   2> 2939705 INFO  (OverseerStateUpdate-96567769189646341-127.0.0.1:59367_solr-n_0000000000) [n:127.0.0.1:59367_solr    ] o.a.s.c.Overseer processMessage: queueSize: 1, message = {
   [junit4]   2>   "name":"testschemaapi",
   [junit4]   2>   "fromApi":"true",
   [junit4]   2>   "replicationFactor":"2",
   [junit4]   2>   "collection.configName":"conf1",
   [junit4]   2>   "numShards":"1",
   [junit4]   2>   "stateFormat":"2",
   [junit4]   2>   "operation":"create"} current state version: 0
   [junit4]   2> 2939706 INFO  (OverseerStateUpdate-96567769189646341-127.0.0.1:59367_solr-n_0000000000) [n:127.0.0.1:59367_solr    ] o.a.s.c.o.ClusterStateMutator building a new cName: testschemaapi
   [junit4]   2> 2939707 INFO  (OverseerStateUpdate-96567769189646341-127.0.0.1:59367_solr-n_0000000000) [n:127.0.0.1:59367_solr    ] o.a.s.c.o.ZkStateWriter going to create_collection /collections/testschemaapi/state.json
   [junit4]   2> 2939806 INFO  (OverseerThreadFactory-11003-thread-1-processing-n:127.0.0.1:59367_solr) [n:127.0.0.1:59367_solr    ] o.a.s.c.CreateCollectionCmd Creating SolrCores for new collection testschemaapi, shardNames [shard1] , replicationFactor : 2
   [junit4]   2> 2939806 INFO  (OverseerThreadFactory-11003-thread-1-processing-n:127.0.0.1:59367_solr) [n:127.0.0.1:59367_solr    ] o.a.s.c.CreateCollectionCmd Creating core testschemaapi_shard1_replica1 as part of shard shard1 of collection testschemaapi on 127.0.0.1:59361_solr
   [junit4]   2> 2939807 INFO  (OverseerThreadFactory-11003-thread-1-processing-n:127.0.0.1:59367_solr) [n:127.0.0.1:59367_solr    ] o.a.s.c.CreateCollectionCmd Creating core testschemaapi_shard1_replica2 as part of shard shard1 of collection testschemaapi on 127.0.0.1:59367_solr
   [junit4]   2> 2939810 INFO  (qtp4245224-43217) [n:127.0.0.1:59367_solr    ] o.a.s.h.a.CoreAdminOperation core create command qt=/admin/cores&collection.configName=conf1&name=testschemaapi_shard1_replica2&action=CREATE&numShards=1&collection=testschemaapi&shard=shard1&wt=javabin&version=2
   [junit4]   2> 2939810 INFO  (qtp12079397-43213) [n:127.0.0.1:59361_solr    ] o.a.s.h.a.CoreAdminOperation core create command qt=/admin/cores&collection.configName=conf1&name=testschemaapi_shard1_replica1&action=CREATE&numShards=1&collection=testschemaapi&shard=shard1&wt=javabin&version=2
   [junit4]   2> 2939812 INFO  (qtp4245224-43217) [n:127.0.0.1:59367_solr    ] o.a.s.c.CoreDescriptor Created CoreDescriptor: {name=testschemaapi_shard1_replica2, collection.configName=conf1, config=solrconfig.xml, transient=false, schema=schema.xml, loadOnStartup=true, configSetProperties=configsetprops.json, collection=testschemaapi, numShards=1, dataDir=data\, shard=shard1}
   [junit4]   2> 2939812 INFO  (qtp12079397-43213) [n:127.0.0.1:59361_solr    ] o.a.s.c.CoreDescriptor Created CoreDescriptor: {name=testschemaapi_shard1_replica1, collection.configName=conf1, config=solrconfig.xml, transient=false, schema=schema.xml, loadOnStartup=true, configSetProperties=configsetprops.json, collection=testschemaapi, numShards=1, dataDir=data\, shard=shard1}
   [junit4]   2> 2939814 INFO  (qtp4245224-43217) [n:127.0.0.1:59367_solr c:testschemaapi s:shard1  x:testschemaapi_shard1_replica2] o.a.s.c.ZkController publishing state=down
   [junit4]   2> 2939814 INFO  (qtp12079397-43213) [n:127.0.0.1:59361_solr c:testschemaapi s:shard1  x:testschemaapi_shard1_replica1] o.a.s.c.ZkController publishing state=down
   [junit4]   2> 2939817 INFO  (qtp4245224-43217) [n:127.0.0.1:59367_solr c:testschemaapi s:shard1  x:testschemaapi_shard1_replica2] o.a.s.c.ZkController Registering watch for collection testschemaapi
   [junit4]   2> 2939817 INFO  (qtp12079397-43213) [n:127.0.0.1:59361_solr c:testschemaapi s:shard1  x:testschemaapi_shard1_replica1] o.a.s.c.ZkController Registering watch for collection testschemaapi
   [junit4]   2> 2939817 INFO  (qtp4245224-43217) [n:127.0.0.1:59367_solr c:testschemaapi s:shard1  x:testschemaapi_shard1_replica2] o.a.s.c.c.ZkStateReader Add data for [testschemaapi] ver [0]
   [junit4]   2> 2939818 INFO  (qtp4245224-43217) [n:127.0.0.1:59367_solr c:testschemaapi s:shard1  x:testschemaapi_shard1_replica2] o.a.s.c.ZkController look for our core node name
   [junit4]   2> 2939818 INFO  (OverseerStateUpdate-96567769189646341-127.0.0.1:59367_solr-n_0000000000) [n:127.0.0.1:59367_solr    ] o.a.s.c.Overseer processMessage: queueSize: 2, message = {
   [junit4]   2>   "core":"testschemaapi_shard1_replica2",
   [junit4]   2>   "roles":null,
   [junit4]   2>   "base_url":"http://127.0.0.1:59367/solr",
   [junit4]   2>   "node_name":"127.0.0.1:59367_solr",
   [junit4]   2>   "numShards":"1",
   [junit4]   2>   "state":"down",
   [junit4]   2>   "shard":"shard1",
   [junit4]   2>   "collection":"testschemaapi",
   [junit4]   2>   "operation":"state"} current state version: 0
   [junit4]   2> 2939818 INFO  (OverseerStateUpdate-96567769189646341-127.0.0.1:59367_solr-n_0000000000) [n:127.0.0.1:59367_solr    ] o.a.s.c.o.ReplicaMutator Update state numShards=1 message={
   [junit4]   2>   "core":"testschemaapi_shard1_replica2",
   [junit4]   2>   "roles":null,
   [junit4]   2>   "base_url":"http://127.0.0.1:59367/solr",
   [junit4]   2>   "node_name":"127.0.0.1:59367_solr",
   [junit4]   2>   "numShards":"1",
   [junit4]   2>   "state":"down",
   [junit4]   2>   "shard":"shard1",
   [junit4]   2>   "collection":"testschemaapi",
   [junit4]   2>   "operation":"state"}
   [junit4]   2> 2939818 INFO  (qtp12079397-43213) [n:127.0.0.1:59361_solr c:testschemaapi s:shard1  x:testschemaapi_shard1_replica1] o.a.s.c.c.ZkStateReader Add data for [testschemaapi] ver [0]
   [junit4]   2> 2939818 INFO  (qtp12079397-43213) [n:127.0.0.1:59361_solr c:testschemaapi s:shard1  x:testschemaapi_shard1_replica1] o.a.s.c.ZkController look for our core node name
   [junit4]   2> 2939820 INFO  (OverseerStateUpdate-96567769189646341-127.0.0.1:59367_solr-n_0000000000) [n:127.0.0.1:59367_solr    ] o.a.s.c.Overseer processMessage: queueSize: 1, message = {
   [junit4]   2>   "core":"testschemaapi_shard1_replica1",
   [junit4]   2>   "roles":null,
   [junit4]   2>   "base_url":"http://127.0.0.1:59361/solr",
   [junit4]   2>   "node_name":"127.0.0.1:59361_solr",
   [junit4]   2>   "numShards":"1",
   [junit4]   2>   "state":"down",
   [junit4]   2>   "shard":"shard1",
   [junit4]   2>   "collection":"testschemaapi",
   [junit4]   2>   "operation":"state"} current state version: 0
   [junit4]   2> 2939821 INFO  (OverseerStateUpdate-96567769189646341-127.0.0.1:59367_solr-n_0000000000) [n:127.0.0.1:59367_solr    ] o.a.s.c.o.ReplicaMutator Update state numShards=1 message={
   [junit4]   2>   "core":"testschemaapi_shard1_replica1",
   [junit4]   2>   "roles":null,
   [junit4]   2>   "base_url":"http://127.0.0.1:59361/solr",
   [junit4]   2>   "node_name":"127.0.0.1:59361_solr",
   [junit4]   2>   "numShards":"1",
   [junit4]   2>   "state":"down",
   [junit4]   2>   "shard":"shard1",
   [junit4]   2>   "collection":"testschemaapi",
   [junit4]   2>   "operation":"state"}
   [junit4]   2> 2939925 INFO  (OverseerStateUpdate-96567769189646341-127.0.0.1:59367_solr-n_0000000000) [n:127.0.0.1:59367_solr    ] o.a.s.c.o.ZkStateWriter going to update_collection /collections/testschemaapi/state.json version: 0
   [junit4]   2> 2939925 INFO  (zkCallback-9446-thread-1-processing-n:127.0.0.1:59367_solr) [n:127.0.0.1:59367_solr    ] o.a.s.c.c.ZkStateReader A cluster state change: [WatchedEvent state:SyncConnected type:NodeDataChanged path:/collections/testschemaapi/state.json] for collection [testschemaapi] has occurred - updating... (live nodes size: [2])
   [junit4]   2> 2939925 INFO  (zkCallback-9447-thread-1-processing-n:127.0.0.1:59361_solr) [n:127.0.0.1:59361_solr    ] o.a.s.c.c.ZkStateReader A cluster state change: [WatchedEvent state:SyncConnected type:NodeDataChanged path:/collections/testschemaapi/state.json] for collection [testschemaapi] has occurred - updating... (live nodes size: [2])
   [junit4]   2> 2939926 INFO  (zkCallback-9447-thread-1-processing-n:127.0.0.1:59361_solr) [n:127.0.0.1:59361_solr    ] o.a.s.c.c.ZkStateReader Updating data for [testschemaapi] from [0] to [1]
   [junit4]   2> 2939926 INFO  (zkCallback-9446-thread-1-processing-n:127.0.0.1:59367_solr) [n:127.0.0.1:59367_solr    ] o.a.s.c.c.ZkStateReader Updating data for [testschemaapi] from [0] to [1]
   [junit4]   2> 2940818 INFO  (qtp4245224-43217) [n:127.0.0.1:59367_solr c:testschemaapi s:shard1  x:testschemaapi_shard1_replica2] o.a.s.c.ZkController waiting to find shard id in clusterstate for testschemaapi_shard1_replica2
   [junit4]   2> 2940818 INFO  (qtp4245224-43217) [n:127.0.0.1:59367_solr c:testschemaapi s:shard1  x:testschemaapi_shard1_replica2] o.a.s.c.ZkController Check for collection zkNode:testschemaapi
   [junit4]   2> 2940819 INFO  (qtp12079397-43213) [n:127.0.0.1:59361_solr c:testschemaapi s:shard1  x:testschemaapi_shard1_replica1] o.a.s.c.ZkController waiting to find shard id in clusterstate for testschemaapi_shard1_replica1
   [junit4]   2> 2940819 INFO  (qtp12079397-43213) [n:127.0.0.1:59361_solr c:testschemaapi s:shard1  x:testschemaapi_shard1_replica1] o.a.s.c.ZkController Check for collection zkNode:testschemaapi
   [junit4]   2> 2940819 INFO  (qtp4245224-43217) [n:127.0.0.1:59367_solr c:testschemaapi s:shard1  x:testschemaapi_shard1_replica2] o.a.s.c.ZkController Collection zkNode exists
   [junit4]   2> 2940819 INFO  (qtp4245224-43217) [n:127.0.0.1:59367_solr c:testschemaapi s:shard1  x:testschemaapi_shard1_replica2] o.a.s.c.c.ZkStateReader Load collection config from: [/collections/testschemaapi]
   [junit4]   2> 2940819 INFO  (qtp12079397-43213) [n:127.0.0.1:59361_solr c:testschemaapi s:shard1  x:testschemaapi_shard1_replica1] o.a.s.c.ZkController Collection zkNode exists
   [junit4]   2> 2940819 INFO  (qtp12079397-43213) [n:127.0.0.1:59361_solr c:testschemaapi s:shard1  x:testschemaapi_shard1_replica1] o.a.s.c.c.ZkStateReader Load collection config from: [/collections/testschemaapi]
   [junit4]   2> 2940820 INFO  (qtp4245224-43217) [n:127.0.0.1:59367_solr c:testschemaapi s:shard1  x:testschemaapi_shard1_replica2] o.a.s.c.c.ZkStateReader path=[/collections/testschemaapi] [configName]=[conf1] specified config exists in ZooKeeper
   [junit4]   2> 2940820 INFO  (qtp4245224-43217) [n:127.0.0.1:59367_solr c:testschemaapi s:shard1  x:testschemaapi_shard1_replica2] o.a.s.c.SolrResourceLoader new SolrResourceLoader for directory: 'C:\Users\jenkins\workspace\Lucene-Solr-master-Windows\solr\build\solr-core\test\J0\temp\solr.schema.TestManagedSchemaAPI_85D8B94A0B941025-001\tempDir-001\node1\testschemaapi_shard1_replica2'
   [junit4]   2> 2940820 INFO  (qtp4245224-43217) [n:127.0.0.1:59367_solr c:testschemaapi s:shard1  x:testschemaapi_shard1_replica2] o.a.s.c.SolrResourceLoader JNDI not configured for solr (NoInitialContextEx)
   [junit4]   2> 2940821 INFO  (qtp12079397-43213) [n:127.0.0.1:59361_solr c:testschemaapi s:shard1  x:testschemaapi_shard1_replica1] o.a.s.c.c.ZkStateReader path=[/collections/testschemaapi] [configName]=[conf1] specified config exists in ZooKeeper
   [junit4]   2> 2940821 INFO  (qtp4245224-43217) [n:127.0.0.1:59367_solr c:testschemaapi s:shard1  x:testschemaapi_shard1_replica2] o.a.s.c.SolrResourceLoader solr home defaulted to 'solr/' (could not find system property or JNDI)
   [junit4]   2> 2940821 INFO  (qtp12079397-43213) [n:127.0.0.1:59361_solr c:testschemaapi s:shard1  x:testschemaapi_shard1_replica1] o.a.s.c.SolrResourceLoader new SolrResourceLoader for directory: 'C:\Users\jenkins\workspace\Lucene-Solr-master-Windows\solr\build\solr-core\test\J0\temp\solr.schema.TestManagedSchemaAPI_85D8B94A0B941025-001\tempDir-001\node2\testschemaapi_shard1_replica1'
   [junit4]   2> 2940821 INFO  (qtp12079397-43213) [n:127.0.0.1:59361_solr c:testschemaapi s:shard1  x:testschemaapi_shard1_replica1] o.a.s.c.SolrResourceLoader JNDI not configured for solr (NoInitialContextEx)
   [junit4]   2> 2940821 INFO  (qtp12079397-43213) [n:127.0.0.1:59361_solr c:testschemaapi s:shard1  x:testschemaapi_shard1_replica1] o.a.s.c.SolrResourceLoader solr home defaulted to 'solr/' (could not find system property or JNDI)
   [junit4]   2> 2940824 INFO  (qtp12079397-43213) [n:127.0.0.1:59361_solr c:testschemaapi s:shard1  x:testschemaapi_shard1_replica1] o.a.s.c.Config loaded config solrconfig.xml with version 0 
   [junit4]   2> 2940824 INFO  (qtp4245224-43217) [n:127.0.0.1:59367_solr c:testschemaapi s:shard1  x:testschemaapi_shard1_replica2] o.a.s.c.Config loaded config solrconfig.xml with version 0 
   [junit4]   2> 2940831 INFO  (qtp12079397-43213) [n:127.0.0.1:59361_solr c:testschemaapi s:shard1  x:testschemaapi_shard1_replica1] o.a.s.c.SolrConfig current version of requestparams : -1
   [junit4]   2> 2940831 INFO  (qtp4245224-43217) [n:127.0.0.1:59367_solr c:testschemaapi s:shard1  x:testschemaapi_shard1_replica2] o.a.s.c.SolrConfig current version of requestparams : -1
   [junit4]   2> 2940835 INFO  (qtp12079397-43213) [n:127.0.0.1:59361_solr c:testschemaapi s:shard1  x:testschemaapi_shard1_replica1] o.a.s.c.SolrConfig Using Lucene MatchVersion: 7.0.0
   [junit4]   2> 2940835 INFO  (qtp4245224-43217) [n:127.0.0.1:59367_solr c:testschemaapi s:shard1  x:testschemaapi_shard1_replica2] o.a.s.c.SolrConfig Using Lucene MatchVersion: 7.0.0
   [junit4]   2> 2940842 INFO  (qtp4245224-43217) [n:127.0.0.1:59367_solr c:testschemaapi s:shard1  x:testschemaapi_shard1_replica2] o.a.s.c.SolrConfig Loaded SolrConfig: solrconfig.xml
   [junit4]   2> 2940842 INFO  (qtp12079397-43213) [n:127.0.0.1:59361_solr c:testschemaapi s:shard1  x:testschemaapi_shard1_replica1] o.a.s.c.SolrConfig Loaded SolrConfig: solrconfig.xml
   [junit4]   2> 2940849 INFO  (qtp4245224-43217) [n:127.0.0.1:59367_solr c:testschemaapi s:shard1  x:testschemaapi_shard1_replica2] o.a.s.s.IndexSchema [testschemaapi_shard1_replica2] Schema name=minimal
   [junit4]   2> 2940849 INFO  (qtp12079397-43213) [n:127.0.0.1:59361_solr c:testschemaapi s:shard1  x:testschemaapi_shard1_replica1] o.a.s.s.IndexSchema [testschemaapi_shard1_replica1] Schema name=minimal
   [junit4]   2> 2940853 INFO  (qtp4245224-43217) [n:127.0.0.1:59367_solr c:testschemaapi s:shard1  x:testschemaapi_shard1_replica2] o.a.s.s.IndexSchema unique key field: id
   [junit4]   2> 2940853 INFO  (qtp12079397-43213) [n:127.0.0.1:59361_solr c:testschemaapi s:shard1  x:testschemaapi_shard1_replica1] o.a.s.s.IndexSchema unique key field: id
   [junit4]   2> 2940855 INFO  (qtp4245224-43217) [n:127.0.0.1:59367_solr c:testschemaapi s:shard1  x:testschemaapi_shard1_replica2] o.a.s.c.ConfigSetProperties Did not find ConfigSet properties, assuming default properties: Can't find resource 'configsetprops.json' in classpath or '/configs/conf1', cwd=C:\Users\jenkins\workspace\Lucene-Solr-master-Windows\solr\build\solr-core\test\J0
   [junit4]   2> 2940855 INFO  (qtp4245224-43217) [n:127.0.0.1:59367_solr c:testschemaapi s:shard1  x:testschemaapi_shard1_replica2] o.a.s.c.CoreContainer Creating SolrCore 'testschemaapi_shard1_replica2' using configuration from collection testschemaapi
   [junit4]   2> 2940855 INFO  (qtp12079397-43213) [n:127.0.0.1:59361_solr c:testschemaapi s:shard1  x:testschemaapi_shard1_replica1] o.a.s.c.ConfigSetProperties Did not find ConfigSet properties, assuming default properties: Can't find resource 'configsetprops.json' in classpath or '/configs/conf1', cwd=C:\Users\jenkins\workspace\Lucene-Solr-master-Windows\solr\build\solr-core\test\J0
   [junit4]   2> 2940855 INFO  (qtp12079397-43213) [n:127.0.0.1:59361_solr c:testschemaapi s:shard1  x:testschemaapi_shard1_replica1] o.a.s.c.CoreContainer Creating SolrCore 'testschemaapi_shard1_replica1' using configuration from collection testschemaapi
   [junit4]   2> 2940856 INFO  (qtp4245224-43217) [n:127.0.0.1:59367_solr c:testschemaapi s:shard1 r:core_node1 x:testschemaapi_shard1_replica2] o.a.s.c.SolrCore org.apache.solr.core.MockDirectoryFactory
   [junit4]   2> 2940856 INFO  (qtp12079397-43213) [n:127.0.0.1:59361_solr c:testschemaapi s:shard1 r:core_node2 x:testschemaapi_shard1_replica1] o.a.s.c.SolrCore org.apache.solr.core.MockDirectoryFactory
   [junit4]   2> 2940856 INFO  (qtp4245224-43217) [n:127.0.0.1:59367_solr c:testschemaapi s:shard1 r:core_node1 x:testschemaapi_shard1_replica2] o.a.s.c.SolrCore [[testschemaapi_shard1_replica2] ] Opening new SolrCore at [C:\Users\jenkins\workspace\Lucene-Solr-master-Windows\solr\build\solr-core\test\J0\temp\solr.schema.TestManagedSchemaAPI_85D8B94A0B941025-001\tempDir-001\node1\testschemaapi_shard1_replica2], dataDir=[C:\Users\jenkins\workspace\Lucene-Solr-master-Windows\solr\build\solr-core\test\J0\temp\solr.schema.TestManagedSchemaAPI_85D8B94A0B941025-001\tempDir-001\node1\.\testschemaapi_shard1_replica2\data\]
   [junit4]   2> 2940856 INFO  (qtp4245224-43217) [n:127.0.0.1:59367_solr c:testschemaapi s:shard1 r:core_node1 x:testschemaapi_shard1_replica2] o.a.s.c.SolrCore JMX monitoring not detected for core: testschemaapi_shard1_replica2
   [junit4]   2> 2940856 INFO  (qtp12079397-43213) [n:127.0.0.1:59361_solr c:testschemaapi s:shard1 r:core_node2 x:testschemaapi_shard1_replica1] o.a.s.c.SolrCore [[testschemaapi_shard1_replica1] ] Opening new SolrCore at [C:\Users\jenkins\workspace\Lucene-Solr-master-Windows\solr\build\solr-core\test\J0\temp\solr.schema.TestManagedSchemaAPI_85D8B94A0B941025-001\tempDir-001\node2\testschemaapi_shard1_replica1], dataDir=[C:\Users\jenkins\workspace\Lucene-Solr-master-Windows\solr\build\solr-core\test\J0\temp\solr.schema.TestManagedSchemaAPI_85D8B94A0B941025-001\tempDir-001\node2\.\testschemaapi_shard1_replica1\data\]
   [junit4]   2> 2940856 INFO  (qtp12079397-43213) [n:127.0.0.1:59361_solr c:testschemaapi s:shard1 r:core_node2 x:testschemaapi_shard1_replica1] o.a.s.c.SolrCore JMX monitoring not detected for core: testschemaapi_shard1_replica1
   [junit4]   2> 2940857 INFO  (qtp4245224-43217) [n:127.0.0.1:59367_solr c:testschemaapi s:shard1 r:core_node1 x:testschemaapi_shard1_replica2] o.a.s.c.CachingDirectoryFactory return new directory for C:\Users\jenkins\workspace\Lucene-Solr-master-Windows\solr\build\solr-core\test\J0\temp\solr.schema.TestManagedSchemaAPI_85D8B94A0B941025-001\tempDir-001\node1\.\testschemaapi_shard1_replica2\data\snapshot_metadata
   [junit4]   2> 2940857 INFO  (qtp4245224-43217) [n:127.0.0.1:59367_solr c:testschemaapi s:shard1 r:core_node1 x:testschemaapi_shard1_replica2] o.a.s.c.s.SolrSnapshotMetaDataManager Loading from snapshot metadata file...
   [junit4]   2> 2940857 INFO  (qtp12079397-43213) [n:127.0.0.1:59361_solr c:testschemaapi s:shard1 r:core_node2 x:testschemaapi_shard1_replica1] o.a.s.c.CachingDirectoryFactory return new directory for C:\Users\jenkins\workspace\Lucene-Solr-master-Windows\solr\build\solr-core\test\J0\temp\solr.schema.TestManagedSchemaAPI_85D8B94A0B941025-001\tempDir-001\node2\.\testschemaapi_shard1_replica1\data\snapshot_metadata
   [junit4]   2> 2940857 INFO  (qtp12079397-43213) [n:127.0.0.1:59361_solr c:testschemaapi s:shard1 r:core_node2 x:testschemaapi_shard1_replica1] o.a.s.c.s.SolrSnapshotMetaDataManager Loading from snapshot metadata file...
   [junit4]   2> 2940858 INFO  (qtp4245224-43217) [n:127.0.0.1:59367_solr c:testschemaapi s:shard1 r:core_node1 x:testschemaapi_shard1_replica2] o.a.s.c.CachingDirectoryFactory return new directory for C:\Users\jenkins\workspace\Lucene-Solr-master-Windows\solr\build\solr-core\test\J0\temp\solr.schema.TestManagedSchemaAPI_85D8B94A0B941025-001\tempDir-001\node1\.\testschemaapi_shard1_replica2\data\
   [junit4]   2> 2940858 INFO  (qtp4245224-43217) [n:127.0.0.1:59367_solr c:testschemaapi s:shard1 r:core_node1 x:testschemaapi_shard1_replica2] o.a.s.c.SolrCore New index directory detected: old=null new=C:\Users\jenkins\workspace\Lucene-Solr-master-Windows\solr\build\solr-core\test\J0\temp\solr.schema.TestManagedSchemaAPI_85D8B94A0B941025-001\tempDir-001\node1\.\testschemaapi_shard1_replica2\data\index/
   [junit4]   2> 2940858 INFO  (qtp12079397-43213) [n:127.0.0.1:59361_solr c:testschemaapi s:shard1 r:core_node2 x:testschemaapi_shard1_replica1] o.a.s.c.CachingDirectoryFactory return new directory for C:\Users\jenkins\workspace\Lucene-Solr-master-Windows\solr\build\solr-core\test\J0\temp\solr.schema.TestManagedSchemaAPI_85D8B94A0B941025-001\tempDir-001\node2\.\testschemaapi_shard1_replica1\data\
   [junit4]   2> 2940858 WARN  (qtp4245224-43217) [n:127.0.0.1:59367_solr c:testschemaapi s:shard1 r:core_node1 x:testschemaapi_shard1_replica2] o.a.s.c.SolrCore [testschemaapi_shard1_replica2] Solr index directory 'C:\Users\jenkins\workspace\Lucene-Solr-master-Windows\solr\build\solr-core\test\J0\temp\solr.schema.TestManagedSchemaAPI_85D8B94A0B941025-001\tempDir-001\node1\.\testschemaapi_shard1_replica2\data\index' doesn't exist. Creating new index...
   [junit4]   2> 2940858 INFO  (qtp12079397-43213) [n:127.0.0.1:59361_solr c:testschemaapi s:shard1 r:core_node2 x:testschemaapi_shard1_replica1] o.a.s.c.SolrCore New index directory detected: old=null new=C:\Users\jenkins\workspace\Lucene-Solr-master-Windows\solr\build\solr-core\test\J0\temp\solr.schema.TestManagedSchemaAPI_85D8B94A0B941025-001\tempDir-001\node2\.\testschemaapi_shard1_replica1\data\index/
   [junit4]   2> 2940858 WARN  (qtp12079397-43213) [n:127.0.0.1:59361_solr c:testschemaapi s:shard1 r:core_node2 x:testschemaapi_shard1_replica1] o.a.s.c.SolrCore [testschemaapi_shard1_replica1] Solr index directory 'C:\Users\jenkins\workspace\Lucene-Solr-master-Windows\solr\build\solr-core\test\J0\temp\solr.schema.TestManagedSchemaAPI_85D8B94A0B941025-001\tempDir-001\node2\.\testschemaapi_shard1_replica1\data\index' doesn't exist. Creating new index...
   [junit4]   2> 2940859 INFO  (qtp4245224-43217) [n:127.0.0.1:59367_solr c:testschemaapi s:shard1 r:core_node1 x:testschemaapi_shard1_replica2] o.a.s.c.CachingDirectoryFactory return new directory for C:\Users\jenkins\workspace\Lucene-Solr-master-Windows\solr\build\solr-core\test\J0\temp\solr.schema.TestManagedSchemaAPI_85D8B94A0B941025-001\tempDir-001\node1\.\testschemaapi_shard1_replica2\data\index
   [junit4]   2> 2940859 INFO  (qtp12079397-43213) [n:127.0.0.1:59361_solr c:testschemaapi s:shard1 r:core_node2 x:testschemaapi_shard1_replica1] o.a.s.c.CachingDirectoryFactory return new directory for C:\Users\jenkins\workspace\Lucene-Solr-master-Windows\solr\build\solr-core\test\J0\temp\solr.schema.TestManagedSchemaAPI_85D8B94A0B941025-001\tempDir-001\node2\.\testschemaapi_shard1_replica1\data\index
   [junit4]   2> 2940859 INFO  (qtp4245224-43217) [n:127.0.0.1:59367_solr c:testschemaapi s:shard1 r:core_node1 x:testschemaapi_shard1_replica2] o.a.s.c.SolrDeletionPolicy SolrDeletionPolicy.onCommit: commits: num=1
   [junit4]   2> 	commit{dir=MockDirectoryWrapper(RAMDirectory@406fd4 lockFactory=org.apache.lucene.store.SingleInstanceLockFactory@159d3d7),segFN=segments_1,generation=1}
   [junit4]   2> 2940859 INFO  (qtp12079397-43213) [n:127.0.0.1:59361_solr c:testschemaapi s:shard1 r:core_node2 x:testschemaapi_shard1_replica1] o.a.s.c.SolrDeletionPolicy SolrDeletionPolicy.onCommit: commits: num=1
   [junit4]   2> 	commit{dir=MockDirectoryWrapper(RAMDirectory@134aa20 lockFactory=org.apache.lucene.store.SingleInstanceLockFactory@1b369d3),segFN=segments_1,generation=1}
   [junit4]   2> 2940859 INFO  (qtp4245224-43217) [n:127.0.0.1:59367_solr c:testschemaapi s:shard1 r:core_node1 x:testschemaapi_shard1_replica2] o.a.s.c.SolrDeletionPolicy newest commit generation = 1
   [junit4]   2> 2940859 INFO  (qtp12079397-43213) [n:127.0.0.1:59361_solr c:testschemaapi s:shard1 r:core_node2 x:testschemaapi_shard1_replica1] o.a.s.c.SolrDeletionPolicy newest commit generation = 1
   [junit4]   2> 2940861 INFO  (OldIndexDirectoryCleanupThreadForCore-testschemaapi_shard1_replica2) [n:127.0.0.1:59367_solr c:testschemaapi s:shard1 r:core_node1 x:testschemaapi_shard1_replica2] o.a.s.c.SolrCore Looking for old index directories to cleanup for core testschemaapi_shard1_replica2 in C:\Users\jenkins\workspace\Lucene-Solr-master-Windows\solr\build\solr-core\test\J0\temp\solr.schema.TestManagedSchemaAPI_85D8B94A0B941025-001\tempDir-001\node1\.\testschemaapi_shard1_replica2\data\
   [junit4]   2> 2940861 INFO  (OldIndexDirectoryCleanupThreadForCore-testschemaapi_shard1_replica1) [n:127.0.0.1:59361_solr c:testschemaapi s:shard1 r:core_node2 x:testschemaapi_shard1_replica1] o.a.s.c.SolrCore Looking for old index directories to cleanup for core testschemaapi_shard1_replica1 in C:\Users\jenkins\workspace\Lucene-Solr-master-Windows\solr\build\solr-core\test\J0\temp\solr.schema.TestManagedSchemaAPI_85D8B94A0B941025-001\tempDir-001\node2\.\testschemaapi_shard1_replica1\data\
   [junit4]   2> 2940862 INFO  (qtp4245224-43217) [n:127.0.0.1:59367_solr c:testschemaapi s:shard1 r:core_node1 x:testschemaapi_shard1_replica2] o.a.s.c.SolrCore no updateRequestProcessorChain defined as default, creating implicit default
   [junit4]   2> 2940862 INFO  (qtp12079397-43213) [n:127.0.0.1:59361_solr c:testschemaapi s:shard1 r:core_node2 x:testschemaapi_shard1_replica1] o.a.s.c.SolrCore no updateRequestProcessorChain defined as default, creating implicit default
   [junit4]   2> 2940862 WARN  (OldIndexDirectoryCleanupThreadForCore-testschemaapi_shard1_replica1) [n:127.0.0.1:59361_solr c:testschemaapi s:shard1 r:core_node2 x:testschemaapi_shard1_replica1] o.a.s.c.DirectoryFactory C:\Users\jenkins\workspace\Lucene-Solr-master-Windows\solr\build\solr-core\test\J0\temp\solr.schema.TestManagedSchemaAPI_85D8B94A0B941025-001\tempDir-001\node2\.\testschemaapi_shard1_replica1\data\ does not point to a valid data directory; skipping clean-up of old index directories.
   [junit4]   2> 2940864 INFO  (qtp4245224-43217) [n:127.0.0.1:59367_solr c:testschemaapi s:shard1 r:core_node1 x:testschemaapi_shard1_replica2] o.a.s.h.l.XMLLoader xsltCacheLifetimeSeconds=60
   [junit4]   2> 2940864 INFO  (qtp12079397-43213) [n:127.0.0.1:59361_solr c:testschemaapi s:shard1 r:core_node2 x:testschemaapi_shard1_replica1] o.a.s.h.l.XMLLoader xsltCacheLifetimeSeconds=60
   [junit4]   2> 2940865 WARN  (OldIndexDirectoryCleanupThreadForCore-testschemaapi_shard1_replica2) [n:127.0.0.1:59367_solr c:testschemaapi s:shard1 r:core_node1 x:testschemaapi_shard1_replica2] o.a.s.c.DirectoryFactory C:\Users\jenkins\workspace\Lucene-Solr-master-Windows\solr\build\solr-core\test\J0\temp\solr.schema.TestManagedSchemaAPI_85D8B94A0B941025-001\tempDir-001\node1\.\testschemaapi_shard1_replica2\data\ does not point to a valid data directory; skipping clean-up of old index directories.
   [junit4]   2> 2940866 INFO  (qtp4245224-43217) [n:127.0.0.1:59367_solr c:testschemaapi s:shard1 r:core_node1 x:testschemaapi_shard1_replica2] o.a.s.h.l.XMLLoader xsltCacheLifetimeSeconds=60
   [junit4]   2> 2940866 INFO  (qtp12079397-43213) [n:127.0.0.1:59361_solr c:testschemaapi s:shard1 r:core_node2 x:testschemaapi_shard1_replica1] o.a.s.h.l.XMLLoader xsltCacheLifetimeSeconds=60
   [junit4]   2> 2940868 INFO  (qtp4245224-43217) [n:127.0.0.1:59367_solr c:testschemaapi s:shard1 r:core_node1 x:testschemaapi_shard1_replica2] o.a.s.h.l.XMLLoader xsltCacheLifetimeSeconds=60
   [junit4]   2> 2940868 INFO  (qtp12079397-43213) [n:127.0.0.1:59361_solr c:testschemaapi s:shard1 r:core_node2 x:testschemaapi_shard1_replica1] o.a.s.h.l.XMLLoader xsltCacheLifetimeSeconds=60
   [junit4]   2> 2940869 INFO  (qtp4245224-43217) [n:127.0.0.1:59367_solr c:testschemaapi s:shard1 r:core_node1 x:testschemaapi_shard1_replica2] o.a.s.h.l.XMLLoader xsltCacheLifetimeSeconds=60
   [junit4]   2> 2940869 INFO  (qtp12079397-43213) [n:127.0.0.1:59361_solr c:testschemaapi s:shard1 r:core_node2 x:testschemaapi_shard1_replica1] o.a.s.h.l.XMLLoader xsltCacheLifetimeSeconds=60
   [junit4]   2> 2940871 INFO  (qtp4245224-43217) [n:127.0.0.1:59367_solr c:testschemaapi s:shard1 r:core_node1 x:testschemaapi_shard1_replica2] o.a.s.c.RequestHandlers Registered paths: /admin/mbeans,/update/json/docs,/admin/luke,/export,/get,/admin/properties,/update/json,/admin/threads,/update/csv,/sql,/graph,/select,/admin/segments,/admin/system,/replication,/config,/stream,/schema,/admin/plugins,/admin/logging,/admin/ping,/update,/admin/file,/terms
   [junit4]   2> 2940871 INFO  (qtp4245224-43217) [n:127.0.0.1:59367_solr c:testschemaapi s:shard1 r:core_node1 x:testschemaapi_shard1_replica2] o.a.s.c.SolrCore Using default statsCache cache: org.apache.solr.search.stats.LocalStatsCache
   [junit4]   2> 2940871 INFO  (qtp12079397-43213) [n:127.0.0.1:59361_solr c:testschemaapi s:shard1 r:core_node2 x:testschemaapi_shard1_replica1] o.a.s.c.RequestHandlers Registered paths: /admin/mbeans,/update/json/docs,/admin/luke,/export,/get,/admin/properties,/update/json,/admin/threads,/update/csv,/sql,/graph,/select,/admin/segments,/admin/system,/replication,/config,/stream,/schema,/admin/plugins,/admin/logging,/admin/ping,/update,/admin/file,/terms
   [junit4]   2> 2940871 INFO  (qtp12079397-43213) [n:127.0.0.1:59361_solr c:testschemaapi s:shard1 r:core_node2 x:testschemaapi_shard1_replica1] o.a.s.c.SolrCore Using default statsCache cache: org.apache.solr.search.stats.LocalStatsCache
   [junit4]   2> 2940873 INFO  (qtp4245224-43217) [n:127.0.0.1:59367_solr c:testschemaapi s:shard1 r:core_node1 x:testschemaapi_shard1_replica2] o.a.s.u.UpdateHandler Using UpdateLog implementation: org.apache.solr.update.UpdateLog
   [junit4]   2> 2940873 INFO  (qtp4245224-43217) [n:127.0.0.1:59367_solr c:testschemaapi s:shard1 r:core_node1 x:testschemaapi_shard1_replica2] o.a.s.u.UpdateLog Initializing UpdateLog: dataDir=null defaultSyncLevel=FLUSH numRecordsToKeep=100 maxNumLogsToKeep=10 numVersionBuckets=65536
   [junit4]   2> 2940873 INFO  (qtp12079397-43213) [n:127.0.0.1:59361_solr c:testschemaapi s:shard1 r:core_node2 x:testschemaapi_shard1_replica1] o.a.s.u.UpdateHandler Using UpdateLog implementation: org.apache.solr.update.UpdateLog
   [junit4]   2> 2940873 INFO  (qtp12079397-43213) [n:127.0.0.1:59361_solr c:testschemaapi s:shard1 r:core_node2 x:testschemaapi_shard1_replica1] o.a.s.u.UpdateLog Initializing UpdateLog: dataDir=null defaultSyncLevel=FLUSH numRecordsToKeep=100 maxNumLogsToKeep=10 numVersionBuckets=65536
   [junit4]   2> 2940875 INFO  (qtp4245224-43217) [n:127.0.0.1:59367_solr c:testschemaapi s:shard1 r:core_node1 x:testschemaapi_shard1_replica2] o.a.s.u.CommitTracker Hard AutoCommit: disabled
   [junit4]   2> 2940875 INFO  (qtp4245224-43217) [n:127.0.0.1:59367_solr c:testschemaapi s:shard1 r:core_node1 x:testschemaapi_shard1_replica2] o.a.s.u.CommitTracker Soft AutoCommit: disabled
   [junit4]   2> 2940875 INFO  (qtp12079397-43213) [n:127.0.0.1:59361_solr c:testschemaapi s:shard1 r:core_node2 x:testschemaapi_shard1_replica1] o.a.s.u.CommitTracker Hard AutoCommit: disabled
   [junit4]   2> 2940875 INFO  (qtp12079397-43213) [n:127.0.0.1:59361_solr c:testschemaapi s:shard1 r:core_node2 x:testschemaapi_shard1_replica1] o.a.s.u.CommitTracker Soft AutoCommit: disabled
   [junit4]   2> 2940875 INFO  (qtp4245224-43217) [n:127.0.0.1:59367_solr c:testschemaapi s:shard1 r:core_node1 x:testschemaapi_shard1_replica2] o.a.s.c.SolrDeletionPolicy SolrDeletionPolicy.onInit: commits: num=1
   [junit4]   2> 	commit{dir=MockDirectoryWrapper(RAMDirectory@406fd4 lockFactory=org.apache.lucene.store.SingleInstanceLockFactory@159d3d7),segFN=segments_1,generation=1}
   [junit4]   2> 2940875 INFO  (qtp4245224-43217) [n:127.0.0.1:59367_solr c:testschemaapi s:shard1 r:core_node1 x:testschemaapi_shard1_replica2] o.a.s.c.SolrDeletionPolicy newest commit generation = 1
   [junit4]   2> 2940875 INFO  (qtp12079397-43213) [n:127.0.0.1:59361_solr c:testschemaapi s:shard1 r:core_node2 x:testschemaapi_shard1_replica1] o.a.s.c.SolrDeletionPolicy SolrDeletionPolicy.onInit: commits: num=1
   [junit4]   2> 	commit{dir=MockDirectoryWrapper(RAMDirectory@134aa20 lockFactory=org.apache.lucene.store.SingleInstanceLockFactory@1b369d3),segFN=segments_1,generation=1}
   [junit4]   2> 2940875 INFO  (qtp12079397-43213) [n:127.0.0.1:59361_solr c:testschemaapi s:shard1 r:core_node2 x:testschemaapi_shard1_replica1] o.a.s.c.SolrDeletionPolicy newest commit generation = 1
   [junit4]   2> 2940875 INFO  (qtp4245224-43217) [n:127.0.0.1:59367_solr c:testschemaapi s:shard1 r:core_node1 x:testschemaapi_shard1_replica2] o.a.s.s.SolrIndexSearcher Opening [Searcher@11df5fa[testschemaapi_shard1_replica2] main]
   [junit4]   2> 2940876 INFO  (qtp12079397-43213) [n:127.0.0.1:59361_solr c:testschemaapi s:shard1 r:core_node2 x:testschemaapi_shard1_replica1] o.a.s.s.SolrIndexSearcher Opening [Searcher@11868ba[testschemaapi_shard1_replica1] main]
   [junit4]   2> 2940876 INFO  (qtp4245224-43217) [n:127.0.0.1:59367_solr c:testschemaapi s:shard1 r:core_node1 x:testschemaapi_shard1_replica2] o.a.s.c.c.ZkStateReader Load collection config from: [/collections/testschemaapi]
   [junit4]   2> 2940876 INFO  (qtp12079397-43213) [n:127.0.0.1:59361_solr c:testschemaapi s:shard1 r:core_node2 x:testschemaapi_shard1_replica1] o.a.s.c.c.ZkStateReader Load collection config from: [/collections/testschemaapi]
   [junit4]   2> 2940877 INFO  (qtp4245224-43217) [n:127.0.0.1:59367_solr c:testschemaapi s:shard1 r:core_node1 x:testschemaapi_shard1_replica2] o.a.s.c.c.ZkStateReader path=[/collections/testschemaapi] [configName]=[conf1] specified config exists in ZooKeeper
   [junit4]   2> 2940877 INFO  (qtp4245224-43217) [n:127.0.0.1:59367_solr c:testschemaapi s:shard1 r:core_node1 x:testschemaapi_shard1_replica2] o.a.s.r.ManagedResourceStorage Setting up ZooKeeper-based storage for the RestManager with znodeBase: /configs/conf1
   [junit4]   2> 2940877 INFO  (qtp12079397-43213) [n:127.0.0.1:59361_solr c:testschemaapi s:shard1 r:core_node2 x:testschemaapi_shard1_replica1] o.a.s.c.c.ZkStateReader path=[/collections/testschemaapi] [configName]=[conf1] specified config exists in ZooKeeper
   [junit4]   2> 2940877 INFO  (qtp12079397-43213) [n:127.0.0.1:59361_solr c:testschemaapi s:shard1 r:core_node2 x:testschemaapi_shard1_replica1] o.a.s.r.ManagedResourceStorage Setting up ZooKeeper-based storage for the RestManager with znodeBase: /configs/conf1
   [junit4]   2> 2940878 INFO  (qtp4245224-43217) [n:127.0.0.1:59367_solr c:testschemaapi s:shard1 r:core_node1 x:testschemaapi_shard1_replica2] o.a.s.r.ManagedResourceStorage Configured ZooKeeperStorageIO with znodeBase: /configs/conf1
   [junit4]   2> 2940878 INFO  (qtp4245224-43217) [n:127.0.0.1:59367_solr c:testschemaapi s:shard1 r:core_node1 x:testschemaapi_shard1_replica2] o.a.s.r.RestManager Initializing RestManager with initArgs: {}
   [junit4]   2> 2940878 INFO  (qtp12079397-43213) [n:127.0.0.1:59361_solr c:testschemaapi s:shard1 r:core_node2 x:testschemaapi_shard1_replica1] o.a.s.r.ManagedResourceStorage Configured ZooKeeperStorageIO with znodeBase: /configs/conf1
   [junit4]   2> 2940878 INFO  (qtp12079397-43213) [n:127.0.0.1:59361_solr c:testschemaapi s:shard1 r:core_node2 x:testschemaapi_shard1_replica1] o.a.s.r.RestManager Initializing RestManager with initArgs: {}
   [junit4]   2> 2940878 INFO  (qtp4245224-43217) [n:127.0.0.1:59367_solr c:testschemaapi s:shard1 r:core_node1 x:testschemaapi_shard1_replica2] o.a.s.r.ManagedResourceStorage Reading _rest_managed.json using ZooKeeperStorageIO:path=/configs/conf1
   [junit4]   2> 2940878 INFO  (qtp12079397-43213) [n:127.0.0.1:59361_solr c:testschemaapi s:shard1 r:core_node2 x:testschemaapi_shard1_replica1] o.a.s.r.ManagedResourceStorage Reading _rest_managed.json using ZooKeeperStorageIO:path=/configs/conf1
   [junit4]   2> 2940879 INFO  (qtp4245224-43217) [n:127.0.0.1:59367_solr c:testschemaapi s:shard1 r:core_node1 x:testschemaapi_shard1_replica2] o.a.s.r.ManagedResourceStorage No data found for znode /configs/conf1/_rest_managed.json
   [junit4]   2> 2940879 INFO  (qtp12079397-43213) [n:127.0.0.1:59361_solr c:testschemaapi s:shard1 r:core_node2 x:testschemaapi_shard1_replica1] o.a.s.r.ManagedResourceStorage No data found for znode /configs/conf1/_rest_managed.json
   [junit4]   2> 2940879 INFO  (qtp4245224-43217) [n:127.0.0.1:59367_solr c:testschemaapi s:shard1 r:core_node1 x:testschemaapi_shard1_replica2] o.a.s.r.ManagedResourceStorage Loaded null at path _rest_managed.json using ZooKeeperStorageIO:path=/configs/conf1
   [junit4]   2> 2940879 INFO  (qtp12079397-43213) [n:127.0.0.1:59361_solr c:testschemaapi s:shard1 r:core_node2 x:testschemaapi_shard1_replica1] o.a.s.r.ManagedResourceStorage Loaded null at path _rest_managed.json using ZooKeeperStorageIO:path=/configs/conf1
   [junit4]   2> 2940879 INFO  (qtp12079397-43213) [n:127.0.0.1:59361_solr c:testschemaapi s:shard1 r:core_node2 x:testschemaapi_shard1_replica1] o.a.s.r.RestManager Initializing 0 registered ManagedResources
   [junit4]   2> 2940879 INFO  (qtp4245224-43217) [n:127.0.0.1:59367_solr c:testschemaapi s:shard1 r:core_node1 x:testschemaapi_shard1_replica2] o.a.s.r.RestManager Initializing 0 registered ManagedResources
   [junit4]   2> 2940879 INFO  (qtp12079397-43213) [n:127.0.0.1:59361_solr c:testschemaapi s:shard1 r:core_node2 x:testschemaapi_shard1_replica1] o.a.s.s.ZkIndexSchemaReader Creating ZooKeeper watch for the managed schema at /configs/conf1/managed-schema
   [junit4]   2> 2940879 INFO  (qtp4245224-43217) [n:127.0.0.1:59367_solr c:testschemaapi s:shard1 r:core_node1 x:testschemaapi_shard1_replica2] o.a.s.s.ZkIndexSchemaReader Creating ZooKeeper watch for the managed schema at /configs/conf1/managed-schema
   [junit4]   2> 2940880 INFO  (qtp12079397-43213) [n:127.0.0.1:59361_solr c:testschemaapi s:shard1 r:core_node2 x:testschemaapi_shard1_replica1] o.a.s.c.ZkController Added new OnReconnect listener ZkIndexSchemaReader: /configs/conf1/managed-schema, uniqueCoreId: testschemaapi_shard1_replica1:645846588056716
   [junit4]   2> 2940880 INFO  (qtp4245224-43217) [n:127.0.0.1:59367_solr c:testschemaapi s:shard1 r:core_node1 x:testschemaapi_shard1_replica2] o.a.s.c.ZkController Added new OnReconnect listener ZkIndexSchemaReader: /configs/conf1/managed-schema, uniqueCoreId: testschemaapi_shard1_replica2:645846587884998
   [junit4]   2> 2940880 INFO  (qtp12079397-43213) [n:127.0.0.1:59361_solr c:testschemaapi s:shard1 r:core_node2 x:testschemaapi_shard1_replica1] o.a.s.h.ReplicationHandler Commits will be reserved for  10000
   [junit4]   2> 2940880 INFO  (qtp4245224-43217) [n:127.0.0.1:59367_solr c:testschemaapi s:shard1 r:core_node1 x:testschemaapi_shard1_replica2] o.a.s.h.ReplicationHandler Commits will be reserved for  10000
   [junit4]   2> 2940881 INFO  (searcherExecutor-11009-thread-1-processing-n:127.0.0.1:59361_solr x:testschemaapi_shard1_replica1 s:shard1 c:testschemaapi r:core_node2) [n:127.0.0.1:59361_solr c:testschemaapi s:shard1 r:core_node2 x:testschemaapi_shard1_replica1] o.a.s.c.SolrCore [testschemaapi_shard1_replica1] Registered new searcher Searcher@11868ba[testschemaapi_shard1_replica1] main{ExitableDirectoryReader(UninvertingDirectoryReader())}
   [junit4]   2> 2940881 INFO  (qtp4245224-43217) [n:127.0.0.1:59367_solr c:testschemaapi s:shard1 r:core_node1 x:testschemaapi_shard1_replica2] o.a.s.u.UpdateLog Looking up max value of version field to seed version buckets
   [junit4]   2> 2940881 INFO  (searcherExecutor-11008-thread-1-processing-n:127.0.0.1:59367_solr x:testschemaapi_shard1_replica2 s:shard1 c:testschemaapi r:core_node1) [n:127.0.0.1:59367_solr c:testschemaapi s:shard1 r:core_node1 x:testschemaapi_shard1_replica2] o.a.s.c.SolrCore [testschemaapi_shard1_replica2] Registered new searcher Searcher@11df5fa[testschemaapi_shard1_replica2] main{ExitableDirectoryReader(UninvertingDirectoryReader())}
   [junit4]   2> 2940881 INFO  (qtp12079397-43213) [n:127.0.0.1:59361_solr c:testschemaapi s:shard1 r:core_node2 x:testschemaapi_shard1_replica1] o.a.s.u.UpdateLog Looking up max value of version field to seed version buckets
   [junit4]   2> 2940881 INFO  (qtp4245224-43217) [n:127.0.0.1:59367_solr c:testschemaapi s:shard1 r:core_node1 x:testschemaapi_shard1_replica2] o.a.s.u.VersionInfo Refreshing highest value of _version_ for 65536 version buckets from index
   [junit4]   2> 2940881 INFO  (qtp12079397-43213) [n:127.0.0.1:59361_solr c:testschemaapi s:shard1 r:core_node2 x:testschemaapi_shard1_replica1] o.a.s.u.VersionInfo Refreshing highest value of _version_ for 65536 version buckets from index
   [junit4]   2> 2940881 INFO  (qtp4245224-43217) [n:127.0.0.1:59367_solr c:testschemaapi s:shard1 r:core_node1 x:testschemaapi_shard1_replica2] o.a.s.u.VersionInfo No terms found for _version_, cannot seed version bucket highest value from index
   [junit4]   2> 2940881 INFO  (qtp12079397-43213) [n:127.0.0.1:59361_solr c:testschemaapi s:shard1 r:core_node2 x:testschemaapi_shard1_replica1] o.a.s.u.VersionInfo No terms found for _version_, cannot seed version bucket highest value from index
   [junit4]   2> 2940881 INFO  (qtp4245224-43217) [n:127.0.0.1:59367_solr c:testschemaapi s:shard1 r:core_node1 x:testschemaapi_shard1_replica2] o.a.s.u.UpdateLog Could not find max version in index or recent updates, using new clock 1545084308613496832
   [junit4]   2> 2940882 INFO  (qtp12079397-43213) [n:127.0.0.1:59361_solr c:testschemaapi s:shard1 r:core_node2 x:testschemaapi_shard1_replica1] o.a.s.u.UpdateLog Could not find max version in index or recent updates, using new clock 1545084308614545408
   [junit4]   2> 2940883 INFO  (qtp4245224-43217) [n:127.0.0.1:59367_solr c:testschemaapi s:shard1 r:core_node1 x:testschemaapi_shard1_replica2] o.a.s.u.UpdateLog Took 2.0ms to seed version buckets with highest version 1545084308613496832
   [junit4]   2> 2940883 INFO  (qtp12079397-43213) [n:127.0.0.1:59361_solr c:testschemaapi s:shard1 r:core_node2 x:testschemaapi_shard1_replica1] o.a.s.u.UpdateLog Took 2.0ms to seed version buckets with highest version 1545084308614545408
   [junit4]   2> 2940883 INFO  (qtp4245224-43217) [n:127.0.0.1:59367_solr c:testschemaapi s:shard1 r:core_node1 x:testschemaapi_shard1_replica2] o.a.s.c.ZkController watch zkdir /configs/conf1
   [junit4]   2> 2940883 INFO  (qtp12079397-43213) [n:127.0.0.1:59361_solr c:testschemaapi s:shard1 r:core_node2 x:testschemaapi_shard1_replica1] o.a.s.c.ZkController watch zkdir /configs/conf1
   [junit4]   2> 2940884 INFO  (qtp12079397-43213) [n:127.0.0.1:59361_solr c:testschemaapi s:shard1 r:core_node2 x:testschemaapi_shard1_replica1] o.a.s.c.CoreContainer registering core: testschemaapi_shard1_replica1
   [junit4]   2> 2940885 INFO  (qtp4245224-43217) [n:127.0.0.1:59367_solr c:testschemaapi s:shard1 r:core_node1 x:testschemaapi_shard1_replica2] o.a.s.c.CoreContainer registering core: testschemaapi_shard1_replica2
   [junit4]   2> 2940885 INFO  (qtp12079397-43213) [n:127.0.0.1:59361_solr c:testschemaapi s:shard1 r:core_node2 x:testschemaapi_shard1_replica1] o.a.s.c.ZkController Register replica - core:testschemaapi_shard1_replica1 address:http://127.0.0.1:59361/solr collection:testschemaapi shard:shard1
   [junit4]   2> 2940885 INFO  (qtp4245224-43217) [n:127.0.0.1:59367_solr c:testschemaapi s:shard1 r:core_node1 x:testschemaapi_shard1_replica2] o.a.s.c.ZkController Register replica - core:testschemaapi_shard1_replica2 address:http://127.0.0.1:59367/solr collection:testschemaapi shard:shard1
   [junit4]   2> 2940886 INFO  (qtp12079397-43213) [n:127.0.0.1:59361_solr c:testschemaapi s:shard1 r:core_node2 x:testschemaapi_shard1_replica1] o.a.s.c.c.SolrZkClient makePath: /collections/testschemaapi/leader_elect/shard1/election
   [junit4]   2> 2940886 INFO  (qtp4245224-43217) [n:127.0.0.1:59367_solr c:testschemaapi s:shard1 r:core_node1 x:testschemaapi_shard1_replica2] o.a.s.c.c.SolrZkClient makePath: /collections/testschemaapi/leader_elect/shard1/election
   [junit4]   2> 2940890 INFO  (qtp4245224-43217) [n:127.0.0.1:59367_solr c:testschemaapi s:shard1 r:core_node1 x:testschemaapi_shard1_replica2] o.a.s.c.LeaderElector Joined leadership election with path: /collections/testschemaapi/leader_elect/shard1/election/96567769189646341-core_node1-n_0000000000
   [junit4]   2> 2940890 INFO  (qtp12079397-43213) [n:127.0.0.1:59361_solr c:testschemaapi s:shard1 r:core_node2 x:testschemaapi_shard1_replica1] o.a.s.c.LeaderElector Joined leadership election with path: /collections/testschemaapi/leader_elect/shard1/election/96567769189646342-core_node2-n_0000000001
   [junit4]   2> 2940891 INFO  (qtp4245224-43217) [n:127.0.0.1:59367_solr c:testschemaapi s:shard1 r:core_node1 x:testschemaapi_shard1_replica2] o.a.s.c.ShardLeaderElectionContext Running the leader process for shard=shard1 and weAreReplacement=false and leaderVoteWait=10000
   [junit4]   2> 2940891 INFO  (qtp12079397-43213) [n:127.0.0.1:59361_solr c:testschemaapi s:shard1 r:core_node2 x:testschemaapi_shard1_replica1] o.a.s.c.LeaderElector Watching path /collections/testschemaapi/leader_elect/shard1/election/96567769189646341-core_node1-n_0000000000 to know if I could be the leader
   [junit4]   2> 2940893 INFO  (qtp4245224-43217) [n:127.0.0.1:59367_solr c:testschemaapi s:shard1 r:core_node1 x:testschemaapi_shard1_replica2] o.a.s.c.ShardLeaderElectionContext Enough replicas found to continue.
   [junit4]   2> 2940893 INFO  (qtp4245224-43217) [n:127.0.0.1:59367_solr c:testschemaapi s:shard1 r:core_node1 x:testschemaapi_shard1_replica2] o.a.s.c.ShardLeaderElectionContext I may be the new leader - try and sync
   [junit4]   2> 2940893 INFO  (qtp4245224-43217) [n:127.0.0.1:59367_solr c:testschemaapi s:shard1 r:core_node1 x:testschemaapi_shard1_replica2] o.a.s.c.SyncStrategy Sync replicas to http://127.0.0.1:59367/solr/testschemaapi_shard1_replica2/
   [junit4]   2> 2940893 INFO  (qtp4245224-43217) [n:127.0.0.1:59367_solr c:testschemaapi s:shard1 r:core_node1 x:testschemaapi_shard1_replica2] o.a.s.u.PeerSync PeerSync: core=testschemaapi_shard1_replica2 url=http://127.0.0.1:59367/solr START replicas=[http://127.0.0.1:59361/solr/testschemaapi_shard1_replica1/] nUpdates=100
   [junit4]   2> 2940894 INFO  (qtp4245224-43217) [n:127.0.0.1:59367_solr c:testschemaapi s:shard1 r:core_node1 x:testschemaapi_shard1_replica2] o.a.s.u.PeerSync PeerSync: core=testschemaapi_shard1_replica2 url=http://127.0.0.1:59367/solr DONE.  We have no versions.  sync failed.
   [junit4]   2> 2940894 INFO  (qtp4245224-43217) [n:127.0.0.1:59367_solr c:testschemaapi s:shard1 r:core_node1 x:testschemaapi_shard1_replica2] o.a.s.c.SyncStrategy Leader's attempt to sync with shard failed, moving to the next candidate
   [junit4]   2> 2940894 INFO  (Oversee

[...truncated too long message...]

 CollectionReloadTest, ZkControllerTest, TestTolerantUpdateProcessorRandomCloud, DocValuesTest, TestSolrJ, TestHighlightDedupGrouping, TestXIncludeConfig, ClusterStateUpdateTest, TestStressLucene, JavabinLoaderTest, DistributedQueryComponentOptimizationTest, SchemaVersionSpecificBehaviorTest, CollectionsAPISolrJTest, SystemInfoHandlerTest, SuggesterFSTTest, XsltUpdateRequestHandlerTest, StandardRequestHandlerTest, TestSolrDynamicMBean, EnumFieldTest, SampleTest, DistribCursorPagingTest, DistributedQueryElevationComponentTest, HdfsThreadLeakTest, CollectionTooManyReplicasTest, HighlighterTest, TestBlendedInfixSuggestions, TestDownShardTolerantSearch, IndexSchemaRuntimeFieldTest, MultiTermTest, TestSolrCloudWithDelegationTokens, TestExtendedDismaxParser, TestDFISimilarityFactory, LeaderInitiatedRecoveryOnCommitTest, ResponseLogComponentTest, HLLSerializationTest, TestManagedSynonymFilterFactory, TestRandomDVFaceting, TestAnalyzedSuggestions, SimpleFacetsTest, TestFunctionQuery, DeleteNodeTest, TestCSVResponseWriter, TestLeaderInitiatedRecoveryThread, TestStressReorder, TestJsonRequest, RulesTest, MoreLikeThisHandlerTest, TestDynamicFieldResource, TestReloadDeadlock, SimplePostToolTest, DistributedFacetPivotSmallAdvancedTest, RecoveryAfterSoftCommitTest, BlockCacheTest, TestStressRecovery, TestAddFieldRealTimeGet, TestOverriddenPrefixQueryForCustomFieldType, DataDrivenBlockJoinTest, SoftAutoCommitTest, DeleteShardTest, SSLMigrationTest, CdcrReplicationHandlerTest, TriLevelCompositeIdRoutingTest, DateRangeFieldTest, TestIBSimilarityFactory, TestLRUStatsCache, TestCollectionAPI, TestSchemaVersionResource, MigrateRouteKeyTest, DistributedVersionInfoTest, TestUseDocValuesAsStored, TestCharFilters, JSONWriterTest, TestSolrConfigHandlerConcurrent, ShardSplitTest, CloneFieldUpdateProcessorFactoryTest, InfoHandlerTest, TermsComponentTest, TestDistributedSearch, IgnoreCommitOptimizeUpdateProcessorFactoryTest, TestFreeTextSuggestions, TestEmbeddedSolrServerConstructors, TestFaceting, TestPartialUpdateDeduplication, DateFieldTest, BigEndianAscendingWordSerializerTest, TestMissingGroups, QueryEqualityTest, TestRemoteStreaming, ExplicitHLLTest, TolerantUpdateProcessorTest, TestDocumentBuilder, TestGroupingSearch, TestPKIAuthenticationPlugin, TestSolr4Spatial2, TestSolrCoreSnapshots, SegmentsInfoRequestHandlerTest, TestScoreJoinQPNoScore, SyncSliceTest, TestExactSharedStatsCache, TestWordDelimiterFilterFactory, DeleteInactiveReplicaTest, PreAnalyzedUpdateProcessorTest, TestOnReconnectListenerSupport, CursorPagingTest, TestSort, DirectSolrConnectionTest, SolrTestCaseJ4Test, SynonymTokenizerTest, SuggestComponentContextFilterQueryTest, TestComponentsName, SpatialFilterTest, PathHierarchyTokenizerFactoryTest, TestFieldTypeResource, TestFastLRUCache, AnalysisAfterCoreReloadTest, AnalyticsMergeStrategyTest, TestDynamicLoading, CreateCollectionCleanupTest, TestCollationField, TestSlowCompositeReaderWrapper, TestElisionMultitermQuery, TestNRTOpen, TestStandardQParsers, AnalysisErrorHandlingTest, TestHdfsCloudBackupRestore, CurrencyFieldXmlFileTest, BooleanFieldTest, TestSolrQueryResponse, TestDefaultSearchFieldResource, CoreSorterTest, PrimitiveFieldTypeTest, TestSubQueryTransformerCrossCore, TestCSVLoader, TestShortCircuitedRequests, TestSortByMinMaxFunction, TestInfoStreamLogging, TestDistributedStatsComponentCardinality, TestRestManager, TestPerFieldSimilarity, TestPerFieldSimilarityWithDefaultOverride, SolrPluginUtilsTest, TestSha256AuthenticationProvider, OverseerTest, DistributedFacetPivotLargeTest, TestSolrIndexConfig, ShardRoutingTest, FullSolrCloudDistribCmdsTest, TestRandomFaceting, ZkSolrClientTest, TestZkChroot, AutoCommitTest, TestHashPartitioner, TestRealTimeGet, HardAutoCommitTest, TestCoreContainer, TestSolr4Spatial, SolrCmdDistributorTest, PeerSyncTest, TestLazyCores, ShowFileRequestHandlerTest, SolrRequestParserTest, SuggesterTest, PolyFieldTest, SolrCoreCheckLockOnStartupTest, StatelessScriptUpdateProcessorFactoryTest, TestSolrDeletionPolicy1, CacheHeaderTest, TestSurroundQueryParser, DirectSolrSpellCheckerTest, TestQueryTypes, XmlUpdateRequestHandlerTest, TermVectorComponentTest, FastVectorHighlighterTest, TestJmxIntegration, QueryParsingTest, JsonLoaderTest, TestBinaryResponseWriter, TestLFUCache, NumericFieldsTest, TestConfig, ExternalFileFieldSortTest, TestSolrCoreProperties, TestCodecSupport, TestFastWriter, TestJmxMonitoredMap, OpenExchangeRatesOrgProviderTest, DateMathParserTest, PreAnalyzedFieldTest, TestSystemIdResolver, PrimUtilsTest, DOMUtilTest, ClusterStateTest, TestLRUCache, ZkNodePropsTest, SliceStateTest, UUIDFieldTest, FileUtilsTest, CircularListTest, DistributedMLTComponentTest, TestRTGBase, DistributedIntervalFacetingTest, TestCrossCoreJoin, TestCursorMarkWithoutUniqueKey, TestDistributedMissingSort, ActionThrottleTest, AsyncMigrateRouteKeyTest, CollectionsAPIAsyncDistributedZkTest, DistribJoinFromCollectionTest, LeaderInitiatedRecoveryOnShardRestartTest, MultiThreadedOCPTest, OutOfBoxZkACLAndCredentialsProvidersTest, OverseerModifyCollectionTest, OverseerRolesTest, OverseerTaskQueueTest, RemoteQueryErrorTest, SolrCLIZkUtilsTest, SolrCloudExampleTest, TestConfigSetsAPIExclusivity, TestCryptoKeys, TestLeaderElectionZkExpiry, TestLocalFSCloudBackupRestore, TestMiniSolrCloudClusterSSL, TestRandomFlRTGCloud, TestRandomRequestDistribution, TestReplicaProperties, TestSolrCloudWithKerberosAlt, TestSolrCloudWithSecureImpersonation, TestStressLiveNodes, TestHdfsBackupRestoreCore, TestReplicationHandlerBackup, TestReqParamsAPI, TestSQLHandler, CoreAdminCreateDiscoverTest, CoreAdminRequestStatusTest, CoreMergeIndexesAdminHandlerTest, DistributedExpandComponentTest, DistributedFacetPivotLongTailTest, DistributedFacetPivotWhiteBoxTest, DistributedSuggestComponentTest, TestExpandComponent, HighlighterMaxOffsetTest, CheckHdfsIndexTest, SmileWriterTest, TestMacros, TestGeoJSONResponseWriter, TestGraphMLResponseWriter, TestRawResponseWriter, TestSortingResponseWriter, TestSubQueryTransformerDistrib, TestCollationFieldDocValues, TestManagedSchemaAPI]
   [junit4]   2> NOTE: reproduce with: ant test  -Dtestcase=TestManagedSchemaAPI -Dtests.seed=85D8B94A0B941025 -Dtests.slow=true -Dtests.locale=es-CL -Dtests.timezone=Pacific/Fiji -Dtests.asserts=true -Dtests.file.encoding=ISO-8859-1
   [junit4] ERROR   0.00s J0 | TestManagedSchemaAPI (suite) <<<
   [junit4]    > Throwable #1: java.lang.AssertionError: ObjectTracker found 10 object(s) that were not released!!! [MockDirectoryWrapper, MockDirectoryWrapper, MDCAwareThreadPoolExecutor, TransactionLog, MockDirectoryWrapper, MockDirectoryWrapper, MockDirectoryWrapper, TransactionLog, MDCAwareThreadPoolExecutor, MockDirectoryWrapper]
   [junit4]    > 	at __randomizedtesting.SeedInfo.seed([85D8B94A0B941025]:0)
   [junit4]    > 	at org.apache.solr.SolrTestCaseJ4.teardownTestCases(SolrTestCaseJ4.java:257)
   [junit4]    > 	at java.lang.Thread.run(Thread.java:745)Throwable #2: java.io.IOException: Could not remove the following files (in the order of attempts):
   [junit4]    >    C:\Users\jenkins\workspace\Lucene-Solr-master-Windows\solr\build\solr-core\test\J0\temp\solr.schema.TestManagedSchemaAPI_85D8B94A0B941025-001\tempDir-001\node2\testschemaapi_shard1_replica1\data\tlog\tlog.0000000000000000000: java.nio.file.FileSystemException: C:\Users\jenkins\workspace\Lucene-Solr-master-Windows\solr\build\solr-core\test\J0\temp\solr.schema.TestManagedSchemaAPI_85D8B94A0B941025-001\tempDir-001\node2\testschemaapi_shard1_replica1\data\tlog\tlog.0000000000000000000: The process cannot access the file because it is being used by another process.
   [junit4]    >    C:\Users\jenkins\workspace\Lucene-Solr-master-Windows\solr\build\solr-core\test\J0\temp\solr.schema.TestManagedSchemaAPI_85D8B94A0B941025-001\tempDir-001\node2\testschemaapi_shard1_replica1\data\tlog: java.nio.file.DirectoryNotEmptyException: C:\Users\jenkins\workspace\Lucene-Solr-master-Windows\solr\build\solr-core\test\J0\temp\solr.schema.TestManagedSchemaAPI_85D8B94A0B941025-001\tempDir-001\node2\testschemaapi_shard1_replica1\data\tlog
   [junit4]    >    C:\Users\jenkins\workspace\Lucene-Solr-master-Windows\solr\build\solr-core\test\J0\temp\solr.schema.TestManagedSchemaAPI_85D8B94A0B941025-001\tempDir-001\node2\testschemaapi_shard1_replica1\data: java.nio.file.DirectoryNotEmptyException: C:\Users\jenkins\workspace\Lucene-Solr-master-Windows\solr\build\solr-core\test\J0\temp\solr.schema.TestManagedSchemaAPI_85D8B94A0B941025-001\tempDir-001\node2\testschemaapi_shard1_replica1\data
   [junit4]    >    C:\Users\jenkins\workspace\Lucene-Solr-master-Windows\solr\build\solr-core\test\J0\temp\solr.schema.TestManagedSchemaAPI_85D8B94A0B941025-001\tempDir-001\node2\testschemaapi_shard1_replica1: java.nio.file.DirectoryNotEmptyException: C:\Users\jenkins\workspace\Lucene-Solr-master-Windows\solr\build\solr-core\test\J0\temp\solr.schema.TestManagedSchemaAPI_85D8B94A0B941025-001\tempDir-001\node2\testschemaapi_shard1_replica1
   [junit4]    >    C:\Users\jenkins\workspace\Lucene-Solr-master-Windows\solr\build\solr-core\test\J0\temp\solr.schema.TestManagedSchemaAPI_85D8B94A0B941025-001\tempDir-001\node2: java.nio.file.DirectoryNotEmptyException: C:\Users\jenkins\workspace\Lucene-Solr-master-Windows\solr\build\solr-core\test\J0\temp\solr.schema.TestManagedSchemaAPI_85D8B94A0B941025-001\tempDir-001\node2
   [junit4]    >    C:\Users\jenkins\workspace\Lucene-Solr-master-Windows\solr\build\solr-core\test\J0\temp\solr.schema.TestManagedSchemaAPI_85D8B94A0B941025-001\tempDir-001: java.nio.file.DirectoryNotEmptyException: C:\Users\jenkins\workspace\Lucene-Solr-master-Windows\solr\build\solr-core\test\J0\temp\solr.schema.TestManagedSchemaAPI_85D8B94A0B941025-001\tempDir-001
   [junit4]    > 	at org.apache.lucene.util.IOUtils.rm(IOUtils.java:323)
   [junit4]    > 	at java.lang.Thread.run(Thread.java:745)
   [junit4] Completed [569/631 (1!)] on J0 in 12.90s, 1 test, 1 failure, 1 error <<< FAILURES!

[...truncated 52727 lines...]


Mime
View raw message