lucene-dev mailing list archives

Site index · List index
Message view « Date » · « Thread »
Top « Date » · « Thread »
From Policeman Jenkins Server <jenk...@thetaphi.de>
Subject [JENKINS] Lucene-Solr-5.5-Linux (32bit/jdk1.7.0_80) - Build # 375 - Still Unstable!
Date Sat, 03 Sep 2016 18:58:55 GMT
Build: http://jenkins.thetaphi.de/job/Lucene-Solr-5.5-Linux/375/
Java: 32bit/jdk1.7.0_80 -server -XX:+UseParallelGC

1 tests failed.
FAILED:  org.apache.solr.schema.TestManagedSchemaAPI.test

Error Message:
Error from server at http://127.0.0.1:42499/solr/testschemaapi_shard1_replica2: ERROR: [doc=2] unknown field 'myNewField1'

Stack Trace:
org.apache.solr.client.solrj.impl.CloudSolrClient$RouteException: Error from server at http://127.0.0.1:42499/solr/testschemaapi_shard1_replica2: ERROR: [doc=2] unknown field 'myNewField1'
	at __randomizedtesting.SeedInfo.seed([49B94BCC331D285B:C1ED74169DE145A3]:0)
	at org.apache.solr.client.solrj.impl.CloudSolrClient.directUpdate(CloudSolrClient.java:653)
	at org.apache.solr.client.solrj.impl.CloudSolrClient.sendRequest(CloudSolrClient.java:1002)
	at org.apache.solr.client.solrj.impl.CloudSolrClient.requestWithRetryOnStaleState(CloudSolrClient.java:891)
	at org.apache.solr.client.solrj.impl.CloudSolrClient.request(CloudSolrClient.java:827)
	at org.apache.solr.schema.TestManagedSchemaAPI.testAddFieldAndDocument(TestManagedSchemaAPI.java:101)
	at org.apache.solr.schema.TestManagedSchemaAPI.test(TestManagedSchemaAPI.java:69)
	at sun.reflect.NativeMethodAccessorImpl.invoke0(Native Method)
	at sun.reflect.NativeMethodAccessorImpl.invoke(NativeMethodAccessorImpl.java:57)
	at sun.reflect.DelegatingMethodAccessorImpl.invoke(DelegatingMethodAccessorImpl.java:43)
	at java.lang.reflect.Method.invoke(Method.java:606)
	at com.carrotsearch.randomizedtesting.RandomizedRunner.invoke(RandomizedRunner.java:1764)
	at com.carrotsearch.randomizedtesting.RandomizedRunner$8.evaluate(RandomizedRunner.java:871)
	at com.carrotsearch.randomizedtesting.RandomizedRunner$9.evaluate(RandomizedRunner.java:907)
	at com.carrotsearch.randomizedtesting.RandomizedRunner$10.evaluate(RandomizedRunner.java:921)
	at com.carrotsearch.randomizedtesting.rules.SystemPropertiesRestoreRule$1.evaluate(SystemPropertiesRestoreRule.java:57)
	at org.apache.lucene.util.TestRuleSetupTeardownChained$1.evaluate(TestRuleSetupTeardownChained.java:49)
	at org.apache.lucene.util.AbstractBeforeAfterRule$1.evaluate(AbstractBeforeAfterRule.java:45)
	at org.apache.lucene.util.TestRuleThreadAndTestName$1.evaluate(TestRuleThreadAndTestName.java:48)
	at org.apache.lucene.util.TestRuleIgnoreAfterMaxFailures$1.evaluate(TestRuleIgnoreAfterMaxFailures.java:64)
	at org.apache.lucene.util.TestRuleMarkFailure$1.evaluate(TestRuleMarkFailure.java:47)
	at com.carrotsearch.randomizedtesting.rules.StatementAdapter.evaluate(StatementAdapter.java:36)
	at com.carrotsearch.randomizedtesting.ThreadLeakControl$StatementRunner.run(ThreadLeakControl.java:367)
	at com.carrotsearch.randomizedtesting.ThreadLeakControl.forkTimeoutingTask(ThreadLeakControl.java:809)
	at com.carrotsearch.randomizedtesting.ThreadLeakControl$3.evaluate(ThreadLeakControl.java:460)
	at com.carrotsearch.randomizedtesting.RandomizedRunner.runSingleTest(RandomizedRunner.java:880)
	at com.carrotsearch.randomizedtesting.RandomizedRunner$5.evaluate(RandomizedRunner.java:781)
	at com.carrotsearch.randomizedtesting.RandomizedRunner$6.evaluate(RandomizedRunner.java:816)
	at com.carrotsearch.randomizedtesting.RandomizedRunner$7.evaluate(RandomizedRunner.java:827)
	at com.carrotsearch.randomizedtesting.rules.StatementAdapter.evaluate(StatementAdapter.java:36)
	at com.carrotsearch.randomizedtesting.rules.SystemPropertiesRestoreRule$1.evaluate(SystemPropertiesRestoreRule.java:57)
	at org.apache.lucene.util.AbstractBeforeAfterRule$1.evaluate(AbstractBeforeAfterRule.java:45)
	at com.carrotsearch.randomizedtesting.rules.StatementAdapter.evaluate(StatementAdapter.java:36)
	at org.apache.lucene.util.TestRuleStoreClassName$1.evaluate(TestRuleStoreClassName.java:41)
	at com.carrotsearch.randomizedtesting.rules.NoShadowingOrOverridesOnMethodsRule$1.evaluate(NoShadowingOrOverridesOnMethodsRule.java:40)
	at com.carrotsearch.randomizedtesting.rules.NoShadowingOrOverridesOnMethodsRule$1.evaluate(NoShadowingOrOverridesOnMethodsRule.java:40)
	at com.carrotsearch.randomizedtesting.rules.StatementAdapter.evaluate(StatementAdapter.java:36)
	at com.carrotsearch.randomizedtesting.rules.StatementAdapter.evaluate(StatementAdapter.java:36)
	at com.carrotsearch.randomizedtesting.rules.StatementAdapter.evaluate(StatementAdapter.java:36)
	at org.apache.lucene.util.TestRuleAssertionsRequired$1.evaluate(TestRuleAssertionsRequired.java:53)
	at org.apache.lucene.util.TestRuleMarkFailure$1.evaluate(TestRuleMarkFailure.java:47)
	at org.apache.lucene.util.TestRuleIgnoreAfterMaxFailures$1.evaluate(TestRuleIgnoreAfterMaxFailures.java:64)
	at org.apache.lucene.util.TestRuleIgnoreTestSuites$1.evaluate(TestRuleIgnoreTestSuites.java:54)
	at com.carrotsearch.randomizedtesting.rules.StatementAdapter.evaluate(StatementAdapter.java:36)
	at com.carrotsearch.randomizedtesting.ThreadLeakControl$StatementRunner.run(ThreadLeakControl.java:367)
	at java.lang.Thread.run(Thread.java:745)
Caused by: org.apache.solr.client.solrj.impl.HttpSolrClient$RemoteSolrException: Error from server at http://127.0.0.1:42499/solr/testschemaapi_shard1_replica2: ERROR: [doc=2] unknown field 'myNewField1'
	at org.apache.solr.client.solrj.impl.HttpSolrClient.executeMethod(HttpSolrClient.java:577)
	at org.apache.solr.client.solrj.impl.HttpSolrClient.request(HttpSolrClient.java:241)
	at org.apache.solr.client.solrj.impl.HttpSolrClient.request(HttpSolrClient.java:230)
	at org.apache.solr.client.solrj.impl.LBHttpSolrClient.doRequest(LBHttpSolrClient.java:372)
	at org.apache.solr.client.solrj.impl.LBHttpSolrClient.request(LBHttpSolrClient.java:325)
	at org.apache.solr.client.solrj.impl.CloudSolrClient$2.call(CloudSolrClient.java:628)
	at org.apache.solr.client.solrj.impl.CloudSolrClient$2.call(CloudSolrClient.java:625)
	at java.util.concurrent.FutureTask.run(FutureTask.java:262)
	at org.apache.solr.common.util.ExecutorUtil$MDCAwareThreadPoolExecutor$1.run(ExecutorUtil.java:231)
	at java.util.concurrent.ThreadPoolExecutor.runWorker(ThreadPoolExecutor.java:1145)
	at java.util.concurrent.ThreadPoolExecutor$Worker.run(ThreadPoolExecutor.java:615)
	... 1 more




Build Log:
[...truncated 12209 lines...]
   [junit4] Suite: org.apache.solr.schema.TestManagedSchemaAPI
   [junit4]   2> Creating dataDir: /home/jenkins/workspace/Lucene-Solr-5.5-Linux/solr/build/solr-core/test/J1/temp/solr.schema.TestManagedSchemaAPI_49B94BCC331D285B-001/init-core-data-001
   [junit4]   2> 1963270 INFO  (SUITE-TestManagedSchemaAPI-seed#[49B94BCC331D285B]-worker) [    ] o.a.s.SolrTestCaseJ4 Randomized ssl (false) and clientAuth (false)
   [junit4]   2> 1963272 INFO  (TEST-TestManagedSchemaAPI.test-seed#[49B94BCC331D285B]) [    ] o.a.s.SolrTestCaseJ4 ###Starting test
   [junit4]   2> 1963273 INFO  (TEST-TestManagedSchemaAPI.test-seed#[49B94BCC331D285B]) [    ] o.a.s.c.ZkTestServer STARTING ZK TEST SERVER
   [junit4]   2> 1963274 INFO  (Thread-6236) [    ] o.a.s.c.ZkTestServer client port:0.0.0.0/0.0.0.0:0
   [junit4]   2> 1963274 INFO  (Thread-6236) [    ] o.a.s.c.ZkTestServer Starting server
   [junit4]   2> 1963374 INFO  (TEST-TestManagedSchemaAPI.test-seed#[49B94BCC331D285B]) [    ] o.a.s.c.ZkTestServer start zk server on port:42989
   [junit4]   2> 1963374 INFO  (TEST-TestManagedSchemaAPI.test-seed#[49B94BCC331D285B]) [    ] o.a.s.c.c.SolrZkClient Using default ZkCredentialsProvider
   [junit4]   2> 1963374 INFO  (TEST-TestManagedSchemaAPI.test-seed#[49B94BCC331D285B]) [    ] o.a.s.c.c.ConnectionManager Waiting for client to connect to ZooKeeper
   [junit4]   2> 1963375 INFO  (zkCallback-24238-thread-1) [    ] o.a.s.c.c.ConnectionManager Watcher org.apache.solr.common.cloud.ConnectionManager@160e48 name:ZooKeeperConnection Watcher:127.0.0.1:42989 got event WatchedEvent state:SyncConnected type:None path:null path:null type:None
   [junit4]   2> 1963376 INFO  (TEST-TestManagedSchemaAPI.test-seed#[49B94BCC331D285B]) [    ] o.a.s.c.c.ConnectionManager Client is connected to ZooKeeper
   [junit4]   2> 1963376 INFO  (TEST-TestManagedSchemaAPI.test-seed#[49B94BCC331D285B]) [    ] o.a.s.c.c.SolrZkClient Using default ZkACLProvider
   [junit4]   2> 1963376 INFO  (TEST-TestManagedSchemaAPI.test-seed#[49B94BCC331D285B]) [    ] o.a.s.c.c.SolrZkClient makePath: /solr/solr.xml
   [junit4]   2> 1963378 INFO  (jetty-launcher-24237-thread-2) [    ] o.e.j.s.Server jetty-9.2.13.v20150730
   [junit4]   2> 1963378 INFO  (jetty-launcher-24237-thread-1) [    ] o.e.j.s.Server jetty-9.2.13.v20150730
   [junit4]   2> 1963379 INFO  (jetty-launcher-24237-thread-2) [    ] o.e.j.s.h.ContextHandler Started o.e.j.s.ServletContextHandler@c00fef{/solr,null,AVAILABLE}
   [junit4]   2> 1963379 INFO  (jetty-launcher-24237-thread-1) [    ] o.e.j.s.h.ContextHandler Started o.e.j.s.ServletContextHandler@1878567{/solr,null,AVAILABLE}
   [junit4]   2> 1963382 INFO  (jetty-launcher-24237-thread-1) [    ] o.e.j.s.ServerConnector Started ServerConnector@629edf{HTTP/1.1}{127.0.0.1:38484}
   [junit4]   2> 1963382 INFO  (jetty-launcher-24237-thread-1) [    ] o.e.j.s.Server Started @1964882ms
   [junit4]   2> 1963382 INFO  (jetty-launcher-24237-thread-2) [    ] o.e.j.s.ServerConnector Started ServerConnector@d745fe{HTTP/1.1}{127.0.0.1:42499}
   [junit4]   2> 1963382 INFO  (jetty-launcher-24237-thread-1) [    ] o.a.s.c.s.e.JettySolrRunner Jetty properties: {hostContext=/solr, hostPort=38484}
   [junit4]   2> 1963382 INFO  (jetty-launcher-24237-thread-2) [    ] o.e.j.s.Server Started @1964882ms
   [junit4]   2> 1963382 INFO  (jetty-launcher-24237-thread-2) [    ] o.a.s.c.s.e.JettySolrRunner Jetty properties: {hostContext=/solr, hostPort=42499}
   [junit4]   2> 1963382 INFO  (jetty-launcher-24237-thread-1) [    ] o.a.s.s.SolrDispatchFilter SolrDispatchFilter.init(): sun.misc.Launcher$AppClassLoader@149a2c8
   [junit4]   2> 1963382 INFO  (jetty-launcher-24237-thread-1) [    ] o.a.s.c.SolrResourceLoader new SolrResourceLoader for directory: '/home/jenkins/workspace/Lucene-Solr-5.5-Linux/solr/build/solr-core/test/J1/temp/solr.schema.TestManagedSchemaAPI_49B94BCC331D285B-001/tempDir-001/node1'
   [junit4]   2> 1963382 INFO  (jetty-launcher-24237-thread-2) [    ] o.a.s.s.SolrDispatchFilter SolrDispatchFilter.init(): sun.misc.Launcher$AppClassLoader@149a2c8
   [junit4]   2> 1963383 INFO  (jetty-launcher-24237-thread-1) [    ] o.a.s.c.SolrResourceLoader JNDI not configured for solr (NoInitialContextEx)
   [junit4]   2> 1963383 INFO  (jetty-launcher-24237-thread-2) [    ] o.a.s.c.SolrResourceLoader new SolrResourceLoader for directory: '/home/jenkins/workspace/Lucene-Solr-5.5-Linux/solr/build/solr-core/test/J1/temp/solr.schema.TestManagedSchemaAPI_49B94BCC331D285B-001/tempDir-001/node2'
   [junit4]   2> 1963383 INFO  (jetty-launcher-24237-thread-1) [    ] o.a.s.c.SolrResourceLoader solr home defaulted to 'solr/' (could not find system property or JNDI)
   [junit4]   2> 1963383 INFO  (jetty-launcher-24237-thread-2) [    ] o.a.s.c.SolrResourceLoader JNDI not configured for solr (NoInitialContextEx)
   [junit4]   2> 1963383 INFO  (jetty-launcher-24237-thread-2) [    ] o.a.s.c.SolrResourceLoader solr home defaulted to 'solr/' (could not find system property or JNDI)
   [junit4]   2> 1963383 INFO  (jetty-launcher-24237-thread-1) [    ] o.a.s.c.c.SolrZkClient Using default ZkCredentialsProvider
   [junit4]   2> 1963383 INFO  (jetty-launcher-24237-thread-2) [    ] o.a.s.c.c.SolrZkClient Using default ZkCredentialsProvider
   [junit4]   2> 1963383 INFO  (jetty-launcher-24237-thread-1) [    ] o.a.s.c.c.ConnectionManager Waiting for client to connect to ZooKeeper
   [junit4]   2> 1963389 INFO  (jetty-launcher-24237-thread-2) [    ] o.a.s.c.c.ConnectionManager Waiting for client to connect to ZooKeeper
   [junit4]   2> 1963390 INFO  (zkCallback-24239-thread-1) [    ] o.a.s.c.c.ConnectionManager Watcher org.apache.solr.common.cloud.ConnectionManager@90155a name:ZooKeeperConnection Watcher:127.0.0.1:42989/solr got event WatchedEvent state:SyncConnected type:None path:null path:null type:None
   [junit4]   2> 1963390 INFO  (jetty-launcher-24237-thread-1) [    ] o.a.s.c.c.ConnectionManager Client is connected to ZooKeeper
   [junit4]   2> 1963390 INFO  (zkCallback-24240-thread-1) [    ] o.a.s.c.c.ConnectionManager Watcher org.apache.solr.common.cloud.ConnectionManager@14ea843 name:ZooKeeperConnection Watcher:127.0.0.1:42989/solr got event WatchedEvent state:SyncConnected type:None path:null path:null type:None
   [junit4]   2> 1963390 INFO  (jetty-launcher-24237-thread-2) [    ] o.a.s.c.c.ConnectionManager Client is connected to ZooKeeper
   [junit4]   2> 1963390 INFO  (jetty-launcher-24237-thread-1) [    ] o.a.s.c.c.SolrZkClient Using default ZkACLProvider
   [junit4]   2> 1963390 INFO  (jetty-launcher-24237-thread-2) [    ] o.a.s.c.c.SolrZkClient Using default ZkACLProvider
   [junit4]   2> 1963390 INFO  (jetty-launcher-24237-thread-1) [    ] o.a.s.s.SolrDispatchFilter solr.xml found in ZooKeeper. Loading...
   [junit4]   2> 1963390 INFO  (jetty-launcher-24237-thread-2) [    ] o.a.s.s.SolrDispatchFilter solr.xml found in ZooKeeper. Loading...
   [junit4]   2> 1963401 INFO  (jetty-launcher-24237-thread-1) [    ] o.a.s.c.CorePropertiesLocator Config-defined core root directory: /home/jenkins/workspace/Lucene-Solr-5.5-Linux/solr/build/solr-core/test/J1/temp/solr.schema.TestManagedSchemaAPI_49B94BCC331D285B-001/tempDir-001/node1/.
   [junit4]   2> 1963401 INFO  (jetty-launcher-24237-thread-1) [    ] o.a.s.c.CoreContainer New CoreContainer 18411709
   [junit4]   2> 1963401 INFO  (jetty-launcher-24237-thread-1) [    ] o.a.s.c.CoreContainer Loading cores into CoreContainer [instanceDir=/home/jenkins/workspace/Lucene-Solr-5.5-Linux/solr/build/solr-core/test/J1/temp/solr.schema.TestManagedSchemaAPI_49B94BCC331D285B-001/tempDir-001/node1]
   [junit4]   2> 1963410 INFO  (jetty-launcher-24237-thread-2) [    ] o.a.s.c.CorePropertiesLocator Config-defined core root directory: /home/jenkins/workspace/Lucene-Solr-5.5-Linux/solr/build/solr-core/test/J1/temp/solr.schema.TestManagedSchemaAPI_49B94BCC331D285B-001/tempDir-001/node2/.
   [junit4]   2> 1963410 WARN  (jetty-launcher-24237-thread-1) [    ] o.a.s.c.CoreContainer Couldn't add files from /home/jenkins/workspace/Lucene-Solr-5.5-Linux/solr/build/solr-core/test/J1/temp/solr.schema.TestManagedSchemaAPI_49B94BCC331D285B-001/tempDir-001/node1/lib to classpath: /home/jenkins/workspace/Lucene-Solr-5.5-Linux/solr/build/solr-core/test/J1/temp/solr.schema.TestManagedSchemaAPI_49B94BCC331D285B-001/tempDir-001/node1/lib
   [junit4]   2> 1963410 INFO  (jetty-launcher-24237-thread-2) [    ] o.a.s.c.CoreContainer New CoreContainer 6621928
   [junit4]   2> 1963410 INFO  (jetty-launcher-24237-thread-2) [    ] o.a.s.c.CoreContainer Loading cores into CoreContainer [instanceDir=/home/jenkins/workspace/Lucene-Solr-5.5-Linux/solr/build/solr-core/test/J1/temp/solr.schema.TestManagedSchemaAPI_49B94BCC331D285B-001/tempDir-001/node2]
   [junit4]   2> 1963410 INFO  (jetty-launcher-24237-thread-1) [    ] o.a.s.h.c.HttpShardHandlerFactory created with socketTimeout : 90000,urlScheme : ,connTimeout : 15000,maxConnectionsPerHost : 20,maxConnections : 10000,corePoolSize : 0,maximumPoolSize : 2147483647,maxThreadIdleTime : 5,sizeOfQueue : -1,fairnessPolicy : false,useRetries : false,connectionsEvictorSleepDelay : 5000,maxConnectionIdleTime : 40000,
   [junit4]   2> 1963411 WARN  (jetty-launcher-24237-thread-2) [    ] o.a.s.c.CoreContainer Couldn't add files from /home/jenkins/workspace/Lucene-Solr-5.5-Linux/solr/build/solr-core/test/J1/temp/solr.schema.TestManagedSchemaAPI_49B94BCC331D285B-001/tempDir-001/node2/lib to classpath: /home/jenkins/workspace/Lucene-Solr-5.5-Linux/solr/build/solr-core/test/J1/temp/solr.schema.TestManagedSchemaAPI_49B94BCC331D285B-001/tempDir-001/node2/lib
   [junit4]   2> 1963411 INFO  (jetty-launcher-24237-thread-2) [    ] o.a.s.h.c.HttpShardHandlerFactory created with socketTimeout : 90000,urlScheme : ,connTimeout : 15000,maxConnectionsPerHost : 20,maxConnections : 10000,corePoolSize : 0,maximumPoolSize : 2147483647,maxThreadIdleTime : 5,sizeOfQueue : -1,fairnessPolicy : false,useRetries : false,connectionsEvictorSleepDelay : 5000,maxConnectionIdleTime : 40000,
   [junit4]   2> 1963412 INFO  (jetty-launcher-24237-thread-2) [    ] o.a.s.u.UpdateShardHandler Creating UpdateShardHandler HTTP client with params: socketTimeout=340000&connTimeout=45000&retry=true
   [junit4]   2> 1963412 INFO  (jetty-launcher-24237-thread-1) [    ] o.a.s.u.UpdateShardHandler Creating UpdateShardHandler HTTP client with params: socketTimeout=340000&connTimeout=45000&retry=true
   [junit4]   2> 1963412 INFO  (jetty-launcher-24237-thread-2) [    ] o.a.s.l.LogWatcher SLF4J impl is org.slf4j.impl.Log4jLoggerFactory
   [junit4]   2> 1963412 INFO  (jetty-launcher-24237-thread-2) [    ] o.a.s.l.LogWatcher Registering Log Listener [Log4j (org.slf4j.impl.Log4jLoggerFactory)]
   [junit4]   2> 1963412 INFO  (jetty-launcher-24237-thread-2) [    ] o.a.s.c.ZkContainer Zookeeper client=127.0.0.1:42989/solr
   [junit4]   2> 1963412 INFO  (jetty-launcher-24237-thread-2) [    ] o.a.s.c.ZkController zkHost includes chroot
   [junit4]   2> 1963412 INFO  (jetty-launcher-24237-thread-1) [    ] o.a.s.l.LogWatcher SLF4J impl is org.slf4j.impl.Log4jLoggerFactory
   [junit4]   2> 1963412 INFO  (jetty-launcher-24237-thread-2) [    ] o.a.s.c.c.SolrZkClient Using default ZkCredentialsProvider
   [junit4]   2> 1963412 INFO  (jetty-launcher-24237-thread-1) [    ] o.a.s.l.LogWatcher Registering Log Listener [Log4j (org.slf4j.impl.Log4jLoggerFactory)]
   [junit4]   2> 1963412 INFO  (jetty-launcher-24237-thread-1) [    ] o.a.s.c.ZkContainer Zookeeper client=127.0.0.1:42989/solr
   [junit4]   2> 1963412 INFO  (jetty-launcher-24237-thread-1) [    ] o.a.s.c.ZkController zkHost includes chroot
   [junit4]   2> 1963412 INFO  (jetty-launcher-24237-thread-2) [    ] o.a.s.c.c.ConnectionManager Waiting for client to connect to ZooKeeper
   [junit4]   2> 1963412 INFO  (jetty-launcher-24237-thread-1) [    ] o.a.s.c.c.SolrZkClient Using default ZkCredentialsProvider
   [junit4]   2> 1963413 INFO  (jetty-launcher-24237-thread-1) [    ] o.a.s.c.c.ConnectionManager Waiting for client to connect to ZooKeeper
   [junit4]   2> 1963413 INFO  (zkCallback-24245-thread-1) [    ] o.a.s.c.c.ConnectionManager Watcher org.apache.solr.common.cloud.ConnectionManager@1ad4472 name:ZooKeeperConnection Watcher:127.0.0.1:42989 got event WatchedEvent state:SyncConnected type:None path:null path:null type:None
   [junit4]   2> 1963413 INFO  (jetty-launcher-24237-thread-2) [    ] o.a.s.c.c.ConnectionManager Client is connected to ZooKeeper
   [junit4]   2> 1963413 INFO  (zkCallback-24246-thread-1) [    ] o.a.s.c.c.ConnectionManager Watcher org.apache.solr.common.cloud.ConnectionManager@1445eab name:ZooKeeperConnection Watcher:127.0.0.1:42989 got event WatchedEvent state:SyncConnected type:None path:null path:null type:None
   [junit4]   2> 1963413 INFO  (jetty-launcher-24237-thread-2) [    ] o.a.s.c.c.SolrZkClient Using default ZkACLProvider
   [junit4]   2> 1963413 INFO  (jetty-launcher-24237-thread-1) [    ] o.a.s.c.c.ConnectionManager Client is connected to ZooKeeper
   [junit4]   2> 1963414 INFO  (jetty-launcher-24237-thread-1) [    ] o.a.s.c.c.SolrZkClient Using default ZkACLProvider
   [junit4]   2> 1963414 INFO  (jetty-launcher-24237-thread-2) [n:127.0.0.1:42499_solr    ] o.a.s.c.ZkController Added new OnReconnect listener org.apache.solr.cloud.ZkController$6@13a6fd7
   [junit4]   2> 1963414 INFO  (jetty-launcher-24237-thread-2) [n:127.0.0.1:42499_solr    ] o.a.s.c.c.ConnectionManager Waiting for client to connect to ZooKeeper
   [junit4]   2> 1963414 INFO  (jetty-launcher-24237-thread-1) [n:127.0.0.1:38484_solr    ] o.a.s.c.ZkController Added new OnReconnect listener org.apache.solr.cloud.ZkController$6@1ec8267
   [junit4]   2> 1963414 INFO  (jetty-launcher-24237-thread-1) [n:127.0.0.1:38484_solr    ] o.a.s.c.c.ConnectionManager Waiting for client to connect to ZooKeeper
   [junit4]   2> 1963414 INFO  (zkCallback-24247-thread-1-processing-n:127.0.0.1:42499_solr) [n:127.0.0.1:42499_solr    ] o.a.s.c.c.ConnectionManager Watcher org.apache.solr.common.cloud.ConnectionManager@163ae72 name:ZooKeeperConnection Watcher:127.0.0.1:42989/solr got event WatchedEvent state:SyncConnected type:None path:null path:null type:None
   [junit4]   2> 1963415 INFO  (jetty-launcher-24237-thread-2) [n:127.0.0.1:42499_solr    ] o.a.s.c.c.ConnectionManager Client is connected to ZooKeeper
   [junit4]   2> 1963415 INFO  (zkCallback-24248-thread-1-processing-n:127.0.0.1:38484_solr) [n:127.0.0.1:38484_solr    ] o.a.s.c.c.ConnectionManager Watcher org.apache.solr.common.cloud.ConnectionManager@116a06b name:ZooKeeperConnection Watcher:127.0.0.1:42989/solr got event WatchedEvent state:SyncConnected type:None path:null path:null type:None
   [junit4]   2> 1963415 INFO  (jetty-launcher-24237-thread-1) [n:127.0.0.1:38484_solr    ] o.a.s.c.c.ConnectionManager Client is connected to ZooKeeper
   [junit4]   2> 1963415 INFO  (jetty-launcher-24237-thread-2) [n:127.0.0.1:42499_solr    ] o.a.s.c.c.SolrZkClient makePath: /overseer/queue
   [junit4]   2> 1963416 INFO  (jetty-launcher-24237-thread-1) [n:127.0.0.1:38484_solr    ] o.a.s.c.c.SolrZkClient makePath: /overseer/collection-queue-work
   [junit4]   2> 1963416 INFO  (jetty-launcher-24237-thread-2) [n:127.0.0.1:42499_solr    ] o.a.s.c.c.SolrZkClient makePath: /overseer/collection-queue-work
   [junit4]   2> 1963417 INFO  (jetty-launcher-24237-thread-2) [n:127.0.0.1:42499_solr    ] o.a.s.c.c.SolrZkClient makePath: /overseer/collection-map-running
   [junit4]   2> 1963418 INFO  (jetty-launcher-24237-thread-1) [n:127.0.0.1:38484_solr    ] o.a.s.c.c.SolrZkClient makePath: /overseer/collection-map-running
   [junit4]   2> 1963419 INFO  (jetty-launcher-24237-thread-1) [n:127.0.0.1:38484_solr    ] o.a.s.c.c.SolrZkClient makePath: /overseer/collection-map-completed
   [junit4]   2> 1963419 INFO  (jetty-launcher-24237-thread-2) [n:127.0.0.1:42499_solr    ] o.a.s.c.c.SolrZkClient makePath: /overseer/collection-map-completed
   [junit4]   2> 1963419 INFO  (jetty-launcher-24237-thread-1) [n:127.0.0.1:38484_solr    ] o.a.s.c.c.SolrZkClient makePath: /overseer/collection-map-failure
   [junit4]   2> 1963419 INFO  (jetty-launcher-24237-thread-2) [n:127.0.0.1:42499_solr    ] o.a.s.c.c.SolrZkClient makePath: /overseer/collection-map-failure
   [junit4]   2> 1963420 INFO  (jetty-launcher-24237-thread-1) [n:127.0.0.1:38484_solr    ] o.a.s.c.c.SolrZkClient makePath: /live_nodes
   [junit4]   2> 1963420 INFO  (jetty-launcher-24237-thread-2) [n:127.0.0.1:42499_solr    ] o.a.s.c.c.SolrZkClient makePath: /live_nodes
   [junit4]   2> 1963420 INFO  (jetty-launcher-24237-thread-1) [n:127.0.0.1:38484_solr    ] o.a.s.c.c.SolrZkClient makePath: /collections
   [junit4]   2> 1963420 INFO  (jetty-launcher-24237-thread-2) [n:127.0.0.1:42499_solr    ] o.a.s.c.c.SolrZkClient makePath: /collections
   [junit4]   2> 1963421 INFO  (jetty-launcher-24237-thread-1) [n:127.0.0.1:38484_solr    ] o.a.s.c.c.SolrZkClient makePath: /aliases.json
   [junit4]   2> 1963421 INFO  (jetty-launcher-24237-thread-2) [n:127.0.0.1:42499_solr    ] o.a.s.c.c.SolrZkClient makePath: /aliases.json
   [junit4]   2> 1963427 INFO  (jetty-launcher-24237-thread-1) [n:127.0.0.1:38484_solr    ] o.a.s.c.c.SolrZkClient makePath: /clusterstate.json
   [junit4]   2> 1963427 INFO  (jetty-launcher-24237-thread-2) [n:127.0.0.1:42499_solr    ] o.a.s.c.c.SolrZkClient makePath: /clusterstate.json
   [junit4]   2> 1963428 INFO  (jetty-launcher-24237-thread-1) [n:127.0.0.1:38484_solr    ] o.a.s.c.c.SolrZkClient makePath: /security.json
   [junit4]   2> 1963428 INFO  (jetty-launcher-24237-thread-2) [n:127.0.0.1:42499_solr    ] o.a.s.c.c.SolrZkClient makePath: /security.json
   [junit4]   2> 1963428 INFO  (jetty-launcher-24237-thread-1) [n:127.0.0.1:38484_solr    ] o.a.s.c.ZkController Register node as live in ZooKeeper:/live_nodes/127.0.0.1:38484_solr
   [junit4]   2> 1963428 INFO  (jetty-launcher-24237-thread-2) [n:127.0.0.1:42499_solr    ] o.a.s.c.ZkController Register node as live in ZooKeeper:/live_nodes/127.0.0.1:42499_solr
   [junit4]   2> 1963428 INFO  (jetty-launcher-24237-thread-1) [n:127.0.0.1:38484_solr    ] o.a.s.c.c.SolrZkClient makePath: /live_nodes/127.0.0.1:38484_solr
   [junit4]   2> 1963428 INFO  (jetty-launcher-24237-thread-2) [n:127.0.0.1:42499_solr    ] o.a.s.c.c.SolrZkClient makePath: /live_nodes/127.0.0.1:42499_solr
   [junit4]   2> 1963430 INFO  (jetty-launcher-24237-thread-1) [n:127.0.0.1:38484_solr    ] o.a.s.c.c.SolrZkClient makePath: /overseer_elect
   [junit4]   2> 1963430 INFO  (jetty-launcher-24237-thread-2) [n:127.0.0.1:42499_solr    ] o.a.s.c.c.SolrZkClient makePath: /overseer_elect
   [junit4]   2> 1963430 INFO  (jetty-launcher-24237-thread-1) [n:127.0.0.1:38484_solr    ] o.a.s.c.c.SolrZkClient makePath: /overseer_elect/election
   [junit4]   2> 1963430 INFO  (jetty-launcher-24237-thread-2) [n:127.0.0.1:42499_solr    ] o.a.s.c.c.SolrZkClient makePath: /overseer_elect/election
   [junit4]   2> 1963431 INFO  (jetty-launcher-24237-thread-1) [n:127.0.0.1:38484_solr    ] o.a.s.c.Overseer Overseer (id=null) closing
   [junit4]   2> 1963431 INFO  (jetty-launcher-24237-thread-2) [n:127.0.0.1:42499_solr    ] o.a.s.c.Overseer Overseer (id=null) closing
   [junit4]   2> 1963431 INFO  (jetty-launcher-24237-thread-1) [n:127.0.0.1:38484_solr    ] o.a.s.c.LeaderElector Joined leadership election with path: /overseer_elect/election/96529840341319686-127.0.0.1:38484_solr-n_0000000000
   [junit4]   2> 1963431 INFO  (jetty-launcher-24237-thread-2) [n:127.0.0.1:42499_solr    ] o.a.s.c.LeaderElector Joined leadership election with path: /overseer_elect/election/96529840341319685-127.0.0.1:42499_solr-n_0000000001
   [junit4]   2> 1963431 INFO  (jetty-launcher-24237-thread-1) [n:127.0.0.1:38484_solr    ] o.a.s.c.OverseerElectionContext I am going to be the leader 127.0.0.1:38484_solr
   [junit4]   2> 1963431 INFO  (jetty-launcher-24237-thread-1) [n:127.0.0.1:38484_solr    ] o.a.s.c.c.SolrZkClient makePath: /overseer_elect/leader
   [junit4]   2> 1963432 INFO  (jetty-launcher-24237-thread-2) [n:127.0.0.1:42499_solr    ] o.a.s.c.LeaderElector Watching path /overseer_elect/election/96529840341319686-127.0.0.1:38484_solr-n_0000000000 to know if I could be the leader
   [junit4]   2> 1963432 INFO  (jetty-launcher-24237-thread-2) [n:127.0.0.1:42499_solr    ] o.a.s.c.c.ZkStateReader Updating cluster state from ZooKeeper... 
   [junit4]   2> 1963432 INFO  (jetty-launcher-24237-thread-1) [n:127.0.0.1:38484_solr    ] o.a.s.c.Overseer Overseer (id=96529840341319686-127.0.0.1:38484_solr-n_0000000000) starting
   [junit4]   2> 1963432 INFO  (jetty-launcher-24237-thread-1) [n:127.0.0.1:38484_solr    ] o.a.s.c.c.SolrZkClient makePath: /overseer/queue-work
   [junit4]   2> 1963434 INFO  (jetty-launcher-24237-thread-1) [n:127.0.0.1:38484_solr    ] o.a.s.c.OverseerAutoReplicaFailoverThread Starting OverseerAutoReplicaFailoverThread autoReplicaFailoverWorkLoopDelay=10000 autoReplicaFailoverWaitAfterExpiration=30000 autoReplicaFailoverBadNodeExpiration=60000
   [junit4]   2> 1963435 INFO  (jetty-launcher-24237-thread-1) [n:127.0.0.1:38484_solr    ] o.a.s.c.c.ZkStateReader Updating cluster state from ZooKeeper... 
   [junit4]   2> 1963435 INFO  (OverseerCollectionConfigSetProcessor-96529840341319686-127.0.0.1:38484_solr-n_0000000000) [n:127.0.0.1:38484_solr    ] o.a.s.c.OverseerTaskProcessor Process current queue of overseer operations
   [junit4]   2> 1963442 INFO  (OverseerStateUpdate-96529840341319686-127.0.0.1:38484_solr-n_0000000000) [n:127.0.0.1:38484_solr    ] o.a.s.c.Overseer Starting to work on the main queue
   [junit4]   2> 1963446 INFO  (jetty-launcher-24237-thread-2) [n:127.0.0.1:42499_solr    ] o.a.s.c.CoreContainer Security conf doesn't exist. Skipping setup for authorization module.
   [junit4]   2> 1963446 INFO  (jetty-launcher-24237-thread-2) [n:127.0.0.1:42499_solr    ] o.a.s.c.CoreContainer No authentication plugin used.
   [junit4]   2> 1963446 INFO  (jetty-launcher-24237-thread-2) [n:127.0.0.1:42499_solr    ] o.a.s.c.CorePropertiesLocator Looking for core definitions underneath /home/jenkins/workspace/Lucene-Solr-5.5-Linux/solr/build/solr-core/test/J1/temp/solr.schema.TestManagedSchemaAPI_49B94BCC331D285B-001/tempDir-001/node2/.
   [junit4]   2> 1963447 INFO  (jetty-launcher-24237-thread-2) [n:127.0.0.1:42499_solr    ] o.a.s.c.CorePropertiesLocator Found 0 core definitions
   [junit4]   2> 1963447 INFO  (jetty-launcher-24237-thread-2) [n:127.0.0.1:42499_solr    ] o.a.s.s.SolrDispatchFilter user.dir=/home/jenkins/workspace/Lucene-Solr-5.5-Linux/solr/build/solr-core/test/J1
   [junit4]   2> 1963448 INFO  (jetty-launcher-24237-thread-2) [n:127.0.0.1:42499_solr    ] o.a.s.s.SolrDispatchFilter SolrDispatchFilter.init() done
   [junit4]   2> 1963471 INFO  (jetty-launcher-24237-thread-1) [n:127.0.0.1:38484_solr    ] o.a.s.c.CoreContainer Security conf doesn't exist. Skipping setup for authorization module.
   [junit4]   2> 1963471 INFO  (jetty-launcher-24237-thread-1) [n:127.0.0.1:38484_solr    ] o.a.s.c.CoreContainer No authentication plugin used.
   [junit4]   2> 1963471 INFO  (jetty-launcher-24237-thread-1) [n:127.0.0.1:38484_solr    ] o.a.s.c.CorePropertiesLocator Looking for core definitions underneath /home/jenkins/workspace/Lucene-Solr-5.5-Linux/solr/build/solr-core/test/J1/temp/solr.schema.TestManagedSchemaAPI_49B94BCC331D285B-001/tempDir-001/node1/.
   [junit4]   2> 1963471 INFO  (jetty-launcher-24237-thread-1) [n:127.0.0.1:38484_solr    ] o.a.s.c.CorePropertiesLocator Found 0 core definitions
   [junit4]   2> 1963472 INFO  (jetty-launcher-24237-thread-1) [n:127.0.0.1:38484_solr    ] o.a.s.s.SolrDispatchFilter user.dir=/home/jenkins/workspace/Lucene-Solr-5.5-Linux/solr/build/solr-core/test/J1
   [junit4]   2> 1963472 INFO  (jetty-launcher-24237-thread-1) [n:127.0.0.1:38484_solr    ] o.a.s.s.SolrDispatchFilter SolrDispatchFilter.init() done
   [junit4]   2> 1963472 INFO  (TEST-TestManagedSchemaAPI.test-seed#[49B94BCC331D285B]) [    ] o.a.s.c.c.SolrZkClient Using default ZkCredentialsProvider
   [junit4]   2> 1963472 INFO  (TEST-TestManagedSchemaAPI.test-seed#[49B94BCC331D285B]) [    ] o.a.s.c.c.ConnectionManager Waiting for client to connect to ZooKeeper
   [junit4]   2> 1963473 INFO  (zkCallback-24249-thread-1) [    ] o.a.s.c.c.ConnectionManager Watcher org.apache.solr.common.cloud.ConnectionManager@40863 name:ZooKeeperConnection Watcher:127.0.0.1:42989 got event WatchedEvent state:SyncConnected type:None path:null path:null type:None
   [junit4]   2> 1963473 INFO  (TEST-TestManagedSchemaAPI.test-seed#[49B94BCC331D285B]) [    ] o.a.s.c.c.ConnectionManager Client is connected to ZooKeeper
   [junit4]   2> 1963473 INFO  (TEST-TestManagedSchemaAPI.test-seed#[49B94BCC331D285B]) [    ] o.a.s.c.c.SolrZkClient Using default ZkACLProvider
   [junit4]   2> 1963474 INFO  (TEST-TestManagedSchemaAPI.test-seed#[49B94BCC331D285B]) [    ] o.a.s.c.c.SolrZkClient Using default ZkCredentialsProvider
   [junit4]   2> 1963474 INFO  (TEST-TestManagedSchemaAPI.test-seed#[49B94BCC331D285B]) [    ] o.a.s.c.c.ConnectionManager Waiting for client to connect to ZooKeeper
   [junit4]   2> 1963474 INFO  (zkCallback-24251-thread-1) [    ] o.a.s.c.c.ConnectionManager Watcher org.apache.solr.common.cloud.ConnectionManager@1a529d8 name:ZooKeeperConnection Watcher:127.0.0.1:42989/solr got event WatchedEvent state:SyncConnected type:None path:null path:null type:None
   [junit4]   2> 1963474 INFO  (TEST-TestManagedSchemaAPI.test-seed#[49B94BCC331D285B]) [    ] o.a.s.c.c.ConnectionManager Client is connected to ZooKeeper
   [junit4]   2> 1963475 INFO  (TEST-TestManagedSchemaAPI.test-seed#[49B94BCC331D285B]) [    ] o.a.s.c.c.SolrZkClient Using default ZkACLProvider
   [junit4]   2> 1963475 INFO  (TEST-TestManagedSchemaAPI.test-seed#[49B94BCC331D285B]) [    ] o.a.s.c.c.SolrZkClient makePath: /configs/conf1/solrconfig.xml
   [junit4]   2> 1963476 INFO  (TEST-TestManagedSchemaAPI.test-seed#[49B94BCC331D285B]) [    ] o.a.s.c.c.SolrZkClient makePath: /configs/conf1/managed-schema
   [junit4]   2> 1963476 INFO  (TEST-TestManagedSchemaAPI.test-seed#[49B94BCC331D285B]) [    ] o.a.s.c.c.SolrZkClient Using default ZkCredentialsProvider
   [junit4]   2> 1963476 INFO  (TEST-TestManagedSchemaAPI.test-seed#[49B94BCC331D285B]) [    ] o.a.s.c.c.ConnectionManager Waiting for client to connect to ZooKeeper
   [junit4]   2> 1963478 INFO  (zkCallback-24252-thread-1) [    ] o.a.s.c.c.ConnectionManager Watcher org.apache.solr.common.cloud.ConnectionManager@1015eb name:ZooKeeperConnection Watcher:127.0.0.1:42989/solr got event WatchedEvent state:SyncConnected type:None path:null path:null type:None
   [junit4]   2> 1963478 INFO  (TEST-TestManagedSchemaAPI.test-seed#[49B94BCC331D285B]) [    ] o.a.s.c.c.ConnectionManager Client is connected to ZooKeeper
   [junit4]   2> 1963478 INFO  (TEST-TestManagedSchemaAPI.test-seed#[49B94BCC331D285B]) [    ] o.a.s.c.c.SolrZkClient Using default ZkACLProvider
   [junit4]   2> 1963478 INFO  (TEST-TestManagedSchemaAPI.test-seed#[49B94BCC331D285B]) [    ] o.a.s.c.c.ZkStateReader Updating cluster state from ZooKeeper... 
   [junit4]   2> 1963481 INFO  (qtp21632847-96711) [n:127.0.0.1:38484_solr    ] o.a.s.h.a.CollectionsHandler Invoked Collection Action :create with params version=2&name=testschemaapi&action=CREATE&numShards=1&replicationFactor=2&wt=javabin&collection.configName=conf1 and sendToOCPQueue=true
   [junit4]   2> 1963482 INFO  (OverseerCollectionConfigSetProcessor-96529840341319686-127.0.0.1:38484_solr-n_0000000000) [n:127.0.0.1:38484_solr    ] o.a.s.c.OverseerTaskProcessor Overseer Collection Message Handler: Get the message id:/overseer/collection-queue-work/qn-0000000000 message:{
   [junit4]   2>   "name":"testschemaapi",
   [junit4]   2>   "fromApi":"true",
   [junit4]   2>   "replicationFactor":"2",
   [junit4]   2>   "collection.configName":"conf1",
   [junit4]   2>   "numShards":"1",
   [junit4]   2>   "stateFormat":"2",
   [junit4]   2>   "operation":"create"}
   [junit4]   2> 1963482 INFO  (OverseerThreadFactory-11689-thread-1-processing-n:127.0.0.1:38484_solr) [n:127.0.0.1:38484_solr    ] o.a.s.c.OverseerCollectionMessageHandler OverseerCollectionMessageHandler.processMessage : create , {
   [junit4]   2>   "name":"testschemaapi",
   [junit4]   2>   "fromApi":"true",
   [junit4]   2>   "replicationFactor":"2",
   [junit4]   2>   "collection.configName":"conf1",
   [junit4]   2>   "numShards":"1",
   [junit4]   2>   "stateFormat":"2",
   [junit4]   2>   "operation":"create"}
   [junit4]   2> 1963482 INFO  (OverseerThreadFactory-11689-thread-1-processing-n:127.0.0.1:38484_solr) [n:127.0.0.1:38484_solr    ] o.a.s.c.OverseerCollectionMessageHandler Create collection testschemaapi
   [junit4]   2> 1963482 INFO  (OverseerThreadFactory-11689-thread-1-processing-n:127.0.0.1:38484_solr) [n:127.0.0.1:38484_solr    ] o.a.s.c.OverseerCollectionMessageHandler creating collections conf node /collections/testschemaapi 
   [junit4]   2> 1963482 INFO  (OverseerThreadFactory-11689-thread-1-processing-n:127.0.0.1:38484_solr) [n:127.0.0.1:38484_solr    ] o.a.s.c.c.SolrZkClient makePath: /collections/testschemaapi
   [junit4]   2> 1963483 INFO  (zkCallback-24247-thread-1-processing-n:127.0.0.1:42499_solr) [n:127.0.0.1:42499_solr    ] o.a.s.c.c.ZkStateReader A collections change: [WatchedEvent state:SyncConnected type:NodeChildrenChanged path:/collections], has occurred - updating...
   [junit4]   2> 1963483 INFO  (zkCallback-24252-thread-1) [    ] o.a.s.c.c.ZkStateReader A collections change: [WatchedEvent state:SyncConnected type:NodeChildrenChanged path:/collections], has occurred - updating...
   [junit4]   2> 1963483 INFO  (zkCallback-24248-thread-1-processing-n:127.0.0.1:38484_solr) [n:127.0.0.1:38484_solr    ] o.a.s.c.c.ZkStateReader A collections change: [WatchedEvent state:SyncConnected type:NodeChildrenChanged path:/collections], has occurred - updating...
   [junit4]   2> 1963484 INFO  (OverseerStateUpdate-96529840341319686-127.0.0.1:38484_solr-n_0000000000) [n:127.0.0.1:38484_solr    ] o.a.s.c.Overseer processMessage: queueSize: 1, message = {
   [junit4]   2>   "name":"testschemaapi",
   [junit4]   2>   "fromApi":"true",
   [junit4]   2>   "replicationFactor":"2",
   [junit4]   2>   "collection.configName":"conf1",
   [junit4]   2>   "numShards":"1",
   [junit4]   2>   "stateFormat":"2",
   [junit4]   2>   "operation":"create"} current state version: 0
   [junit4]   2> 1963484 INFO  (OverseerStateUpdate-96529840341319686-127.0.0.1:38484_solr-n_0000000000) [n:127.0.0.1:38484_solr    ] o.a.s.c.o.ClusterStateMutator building a new cName: testschemaapi
   [junit4]   2> 1963484 INFO  (OverseerStateUpdate-96529840341319686-127.0.0.1:38484_solr-n_0000000000) [n:127.0.0.1:38484_solr    ] o.a.s.c.o.ZkStateWriter going to create_collection /collections/testschemaapi/state.json
   [junit4]   2> 1963584 INFO  (OverseerThreadFactory-11689-thread-1-processing-n:127.0.0.1:38484_solr) [n:127.0.0.1:38484_solr    ] o.a.s.c.OverseerCollectionMessageHandler Creating SolrCores for new collection testschemaapi, shardNames [shard1] , replicationFactor : 2
   [junit4]   2> 1963584 INFO  (OverseerThreadFactory-11689-thread-1-processing-n:127.0.0.1:38484_solr) [n:127.0.0.1:38484_solr    ] o.a.s.c.OverseerCollectionMessageHandler Creating core testschemaapi_shard1_replica1 as part of shard shard1 of collection testschemaapi on 127.0.0.1:38484_solr
   [junit4]   2> 1963586 INFO  (OverseerThreadFactory-11689-thread-1-processing-n:127.0.0.1:38484_solr) [n:127.0.0.1:38484_solr    ] o.a.s.c.OverseerCollectionMessageHandler Creating core testschemaapi_shard1_replica2 as part of shard shard1 of collection testschemaapi on 127.0.0.1:42499_solr
   [junit4]   2> 1963588 INFO  (qtp21632847-96714) [n:127.0.0.1:38484_solr    ] o.a.s.h.a.CoreAdminOperation core create command name=testschemaapi_shard1_replica1&qt=/admin/cores&version=2&action=CREATE&numShards=1&shard=shard1&collection=testschemaapi&wt=javabin&collection.configName=conf1
   [junit4]   2> 1963588 INFO  (qtp11938407-96708) [n:127.0.0.1:42499_solr    ] o.a.s.h.a.CoreAdminOperation core create command name=testschemaapi_shard1_replica2&qt=/admin/cores&version=2&action=CREATE&numShards=1&shard=shard1&collection=testschemaapi&wt=javabin&collection.configName=conf1
   [junit4]   2> 1963588 INFO  (qtp21632847-96714) [n:127.0.0.1:38484_solr    ] o.a.s.c.CoreDescriptor Created CoreDescriptor: {configSetProperties=configsetprops.json, collection=testschemaapi, numShards=1, shard=shard1, config=solrconfig.xml, transient=false, collection.configName=conf1, name=testschemaapi_shard1_replica1, loadOnStartup=true, dataDir=data/, schema=schema.xml}
   [junit4]   2> 1963588 INFO  (qtp11938407-96708) [n:127.0.0.1:42499_solr    ] o.a.s.c.CoreDescriptor Created CoreDescriptor: {config=solrconfig.xml, collection=testschemaapi, numShards=1, schema=schema.xml, dataDir=data/, transient=false, collection.configName=conf1, loadOnStartup=true, name=testschemaapi_shard1_replica2, shard=shard1, configSetProperties=configsetprops.json}
   [junit4]   2> 1963589 INFO  (qtp11938407-96708) [n:127.0.0.1:42499_solr c:testschemaapi s:shard1  x:testschemaapi_shard1_replica2] o.a.s.c.ZkController publishing state=down
   [junit4]   2> 1963589 INFO  (qtp21632847-96714) [n:127.0.0.1:38484_solr c:testschemaapi s:shard1  x:testschemaapi_shard1_replica1] o.a.s.c.ZkController publishing state=down
   [junit4]   2> 1963589 INFO  (qtp11938407-96708) [n:127.0.0.1:42499_solr c:testschemaapi s:shard1  x:testschemaapi_shard1_replica2] o.a.s.c.ZkController Registering watch for collection testschemaapi
   [junit4]   2> 1963590 INFO  (qtp11938407-96708) [n:127.0.0.1:42499_solr c:testschemaapi s:shard1  x:testschemaapi_shard1_replica2] o.a.s.c.c.ZkStateReader addZkWatch [testschemaapi]
   [junit4]   2> 1963590 INFO  (qtp21632847-96714) [n:127.0.0.1:38484_solr c:testschemaapi s:shard1  x:testschemaapi_shard1_replica1] o.a.s.c.ZkController Registering watch for collection testschemaapi
   [junit4]   2> 1963590 INFO  (qtp21632847-96714) [n:127.0.0.1:38484_solr c:testschemaapi s:shard1  x:testschemaapi_shard1_replica1] o.a.s.c.c.ZkStateReader addZkWatch [testschemaapi]
   [junit4]   2> 1963590 INFO  (OverseerStateUpdate-96529840341319686-127.0.0.1:38484_solr-n_0000000000) [n:127.0.0.1:38484_solr    ] o.a.s.c.Overseer processMessage: queueSize: 2, message = {
   [junit4]   2>   "node_name":"127.0.0.1:42499_solr",
   [junit4]   2>   "numShards":"1",
   [junit4]   2>   "state":"down",
   [junit4]   2>   "shard":"shard1",
   [junit4]   2>   "collection":"testschemaapi",
   [junit4]   2>   "base_url":"http://127.0.0.1:42499/solr",
   [junit4]   2>   "operation":"state",
   [junit4]   2>   "core":"testschemaapi_shard1_replica2",
   [junit4]   2>   "roles":null} current state version: 0
   [junit4]   2> 1963590 INFO  (qtp11938407-96708) [n:127.0.0.1:42499_solr c:testschemaapi s:shard1  x:testschemaapi_shard1_replica2] o.a.s.c.c.ZkStateReader Add data for [testschemaapi] ver [0]
   [junit4]   2> 1963590 INFO  (qtp21632847-96714) [n:127.0.0.1:38484_solr c:testschemaapi s:shard1  x:testschemaapi_shard1_replica1] o.a.s.c.c.ZkStateReader Add data for [testschemaapi] ver [0]
   [junit4]   2> 1963590 INFO  (qtp11938407-96708) [n:127.0.0.1:42499_solr c:testschemaapi s:shard1  x:testschemaapi_shard1_replica2] o.a.s.c.ZkController look for our core node name
   [junit4]   2> 1963590 INFO  (qtp21632847-96714) [n:127.0.0.1:38484_solr c:testschemaapi s:shard1  x:testschemaapi_shard1_replica1] o.a.s.c.ZkController look for our core node name
   [junit4]   2> 1963590 INFO  (OverseerStateUpdate-96529840341319686-127.0.0.1:38484_solr-n_0000000000) [n:127.0.0.1:38484_solr    ] o.a.s.c.o.ReplicaMutator Update state numShards=1 message={
   [junit4]   2>   "node_name":"127.0.0.1:42499_solr",
   [junit4]   2>   "numShards":"1",
   [junit4]   2>   "state":"down",
   [junit4]   2>   "shard":"shard1",
   [junit4]   2>   "collection":"testschemaapi",
   [junit4]   2>   "base_url":"http://127.0.0.1:42499/solr",
   [junit4]   2>   "operation":"state",
   [junit4]   2>   "core":"testschemaapi_shard1_replica2",
   [junit4]   2>   "roles":null}
   [junit4]   2> 1963591 INFO  (OverseerStateUpdate-96529840341319686-127.0.0.1:38484_solr-n_0000000000) [n:127.0.0.1:38484_solr    ] o.a.s.c.Overseer processMessage: queueSize: 1, message = {
   [junit4]   2>   "node_name":"127.0.0.1:38484_solr",
   [junit4]   2>   "numShards":"1",
   [junit4]   2>   "state":"down",
   [junit4]   2>   "shard":"shard1",
   [junit4]   2>   "collection":"testschemaapi",
   [junit4]   2>   "base_url":"http://127.0.0.1:38484/solr",
   [junit4]   2>   "operation":"state",
   [junit4]   2>   "core":"testschemaapi_shard1_replica1",
   [junit4]   2>   "roles":null} current state version: 0
   [junit4]   2> 1963591 INFO  (OverseerStateUpdate-96529840341319686-127.0.0.1:38484_solr-n_0000000000) [n:127.0.0.1:38484_solr    ] o.a.s.c.o.ReplicaMutator Update state numShards=1 message={
   [junit4]   2>   "node_name":"127.0.0.1:38484_solr",
   [junit4]   2>   "numShards":"1",
   [junit4]   2>   "state":"down",
   [junit4]   2>   "shard":"shard1",
   [junit4]   2>   "collection":"testschemaapi",
   [junit4]   2>   "base_url":"http://127.0.0.1:38484/solr",
   [junit4]   2>   "operation":"state",
   [junit4]   2>   "core":"testschemaapi_shard1_replica1",
   [junit4]   2>   "roles":null}
   [junit4]   2> 1963692 INFO  (OverseerStateUpdate-96529840341319686-127.0.0.1:38484_solr-n_0000000000) [n:127.0.0.1:38484_solr    ] o.a.s.c.o.ZkStateWriter going to update_collection /collections/testschemaapi/state.json version: 0
   [junit4]   2> 1963693 INFO  (zkCallback-24247-thread-1-processing-n:127.0.0.1:42499_solr) [n:127.0.0.1:42499_solr    ] o.a.s.c.c.ZkStateReader A cluster state change: [WatchedEvent state:SyncConnected type:NodeDataChanged path:/collections/testschemaapi/state.json] for collection [testschemaapi] has occurred - updating... (live nodes size: [2])
   [junit4]   2> 1963693 INFO  (zkCallback-24248-thread-1-processing-n:127.0.0.1:38484_solr) [n:127.0.0.1:38484_solr    ] o.a.s.c.c.ZkStateReader A cluster state change: [WatchedEvent state:SyncConnected type:NodeDataChanged path:/collections/testschemaapi/state.json] for collection [testschemaapi] has occurred - updating... (live nodes size: [2])
   [junit4]   2> 1963693 INFO  (zkCallback-24248-thread-1-processing-n:127.0.0.1:38484_solr) [n:127.0.0.1:38484_solr    ] o.a.s.c.c.ZkStateReader Updating data for [testschemaapi] from [0] to [1]
   [junit4]   2> 1963693 INFO  (zkCallback-24247-thread-1-processing-n:127.0.0.1:42499_solr) [n:127.0.0.1:42499_solr    ] o.a.s.c.c.ZkStateReader Updating data for [testschemaapi] from [0] to [1]
   [junit4]   2> 1964590 INFO  (qtp11938407-96708) [n:127.0.0.1:42499_solr c:testschemaapi s:shard1  x:testschemaapi_shard1_replica2] o.a.s.c.ZkController waiting to find shard id in clusterstate for testschemaapi_shard1_replica2
   [junit4]   2> 1964590 INFO  (qtp21632847-96714) [n:127.0.0.1:38484_solr c:testschemaapi s:shard1  x:testschemaapi_shard1_replica1] o.a.s.c.ZkController waiting to find shard id in clusterstate for testschemaapi_shard1_replica1
   [junit4]   2> 1964590 INFO  (qtp11938407-96708) [n:127.0.0.1:42499_solr c:testschemaapi s:shard1  x:testschemaapi_shard1_replica2] o.a.s.c.ZkController Check for collection zkNode:testschemaapi
   [junit4]   2> 1964590 INFO  (qtp21632847-96714) [n:127.0.0.1:38484_solr c:testschemaapi s:shard1  x:testschemaapi_shard1_replica1] o.a.s.c.ZkController Check for collection zkNode:testschemaapi
   [junit4]   2> 1964591 INFO  (qtp11938407-96708) [n:127.0.0.1:42499_solr c:testschemaapi s:shard1  x:testschemaapi_shard1_replica2] o.a.s.c.ZkController Collection zkNode exists
   [junit4]   2> 1964591 INFO  (qtp21632847-96714) [n:127.0.0.1:38484_solr c:testschemaapi s:shard1  x:testschemaapi_shard1_replica1] o.a.s.c.ZkController Collection zkNode exists
   [junit4]   2> 1964591 INFO  (qtp11938407-96708) [n:127.0.0.1:42499_solr c:testschemaapi s:shard1  x:testschemaapi_shard1_replica2] o.a.s.c.c.ZkStateReader Load collection config from: [/collections/testschemaapi]
   [junit4]   2> 1964591 INFO  (qtp21632847-96714) [n:127.0.0.1:38484_solr c:testschemaapi s:shard1  x:testschemaapi_shard1_replica1] o.a.s.c.c.ZkStateReader Load collection config from: [/collections/testschemaapi]
   [junit4]   2> 1964591 INFO  (qtp11938407-96708) [n:127.0.0.1:42499_solr c:testschemaapi s:shard1  x:testschemaapi_shard1_replica2] o.a.s.c.c.ZkStateReader path=[/collections/testschemaapi] [configName]=[conf1] specified config exists in ZooKeeper
   [junit4]   2> 1964591 INFO  (qtp11938407-96708) [n:127.0.0.1:42499_solr c:testschemaapi s:shard1  x:testschemaapi_shard1_replica2] o.a.s.c.SolrResourceLoader new SolrResourceLoader for directory: '/home/jenkins/workspace/Lucene-Solr-5.5-Linux/solr/build/solr-core/test/J1/temp/solr.schema.TestManagedSchemaAPI_49B94BCC331D285B-001/tempDir-001/node2/testschemaapi_shard1_replica2'
   [junit4]   2> 1964591 INFO  (qtp21632847-96714) [n:127.0.0.1:38484_solr c:testschemaapi s:shard1  x:testschemaapi_shard1_replica1] o.a.s.c.c.ZkStateReader path=[/collections/testschemaapi] [configName]=[conf1] specified config exists in ZooKeeper
   [junit4]   2> 1964591 INFO  (qtp21632847-96714) [n:127.0.0.1:38484_solr c:testschemaapi s:shard1  x:testschemaapi_shard1_replica1] o.a.s.c.SolrResourceLoader new SolrResourceLoader for directory: '/home/jenkins/workspace/Lucene-Solr-5.5-Linux/solr/build/solr-core/test/J1/temp/solr.schema.TestManagedSchemaAPI_49B94BCC331D285B-001/tempDir-001/node1/testschemaapi_shard1_replica1'
   [junit4]   2> 1964591 INFO  (qtp11938407-96708) [n:127.0.0.1:42499_solr c:testschemaapi s:shard1  x:testschemaapi_shard1_replica2] o.a.s.c.SolrResourceLoader JNDI not configured for solr (NoInitialContextEx)
   [junit4]   2> 1964592 INFO  (qtp11938407-96708) [n:127.0.0.1:42499_solr c:testschemaapi s:shard1  x:testschemaapi_shard1_replica2] o.a.s.c.SolrResourceLoader solr home defaulted to 'solr/' (could not find system property or JNDI)
   [junit4]   2> 1964592 INFO  (qtp21632847-96714) [n:127.0.0.1:38484_solr c:testschemaapi s:shard1  x:testschemaapi_shard1_replica1] o.a.s.c.SolrResourceLoader JNDI not configured for solr (NoInitialContextEx)
   [junit4]   2> 1964592 INFO  (qtp21632847-96714) [n:127.0.0.1:38484_solr c:testschemaapi s:shard1  x:testschemaapi_shard1_replica1] o.a.s.c.SolrResourceLoader solr home defaulted to 'solr/' (could not find system property or JNDI)
   [junit4]   2> 1964593 INFO  (qtp11938407-96708) [n:127.0.0.1:42499_solr c:testschemaapi s:shard1  x:testschemaapi_shard1_replica2] o.a.s.c.Config loaded config solrconfig.xml with version 0 
   [junit4]   2> 1964593 INFO  (qtp21632847-96714) [n:127.0.0.1:38484_solr c:testschemaapi s:shard1  x:testschemaapi_shard1_replica1] o.a.s.c.Config loaded config solrconfig.xml with version 0 
   [junit4]   2> 1964596 INFO  (qtp21632847-96714) [n:127.0.0.1:38484_solr c:testschemaapi s:shard1  x:testschemaapi_shard1_replica1] o.a.s.c.SolrConfig current version of requestparams : -1
   [junit4]   2> 1964596 INFO  (qtp11938407-96708) [n:127.0.0.1:42499_solr c:testschemaapi s:shard1  x:testschemaapi_shard1_replica2] o.a.s.c.SolrConfig current version of requestparams : -1
   [junit4]   2> 1964603 INFO  (qtp11938407-96708) [n:127.0.0.1:42499_solr c:testschemaapi s:shard1  x:testschemaapi_shard1_replica2] o.a.s.c.SolrConfig Using Lucene MatchVersion: 5.5.3
   [junit4]   2> 1964607 INFO  (qtp21632847-96714) [n:127.0.0.1:38484_solr c:testschemaapi s:shard1  x:testschemaapi_shard1_replica1] o.a.s.c.SolrConfig Using Lucene MatchVersion: 5.5.3
   [junit4]   2> 1964618 INFO  (qtp11938407-96708) [n:127.0.0.1:42499_solr c:testschemaapi s:shard1  x:testschemaapi_shard1_replica2] o.a.s.c.SolrConfig Loaded SolrConfig: solrconfig.xml
   [junit4]   2> 1964622 INFO  (qtp11938407-96708) [n:127.0.0.1:42499_solr c:testschemaapi s:shard1  x:testschemaapi_shard1_replica2] o.a.s.s.IndexSchema [testschemaapi_shard1_replica2] Schema name=minimal
   [junit4]   2> 1964624 INFO  (qtp21632847-96714) [n:127.0.0.1:38484_solr c:testschemaapi s:shard1  x:testschemaapi_shard1_replica1] o.a.s.c.SolrConfig Loaded SolrConfig: solrconfig.xml
   [junit4]   2> 1964627 INFO  (qtp21632847-96714) [n:127.0.0.1:38484_solr c:testschemaapi s:shard1  x:testschemaapi_shard1_replica1] o.a.s.s.IndexSchema [testschemaapi_shard1_replica1] Schema name=minimal
   [junit4]   2> 1964630 INFO  (qtp11938407-96708) [n:127.0.0.1:42499_solr c:testschemaapi s:shard1  x:testschemaapi_shard1_replica2] o.a.s.s.IndexSchema unique key field: id
   [junit4]   2> 1964631 INFO  (qtp11938407-96708) [n:127.0.0.1:42499_solr c:testschemaapi s:shard1  x:testschemaapi_shard1_replica2] o.a.s.c.ConfigSetProperties Did not find ConfigSet properties, assuming default properties: Can't find resource 'configsetprops.json' in classpath or '/configs/conf1', cwd=/home/jenkins/workspace/Lucene-Solr-5.5-Linux/solr/build/solr-core/test/J1
   [junit4]   2> 1964631 INFO  (qtp11938407-96708) [n:127.0.0.1:42499_solr c:testschemaapi s:shard1  x:testschemaapi_shard1_replica2] o.a.s.c.CoreContainer Creating SolrCore 'testschemaapi_shard1_replica2' using configuration from collection testschemaapi
   [junit4]   2> 1964632 INFO  (qtp11938407-96708) [n:127.0.0.1:42499_solr c:testschemaapi s:shard1 r:core_node1 x:testschemaapi_shard1_replica2] o.a.s.c.SolrCore org.apache.solr.core.MockDirectoryFactory
   [junit4]   2> 1964632 INFO  (qtp11938407-96708) [n:127.0.0.1:42499_solr c:testschemaapi s:shard1 r:core_node1 x:testschemaapi_shard1_replica2] o.a.s.c.SolrCore [[testschemaapi_shard1_replica2] ] Opening new SolrCore at [/home/jenkins/workspace/Lucene-Solr-5.5-Linux/solr/build/solr-core/test/J1/temp/solr.schema.TestManagedSchemaAPI_49B94BCC331D285B-001/tempDir-001/node2/testschemaapi_shard1_replica2], dataDir=[/home/jenkins/workspace/Lucene-Solr-5.5-Linux/solr/build/solr-core/test/J1/temp/solr.schema.TestManagedSchemaAPI_49B94BCC331D285B-001/tempDir-001/node2/./testschemaapi_shard1_replica2/data/]
   [junit4]   2> 1964632 INFO  (qtp11938407-96708) [n:127.0.0.1:42499_solr c:testschemaapi s:shard1 r:core_node1 x:testschemaapi_shard1_replica2] o.a.s.c.SolrCore JMX monitoring not detected for core: testschemaapi_shard1_replica2
   [junit4]   2> 1964632 INFO  (qtp11938407-96708) [n:127.0.0.1:42499_solr c:testschemaapi s:shard1 r:core_node1 x:testschemaapi_shard1_replica2] o.a.s.c.CachingDirectoryFactory return new directory for /home/jenkins/workspace/Lucene-Solr-5.5-Linux/solr/build/solr-core/test/J1/temp/solr.schema.TestManagedSchemaAPI_49B94BCC331D285B-001/tempDir-001/node2/./testschemaapi_shard1_replica2/data
   [junit4]   2> 1964633 INFO  (qtp11938407-96708) [n:127.0.0.1:42499_solr c:testschemaapi s:shard1 r:core_node1 x:testschemaapi_shard1_replica2] o.a.s.c.SolrCore New index directory detected: old=null new=/home/jenkins/workspace/Lucene-Solr-5.5-Linux/solr/build/solr-core/test/J1/temp/solr.schema.TestManagedSchemaAPI_49B94BCC331D285B-001/tempDir-001/node2/./testschemaapi_shard1_replica2/data/index/
   [junit4]   2> 1964633 WARN  (qtp11938407-96708) [n:127.0.0.1:42499_solr c:testschemaapi s:shard1 r:core_node1 x:testschemaapi_shard1_replica2] o.a.s.c.SolrCore [testschemaapi_shard1_replica2] Solr index directory '/home/jenkins/workspace/Lucene-Solr-5.5-Linux/solr/build/solr-core/test/J1/temp/solr.schema.TestManagedSchemaAPI_49B94BCC331D285B-001/tempDir-001/node2/./testschemaapi_shard1_replica2/data/index' doesn't exist. Creating new index...
   [junit4]   2> 1964633 INFO  (qtp11938407-96708) [n:127.0.0.1:42499_solr c:testschemaapi s:shard1 r:core_node1 x:testschemaapi_shard1_replica2] o.a.s.c.CachingDirectoryFactory return new directory for /home/jenkins/workspace/Lucene-Solr-5.5-Linux/solr/build/solr-core/test/J1/temp/solr.schema.TestManagedSchemaAPI_49B94BCC331D285B-001/tempDir-001/node2/./testschemaapi_shard1_replica2/data/index
   [junit4]   2> 1964633 INFO  (qtp11938407-96708) [n:127.0.0.1:42499_solr c:testschemaapi s:shard1 r:core_node1 x:testschemaapi_shard1_replica2] o.a.s.c.SolrDeletionPolicy SolrDeletionPolicy.onCommit: commits: num=1
   [junit4]   2> 	commit{dir=MockDirectoryWrapper(RAMDirectory@1706959 lockFactory=org.apache.lucene.store.SingleInstanceLockFactory@11476b3),segFN=segments_1,generation=1}
   [junit4]   2> 1964634 INFO  (qtp11938407-96708) [n:127.0.0.1:42499_solr c:testschemaapi s:shard1 r:core_node1 x:testschemaapi_shard1_replica2] o.a.s.c.SolrDeletionPolicy newest commit generation = 1
   [junit4]   2> 1964634 INFO  (OldIndexDirectoryCleanupThreadForCore-testschemaapi_shard1_replica2) [n:127.0.0.1:42499_solr c:testschemaapi s:shard1 r:core_node1 x:testschemaapi_shard1_replica2] o.a.s.c.SolrCore Looking for old index directories to cleanup for core testschemaapi_shard1_replica2 in /home/jenkins/workspace/Lucene-Solr-5.5-Linux/solr/build/solr-core/test/J1/temp/solr.schema.TestManagedSchemaAPI_49B94BCC331D285B-001/tempDir-001/node2/./testschemaapi_shard1_replica2/data/
   [junit4]   2> 1964634 INFO  (qtp21632847-96714) [n:127.0.0.1:38484_solr c:testschemaapi s:shard1  x:testschemaapi_shard1_replica1] o.a.s.s.IndexSchema unique key field: id
   [junit4]   2> 1964634 WARN  (OldIndexDirectoryCleanupThreadForCore-testschemaapi_shard1_replica2) [n:127.0.0.1:42499_solr c:testschemaapi s:shard1 r:core_node1 x:testschemaapi_shard1_replica2] o.a.s.c.DirectoryFactory /home/jenkins/workspace/Lucene-Solr-5.5-Linux/solr/build/solr-core/test/J1/temp/solr.schema.TestManagedSchemaAPI_49B94BCC331D285B-001/tempDir-001/node2/./testschemaapi_shard1_replica2/data/ does not point to a valid data directory; skipping clean-up of old index directories.
   [junit4]   2> 1964635 INFO  (qtp21632847-96714) [n:127.0.0.1:38484_solr c:testschemaapi s:shard1  x:testschemaapi_shard1_replica1] o.a.s.c.ConfigSetProperties Did not find ConfigSet properties, assuming default properties: Can't find resource 'configsetprops.json' in classpath or '/configs/conf1', cwd=/home/jenkins/workspace/Lucene-Solr-5.5-Linux/solr/build/solr-core/test/J1
   [junit4]   2> 1964635 INFO  (qtp21632847-96714) [n:127.0.0.1:38484_solr c:testschemaapi s:shard1  x:testschemaapi_shard1_replica1] o.a.s.c.CoreContainer Creating SolrCore 'testschemaapi_shard1_replica1' using configuration from collection testschemaapi
   [junit4]   2> 1964635 INFO  (qtp11938407-96708) [n:127.0.0.1:42499_solr c:testschemaapi s:shard1 r:core_node1 x:testschemaapi_shard1_replica2] o.a.s.c.SolrCore no updateRequestProcessorChain defined as default, creating implicit default
   [junit4]   2> 1964635 INFO  (qtp21632847-96714) [n:127.0.0.1:38484_solr c:testschemaapi s:shard1 r:core_node2 x:testschemaapi_shard1_replica1] o.a.s.c.SolrCore org.apache.solr.core.MockDirectoryFactory
   [junit4]   2> 1964635 INFO  (qtp21632847-96714) [n:127.0.0.1:38484_solr c:testschemaapi s:shard1 r:core_node2 x:testschemaapi_shard1_replica1] o.a.s.c.SolrCore [[testschemaapi_shard1_replica1] ] Opening new SolrCore at [/home/jenkins/workspace/Lucene-Solr-5.5-Linux/solr/build/solr-core/test/J1/temp/solr.schema.TestManagedSchemaAPI_49B94BCC331D285B-001/tempDir-001/node1/testschemaapi_shard1_replica1], dataDir=[/home/jenkins/workspace/Lucene-Solr-5.5-Linux/solr/build/solr-core/test/J1/temp/solr.schema.TestManagedSchemaAPI_49B94BCC331D285B-001/tempDir-001/node1/./testschemaapi_shard1_replica1/data/]
   [junit4]   2> 1964635 INFO  (qtp21632847-96714) [n:127.0.0.1:38484_solr c:testschemaapi s:shard1 r:core_node2 x:testschemaapi_shard1_replica1] o.a.s.c.SolrCore JMX monitoring not detected for core: testschemaapi_shard1_replica1
   [junit4]   2> 1964636 INFO  (qtp21632847-96714) [n:127.0.0.1:38484_solr c:testschemaapi s:shard1 r:core_node2 x:testschemaapi_shard1_replica1] o.a.s.c.CachingDirectoryFactory return new directory for /home/jenkins/workspace/Lucene-Solr-5.5-Linux/solr/build/solr-core/test/J1/temp/solr.schema.TestManagedSchemaAPI_49B94BCC331D285B-001/tempDir-001/node1/./testschemaapi_shard1_replica1/data
   [junit4]   2> 1964636 INFO  (qtp21632847-96714) [n:127.0.0.1:38484_solr c:testschemaapi s:shard1 r:core_node2 x:testschemaapi_shard1_replica1] o.a.s.c.SolrCore New index directory detected: old=null new=/home/jenkins/workspace/Lucene-Solr-5.5-Linux/solr/build/solr-core/test/J1/temp/solr.schema.TestManagedSchemaAPI_49B94BCC331D285B-001/tempDir-001/node1/./testschemaapi_shard1_replica1/data/index/
   [junit4]   2> 1964636 WARN  (qtp21632847-96714) [n:127.0.0.1:38484_solr c:testschemaapi s:shard1 r:core_node2 x:testschemaapi_shard1_replica1] o.a.s.c.SolrCore [testschemaapi_shard1_replica1] Solr index directory '/home/jenkins/workspace/Lucene-Solr-5.5-Linux/solr/build/solr-core/test/J1/temp/solr.schema.TestManagedSchemaAPI_49B94BCC331D285B-001/tempDir-001/node1/./testschemaapi_shard1_replica1/data/index' doesn't exist. Creating new index...
   [junit4]   2> 1964636 INFO  (qtp21632847-96714) [n:127.0.0.1:38484_solr c:testschemaapi s:shard1 r:core_node2 x:testschemaapi_shard1_replica1] o.a.s.c.CachingDirectoryFactory return new directory for /home/jenkins/workspace/Lucene-Solr-5.5-Linux/solr/build/solr-core/test/J1/temp/solr.schema.TestManagedSchemaAPI_49B94BCC331D285B-001/tempDir-001/node1/./testschemaapi_shard1_replica1/data/index
   [junit4]   2> 1964636 INFO  (qtp21632847-96714) [n:127.0.0.1:38484_solr c:testschemaapi s:shard1 r:core_node2 x:testschemaapi_shard1_replica1] o.a.s.c.SolrDeletionPolicy SolrDeletionPolicy.onCommit: commits: num=1
   [junit4]   2> 	commit{dir=MockDirectoryWrapper(RAMDirectory@15f6188 lockFactory=org.apache.lucene.store.SingleInstanceLockFactory@fc6806),segFN=segments_1,generation=1}
   [junit4]   2> 1964636 INFO  (qtp21632847-96714) [n:127.0.0.1:38484_solr c:testschemaapi s:shard1 r:core_node2 x:testschemaapi_shard1_replica1] o.a.s.c.SolrDeletionPolicy newest commit generation = 1
   [junit4]   2> 1964637 INFO  (OldIndexDirectoryCleanupThreadForCore-testschemaapi_shard1_replica1) [n:127.0.0.1:38484_solr c:testschemaapi s:shard1 r:core_node2 x:testschemaapi_shard1_replica1] o.a.s.c.SolrCore Looking for old index directories to cleanup for core testschemaapi_shard1_replica1 in /home/jenkins/workspace/Lucene-Solr-5.5-Linux/solr/build/solr-core/test/J1/temp/solr.schema.TestManagedSchemaAPI_49B94BCC331D285B-001/tempDir-001/node1/./testschemaapi_shard1_replica1/data/
   [junit4]   2> 1964637 INFO  (qtp11938407-96708) [n:127.0.0.1:42499_solr c:testschemaapi s:shard1 r:core_node1 x:testschemaapi_shard1_replica2] o.a.s.h.l.XMLLoader xsltCacheLifetimeSeconds=60
   [junit4]   2> 1964637 WARN  (OldIndexDirectoryCleanupThreadForCore-testschemaapi_shard1_replica1) [n:127.0.0.1:38484_solr c:testschemaapi s:shard1 r:core_node2 x:testschemaapi_shard1_replica1] o.a.s.c.DirectoryFactory /home/jenkins/workspace/Lucene-Solr-5.5-Linux/solr/build/solr-core/test/J1/temp/solr.schema.TestManagedSchemaAPI_49B94BCC331D285B-001/tempDir-001/node1/./testschemaapi_shard1_replica1/data/ does not point to a valid data directory; skipping clean-up of old index directories.
   [junit4]   2> 1964637 INFO  (qtp21632847-96714) [n:127.0.0.1:38484_solr c:testschemaapi s:shard1 r:core_node2 x:testschemaapi_shard1_replica1] o.a.s.c.SolrCore no updateRequestProcessorChain defined as default, creating implicit default
   [junit4]   2> 1964638 INFO  (qtp11938407-96708) [n:127.0.0.1:42499_solr c:testschemaapi s:shard1 r:core_node1 x:testschemaapi_shard1_replica2] o.a.s.h.l.XMLLoader xsltCacheLifetimeSeconds=60
   [junit4]   2> 1964638 INFO  (qtp21632847-96714) [n:127.0.0.1:38484_solr c:testschemaapi s:shard1 r:core_node2 x:testschemaapi_shard1_replica1] o.a.s.h.l.XMLLoader xsltCacheLifetimeSeconds=60
   [junit4]   2> 1964638 INFO  (qtp11938407-96708) [n:127.0.0.1:42499_solr c:testschemaapi s:shard1 r:core_node1 x:testschemaapi_shard1_replica2] o.a.s.h.l.XMLLoader xsltCacheLifetimeSeconds=60
   [junit4]   2> 1964639 INFO  (qtp21632847-96714) [n:127.0.0.1:38484_solr c:testschemaapi s:shard1 r:core_node2 x:testschemaapi_shard1_replica1] o.a.s.h.l.XMLLoader xsltCacheLifetimeSeconds=60
   [junit4]   2> 1964639 INFO  (qtp11938407-96708) [n:127.0.0.1:42499_solr c:testschemaapi s:shard1 r:core_node1 x:testschemaapi_shard1_replica2] o.a.s.h.l.XMLLoader xsltCacheLifetimeSeconds=60
   [junit4]   2> 1964640 INFO  (qtp21632847-96714) [n:127.0.0.1:38484_solr c:testschemaapi s:shard1 r:core_node2 x:testschemaapi_shard1_replica1] o.a.s.h.l.XMLLoader xsltCacheLifetimeSeconds=60
   [junit4]   2> 1964640 INFO  (qtp11938407-96708) [n:127.0.0.1:42499_solr c:testschemaapi s:shard1 r:core_node1 x:testschemaapi_shard1_replica2] o.a.s.c.RequestHandlers Registered paths: /get,/update/json,/config,/admin/logging,/schema,/update/csv,/update,/admin/properties,/select,/update/json/docs,/admin/mbeans,/admin/file,/admin/segments,/replication,/admin/threads,/admin/plugins,/admin/ping,/admin/system,/admin/luke
   [junit4]   2> 1964641 INFO  (qtp21632847-96714) [n:127.0.0.1:38484_solr c:testschemaapi s:shard1 r:core_node2 x:testschemaapi_shard1_replica1] o.a.s.h.l.XMLLoader xsltCacheLifetimeSeconds=60
   [junit4]   2> 1964641 INFO  (qtp11938407-96708) [n:127.0.0.1:42499_solr c:testschemaapi s:shard1 r:core_node1 x:testschemaapi_shard1_replica2] o.a.s.c.SolrCore Using default statsCache cache: org.apache.solr.search.stats.LocalStatsCache
   [junit4]   2> 1964642 INFO  (qtp11938407-96708) [n:127.0.0.1:42499_solr c:testschemaapi s:shard1 r:core_node1 x:testschemaapi_shard1_replica2] o.a.s.u.UpdateHandler Using UpdateLog implementation: org.apache.solr.update.UpdateLog
   [junit4]   2> 1964642 INFO  (qtp11938407-96708) [n:127.0.0.1:42499_solr c:testschemaapi s:shard1 r:core_node1 x:testschemaapi_shard1_replica2] o.a.s.u.UpdateLog Initializing UpdateLog: dataDir=null defaultSyncLevel=FLUSH numRecordsToKeep=100 maxNumLogsToKeep=10 numVersionBuckets=65536
   [junit4]   2> 1964642 INFO  (qtp21632847-96714) [n:127.0.0.1:38484_solr c:testschemaapi s:shard1 r:core_node2 x:testschemaapi_shard1_replica1] o.a.s.c.RequestHandlers Registered paths: /get,/update/json,/config,/admin/logging,/schema,/update/csv,/update,/admin/properties,/select,/update/json/docs,/admin/mbeans,/admin/file,/admin/segments,/replication,/admin/threads,/admin/plugins,/admin/ping,/admin/system,/admin/luke
   [junit4]   2> 1964642 INFO  (qtp11938407-96708) [n:127.0.0.1:42499_solr c:testschemaapi s:shard1 r:core_node1 x:testschemaapi_shard1_replica2] o.a.s.u.CommitTracker Hard AutoCommit: disabled
   [junit4]   2> 1964642 INFO  (qtp11938407-96708) [n:127.0.0.1:42499_solr c:testschemaapi s:shard1 r:core_node1 x:testschemaapi_shard1_replica2] o.a.s.u.CommitTracker Soft AutoCommit: disabled
   [junit4]   2> 1964642 INFO  (qtp21632847-96714) [n:127.0.0.1:38484_solr c:testschemaapi s:shard1 r:core_node2 x:testschemaapi_shard1_replica1] o.a.s.c.SolrCore Using default statsCache cache: org.apache.solr.search.stats.LocalStatsCache
   [junit4]   2> 1964643 INFO  (qtp11938407-96708) [n:127.0.0.1:42499_solr c:testschemaapi s:shard1 r:core_node1 x:testschemaapi_shard1_replica2] o.a.s.c.SolrDeletionPolicy SolrDeletionPolicy.onInit: commits: num=1
   [junit4]   2> 	commit{dir=MockDirectoryWrapper(RAMDirectory@1706959 lockFactory=org.apache.lucene.store.SingleInstanceLockFactory@11476b3),segFN=segments_1,generation=1}
   [junit4]   2> 1964643 INFO  (qtp11938407-96708) [n:127.0.0.1:42499_solr c:testschemaapi s:shard1 r:core_node1 x:testschemaapi_shard1_replica2] o.a.s.c.SolrDeletionPolicy newest commit generation = 1
   [junit4]   2> 1964643 INFO  (qtp21632847-96714) [n:127.0.0.1:38484_solr c:testschemaapi s:shard1 r:core_node2 x:testschemaapi_shard1_replica1] o.a.s.u.UpdateHandler Using UpdateLog implementation: org.apache.solr.update.UpdateLog
   [junit4]   2> 1964643 INFO  (qtp21632847-96714) [n:127.0.0.1:38484_solr c:testschemaapi s:shard1 r:core_node2 x:testschemaapi_shard1_replica1] o.a.s.u.UpdateLog Initializing UpdateLog: dataDir=null defaultSyncLevel=FLUSH numRecordsToKeep=100 maxNumLogsToKeep=10 numVersionBuckets=65536
   [junit4]   2> 1964643 INFO  (qtp11938407-96708) [n:127.0.0.1:42499_solr c:testschemaapi s:shard1 r:core_node1 x:testschemaapi_shard1_replica2] o.a.s.s.SolrIndexSearcher Opening Searcher@18048e5[testschemaapi_shard1_replica2] main
   [junit4]   2> 1964643 INFO  (qtp11938407-96708) [n:127.0.0.1:42499_solr c:testschemaapi s:shard1 r:core_node1 x:testschemaapi_shard1_replica2] o.a.s.c.c.ZkStateReader Load collection config from: [/collections/testschemaapi]
   [junit4]   2> 1964643 INFO  (qtp11938407-96708) [n:127.0.0.1:42499_solr c:testschemaapi s:shard1 r:core_node1 x:testschemaapi_shard1_replica2] o.a.s.c.c.ZkStateReader path=[/collections/testschemaapi] [configName]=[conf1] specified config exists in ZooKeeper
   [junit4]   2> 1964643 INFO  (qtp11938407-96708) [n:127.0.0.1:42499_solr c:testschemaapi s:shard1 r:core_node1 x:testschemaapi_shard1_replica2] o.a.s.r.ManagedResourceStorage Setting up ZooKeeper-based storage for the RestManager with znodeBase: /configs/conf1
   [junit4]   2> 1964643 INFO  (qtp21632847-96714) [n:127.0.0.1:38484_solr c:testschemaapi s:shard1 r:core_node2 x:testschemaapi_shard1_replica1] o.a.s.u.CommitTracker Hard AutoCommit: disabled
   [junit4]   2> 1964644 INFO  (qtp21632847-96714) [n:127.0.0.1:38484_solr c:testschemaapi s:shard1 r:core_node2 x:testschemaapi_shard1_replica1] o.a.s.u.CommitTracker Soft AutoCommit: disabled
   [junit4]   2> 1964644 INFO  (qtp11938407-96708) [n:127.0.0.1:42499_solr c:testschemaapi s:shard1 r:core_node1 x:testschemaapi_shard1_replica2] o.a.s.r.ManagedResourceStorage Configured ZooKeeperStorageIO with znodeBase: /configs/conf1
   [junit4]   2> 1964644 INFO  (qtp11938407-96708) [n:127.0.0.1:42499_solr c:testschemaapi s:shard1 r:core_node1 x:testschemaapi_shard1_replica2] o.a.s.r.RestManager Initializing RestManager with initArgs: {}
   [junit4]   2> 1964644 INFO  (qtp11938407-96708) [n:127.0.0.1:42499_solr c:testschemaapi s:shard1 r:core_node1 x:testschemaapi_shard1_replica2] o.a.s.r.ManagedResourceStorage Reading _rest_managed.json using ZooKeeperStorageIO:path=/configs/conf1
   [junit4]   2> 1964644 INFO  (qtp21632847-96714) [n:127.0.0.1:38484_solr c:testschemaapi s:shard1 r:core_node2 x:testschemaapi_shard1_replica1] o.a.s.c.SolrDeletionPolicy SolrDeletionPolicy.onInit: commits: num=1
   [junit4]   2> 	commit{dir=MockDirectoryWrapper(RAMDirectory@15f6188 lockFactory=org.apache.lucene.store.SingleInstanceLockFactory@fc6806),segFN=segments_1,generation=1}
   [junit4]   2> 1964644 INFO  (qtp21632847-96714) [n:127.0.0.1:38484_solr c:testschemaapi s:shard1 r:core_node2 x:testschemaapi_shard1_replica1] o.a.s.c.SolrDeletionPolicy newest commit generation = 1
   [junit4]   2> 1964644 INFO  (qtp11938407-96708) [n:127.0.0.1:42499_solr c:testschemaapi s:shard1 r:core_node1 x:testschemaapi_shard1_replica2] o.a.s.r.ManagedResourceStorage No data found for znode /configs/conf1/_rest_managed.json
   [junit4]   2> 1964644 INFO  (qtp21632847-96714) [n:127.0.0.1:38484_solr c:testschemaapi s:shard1 r:core_node2 x:testschemaapi_shard1_replica1] o.a.s.s.SolrIndexSearcher Opening Searcher@15930fb[testschemaapi_shard1_replica1] main
   [junit4]   2> 1964644 INFO  (qtp11938407-96708) [n:127.0.0.1:42499_solr c:testschemaapi s:shard1 r:core_node1 x:testschemaapi_shard1_replica2] o.a.s.r.ManagedResourceStorage Loaded null at path _rest_managed.json using ZooKeeperStorageIO:path=/configs/conf1
   [junit4]   2> 1964644 INFO  (qtp21632847-96714) [n:127.0.0.1:38484_solr c:testschemaapi s:shard1 r:core_node2 x:testschemaapi_shard1_replica1] o.a.s.c.c.ZkStateReader Load collection config from: [/collections/testschemaapi]
   [junit4]   2> 1964644 INFO  (qtp11938407-96708) [n:127.0.0.1:42499_solr c:testschemaapi s:shard1 r:core_node1 x:testschemaapi_shard1_replica2] o.a.s.r.RestManager Initializing 0 registered ManagedResources
   [junit4]   2> 1964644 INFO  (qtp11938407-96708) [n:127.0.0.1:42499_solr c:testschemaapi s:shard1 r:core_node1 x:testschemaapi_shard1_replica2] o.a.s.s.ZkIndexSchemaReader Creating ZooKeeper watch for the managed schema at /configs/conf1/managed-schema
   [junit4]   2> 1964644 INFO  (qtp11938407-96708) [n:127.0.0.1:42499_solr c:testschemaapi s:shard1 r:core_node1 x:testschemaapi_shard1_replica2] o.a.s.c.ZkController Added new OnReconnect listener ZkIndexSchemaReader: /configs/conf1/managed-schema, uniqueCoreId: testschemaapi_shard1_replica2:4221303514914800
   [junit4]   2> 1964644 INFO  (qtp21632847-96714) [n:127.0.0.1:38484_solr c:testschemaapi s:shard1 r:core_node2 x:testschemaapi_shard1_replica1] o.a.s.c.c.ZkStateReader path=[/collections/testschemaapi] [configName]=[conf1] specified config exists in ZooKeeper
   [junit4]   2> 1964644 INFO  (qtp11938407-96708) [n:127.0.0.1:42499_solr c:testschemaapi s:shard1 r:core_node1 x:testschemaapi_shard1_replica2] o.a.s.h.ReplicationHandler Commits will be reserved for  10000
   [junit4]   2> 1964645 INFO  (qtp21632847-96714) [n:127.0.0.1:38484_solr c:testschemaapi s:shard1 r:core_node2 x:testschemaapi_shard1_replica1] o.a.s.r.ManagedResourceStorage Setting up ZooKeeper-based storage for the RestManager with znodeBase: /configs/conf1
   [junit4]   2> 1964645 INFO  (searcherExecutor-11694-thread-1-processing-n:127.0.0.1:42499_solr r:core_node1 s:shard1 c:testschemaapi x:testschemaapi_shard1_replica2) [n:127.0.0.1:42499_solr c:testschemaapi s:shard1 r:core_node1 x:testschemaapi_shard1_replica2] o.a.s.c.SolrCore [testschemaapi_shard1_replica2] Registered new searcher Searcher@18048e5[testschemaapi_shard1_replica2] main{ExitableDirectoryReader(UninvertingDirectoryReader())}
   [junit4]   2> 1964645 INFO  (qtp21632847-96714) [n:127.0.0.1:38484_solr c:testschemaapi s:shard1 r:core_node2 x:testschemaapi_shard1_replica1] o.a.s.r.ManagedResourceStorage Configured ZooKeeperStorageIO with znodeBase: /configs/conf1
   [junit4]   2> 1964645 INFO  (qtp11938407-96708) [n:127.0.0.1:42499_solr c:testschemaapi s:shard1 r:core_node1 x:testschemaapi_shard1_replica2] o.a.s.u.UpdateLog Looking up max value of version field to seed version buckets
   [junit4]   2> 1964645 INFO  (qtp21632847-96714) [n:127.0.0.1:38484_solr c:testschemaapi s:shard1 r:core_node2 x:testschemaapi_shard1_replica1] o.a.s.r.RestManager Initializing RestManager with initArgs: {}
   [junit4]   2> 1964645 INFO  (qtp11938407-96708) [n:127.0.0.1:42499_solr c:testschemaapi s:shard1 r:core_node1 x:testschemaapi_shard1_replica2] o.a.s.u.VersionInfo Refreshing highest value of _version_ for 65536 version buckets from index
   [junit4]   2> 1964645 INFO  (qtp21632847-96714) [n:127.0.0.1:38484_solr c:testschemaapi s:shard1 r:core_node2 x:testschemaapi_shard1_replica1] o.a.s.r.ManagedResourceStorage Reading _rest_managed.json using ZooKeeperStorageIO:path=/configs/conf1
   [junit4]   2> 1964645 INFO  (qtp11938407-96708) [n:127.0.0.1:42499_solr c:testschemaapi s:shard1 r:core_node1 x:testschemaapi_shard1_replica2] o.a.s.u.VersionInfo No terms found for _version_, cannot seed version bucket highest value from index
   [junit4]   2> 1964646 INFO  (qtp11938407-96708) [n:127.0.0.1:42499_solr c:testschemaapi s:shard1 r:core_node1 x:testschemaapi_shard1_replica2] o.a.s.u.UpdateLog Could not find max version in index or recent updates, using new clock 1544477446899761152
   [junit4]   2> 1964646 INFO  (qtp21632847-96714) [n:127.0.0.1:38484_solr c:testschemaapi s:shard1 r:core_node2 x:testschemaapi_shard1_replica1] o.a.s.r.ManagedResourceStorage No data found for znode /configs/conf1/_rest_managed.json
   [junit4]   2> 1964646 INFO  (qtp21632847-96714) [n:127.0.0.1:38484_solr c:testschemaapi s:shard1 r:core_node2 x:testschemaapi_shard1_replica1] o.a.s.r.ManagedResourceStorage Loaded null at path _rest_managed.json using ZooKeeperStorageIO:path=/configs/conf1
   [junit4]   2> 1964646 INFO  (qtp21632847-96714) [n:127.0.0.1:38484_solr c:testschemaapi s:shard1 r:core_node2 x:testschemaapi_shard1_replica1] o.a.s.r.RestManager Initializing 0 registered ManagedResources
   [junit4]   2> 1964646 INFO  (qtp21632847-96714) [n:127.0.0.1:38484_solr c:testschemaapi s:shard1 r:core_node2 x:testschemaapi_shard1_replica1] o.a.s.s.ZkIndexSchemaReader Creating ZooKeeper watch for the managed schema at /configs/conf1/managed-schema
   [junit4]   2> 1964646 INFO  (qtp21632847-96714) [n:127.0.0.1:38484_solr c:testschemaapi s:shard1 r:core_node2 x:testschemaapi_shard1_replica1] o.a.s.c.ZkController Added new OnReconnect listener ZkIndexSchemaReader: /configs/conf1/managed-schema, uniqueCoreId: testschemaapi_shard1_replica1:4221303518125503
   [junit4]   2> 1964646 INFO  (qtp21632847-96714) [n:127.0.0.1:38484_solr c:testschemaapi s:shard1 r:core_node2 x:testschemaapi_shard1_replica1] o.a.s.h.ReplicationHandler Commits will be reserved for  10000
   [junit4]   2> 1964646 INFO  (searcherExecutor-11695-thread-1-processing-n:127.0.0.1:38484_solr r:core_node2 s:shard1 c:testschemaapi x:testschemaapi_shard1_replica1) [n:127.0.0.1:38484_solr c:testschemaapi s:shard1 r:core_node2 x:testschemaapi_shard1_replica1] o.a.s.c.SolrCore [testschemaapi_shard1_replica1] Registered new searcher Searcher@15930fb[testschemaapi_shard1_replica1] main{ExitableDirectoryReader(UninvertingDirectoryReader())}
   [junit4]   2> 1964646 INFO  (qtp21632847-96714) [n:127.0.0.1:38484_solr c:testschemaapi s:shard1 r:core_node2 x:testschemaapi_shard1_replica1] o.a.s.u.UpdateLog Looking up max value of version field to seed version buckets
   [junit4]   2> 1964646 INFO  (qtp21632847-96714) [n:127.0.0.1:38484_solr c:testschemaapi s:shard1 r:core_node2 x:testschemaapi_shard1_replica1] o.a.s.u.VersionInfo Refreshing highest value of _version_ for 65536 version buckets from index
   [junit4]   2> 1964646 INFO  (qtp21632847-96714) [n:127.0.0.1:38484_solr c:testschemaapi s:shard1 r:core_node2 x:testschemaapi_shard1_replica1] o.a.s.u.VersionInfo No terms found for _version_, cannot seed version bucket highest value from index
   [junit4]   2> 1964646 INFO  (qtp21632847-96714) [n:127.0.0.1:38484_solr c:testschemaapi s:shard1 r:core_node2 x:testschemaapi_shard1_replica1] o.a.s.u.UpdateLog Could not find max version in index or recent updates, using new clock 1544477446899761152
   [junit4]   2> 1964647 INFO  (qtp11938407-96708) [n:127.0.0.1:42499_solr c:testschemaapi s:shard1 r:core_node1 x:testschemaapi_shard1_replica2] o.a.s.u.UpdateLog Took 1.0ms to seed version buckets with highest version 1544477446899761152
   [junit4]   2> 1964647 INFO  (qtp11938407-96708) [n:127.0.0.1:42499_solr c:testschemaapi s:shard1 r:core_node1 x:testschemaapi_shard1_replica2] o.a.s.c.ZkController watch zkdir /configs/conf1
   [junit4]   2> 1964648 INFO  (qtp11938407-96708) [n:127.0.0.1:42499_solr c:testschemaapi s:shard1 r:core_node1 x:testschemaapi_shard1_replica2] o.a.s.c.CoreContainer registering core: testschemaapi_shard1_replica2
   [junit4]   2> 1964648 INFO  (qtp11938407-96708) [n:127.0.0.1:42499_solr c:testschemaapi s:shard1 r:core_node1 x:testschemaapi_shard1_replica2] o.a.s.c.ZkController Register replica - core:testschemaapi_shard1_replica2 address:http://127.0.0.1:42499/solr collection:testschemaapi shard:shard1
   [junit4]   2> 1964648 INFO  (qtp21632847-96714) [n:127.0.0.1:38484_solr c:testschemaapi s:shard1 r:core_node2 x:testschemaapi_shard1_replica1] o.a.s.u.UpdateLog Took 1.0ms to seed version buckets with highest version 1544477446899761152
   [junit4]   2> 1964648 INFO  (qtp11938407-96708) [n:127.0.0.1:42499_solr c:testschemaapi s:shard1 r:core_node1 x:testschemaapi_shard1_replica2] o.a.s.c.c.SolrZkClient makePath: /collections/testschemaapi/leader_elect/shard1/election
   [junit4]   2> 1964648 INFO  (qtp21632847-96714) [n:127.0.0.1:38484_solr c:testschemaapi s:shard1 r:core_node2 x:testschemaapi_shard1_replica1] o.a.s.c.ZkController watch zkdir /configs/conf1
   [junit4]   2> 1964648 INFO  (qtp21632847-96714) [n:127.0.0.1:38484_solr c:testschemaapi s:shard1 r:core_node2 x:testschemaapi_shard1_replica1] o.a.s.c.CoreContainer registering core: testschemaapi_shard1_replica1
   [junit4]   2> 1964649 INFO  (qtp21632847-96714) [n:127.0.0.1:38484_solr c:testschemaapi s:shard1 r:core_node2 x:testschemaapi_shard1_replica1] o.a.s.c.ZkController Register replica - core:testschemaapi_shard1_replica1 address:http://127.0.0.1:38484/solr collection:testschemaapi shard:shard1
   [junit4]   2> 1964649 INFO  (qtp21632847-96714) [n:127.0.0.1:38484_solr c:testschemaapi s:shard1 r:core_node2 x:testschemaapi_shard1_replica1] o.a.s.c.c.SolrZkClient makePath: /collections/testschemaapi/leader_elect/shard1/election
   [junit4]   2> 1964649 INFO  (qtp11938407-96708) [n:127.0.0.1:42499_solr c:testschemaapi s:shard1 r:core_node1 x:testschemaapi_shard1_replica2] o.a.s.c.LeaderElector Joined leadership election with path: /collections/testschemaapi/leader_elect/shard1/election/96529840341319685-core_node1-n_0000000000
   [junit4]   2> 1964650 INFO  (qtp11938407-96708) [n:127.0.0.1:42499_solr c:testschemaapi s:shard1 r:core_node1 x:testschemaapi_shard1_replica2] o.a.s.c.ShardLeaderElectionContext Running the leader process for shard=shard1 and weAreReplacement=false and leaderVoteWait=10000
   [junit4]   2> 1964650 INFO  (qtp21632847-96714) [n:127.0.0.1:38484_solr c:testschemaapi s:shard1 r:core_node2 x:testschemaapi_shard1_replica1] o.a.s.c.LeaderElector Joined leadership election with path: /collections/testschemaapi/leader_elect/shard1/election/96529840341319686-core_node2-n_0000000001
   [junit4]   2> 1964650 INFO  (qtp11938407-96708) [n:127.0.0.1:42499_solr c:testschemaapi s:shard1 r:core_node1 x:testschemaapi_shard1_replica2] o.a.s.c.ShardLeaderElectionContext Enough replicas found to continue.
   [junit4]   2> 1964650 INFO  (qtp11938407-96708) [n:127.0.0.1:42499_solr c:testschemaapi s:shard1 r:core_node1 x:testschemaapi_shard1_replica2] o.a.s.c.ShardLeaderElectionContext I may be the new leader - try and sync
   [junit4]   2> 1964650 INFO  (qtp11938407-96708) [n:127.0.0.1:42499_solr c:testschemaapi s:shard1 r:core_node1 x:testschemaapi_shard1_replica2] o.a.s.c.SyncStrategy Sync replicas to http://127.0.0.1:42499/solr/testschemaapi_shard1_replica2/
   [junit4]   2> 1964650 INFO  (qtp11938407-96708) [n:127.0.0.1:42499_solr c:testschemaapi s:shard1 r:core_node1 x:testschemaapi_shard1_replica2] o.a.s.u.PeerSync PeerSync: core=testschemaapi_shard1_replica2 url=http://127.0.0.1:42499/solr START replicas=[http://127.0.0.1:38484/solr/testschemaapi_shard1_replica1/] nUpdates=100
   [junit4]   2> 1964650 INFO  (qtp21632847-96714) [n:127.0.0.1:38484_solr c:testschemaapi s:shard1 r:core_node2 x:testschemaapi_shard1_replica1] o.a.s.c.LeaderElector Watching path /collections/testschemaapi/leader_elect/shard1/election/96529840341319685-core_node1-n_0000000000 to know if I could be the leader
   [junit4]   2> 1964650 INFO  (OverseerStateUpdate-96529840341319686-127.0.0.1:38484_solr-n_0000000000) [n:127.0.0.1:38484_solr    ] o.a.s.c.Overseer processMessage: queueSize: 1, message = {
   [junit4]   2>   "operation":"leader",
   [junit4]   2>   "shard":"shard1",
   [junit4]   2>   "collection":"testschemaapi"} current state version: 0
   [junit4]   2> 1964651 INFO  (qtp11938407-96708) [n:127.0.0.1:42499_solr c:testschemaapi s:shard1 r:core_node1 x:testschemaapi_shard1_replica2] o.a.s.u.PeerSync PeerSync: core=testschemaapi_shard1_replica2 url=http://127.0.0.1:42499/solr DONE.  We have no versions.  sync failed.
   [junit4]   2> 1964651 INFO  (qtp11938407-96708) [n:127.0.0.1:42499_solr c:testschemaapi s:shard1 r:core_node1 x:testschemaapi_shard1_replica2] o.a.s.c.SyncStrategy Leader's attempt to sync with shard failed, moving to the next candidate
   [junit4]   2> 1964651 INFO  (qtp11938407-96708) [n:127.0.0.1:42499_solr c:testschemaapi s:shard1 r:core_node1 x:testschemaapi_shard1_replica2] o.a.s.c.ShardLeaderElectionContext We failed sync, but we have no versions - we can't sync in that case - we were active before, so become leader anyway
   [junit4]   2> 1964652 INFO  (qtp11938407-96708) [n:127.0.0.1:42499_solr c:testschemaapi s:shard1 r:core_node1 x:testschemaapi_shard1_replica2] o.a.s.c.c.SolrZkClient makePath: /collections/testschemaapi/leaders/shard1
   [junit4]   2> 1964654 INFO  (qtp21632847-96715) [n:127.0.0.1:38484_solr c:testschemaapi s:shard1 r:core_node2 x:testschemaapi_shard1_replica1] o.a.s.c.S.Request [testschemaapi_shard1_replica1]  webapp=/solr path=/get params={version=2&qt=/get&distrib=false&getVersions=100&wt=javabin&fingerprint=false} status=0 QTime=1
   [junit4]   2> 1964654 INFO  (qtp11938407-96708) [n:127.0.0.1:42499_solr c:testschemaapi s:shard1 r:core_node1 x:testschemaapi_shard1_replica2] o.a.s.c.ShardLeaderElectionContextBase Creating leader registration node /collections/testschemaapi/leaders/shard1/leader after winning as /collections/testschemaapi/leader_elect/shard1/election/96529840341319685-core_node1-n_0000000000
   [junit4]   2> 1964655 INFO  (qtp11938407-96708) [n:127.0.0.1:42499_solr c:testschemaapi s:shard1 r:core_node1 x:testschemaapi_shard1_replica2] o.a.s.c.ShardLeaderElectionContext I am the new leader: http://127.0.0.1:42499/solr/testschemaapi_shard1_replica2/ shard1
   [junit4]   2> 1964655 INFO  (OverseerStateUpdate-96529840341319686-127.0.0.1:38484_solr-n_0000000000) [n:127.0.0.1:38484_solr    ] o.a.s.c.Overseer processMessage: queueSize: 1, message = {
   [junit4]   2>   "operation":"leader",
   [junit4]   2>   "shard":"shard1",
   [junit4]   2>   "collection":"testschemaapi",
   [junit4]   2>   "base_url":"http://127.0.0.1:42499/solr",
   [junit4]   2>   "core":"testschemaapi_shard1_replica2",
   [junit4]   2>   "state":"active"} current state version: 0
   [junit4]   2> 1964756 INFO  (OverseerStateUpdate-96529840341319686-127.0.0.1:38484_solr-n_0000000000) [n:127.0.0.1:38484_solr    ] o.a.s.c.o.ZkStateWriter going to update_collection /collections/testschemaapi/state.json version: 1
   [junit4]   2> 1964757 INFO  (zkCallback-24247-thread-1-processing-n:127.0.0.1:42499_solr) [n:127.0.0.1:42499_solr    ] o.a.s.c.c.ZkStateReader A cluster state change: [WatchedEvent state:SyncConnected type:NodeDataChanged path:/collections/testschemaapi/state.json] for collection [testschemaapi] has occurred - updating... (live nodes size: [2])
   [junit4]   2> 1964757 INFO  (zkCallback-24248-thread-2-processing-n:127.0.0.1:38484_solr) [n:127.0.0.1:38484_solr    ] o.a.s.c.c.ZkStateReader A cluster state change: [WatchedEvent state:SyncConnected type:NodeDataChanged path:/collections/testschemaapi/state.json] for collection [testschemaapi] has occurred - updating... (live nodes size: [2])
   [junit4]   2> 1964761 INFO  (zkCallback-24247-thread-1-processing-n:127.0.0.1:42499_solr) [n:127.0.0.1:42499_solr    ] o.a.s.c.c.ZkStateReader Updating data for [testschemaapi] from [1] to [2]
   [junit4]   2> 1964761 INFO  (zkCallback-24248-thread-2-processing-n:127.0.0.1:38484_solr) [n:127.0.0.1:38484_solr    ] o.a.s.c.c.ZkStateReader Updating data for [testschemaapi] from [1] to [2]
   [junit4]   2> 1964806 INFO  (qtp11938407-96708) [n:127.0.0.1:42499_solr c:testschemaapi s:shard1 r:core_node1 x:testschemaapi_shard1_replica2] o.a.s.c.ZkController We are http://127.0.0.1:42499/solr/testschemaapi_shard1_replica2/ and leader is http://127.0.0.1:42499/solr/testschemaapi_shard1_replica2/
   [junit4]   2> 1964806 INFO  (qtp11938407-96708) [n:127.0.0.1:42499_solr c:testschemaapi s:shard1 r:core_node1 x:testschemaapi_shard1_replica2] o.a.s.c.ZkController No LogReplay needed for core=testschemaapi_shard1_replica2 baseURL=http://127.0.0.1:42499/solr
   [junit4]   2> 1964806 INFO  (qtp11938407-96708) [n:127.0.0.1:42499_solr c:testschemaapi s:shard1 r:core_node1 x:testschemaapi_shard1_replica2] o.a.s.c.ZkController I am the leader, no recovery necessary
   [junit4]   2> 1964806 INFO  (qtp11938407-96708) [n:127.0.0.1:42499_solr c:testschemaapi s:shard1 r:core_node1 x:testschemaapi_shard1_replica2] o.a.s.c.ZkController publishing state=active
   [junit4]   2> 1964807 INFO  (OverseerStateUpdate-96529840341319686-127.0.0.1:38484_solr-n_0000000000) [n:127.0.0.1:38484_solr    ] o.a.s.c.Overseer processMessage: queueSize: 1, message = {
   [junit4]   2>   "node_name":"127.0.0.1:42499_solr",
   [junit4]   2>   "core_node_name":"core_node1",
   [junit4]   2>   "numShards":"1",
   [junit4]   2>   "state":"active",
   [junit4]   2>   "shard":"shard1",
   [junit4]   2>   "collection":"testschemaapi",
   [junit4]   2>   "base_url":"http://127.0.0.1:42499/solr",
   [junit4]   2>   "operation":"state",
   [junit4]   2>   "core":"testschemaapi_shard1_replica2",
   [junit4]   2>   "roles":null} current state version: 0
   [junit4]   2> 1964807 INFO  (OverseerStateUpdate-96529840341319686-127.0.0.1:38484_solr-n_0000000000) [n:127.0.0.1:38484_solr    ] o.a.s.c.o.ReplicaMutator Update state numShards=1 message={
   [junit4]   2>   "node_name":"127.0.0.1:42499_solr",
   [junit4]   2>   "core_node_name":"core_node1",
   [junit4]   2>   "numShards":"1",
   [junit4]   2>   "state":"active",
   [junit4]   2>   "shard":"shard1",
   [junit4]   2>   "collection":"testschemaapi",
   [junit4]   2>   "base_url":"http://127.0.0.1:42499/solr",
   [junit4]   2>   "operation":"state",
   [junit4]   2>   "core":"testschemaapi_shard1_replica2",
   [junit4]   2>   "roles":null}
   [junit4]   2> 1964807 INFO  (qtp11938407-96708) [n:127.0.0.1:42499_solr c:testschemaapi s:shard1 r:core_node1 x:testschemaapi_shard1_replica2] o.a.s.s.HttpSolrCall [admin] webapp=null path=/admin/cores params={version=2&qt=/admin/cores&name=testschemaapi_shard1_replica2&action=CREATE&numShards=1&shard=shard1&collection=testschemaapi&wt=javabin&collection.configName=conf1} status=0 QTime=1219
   [junit4]   2> 1964908 INFO  (OverseerStateUpdate-96529840341319686-127.0.0.1:38484_solr-n_0000000000) [n:127.0.0.1:38484_solr    ] o.a.s.c.o.ZkStateWriter going to update_collection /collections/testschemaapi/state.json version: 2
   [junit4]   2> 1964908 INFO  (zkCallback-24248-thread-1-processing-n:127.0.0.1:38484_solr) [n:127.0.0.1:38484_solr    ] o.a.s.c.c.ZkStateReader A cluster state change: [WatchedEvent state:SyncConnected type:NodeDataChanged path:/collections/testschemaapi/state.json] for collection [testschemaapi] has occurred - updating... (live nodes size: [2])
   [junit4]   2> 1964908 INFO  (zkCallback-24247-thread-1-processing-n:127.0.0.1:42499_solr) [n:127.0.0.1:42499_solr    ] o.a.s.c.c.ZkStateReader A cluster state change: [WatchedEvent state:SyncConnected type:NodeDataChanged path:/collections/testschemaapi/state.json] for collection [testschemaapi] has occurred - updating... (live nodes size: [2])
   [junit4]   2> 1964908 INFO  (zkCallback-24248-thread-1-processing-n:127.0.0.1:38484_solr) [n:127.0.0.1:38484_solr    ] o.a.s.c.c.ZkStateReader Updating data for [testschemaapi] from [2] to [3]
   [junit4]   2> 1964908 INFO  (zkCallback-24247-thread-1-processing-n:127.0.0.1:42499_solr) [n:127.0.0.1:42499_solr    ] o.a.s.c.c.ZkStateReader Updating data for [testschemaapi] from [2] to [3]
   [junit4]   2> 1965651 INFO  (qtp21632847-96714) [n:127.0.0.1:38484_solr c:testschemaapi s:shard1 r:core_node2 x:testschemaapi_shard1_replica1] o.a.s.c.ZkController We are http://127.0.0.1:38484/solr/testschemaapi_shard1_replica1/ and leader is http://127.0.0.1:42499/solr/testschemaapi_shard1_replica2/
   [junit4]   2> 1965651 INFO  (qtp21632847-96714) [n:127.0.0.1:38484_solr c:testschemaapi s:shard1 r:core_node2 x:testschemaapi_shard1_replica1] o.a.s.c.ZkController No LogReplay needed for core=testschemaapi_shard1_replica1 baseURL=http://127.0.0.1:38484/solr
   [junit4]   2> 1965651 INFO  (qtp21632847-96714) [n:127.0.0.1:38484_solr c:testschemaapi s:shard1 r:core_node2 x:testschemaapi_shard1_replica1] o.a.s.c.ZkController Core needs to recover:testschemaapi_shard1_replica1
   [junit4]   2> 1965652 INFO  (updateExecutor-24243-thread-1-processing-n:127.0.0.1:38484_solr r:core_node2 s:shard1 c:testschemaapi x:testschemaapi_shard1_replica1) [n:127.0.0.1:38484_solr c:testschemaapi s:shard1 r:core_node2 x:testschemaapi_shard1_replica1] o.a.s.u.D

[...truncated too long message...]

$1.run(SolrZkClient.java:264)
   [junit4]   2> 	at java.util.concurrent.Executors$RunnableAdapter.call(Executors.java:471)
   [junit4]   2> 	at java.util.concurrent.FutureTask.run(FutureTask.java:262)
   [junit4]   2> 	at org.apache.solr.common.util.ExecutorUtil$MDCAwareThreadPoolExecutor$1.run(ExecutorUtil.java:231)
   [junit4]   2> 	at java.util.concurrent.ThreadPoolExecutor.runWorker(ThreadPoolExecutor.java:1145)
   [junit4]   2> 	at java.util.concurrent.ThreadPoolExecutor$Worker.run(ThreadPoolExecutor.java:615)
   [junit4]   2> 	at java.lang.Thread.run(Thread.java:745)
   [junit4]   2> 1976357 INFO  (jetty-launcher-24237-thread-2) [    ] o.e.j.s.h.ContextHandler Stopped o.e.j.s.ServletContextHandler@1878567{/solr,null,UNAVAILABLE}
   [junit4]   2> 1976357 INFO  (TEST-TestManagedSchemaAPI.test-seed#[49B94BCC331D285B]) [    ] o.a.s.c.ZkTestServer connecting to 127.0.0.1:42989 42989
   [junit4]   2> 1976454 INFO  (Thread-6236) [    ] o.a.s.c.ZkTestServer connecting to 127.0.0.1:42989 42989
   [junit4]   2> 1976455 WARN  (Thread-6236) [    ] o.a.s.c.ZkTestServer Watch limit violations: 
   [junit4]   2> Maximum concurrent create/delete watches above limit:
   [junit4]   2> 
   [junit4]   2> 	6	/solr/configs/conf1/managed-schema
   [junit4]   2> 	6	/solr/configs/conf1
   [junit4]   2> 	3	/solr/aliases.json
   [junit4]   2> 	2	/solr/security.json
   [junit4]   2> 
   [junit4]   2> Maximum concurrent data watches above limit:
   [junit4]   2> 
   [junit4]   2> 	3	/solr/clusterstate.json
   [junit4]   2> 	2	/solr/collections/testschemaapi/state.json
   [junit4]   2> 
   [junit4]   2> Maximum concurrent children watches above limit:
   [junit4]   2> 
   [junit4]   2> 	9	/solr/overseer/collection-queue-work
   [junit4]   2> 	8	/solr/overseer/queue
   [junit4]   2> 	3	/solr/collections
   [junit4]   2> 	3	/solr/live_nodes
   [junit4]   2> 	3	/solr/overseer/queue-work
   [junit4]   2> 
   [junit4]   2> 1976455 INFO  (TEST-TestManagedSchemaAPI.test-seed#[49B94BCC331D285B]) [    ] o.a.s.SolrTestCaseJ4 ###Ending test
   [junit4]   2> NOTE: reproduce with: ant test  -Dtestcase=TestManagedSchemaAPI -Dtests.method=test -Dtests.seed=49B94BCC331D285B -Dtests.multiplier=3 -Dtests.slow=true -Dtests.locale=sr-BA -Dtests.timezone=SystemV/AST4 -Dtests.asserts=true -Dtests.file.encoding=UTF-8
   [junit4] ERROR   13.2s J1 | TestManagedSchemaAPI.test <<<
   [junit4]    > Throwable #1: org.apache.solr.client.solrj.impl.CloudSolrClient$RouteException: Error from server at http://127.0.0.1:42499/solr/testschemaapi_shard1_replica2: ERROR: [doc=2] unknown field 'myNewField1'
   [junit4]    > 	at __randomizedtesting.SeedInfo.seed([49B94BCC331D285B:C1ED74169DE145A3]:0)
   [junit4]    > 	at org.apache.solr.client.solrj.impl.CloudSolrClient.directUpdate(CloudSolrClient.java:653)
   [junit4]    > 	at org.apache.solr.client.solrj.impl.CloudSolrClient.sendRequest(CloudSolrClient.java:1002)
   [junit4]    > 	at org.apache.solr.client.solrj.impl.CloudSolrClient.requestWithRetryOnStaleState(CloudSolrClient.java:891)
   [junit4]    > 	at org.apache.solr.client.solrj.impl.CloudSolrClient.request(CloudSolrClient.java:827)
   [junit4]    > 	at org.apache.solr.schema.TestManagedSchemaAPI.testAddFieldAndDocument(TestManagedSchemaAPI.java:101)
   [junit4]    > 	at org.apache.solr.schema.TestManagedSchemaAPI.test(TestManagedSchemaAPI.java:69)
   [junit4]    > 	at java.lang.Thread.run(Thread.java:745)
   [junit4]    > Caused by: org.apache.solr.client.solrj.impl.HttpSolrClient$RemoteSolrException: Error from server at http://127.0.0.1:42499/solr/testschemaapi_shard1_replica2: ERROR: [doc=2] unknown field 'myNewField1'
   [junit4]    > 	at org.apache.solr.client.solrj.impl.HttpSolrClient.executeMethod(HttpSolrClient.java:577)
   [junit4]    > 	at org.apache.solr.client.solrj.impl.HttpSolrClient.request(HttpSolrClient.java:241)
   [junit4]    > 	at org.apache.solr.client.solrj.impl.HttpSolrClient.request(HttpSolrClient.java:230)
   [junit4]    > 	at org.apache.solr.client.solrj.impl.LBHttpSolrClient.doRequest(LBHttpSolrClient.java:372)
   [junit4]    > 	at org.apache.solr.client.solrj.impl.LBHttpSolrClient.request(LBHttpSolrClient.java:325)
   [junit4]    > 	at org.apache.solr.client.solrj.impl.CloudSolrClient$2.call(CloudSolrClient.java:628)
   [junit4]    > 	at org.apache.solr.client.solrj.impl.CloudSolrClient$2.call(CloudSolrClient.java:625)
   [junit4]    > 	at java.util.concurrent.FutureTask.run(FutureTask.java:262)
   [junit4]    > 	at org.apache.solr.common.util.ExecutorUtil$MDCAwareThreadPoolExecutor$1.run(ExecutorUtil.java:231)
   [junit4]    > 	at java.util.concurrent.ThreadPoolExecutor.runWorker(ThreadPoolExecutor.java:1145)
   [junit4]    > 	at java.util.concurrent.ThreadPoolExecutor$Worker.run(ThreadPoolExecutor.java:615)
   [junit4]    > 	... 1 more
   [junit4]   2> 1976457 INFO  (SUITE-TestManagedSchemaAPI-seed#[49B94BCC331D285B]-worker) [    ] o.a.s.SolrTestCaseJ4 ###deleteCore
   [junit4]   2> NOTE: leaving temporary files on disk at: /home/jenkins/workspace/Lucene-Solr-5.5-Linux/solr/build/solr-core/test/J1/temp/solr.schema.TestManagedSchemaAPI_49B94BCC331D285B-001
   [junit4]   2> Sep 03, 2016 6:48:05 PM com.carrotsearch.randomizedtesting.ThreadLeakControl checkThreadLeaks
   [junit4]   2> WARNING: Will linger awaiting termination of 1 leaked thread(s).
   [junit4]   2> NOTE: test params are: codec=Lucene54, sim=RandomSimilarity(queryNorm=false,coord=yes): {}, locale=sr-BA, timezone=SystemV/AST4
   [junit4]   2> NOTE: Linux 4.4.0-31-generic i386/Oracle Corporation 1.7.0_80 (32-bit)/cpus=12,threads=1,free=126561512,total=445644800
   [junit4]   2> NOTE: All tests run in this JVM: [TestUseDocValuesAsStored, HighlighterTest, ZkStateWriterTest, MoreLikeThisHandlerTest, TestCodecSupport, TestDistributedGrouping, TestCursorMarkWithoutUniqueKey, TestDefaultStatsCache, TestJsonFacets, ZkControllerTest, TestWordDelimiterFilterFactory, TestLFUCache, PKIAuthenticationIntegrationTest, TimeZoneUtilsTest, TestDistribDocBasedVersion, SortByFunctionTest, TestBlobHandler, SpatialHeatmapFacetsTest, ConjunctionSolrSpellCheckerTest, CachingDirectoryFactoryTest, TestInitQParser, TestCloudPivotFacet, BlockCacheTest, DateRangeFieldTest, SpatialRPTFieldTypeTest, TestFileDictionaryLookup, TestDFRSimilarityFactory, TestSolrConfigHandlerConcurrent, NumericFieldsTest, TestUpdate, TestSimpleTrackingShardHandler, DeleteLastCustomShardedReplicaTest, CoreMergeIndexesAdminHandlerTest, HdfsDirectoryTest, TestRawResponseWriter, TestConfigSets, TestOnReconnectListenerSupport, SpellingQueryConverterTest, SolrInfoMBeanTest, HdfsCollectionsAPIDistributedZkTest, ZkCLITest, DocumentBuilderTest, CollectionTooManyReplicasTest, TestSurroundQueryParser, TestManagedSchemaFieldResource, HdfsThreadLeakTest, RollingRestartTest, TestCoreContainer, RankQueryTest, TestSolrQueryParserResource, TestFieldTypeCollectionResource, RemoteQueryErrorTest, DirectSolrSpellCheckerTest, TestCustomSort, TestBinaryResponseWriter, TestQuerySenderNoQuery, DistributedFacetPivotLargeTest, SpellCheckCollatorTest, BigEndianAscendingWordSerializerTest, TestCopyFieldCollectionResource, DistributedTermsComponentTest, TestLeaderElectionZkExpiry, SimpleCollectionCreateDeleteTest, DistanceUnitsTest, TestExceedMaxTermLength, BlockJoinFacetRandomTest, TestInfoStreamLogging, CloudExitableDirectoryReaderTest, MultiThreadedOCPTest, TestShortCircuitedRequests, TestConfigSetsAPIExclusivity, TestMiniSolrCloudClusterBase, SimpleMLTQParserTest, SoftAutoCommitTest, FileUtilsTest, DistanceFunctionTest, LeaderInitiatedRecoveryOnCommitTest, ZkSolrClientTest, TestRuleBasedAuthorizationPlugin, TestRestManager, DistributedIntervalFacetingTest, HdfsRecoveryZkTest, TestSchemaVersionResource, TestAuthenticationFramework, FastVectorHighlighterTest, AddSchemaFieldsUpdateProcessorFactoryTest, OverseerTaskQueueTest, SpellPossibilityIteratorTest, TestTrie, TestTrackingShardHandlerFactory, SparseHLLTest, TestFiltering, TestSortingResponseWriter, OpenCloseCoreStressTest, LeaderElectionIntegrationTest, ClusterStateUpdateTest, TestZkChroot, TestRandomDVFaceting, ShardRoutingCustomTest, TestFaceting, TestRecovery, TestHashPartitioner, DistributedSpellCheckComponentTest, TestRealTimeGet, TestReload, SolrCmdDistributorTest, PeerSyncTest, ConvertedLegacyTest, BasicFunctionalityTest, CurrencyFieldOpenExchangeTest, DistributedQueryElevationComponentTest, TestExtendedDismaxParser, DocValuesTest, OpenExchangeRatesOrgProviderTest, DateMathParserTest, TestSystemIdResolver, DateFieldTest, CircularListTest, TestRTGBase, CursorPagingTest, TestEmbeddedSolrServerConstructors, TestJettySolrRunner, ActionThrottleTest, AliasIntegrationTest, AsyncMigrateRouteKeyTest, ConcurrentDeleteAndCreateCollectionTest, ConfigSetsAPITest, ConnectionManagerTest, DeleteInactiveReplicaTest, DistribDocExpirationUpdateProcessorTest, HttpPartitionTest, TestConfigSetsAPIZkFailure, TestRandomRequestDistribution, TestReplicaProperties, TestRequestForwarding, TestStressLiveNodes, TestSolrConfigHandler, CoreAdminCreateDiscoverTest, CoreAdminRequestStatusTest, InfoHandlerTest, SecurityConfHandlerTest, SegmentsInfoRequestHandlerTest, DistributedDebugComponentTest, DistributedFacetPivotLongTailTest, DistributedFacetPivotSmallTest, DistributedQueryComponentCustomSortTest, DistributedQueryComponentOptimizationTest, DistributedSuggestComponentTest, FacetPivotSmallTest, SuggestComponentContextFilterQueryTest, TestExpandComponent, TestPivotHelperCode, JavabinLoaderTest, WrapperMergePolicyFactoryTest, SmileWriterTest, TestMacros, TestChildDocTransformer, TestManagedResource, TestBulkSchemaAPI, TestDynamicFieldCollectionResource, TestFieldTypeResource, TestRemoveLastDynamicCopyField, TestSchemaNameResource, TestSerializedLuceneMatchVersion, TestUniqueKeyFieldResource, TestManagedSynonymFilterFactory, BadCopyFieldTest, TestBulkSchemaConcurrent, TestManagedSchema, TestManagedSchemaAPI]
   [junit4] Completed [523/575 (1!)] on J1 in 14.20s, 1 test, 1 error <<< FAILURES!

[...truncated 49290 lines...]


Mime
View raw message