lucene-dev mailing list archives

Site index · List index
Message view « Date » · « Thread »
Top « Date » · « Thread »
From Policeman Jenkins Server <jenk...@thetaphi.de>
Subject [JENKINS] Lucene-Solr-5.5-Linux (32bit/jdk1.7.0_80) - Build # 366 - Still Unstable!
Date Fri, 02 Sep 2016 06:06:34 GMT
Build: http://jenkins.thetaphi.de/job/Lucene-Solr-5.5-Linux/366/
Java: 32bit/jdk1.7.0_80 -client -XX:+UseG1GC

1 tests failed.
FAILED:  org.apache.solr.core.TestDynamicLoading.testDynamicLoading

Error Message:
Could not get expected value  'X val changed' for path 'x' full output: {   "responseHeader":{     "status":0,     "QTime":0},   "params":{"wt":"json"},   "context":{     "path":"/test1",     "webapp":"/wqj",     "httpMethod":"GET"},   "class":"org.apache.solr.core.BlobStoreTestRequestHandler",   "x":"X val"}

Stack Trace:
java.lang.AssertionError: Could not get expected value  'X val changed' for path 'x' full output: {
  "responseHeader":{
    "status":0,
    "QTime":0},
  "params":{"wt":"json"},
  "context":{
    "path":"/test1",
    "webapp":"/wqj",
    "httpMethod":"GET"},
  "class":"org.apache.solr.core.BlobStoreTestRequestHandler",
  "x":"X val"}
	at __randomizedtesting.SeedInfo.seed([50EB9EBCEB400688:88A6B3EB1C9DA328]:0)
	at org.junit.Assert.fail(Assert.java:93)
	at org.junit.Assert.assertTrue(Assert.java:43)
	at org.apache.solr.core.TestSolrConfigHandler.testForResponseElement(TestSolrConfigHandler.java:480)
	at org.apache.solr.core.TestDynamicLoading.testDynamicLoading(TestDynamicLoading.java:255)
	at sun.reflect.NativeMethodAccessorImpl.invoke0(Native Method)
	at sun.reflect.NativeMethodAccessorImpl.invoke(NativeMethodAccessorImpl.java:57)
	at sun.reflect.DelegatingMethodAccessorImpl.invoke(DelegatingMethodAccessorImpl.java:43)
	at java.lang.reflect.Method.invoke(Method.java:606)
	at com.carrotsearch.randomizedtesting.RandomizedRunner.invoke(RandomizedRunner.java:1764)
	at com.carrotsearch.randomizedtesting.RandomizedRunner$8.evaluate(RandomizedRunner.java:871)
	at com.carrotsearch.randomizedtesting.RandomizedRunner$9.evaluate(RandomizedRunner.java:907)
	at com.carrotsearch.randomizedtesting.RandomizedRunner$10.evaluate(RandomizedRunner.java:921)
	at org.apache.solr.BaseDistributedSearchTestCase$ShardsRepeatRule$ShardsFixedStatement.callStatement(BaseDistributedSearchTestCase.java:996)
	at org.apache.solr.BaseDistributedSearchTestCase$ShardsRepeatRule$ShardsStatement.evaluate(BaseDistributedSearchTestCase.java:971)
	at com.carrotsearch.randomizedtesting.rules.SystemPropertiesRestoreRule$1.evaluate(SystemPropertiesRestoreRule.java:57)
	at org.apache.lucene.util.TestRuleSetupTeardownChained$1.evaluate(TestRuleSetupTeardownChained.java:49)
	at org.apache.lucene.util.AbstractBeforeAfterRule$1.evaluate(AbstractBeforeAfterRule.java:45)
	at org.apache.lucene.util.TestRuleThreadAndTestName$1.evaluate(TestRuleThreadAndTestName.java:48)
	at org.apache.lucene.util.TestRuleIgnoreAfterMaxFailures$1.evaluate(TestRuleIgnoreAfterMaxFailures.java:64)
	at org.apache.lucene.util.TestRuleMarkFailure$1.evaluate(TestRuleMarkFailure.java:47)
	at com.carrotsearch.randomizedtesting.rules.StatementAdapter.evaluate(StatementAdapter.java:36)
	at com.carrotsearch.randomizedtesting.ThreadLeakControl$StatementRunner.run(ThreadLeakControl.java:367)
	at com.carrotsearch.randomizedtesting.ThreadLeakControl.forkTimeoutingTask(ThreadLeakControl.java:809)
	at com.carrotsearch.randomizedtesting.ThreadLeakControl$3.evaluate(ThreadLeakControl.java:460)
	at com.carrotsearch.randomizedtesting.RandomizedRunner.runSingleTest(RandomizedRunner.java:880)
	at com.carrotsearch.randomizedtesting.RandomizedRunner$5.evaluate(RandomizedRunner.java:781)
	at com.carrotsearch.randomizedtesting.RandomizedRunner$6.evaluate(RandomizedRunner.java:816)
	at com.carrotsearch.randomizedtesting.RandomizedRunner$7.evaluate(RandomizedRunner.java:827)
	at com.carrotsearch.randomizedtesting.rules.StatementAdapter.evaluate(StatementAdapter.java:36)
	at com.carrotsearch.randomizedtesting.rules.SystemPropertiesRestoreRule$1.evaluate(SystemPropertiesRestoreRule.java:57)
	at org.apache.lucene.util.AbstractBeforeAfterRule$1.evaluate(AbstractBeforeAfterRule.java:45)
	at com.carrotsearch.randomizedtesting.rules.StatementAdapter.evaluate(StatementAdapter.java:36)
	at org.apache.lucene.util.TestRuleStoreClassName$1.evaluate(TestRuleStoreClassName.java:41)
	at com.carrotsearch.randomizedtesting.rules.NoShadowingOrOverridesOnMethodsRule$1.evaluate(NoShadowingOrOverridesOnMethodsRule.java:40)
	at com.carrotsearch.randomizedtesting.rules.NoShadowingOrOverridesOnMethodsRule$1.evaluate(NoShadowingOrOverridesOnMethodsRule.java:40)
	at com.carrotsearch.randomizedtesting.rules.StatementAdapter.evaluate(StatementAdapter.java:36)
	at com.carrotsearch.randomizedtesting.rules.StatementAdapter.evaluate(StatementAdapter.java:36)
	at com.carrotsearch.randomizedtesting.rules.StatementAdapter.evaluate(StatementAdapter.java:36)
	at org.apache.lucene.util.TestRuleAssertionsRequired$1.evaluate(TestRuleAssertionsRequired.java:53)
	at org.apache.lucene.util.TestRuleMarkFailure$1.evaluate(TestRuleMarkFailure.java:47)
	at org.apache.lucene.util.TestRuleIgnoreAfterMaxFailures$1.evaluate(TestRuleIgnoreAfterMaxFailures.java:64)
	at org.apache.lucene.util.TestRuleIgnoreTestSuites$1.evaluate(TestRuleIgnoreTestSuites.java:54)
	at com.carrotsearch.randomizedtesting.rules.StatementAdapter.evaluate(StatementAdapter.java:36)
	at com.carrotsearch.randomizedtesting.ThreadLeakControl$StatementRunner.run(ThreadLeakControl.java:367)
	at java.lang.Thread.run(Thread.java:745)




Build Log:
[...truncated 12070 lines...]
   [junit4] Suite: org.apache.solr.core.TestDynamicLoading
   [junit4]   2> Creating dataDir: /home/jenkins/workspace/Lucene-Solr-5.5-Linux/solr/build/solr-core/test/J2/temp/solr.core.TestDynamicLoading_50EB9EBCEB400688-001/init-core-data-001
   [junit4]   2> 1746956 INFO  (SUITE-TestDynamicLoading-seed#[50EB9EBCEB400688]-worker) [    ] o.a.s.SolrTestCaseJ4 Randomized ssl (false) and clientAuth (false)
   [junit4]   2> 1746956 INFO  (SUITE-TestDynamicLoading-seed#[50EB9EBCEB400688]-worker) [    ] o.a.s.BaseDistributedSearchTestCase Setting hostContext system property: /wqj/
   [junit4]   2> 1746960 INFO  (TEST-TestDynamicLoading.testDynamicLoading-seed#[50EB9EBCEB400688]) [    ] o.a.s.c.ZkTestServer STARTING ZK TEST SERVER
   [junit4]   2> 1746961 INFO  (Thread-4923) [    ] o.a.s.c.ZkTestServer client port:0.0.0.0/0.0.0.0:0
   [junit4]   2> 1746961 INFO  (Thread-4923) [    ] o.a.s.c.ZkTestServer Starting server
   [junit4]   2> 1747061 INFO  (TEST-TestDynamicLoading.testDynamicLoading-seed#[50EB9EBCEB400688]) [    ] o.a.s.c.ZkTestServer start zk server on port:42447
   [junit4]   2> 1747061 INFO  (TEST-TestDynamicLoading.testDynamicLoading-seed#[50EB9EBCEB400688]) [    ] o.a.s.c.c.SolrZkClient Using default ZkCredentialsProvider
   [junit4]   2> 1747061 INFO  (TEST-TestDynamicLoading.testDynamicLoading-seed#[50EB9EBCEB400688]) [    ] o.a.s.c.c.ConnectionManager Waiting for client to connect to ZooKeeper
   [junit4]   2> 1747063 INFO  (zkCallback-1870-thread-1) [    ] o.a.s.c.c.ConnectionManager Watcher org.apache.solr.common.cloud.ConnectionManager@1ad2e23 name:ZooKeeperConnection Watcher:127.0.0.1:42447 got event WatchedEvent state:SyncConnected type:None path:null path:null type:None
   [junit4]   2> 1747063 INFO  (TEST-TestDynamicLoading.testDynamicLoading-seed#[50EB9EBCEB400688]) [    ] o.a.s.c.c.ConnectionManager Client is connected to ZooKeeper
   [junit4]   2> 1747063 INFO  (TEST-TestDynamicLoading.testDynamicLoading-seed#[50EB9EBCEB400688]) [    ] o.a.s.c.c.SolrZkClient Using default ZkACLProvider
   [junit4]   2> 1747063 INFO  (TEST-TestDynamicLoading.testDynamicLoading-seed#[50EB9EBCEB400688]) [    ] o.a.s.c.c.SolrZkClient makePath: /solr
   [junit4]   2> 1747064 INFO  (TEST-TestDynamicLoading.testDynamicLoading-seed#[50EB9EBCEB400688]) [    ] o.a.s.c.c.SolrZkClient Using default ZkCredentialsProvider
   [junit4]   2> 1747065 INFO  (TEST-TestDynamicLoading.testDynamicLoading-seed#[50EB9EBCEB400688]) [    ] o.a.s.c.c.ConnectionManager Waiting for client to connect to ZooKeeper
   [junit4]   2> 1747065 INFO  (zkCallback-1871-thread-1) [    ] o.a.s.c.c.ConnectionManager Watcher org.apache.solr.common.cloud.ConnectionManager@73b793 name:ZooKeeperConnection Watcher:127.0.0.1:42447/solr got event WatchedEvent state:SyncConnected type:None path:null path:null type:None
   [junit4]   2> 1747065 INFO  (TEST-TestDynamicLoading.testDynamicLoading-seed#[50EB9EBCEB400688]) [    ] o.a.s.c.c.ConnectionManager Client is connected to ZooKeeper
   [junit4]   2> 1747067 INFO  (TEST-TestDynamicLoading.testDynamicLoading-seed#[50EB9EBCEB400688]) [    ] o.a.s.c.c.SolrZkClient Using default ZkACLProvider
   [junit4]   2> 1747067 INFO  (TEST-TestDynamicLoading.testDynamicLoading-seed#[50EB9EBCEB400688]) [    ] o.a.s.c.c.SolrZkClient makePath: /collections/collection1
   [junit4]   2> 1747068 INFO  (TEST-TestDynamicLoading.testDynamicLoading-seed#[50EB9EBCEB400688]) [    ] o.a.s.c.c.SolrZkClient makePath: /collections/collection1/shards
   [junit4]   2> 1747069 INFO  (TEST-TestDynamicLoading.testDynamicLoading-seed#[50EB9EBCEB400688]) [    ] o.a.s.c.c.SolrZkClient makePath: /collections/control_collection
   [junit4]   2> 1747069 INFO  (TEST-TestDynamicLoading.testDynamicLoading-seed#[50EB9EBCEB400688]) [    ] o.a.s.c.c.SolrZkClient makePath: /collections/control_collection/shards
   [junit4]   2> 1747070 INFO  (TEST-TestDynamicLoading.testDynamicLoading-seed#[50EB9EBCEB400688]) [    ] o.a.s.c.AbstractZkTestCase put /home/jenkins/workspace/Lucene-Solr-5.5-Linux/solr/core/src/test-files/solr/collection1/conf/solrconfig-tlog.xml to /configs/conf1/solrconfig.xml
   [junit4]   2> 1747070 INFO  (TEST-TestDynamicLoading.testDynamicLoading-seed#[50EB9EBCEB400688]) [    ] o.a.s.c.c.SolrZkClient makePath: /configs/conf1/solrconfig.xml
   [junit4]   2> 1747071 INFO  (TEST-TestDynamicLoading.testDynamicLoading-seed#[50EB9EBCEB400688]) [    ] o.a.s.c.AbstractZkTestCase put /home/jenkins/workspace/Lucene-Solr-5.5-Linux/solr/core/src/test-files/solr/collection1/conf/schema.xml to /configs/conf1/schema.xml
   [junit4]   2> 1747071 INFO  (TEST-TestDynamicLoading.testDynamicLoading-seed#[50EB9EBCEB400688]) [    ] o.a.s.c.c.SolrZkClient makePath: /configs/conf1/schema.xml
   [junit4]   2> 1747072 INFO  (TEST-TestDynamicLoading.testDynamicLoading-seed#[50EB9EBCEB400688]) [    ] o.a.s.c.AbstractZkTestCase put /home/jenkins/workspace/Lucene-Solr-5.5-Linux/solr/core/src/test-files/solr/collection1/conf/solrconfig.snippet.randomindexconfig.xml to /configs/conf1/solrconfig.snippet.randomindexconfig.xml
   [junit4]   2> 1747072 INFO  (TEST-TestDynamicLoading.testDynamicLoading-seed#[50EB9EBCEB400688]) [    ] o.a.s.c.c.SolrZkClient makePath: /configs/conf1/solrconfig.snippet.randomindexconfig.xml
   [junit4]   2> 1747073 INFO  (TEST-TestDynamicLoading.testDynamicLoading-seed#[50EB9EBCEB400688]) [    ] o.a.s.c.AbstractZkTestCase put /home/jenkins/workspace/Lucene-Solr-5.5-Linux/solr/core/src/test-files/solr/collection1/conf/stopwords.txt to /configs/conf1/stopwords.txt
   [junit4]   2> 1747073 INFO  (TEST-TestDynamicLoading.testDynamicLoading-seed#[50EB9EBCEB400688]) [    ] o.a.s.c.c.SolrZkClient makePath: /configs/conf1/stopwords.txt
   [junit4]   2> 1747074 INFO  (TEST-TestDynamicLoading.testDynamicLoading-seed#[50EB9EBCEB400688]) [    ] o.a.s.c.AbstractZkTestCase put /home/jenkins/workspace/Lucene-Solr-5.5-Linux/solr/core/src/test-files/solr/collection1/conf/protwords.txt to /configs/conf1/protwords.txt
   [junit4]   2> 1747074 INFO  (TEST-TestDynamicLoading.testDynamicLoading-seed#[50EB9EBCEB400688]) [    ] o.a.s.c.c.SolrZkClient makePath: /configs/conf1/protwords.txt
   [junit4]   2> 1747075 INFO  (TEST-TestDynamicLoading.testDynamicLoading-seed#[50EB9EBCEB400688]) [    ] o.a.s.c.AbstractZkTestCase put /home/jenkins/workspace/Lucene-Solr-5.5-Linux/solr/core/src/test-files/solr/collection1/conf/currency.xml to /configs/conf1/currency.xml
   [junit4]   2> 1747075 INFO  (TEST-TestDynamicLoading.testDynamicLoading-seed#[50EB9EBCEB400688]) [    ] o.a.s.c.c.SolrZkClient makePath: /configs/conf1/currency.xml
   [junit4]   2> 1747075 INFO  (TEST-TestDynamicLoading.testDynamicLoading-seed#[50EB9EBCEB400688]) [    ] o.a.s.c.AbstractZkTestCase put /home/jenkins/workspace/Lucene-Solr-5.5-Linux/solr/core/src/test-files/solr/collection1/conf/enumsConfig.xml to /configs/conf1/enumsConfig.xml
   [junit4]   2> 1747075 INFO  (TEST-TestDynamicLoading.testDynamicLoading-seed#[50EB9EBCEB400688]) [    ] o.a.s.c.c.SolrZkClient makePath: /configs/conf1/enumsConfig.xml
   [junit4]   2> 1747076 INFO  (TEST-TestDynamicLoading.testDynamicLoading-seed#[50EB9EBCEB400688]) [    ] o.a.s.c.AbstractZkTestCase put /home/jenkins/workspace/Lucene-Solr-5.5-Linux/solr/core/src/test-files/solr/collection1/conf/open-exchange-rates.json to /configs/conf1/open-exchange-rates.json
   [junit4]   2> 1747076 INFO  (TEST-TestDynamicLoading.testDynamicLoading-seed#[50EB9EBCEB400688]) [    ] o.a.s.c.c.SolrZkClient makePath: /configs/conf1/open-exchange-rates.json
   [junit4]   2> 1747077 INFO  (TEST-TestDynamicLoading.testDynamicLoading-seed#[50EB9EBCEB400688]) [    ] o.a.s.c.AbstractZkTestCase put /home/jenkins/workspace/Lucene-Solr-5.5-Linux/solr/core/src/test-files/solr/collection1/conf/mapping-ISOLatin1Accent.txt to /configs/conf1/mapping-ISOLatin1Accent.txt
   [junit4]   2> 1747077 INFO  (TEST-TestDynamicLoading.testDynamicLoading-seed#[50EB9EBCEB400688]) [    ] o.a.s.c.c.SolrZkClient makePath: /configs/conf1/mapping-ISOLatin1Accent.txt
   [junit4]   2> 1747079 INFO  (TEST-TestDynamicLoading.testDynamicLoading-seed#[50EB9EBCEB400688]) [    ] o.a.s.c.AbstractZkTestCase put /home/jenkins/workspace/Lucene-Solr-5.5-Linux/solr/core/src/test-files/solr/collection1/conf/old_synonyms.txt to /configs/conf1/old_synonyms.txt
   [junit4]   2> 1747080 INFO  (TEST-TestDynamicLoading.testDynamicLoading-seed#[50EB9EBCEB400688]) [    ] o.a.s.c.c.SolrZkClient makePath: /configs/conf1/old_synonyms.txt
   [junit4]   2> 1747080 INFO  (TEST-TestDynamicLoading.testDynamicLoading-seed#[50EB9EBCEB400688]) [    ] o.a.s.c.AbstractZkTestCase put /home/jenkins/workspace/Lucene-Solr-5.5-Linux/solr/core/src/test-files/solr/collection1/conf/synonyms.txt to /configs/conf1/synonyms.txt
   [junit4]   2> 1747080 INFO  (TEST-TestDynamicLoading.testDynamicLoading-seed#[50EB9EBCEB400688]) [    ] o.a.s.c.c.SolrZkClient makePath: /configs/conf1/synonyms.txt
   [junit4]   2> 1747146 INFO  (TEST-TestDynamicLoading.testDynamicLoading-seed#[50EB9EBCEB400688]) [    ] o.a.s.SolrTestCaseJ4 Writing core.properties file to /home/jenkins/workspace/Lucene-Solr-5.5-Linux/solr/build/solr-core/test/J2/temp/solr.core.TestDynamicLoading_50EB9EBCEB400688-001/control-001/cores/collection1
   [junit4]   2> 1747147 INFO  (TEST-TestDynamicLoading.testDynamicLoading-seed#[50EB9EBCEB400688]) [    ] o.e.j.s.Server jetty-9.2.13.v20150730
   [junit4]   2> 1747148 INFO  (TEST-TestDynamicLoading.testDynamicLoading-seed#[50EB9EBCEB400688]) [    ] o.e.j.s.h.ContextHandler Started o.e.j.s.ServletContextHandler@1ad7ccf{/wqj,null,AVAILABLE}
   [junit4]   2> 1747148 INFO  (TEST-TestDynamicLoading.testDynamicLoading-seed#[50EB9EBCEB400688]) [    ] o.e.j.s.ServerConnector Started ServerConnector@1469a43{HTTP/1.1}{127.0.0.1:44107}
   [junit4]   2> 1747148 INFO  (TEST-TestDynamicLoading.testDynamicLoading-seed#[50EB9EBCEB400688]) [    ] o.e.j.s.Server Started @1748352ms
   [junit4]   2> 1747148 INFO  (TEST-TestDynamicLoading.testDynamicLoading-seed#[50EB9EBCEB400688]) [    ] o.a.s.c.s.e.JettySolrRunner Jetty properties: {coreRootDirectory=/home/jenkins/workspace/Lucene-Solr-5.5-Linux/solr/build/solr-core/test/J2/../../../../../../../../../home/jenkins/workspace/Lucene-Solr-5.5-Linux/solr/build/solr-core/test/J2/temp/solr.core.TestDynamicLoading_50EB9EBCEB400688-001/control-001/cores, hostPort=44107, hostContext=/wqj, solr.data.dir=/home/jenkins/workspace/Lucene-Solr-5.5-Linux/solr/build/solr-core/test/J2/temp/solr.core.TestDynamicLoading_50EB9EBCEB400688-001/tempDir-001/control/data}
   [junit4]   2> 1747148 INFO  (TEST-TestDynamicLoading.testDynamicLoading-seed#[50EB9EBCEB400688]) [    ] o.a.s.s.SolrDispatchFilter SolrDispatchFilter.init(): sun.misc.Launcher$AppClassLoader@121ea24
   [junit4]   2> 1747148 INFO  (TEST-TestDynamicLoading.testDynamicLoading-seed#[50EB9EBCEB400688]) [    ] o.a.s.c.SolrResourceLoader new SolrResourceLoader for directory: '/home/jenkins/workspace/Lucene-Solr-5.5-Linux/solr/build/solr-core/test/J2/temp/solr.core.TestDynamicLoading_50EB9EBCEB400688-001/control-001'
   [junit4]   2> 1747148 INFO  (TEST-TestDynamicLoading.testDynamicLoading-seed#[50EB9EBCEB400688]) [    ] o.a.s.c.SolrResourceLoader JNDI not configured for solr (NoInitialContextEx)
   [junit4]   2> 1747148 INFO  (TEST-TestDynamicLoading.testDynamicLoading-seed#[50EB9EBCEB400688]) [    ] o.a.s.c.SolrResourceLoader solr home defaulted to 'solr/' (could not find system property or JNDI)
   [junit4]   2> 1747149 INFO  (TEST-TestDynamicLoading.testDynamicLoading-seed#[50EB9EBCEB400688]) [    ] o.a.s.c.c.SolrZkClient Using default ZkCredentialsProvider
   [junit4]   2> 1747149 INFO  (TEST-TestDynamicLoading.testDynamicLoading-seed#[50EB9EBCEB400688]) [    ] o.a.s.c.c.ConnectionManager Waiting for client to connect to ZooKeeper
   [junit4]   2> 1747151 INFO  (zkCallback-1872-thread-1) [    ] o.a.s.c.c.ConnectionManager Watcher org.apache.solr.common.cloud.ConnectionManager@9c1e5d name:ZooKeeperConnection Watcher:127.0.0.1:42447/solr got event WatchedEvent state:SyncConnected type:None path:null path:null type:None
   [junit4]   2> 1747151 INFO  (TEST-TestDynamicLoading.testDynamicLoading-seed#[50EB9EBCEB400688]) [    ] o.a.s.c.c.ConnectionManager Client is connected to ZooKeeper
   [junit4]   2> 1747151 INFO  (TEST-TestDynamicLoading.testDynamicLoading-seed#[50EB9EBCEB400688]) [    ] o.a.s.c.c.SolrZkClient Using default ZkACLProvider
   [junit4]   2> 1747152 INFO  (TEST-TestDynamicLoading.testDynamicLoading-seed#[50EB9EBCEB400688]) [    ] o.a.s.s.SolrDispatchFilter Loading solr.xml from SolrHome (not found in ZooKeeper)
   [junit4]   2> 1747152 INFO  (TEST-TestDynamicLoading.testDynamicLoading-seed#[50EB9EBCEB400688]) [    ] o.a.s.c.SolrXmlConfig Loading container configuration from /home/jenkins/workspace/Lucene-Solr-5.5-Linux/solr/build/solr-core/test/J2/temp/solr.core.TestDynamicLoading_50EB9EBCEB400688-001/control-001/solr.xml
   [junit4]   2> 1747164 INFO  (TEST-TestDynamicLoading.testDynamicLoading-seed#[50EB9EBCEB400688]) [    ] o.a.s.c.CorePropertiesLocator Config-defined core root directory: /home/jenkins/workspace/Lucene-Solr-5.5-Linux/solr/build/solr-core/test/J2/../../../../../../../../../home/jenkins/workspace/Lucene-Solr-5.5-Linux/solr/build/solr-core/test/J2/temp/solr.core.TestDynamicLoading_50EB9EBCEB400688-001/control-001/cores
   [junit4]   2> 1747164 INFO  (TEST-TestDynamicLoading.testDynamicLoading-seed#[50EB9EBCEB400688]) [    ] o.a.s.c.CoreContainer New CoreContainer 1721197
   [junit4]   2> 1747164 INFO  (TEST-TestDynamicLoading.testDynamicLoading-seed#[50EB9EBCEB400688]) [    ] o.a.s.c.CoreContainer Loading cores into CoreContainer [instanceDir=/home/jenkins/workspace/Lucene-Solr-5.5-Linux/solr/build/solr-core/test/J2/temp/solr.core.TestDynamicLoading_50EB9EBCEB400688-001/control-001]
   [junit4]   2> 1747164 WARN  (TEST-TestDynamicLoading.testDynamicLoading-seed#[50EB9EBCEB400688]) [    ] o.a.s.c.CoreContainer Couldn't add files from /home/jenkins/workspace/Lucene-Solr-5.5-Linux/solr/build/solr-core/test/J2/temp/solr.core.TestDynamicLoading_50EB9EBCEB400688-001/control-001/lib to classpath: /home/jenkins/workspace/Lucene-Solr-5.5-Linux/solr/build/solr-core/test/J2/temp/solr.core.TestDynamicLoading_50EB9EBCEB400688-001/control-001/lib
   [junit4]   2> 1747165 INFO  (TEST-TestDynamicLoading.testDynamicLoading-seed#[50EB9EBCEB400688]) [    ] o.a.s.h.c.HttpShardHandlerFactory created with socketTimeout : 90000,urlScheme : ,connTimeout : 15000,maxConnectionsPerHost : 20,maxConnections : 10000,corePoolSize : 0,maximumPoolSize : 2147483647,maxThreadIdleTime : 5,sizeOfQueue : -1,fairnessPolicy : false,useRetries : false,connectionsEvictorSleepDelay : 5000,maxConnectionIdleTime : 40000,
   [junit4]   2> 1747165 INFO  (TEST-TestDynamicLoading.testDynamicLoading-seed#[50EB9EBCEB400688]) [    ] o.a.s.u.UpdateShardHandler Creating UpdateShardHandler HTTP client with params: socketTimeout=340000&connTimeout=45000&retry=true
   [junit4]   2> 1747166 INFO  (TEST-TestDynamicLoading.testDynamicLoading-seed#[50EB9EBCEB400688]) [    ] o.a.s.l.LogWatcher SLF4J impl is org.slf4j.impl.Log4jLoggerFactory
   [junit4]   2> 1747166 INFO  (TEST-TestDynamicLoading.testDynamicLoading-seed#[50EB9EBCEB400688]) [    ] o.a.s.l.LogWatcher Registering Log Listener [Log4j (org.slf4j.impl.Log4jLoggerFactory)]
   [junit4]   2> 1747166 INFO  (TEST-TestDynamicLoading.testDynamicLoading-seed#[50EB9EBCEB400688]) [    ] o.a.s.c.ZkContainer Zookeeper client=127.0.0.1:42447/solr
   [junit4]   2> 1747166 INFO  (TEST-TestDynamicLoading.testDynamicLoading-seed#[50EB9EBCEB400688]) [    ] o.a.s.c.ZkController zkHost includes chroot
   [junit4]   2> 1747166 INFO  (TEST-TestDynamicLoading.testDynamicLoading-seed#[50EB9EBCEB400688]) [    ] o.a.s.c.c.SolrZkClient Using default ZkCredentialsProvider
   [junit4]   2> 1747166 INFO  (TEST-TestDynamicLoading.testDynamicLoading-seed#[50EB9EBCEB400688]) [    ] o.a.s.c.c.ConnectionManager Waiting for client to connect to ZooKeeper
   [junit4]   2> 1747167 INFO  (zkCallback-1875-thread-1) [    ] o.a.s.c.c.ConnectionManager Watcher org.apache.solr.common.cloud.ConnectionManager@93c672 name:ZooKeeperConnection Watcher:127.0.0.1:42447 got event WatchedEvent state:SyncConnected type:None path:null path:null type:None
   [junit4]   2> 1747167 INFO  (TEST-TestDynamicLoading.testDynamicLoading-seed#[50EB9EBCEB400688]) [    ] o.a.s.c.c.ConnectionManager Client is connected to ZooKeeper
   [junit4]   2> 1747168 INFO  (TEST-TestDynamicLoading.testDynamicLoading-seed#[50EB9EBCEB400688]) [    ] o.a.s.c.c.SolrZkClient Using default ZkACLProvider
   [junit4]   2> 1747168 INFO  (TEST-TestDynamicLoading.testDynamicLoading-seed#[50EB9EBCEB400688]) [n:127.0.0.1:44107_wqj    ] o.a.s.c.ZkController Added new OnReconnect listener org.apache.solr.cloud.ZkController$6@36416e
   [junit4]   2> 1747169 INFO  (TEST-TestDynamicLoading.testDynamicLoading-seed#[50EB9EBCEB400688]) [n:127.0.0.1:44107_wqj    ] o.a.s.c.c.ConnectionManager Waiting for client to connect to ZooKeeper
   [junit4]   2> 1747169 INFO  (zkCallback-1876-thread-1-processing-n:127.0.0.1:44107_wqj) [n:127.0.0.1:44107_wqj    ] o.a.s.c.c.ConnectionManager Watcher org.apache.solr.common.cloud.ConnectionManager@82bcec name:ZooKeeperConnection Watcher:127.0.0.1:42447/solr got event WatchedEvent state:SyncConnected type:None path:null path:null type:None
   [junit4]   2> 1747170 INFO  (TEST-TestDynamicLoading.testDynamicLoading-seed#[50EB9EBCEB400688]) [n:127.0.0.1:44107_wqj    ] o.a.s.c.c.ConnectionManager Client is connected to ZooKeeper
   [junit4]   2> 1747170 INFO  (TEST-TestDynamicLoading.testDynamicLoading-seed#[50EB9EBCEB400688]) [n:127.0.0.1:44107_wqj    ] o.a.s.c.c.SolrZkClient makePath: /overseer/queue
   [junit4]   2> 1747171 INFO  (TEST-TestDynamicLoading.testDynamicLoading-seed#[50EB9EBCEB400688]) [n:127.0.0.1:44107_wqj    ] o.a.s.c.c.SolrZkClient makePath: /overseer/collection-queue-work
   [junit4]   2> 1747173 INFO  (TEST-TestDynamicLoading.testDynamicLoading-seed#[50EB9EBCEB400688]) [n:127.0.0.1:44107_wqj    ] o.a.s.c.c.SolrZkClient makePath: /overseer/collection-map-running
   [junit4]   2> 1747173 INFO  (TEST-TestDynamicLoading.testDynamicLoading-seed#[50EB9EBCEB400688]) [n:127.0.0.1:44107_wqj    ] o.a.s.c.c.SolrZkClient makePath: /overseer/collection-map-completed
   [junit4]   2> 1747176 INFO  (TEST-TestDynamicLoading.testDynamicLoading-seed#[50EB9EBCEB400688]) [n:127.0.0.1:44107_wqj    ] o.a.s.c.c.SolrZkClient makePath: /overseer/collection-map-failure
   [junit4]   2> 1747176 INFO  (TEST-TestDynamicLoading.testDynamicLoading-seed#[50EB9EBCEB400688]) [n:127.0.0.1:44107_wqj    ] o.a.s.c.c.SolrZkClient makePath: /live_nodes
   [junit4]   2> 1747177 INFO  (TEST-TestDynamicLoading.testDynamicLoading-seed#[50EB9EBCEB400688]) [n:127.0.0.1:44107_wqj    ] o.a.s.c.c.SolrZkClient makePath: /aliases.json
   [junit4]   2> 1747177 INFO  (TEST-TestDynamicLoading.testDynamicLoading-seed#[50EB9EBCEB400688]) [n:127.0.0.1:44107_wqj    ] o.a.s.c.c.SolrZkClient makePath: /clusterstate.json
   [junit4]   2> 1747178 INFO  (TEST-TestDynamicLoading.testDynamicLoading-seed#[50EB9EBCEB400688]) [n:127.0.0.1:44107_wqj    ] o.a.s.c.c.SolrZkClient makePath: /security.json
   [junit4]   2> 1747178 INFO  (TEST-TestDynamicLoading.testDynamicLoading-seed#[50EB9EBCEB400688]) [n:127.0.0.1:44107_wqj    ] o.a.s.c.ZkController Register node as live in ZooKeeper:/live_nodes/127.0.0.1:44107_wqj
   [junit4]   2> 1747179 INFO  (TEST-TestDynamicLoading.testDynamicLoading-seed#[50EB9EBCEB400688]) [n:127.0.0.1:44107_wqj    ] o.a.s.c.c.SolrZkClient makePath: /live_nodes/127.0.0.1:44107_wqj
   [junit4]   2> 1747179 INFO  (TEST-TestDynamicLoading.testDynamicLoading-seed#[50EB9EBCEB400688]) [n:127.0.0.1:44107_wqj    ] o.a.s.c.c.SolrZkClient makePath: /overseer_elect
   [junit4]   2> 1747179 INFO  (TEST-TestDynamicLoading.testDynamicLoading-seed#[50EB9EBCEB400688]) [n:127.0.0.1:44107_wqj    ] o.a.s.c.c.SolrZkClient makePath: /overseer_elect/election
   [junit4]   2> 1747180 INFO  (TEST-TestDynamicLoading.testDynamicLoading-seed#[50EB9EBCEB400688]) [n:127.0.0.1:44107_wqj    ] o.a.s.c.Overseer Overseer (id=null) closing
   [junit4]   2> 1747180 INFO  (TEST-TestDynamicLoading.testDynamicLoading-seed#[50EB9EBCEB400688]) [n:127.0.0.1:44107_wqj    ] o.a.s.c.LeaderElector Joined leadership election with path: /overseer_elect/election/96521099380981764-127.0.0.1:44107_wqj-n_0000000000
   [junit4]   2> 1747180 INFO  (TEST-TestDynamicLoading.testDynamicLoading-seed#[50EB9EBCEB400688]) [n:127.0.0.1:44107_wqj    ] o.a.s.c.OverseerElectionContext I am going to be the leader 127.0.0.1:44107_wqj
   [junit4]   2> 1747180 INFO  (TEST-TestDynamicLoading.testDynamicLoading-seed#[50EB9EBCEB400688]) [n:127.0.0.1:44107_wqj    ] o.a.s.c.c.SolrZkClient makePath: /overseer_elect/leader
   [junit4]   2> 1747181 INFO  (TEST-TestDynamicLoading.testDynamicLoading-seed#[50EB9EBCEB400688]) [n:127.0.0.1:44107_wqj    ] o.a.s.c.Overseer Overseer (id=96521099380981764-127.0.0.1:44107_wqj-n_0000000000) starting
   [junit4]   2> 1747182 INFO  (TEST-TestDynamicLoading.testDynamicLoading-seed#[50EB9EBCEB400688]) [n:127.0.0.1:44107_wqj    ] o.a.s.c.c.SolrZkClient makePath: /overseer/queue-work
   [junit4]   2> 1747185 INFO  (TEST-TestDynamicLoading.testDynamicLoading-seed#[50EB9EBCEB400688]) [n:127.0.0.1:44107_wqj    ] o.a.s.c.OverseerAutoReplicaFailoverThread Starting OverseerAutoReplicaFailoverThread autoReplicaFailoverWorkLoopDelay=10000 autoReplicaFailoverWaitAfterExpiration=30000 autoReplicaFailoverBadNodeExpiration=60000
   [junit4]   2> 1747185 INFO  (OverseerCollectionConfigSetProcessor-96521099380981764-127.0.0.1:44107_wqj-n_0000000000) [n:127.0.0.1:44107_wqj    ] o.a.s.c.OverseerTaskProcessor Process current queue of overseer operations
   [junit4]   2> 1747185 INFO  (TEST-TestDynamicLoading.testDynamicLoading-seed#[50EB9EBCEB400688]) [n:127.0.0.1:44107_wqj    ] o.a.s.c.c.ZkStateReader Updating cluster state from ZooKeeper... 
   [junit4]   2> 1747185 INFO  (OverseerStateUpdate-96521099380981764-127.0.0.1:44107_wqj-n_0000000000) [n:127.0.0.1:44107_wqj    ] o.a.s.c.Overseer Starting to work on the main queue
   [junit4]   2> 1747285 INFO  (TEST-TestDynamicLoading.testDynamicLoading-seed#[50EB9EBCEB400688]) [n:127.0.0.1:44107_wqj    ] o.a.s.c.CoreContainer Security conf doesn't exist. Skipping setup for authorization module.
   [junit4]   2> 1747285 INFO  (TEST-TestDynamicLoading.testDynamicLoading-seed#[50EB9EBCEB400688]) [n:127.0.0.1:44107_wqj    ] o.a.s.c.CoreContainer No authentication plugin used.
   [junit4]   2> 1747285 INFO  (TEST-TestDynamicLoading.testDynamicLoading-seed#[50EB9EBCEB400688]) [n:127.0.0.1:44107_wqj    ] o.a.s.c.CorePropertiesLocator Looking for core definitions underneath /home/jenkins/workspace/Lucene-Solr-5.5-Linux/solr/build/solr-core/test/J2/../../../../../../../../../home/jenkins/workspace/Lucene-Solr-5.5-Linux/solr/build/solr-core/test/J2/temp/solr.core.TestDynamicLoading_50EB9EBCEB400688-001/control-001/cores
   [junit4]   2> 1747286 INFO  (TEST-TestDynamicLoading.testDynamicLoading-seed#[50EB9EBCEB400688]) [n:127.0.0.1:44107_wqj    ] o.a.s.c.CoreDescriptor Created CoreDescriptor: {loadOnStartup=true, name=collection1, transient=false, coreNodeName=, shard=, dataDir=data/, config=solrconfig.xml, collection=control_collection, configSetProperties=configsetprops.json, schema=schema.xml}
   [junit4]   2> 1747286 INFO  (TEST-TestDynamicLoading.testDynamicLoading-seed#[50EB9EBCEB400688]) [n:127.0.0.1:44107_wqj    ] o.a.s.c.CorePropertiesLocator Found core collection1 in /home/jenkins/workspace/Lucene-Solr-5.5-Linux/solr/build/solr-core/test/J2/../../../../../../../../../home/jenkins/workspace/Lucene-Solr-5.5-Linux/solr/build/solr-core/test/J2/temp/solr.core.TestDynamicLoading_50EB9EBCEB400688-001/control-001/cores/collection1
   [junit4]   2> 1747286 INFO  (TEST-TestDynamicLoading.testDynamicLoading-seed#[50EB9EBCEB400688]) [n:127.0.0.1:44107_wqj    ] o.a.s.c.CorePropertiesLocator Found 1 core definitions
   [junit4]   2> 1747287 INFO  (TEST-TestDynamicLoading.testDynamicLoading-seed#[50EB9EBCEB400688]) [n:127.0.0.1:44107_wqj    ] o.a.s.s.SolrDispatchFilter user.dir=/home/jenkins/workspace/Lucene-Solr-5.5-Linux/solr/build/solr-core/test/J2
   [junit4]   2> 1747287 INFO  (TEST-TestDynamicLoading.testDynamicLoading-seed#[50EB9EBCEB400688]) [n:127.0.0.1:44107_wqj    ] o.a.s.s.SolrDispatchFilter SolrDispatchFilter.init() done
   [junit4]   2> 1747287 INFO  (coreLoadExecutor-6326-thread-1-processing-n:127.0.0.1:44107_wqj) [n:127.0.0.1:44107_wqj c:control_collection   x:collection1] o.a.s.c.ZkController publishing state=down
   [junit4]   2> 1747287 INFO  (coreLoadExecutor-6326-thread-1-processing-n:127.0.0.1:44107_wqj) [n:127.0.0.1:44107_wqj c:control_collection   x:collection1] o.a.s.c.ZkController numShards not found on descriptor - reading it from system property
   [junit4]   2> 1747288 INFO  (coreLoadExecutor-6326-thread-1-processing-n:127.0.0.1:44107_wqj) [n:127.0.0.1:44107_wqj c:control_collection   x:collection1] o.a.s.c.ZkController Collection control_collection not visible yet, but flagging it so a watch is registered when it becomes visible
   [junit4]   2> 1747288 INFO  (coreLoadExecutor-6326-thread-1-processing-n:127.0.0.1:44107_wqj) [n:127.0.0.1:44107_wqj c:control_collection   x:collection1] o.a.s.c.c.ZkStateReader addZkWatch [control_collection]
   [junit4]   2> 1747288 INFO  (OverseerStateUpdate-96521099380981764-127.0.0.1:44107_wqj-n_0000000000) [n:127.0.0.1:44107_wqj    ] o.a.s.c.Overseer processMessage: queueSize: 1, message = {
   [junit4]   2>   "core":"collection1",
   [junit4]   2>   "roles":null,
   [junit4]   2>   "collection":"control_collection",
   [junit4]   2>   "shard":null,
   [junit4]   2>   "operation":"state",
   [junit4]   2>   "node_name":"127.0.0.1:44107_wqj",
   [junit4]   2>   "base_url":"http://127.0.0.1:44107/wqj",
   [junit4]   2>   "state":"down",
   [junit4]   2>   "numShards":"1"} current state version: 0
   [junit4]   2> 1747289 INFO  (coreLoadExecutor-6326-thread-1-processing-n:127.0.0.1:44107_wqj) [n:127.0.0.1:44107_wqj c:control_collection   x:collection1] o.a.s.c.c.ZkStateReader Deleting data for [control_collection]
   [junit4]   2> 1747289 INFO  (OverseerStateUpdate-96521099380981764-127.0.0.1:44107_wqj-n_0000000000) [n:127.0.0.1:44107_wqj    ] o.a.s.c.o.ReplicaMutator Update state numShards=1 message={
   [junit4]   2>   "core":"collection1",
   [junit4]   2>   "roles":null,
   [junit4]   2>   "collection":"control_collection",
   [junit4]   2>   "shard":null,
   [junit4]   2>   "operation":"state",
   [junit4]   2>   "node_name":"127.0.0.1:44107_wqj",
   [junit4]   2>   "base_url":"http://127.0.0.1:44107/wqj",
   [junit4]   2>   "state":"down",
   [junit4]   2>   "numShards":"1"}
   [junit4]   2> 1747289 INFO  (OverseerStateUpdate-96521099380981764-127.0.0.1:44107_wqj-n_0000000000) [n:127.0.0.1:44107_wqj    ] o.a.s.c.o.ClusterStateMutator building a new cName: control_collection
   [junit4]   2> 1747289 INFO  (OverseerStateUpdate-96521099380981764-127.0.0.1:44107_wqj-n_0000000000) [n:127.0.0.1:44107_wqj    ] o.a.s.c.o.ReplicaMutator Assigning new node to shard shard=shard1
   [junit4]   2> 1747289 INFO  (coreLoadExecutor-6326-thread-1-processing-n:127.0.0.1:44107_wqj) [n:127.0.0.1:44107_wqj c:control_collection   x:collection1] o.a.s.c.ZkController look for our core node name
   [junit4]   2> 1747290 INFO  (zkCallback-1876-thread-1-processing-n:127.0.0.1:44107_wqj) [n:127.0.0.1:44107_wqj    ] o.a.s.c.c.ZkStateReader A cluster state change: [WatchedEvent state:SyncConnected type:NodeDataChanged path:/clusterstate.json], has occurred - updating... (live nodes size: [1])
   [junit4]   2> 1748291 INFO  (coreLoadExecutor-6326-thread-1-processing-n:127.0.0.1:44107_wqj) [n:127.0.0.1:44107_wqj c:control_collection   x:collection1] o.a.s.c.ZkController waiting to find shard id in clusterstate for collection1
   [junit4]   2> 1748291 INFO  (coreLoadExecutor-6326-thread-1-processing-n:127.0.0.1:44107_wqj) [n:127.0.0.1:44107_wqj c:control_collection   x:collection1] o.a.s.c.ZkController Check for collection zkNode:control_collection
   [junit4]   2> 1748291 INFO  (coreLoadExecutor-6326-thread-1-processing-n:127.0.0.1:44107_wqj) [n:127.0.0.1:44107_wqj c:control_collection   x:collection1] o.a.s.c.ZkController Collection zkNode exists
   [junit4]   2> 1748291 INFO  (coreLoadExecutor-6326-thread-1-processing-n:127.0.0.1:44107_wqj) [n:127.0.0.1:44107_wqj c:control_collection   x:collection1] o.a.s.c.c.ZkStateReader Load collection config from: [/collections/control_collection]
   [junit4]   2> 1748292 INFO  (coreLoadExecutor-6326-thread-1-processing-n:127.0.0.1:44107_wqj) [n:127.0.0.1:44107_wqj c:control_collection   x:collection1] o.a.s.c.c.ZkStateReader path=[/collections/control_collection] [configName]=[conf1] specified config exists in ZooKeeper
   [junit4]   2> 1748292 INFO  (coreLoadExecutor-6326-thread-1-processing-n:127.0.0.1:44107_wqj) [n:127.0.0.1:44107_wqj c:control_collection   x:collection1] o.a.s.c.SolrResourceLoader new SolrResourceLoader for directory: '/home/jenkins/workspace/Lucene-Solr-5.5-Linux/solr/build/solr-core/test/J2/temp/solr.core.TestDynamicLoading_50EB9EBCEB400688-001/control-001/cores/collection1'
   [junit4]   2> 1748292 INFO  (coreLoadExecutor-6326-thread-1-processing-n:127.0.0.1:44107_wqj) [n:127.0.0.1:44107_wqj c:control_collection   x:collection1] o.a.s.c.SolrResourceLoader JNDI not configured for solr (NoInitialContextEx)
   [junit4]   2> 1748292 INFO  (coreLoadExecutor-6326-thread-1-processing-n:127.0.0.1:44107_wqj) [n:127.0.0.1:44107_wqj c:control_collection   x:collection1] o.a.s.c.SolrResourceLoader solr home defaulted to 'solr/' (could not find system property or JNDI)
   [junit4]   2> 1748294 INFO  (coreLoadExecutor-6326-thread-1-processing-n:127.0.0.1:44107_wqj) [n:127.0.0.1:44107_wqj c:control_collection   x:collection1] o.a.s.c.Config loaded config solrconfig.xml with version 0 
   [junit4]   2> 1748298 INFO  (coreLoadExecutor-6326-thread-1-processing-n:127.0.0.1:44107_wqj) [n:127.0.0.1:44107_wqj c:control_collection   x:collection1] o.a.s.c.SolrConfig current version of requestparams : -1
   [junit4]   2> 1748312 INFO  (coreLoadExecutor-6326-thread-1-processing-n:127.0.0.1:44107_wqj) [n:127.0.0.1:44107_wqj c:control_collection   x:collection1] o.a.s.c.SolrConfig Using Lucene MatchVersion: 5.5.3
   [junit4]   2> 1748340 INFO  (coreLoadExecutor-6326-thread-1-processing-n:127.0.0.1:44107_wqj) [n:127.0.0.1:44107_wqj c:control_collection   x:collection1] o.a.s.c.SolrConfig Loaded SolrConfig: solrconfig.xml
   [junit4]   2> 1748348 INFO  (coreLoadExecutor-6326-thread-1-processing-n:127.0.0.1:44107_wqj) [n:127.0.0.1:44107_wqj c:control_collection   x:collection1] o.a.s.s.IndexSchema [collection1] Schema name=test
   [junit4]   2> 1748600 INFO  (coreLoadExecutor-6326-thread-1-processing-n:127.0.0.1:44107_wqj) [n:127.0.0.1:44107_wqj c:control_collection   x:collection1] o.a.s.s.OpenExchangeRatesOrgProvider Initialized with rates=open-exchange-rates.json, refreshInterval=1440.
   [junit4]   2> 1748608 INFO  (coreLoadExecutor-6326-thread-1-processing-n:127.0.0.1:44107_wqj) [n:127.0.0.1:44107_wqj c:control_collection   x:collection1] o.a.s.s.IndexSchema default search field in schema is text
   [junit4]   2> 1748609 INFO  (coreLoadExecutor-6326-thread-1-processing-n:127.0.0.1:44107_wqj) [n:127.0.0.1:44107_wqj c:control_collection   x:collection1] o.a.s.s.IndexSchema unique key field: id
   [junit4]   2> 1748615 INFO  (coreLoadExecutor-6326-thread-1-processing-n:127.0.0.1:44107_wqj) [n:127.0.0.1:44107_wqj c:control_collection   x:collection1] o.a.s.s.FileExchangeRateProvider Reloading exchange rates from file currency.xml
   [junit4]   2> 1748618 INFO  (coreLoadExecutor-6326-thread-1-processing-n:127.0.0.1:44107_wqj) [n:127.0.0.1:44107_wqj c:control_collection   x:collection1] o.a.s.s.FileExchangeRateProvider Reloading exchange rates from file currency.xml
   [junit4]   2> 1748620 INFO  (coreLoadExecutor-6326-thread-1-processing-n:127.0.0.1:44107_wqj) [n:127.0.0.1:44107_wqj c:control_collection   x:collection1] o.a.s.s.OpenExchangeRatesOrgProvider Reloading exchange rates from open-exchange-rates.json
   [junit4]   2> 1748620 INFO  (coreLoadExecutor-6326-thread-1-processing-n:127.0.0.1:44107_wqj) [n:127.0.0.1:44107_wqj c:control_collection   x:collection1] o.a.s.s.OpenExchangeRatesOrgProvider Reloading exchange rates from open-exchange-rates.json
   [junit4]   2> 1748621 INFO  (coreLoadExecutor-6326-thread-1-processing-n:127.0.0.1:44107_wqj) [n:127.0.0.1:44107_wqj c:control_collection   x:collection1] o.a.s.c.ConfigSetProperties Did not find ConfigSet properties, assuming default properties: Can't find resource 'configsetprops.json' in classpath or '/configs/conf1', cwd=/home/jenkins/workspace/Lucene-Solr-5.5-Linux/solr/build/solr-core/test/J2
   [junit4]   2> 1748621 INFO  (coreLoadExecutor-6326-thread-1-processing-n:127.0.0.1:44107_wqj) [n:127.0.0.1:44107_wqj c:control_collection   x:collection1] o.a.s.c.CoreContainer Creating SolrCore 'collection1' using configuration from collection control_collection
   [junit4]   2> 1748621 INFO  (coreLoadExecutor-6326-thread-1-processing-n:127.0.0.1:44107_wqj) [n:127.0.0.1:44107_wqj c:control_collection s:shard1 r:core_node1 x:collection1] o.a.s.c.SolrCore org.apache.solr.core.MockDirectoryFactory
   [junit4]   2> 1748622 INFO  (coreLoadExecutor-6326-thread-1-processing-n:127.0.0.1:44107_wqj) [n:127.0.0.1:44107_wqj c:control_collection s:shard1 r:core_node1 x:collection1] o.a.s.c.SolrCore [[collection1] ] Opening new SolrCore at [/home/jenkins/workspace/Lucene-Solr-5.5-Linux/solr/build/solr-core/test/J2/temp/solr.core.TestDynamicLoading_50EB9EBCEB400688-001/control-001/cores/collection1], dataDir=[/home/jenkins/workspace/Lucene-Solr-5.5-Linux/solr/build/solr-core/test/J2/../../../../../../../../../home/jenkins/workspace/Lucene-Solr-5.5-Linux/solr/build/solr-core/test/J2/temp/solr.core.TestDynamicLoading_50EB9EBCEB400688-001/control-001/cores/collection1/data/]
   [junit4]   2> 1748622 INFO  (coreLoadExecutor-6326-thread-1-processing-n:127.0.0.1:44107_wqj) [n:127.0.0.1:44107_wqj c:control_collection s:shard1 r:core_node1 x:collection1] o.a.s.c.JmxMonitoredMap JMX monitoring is enabled. Adding Solr mbeans to JMX Server: com.sun.jmx.mbeanserver.JmxMBeanServer@3c3daf
   [junit4]   2> 1748622 INFO  (coreLoadExecutor-6326-thread-1-processing-n:127.0.0.1:44107_wqj) [n:127.0.0.1:44107_wqj c:control_collection s:shard1 r:core_node1 x:collection1] o.a.s.c.CachingDirectoryFactory return new directory for /home/jenkins/workspace/Lucene-Solr-5.5-Linux/solr/build/solr-core/test/J2/../../../../../../../../../home/jenkins/workspace/Lucene-Solr-5.5-Linux/solr/build/solr-core/test/J2/temp/solr.core.TestDynamicLoading_50EB9EBCEB400688-001/control-001/cores/collection1/data
   [junit4]   2> 1748622 INFO  (coreLoadExecutor-6326-thread-1-processing-n:127.0.0.1:44107_wqj) [n:127.0.0.1:44107_wqj c:control_collection s:shard1 r:core_node1 x:collection1] o.a.s.c.SolrCore New index directory detected: old=null new=/home/jenkins/workspace/Lucene-Solr-5.5-Linux/solr/build/solr-core/test/J2/../../../../../../../../../home/jenkins/workspace/Lucene-Solr-5.5-Linux/solr/build/solr-core/test/J2/temp/solr.core.TestDynamicLoading_50EB9EBCEB400688-001/control-001/cores/collection1/data/index/
   [junit4]   2> 1748622 WARN  (coreLoadExecutor-6326-thread-1-processing-n:127.0.0.1:44107_wqj) [n:127.0.0.1:44107_wqj c:control_collection s:shard1 r:core_node1 x:collection1] o.a.s.c.SolrCore [collection1] Solr index directory '/home/jenkins/workspace/Lucene-Solr-5.5-Linux/solr/build/solr-core/test/J2/../../../../../../../../../home/jenkins/workspace/Lucene-Solr-5.5-Linux/solr/build/solr-core/test/J2/temp/solr.core.TestDynamicLoading_50EB9EBCEB400688-001/control-001/cores/collection1/data/index' doesn't exist. Creating new index...
   [junit4]   2> 1748623 INFO  (coreLoadExecutor-6326-thread-1-processing-n:127.0.0.1:44107_wqj) [n:127.0.0.1:44107_wqj c:control_collection s:shard1 r:core_node1 x:collection1] o.a.s.c.CachingDirectoryFactory return new directory for /home/jenkins/workspace/Lucene-Solr-5.5-Linux/solr/build/solr-core/test/J2/../../../../../../../../../home/jenkins/workspace/Lucene-Solr-5.5-Linux/solr/build/solr-core/test/J2/temp/solr.core.TestDynamicLoading_50EB9EBCEB400688-001/control-001/cores/collection1/data/index
   [junit4]   2> 1748623 INFO  (coreLoadExecutor-6326-thread-1-processing-n:127.0.0.1:44107_wqj) [n:127.0.0.1:44107_wqj c:control_collection s:shard1 r:core_node1 x:collection1] o.a.s.u.RandomMergePolicy RandomMergePolicy wrapping class org.apache.lucene.index.LogDocMergePolicy: [LogDocMergePolicy: minMergeSize=1000, mergeFactor=42, maxMergeSize=9223372036854775807, maxMergeSizeForForcedMerge=9223372036854775807, calibrateSizeByDeletes=true, maxMergeDocs=2147483647, maxCFSSegmentSizeMB=8.796093022207999E12, noCFSRatio=0.26301901197464944]
   [junit4]   2> 1748623 INFO  (coreLoadExecutor-6326-thread-1-processing-n:127.0.0.1:44107_wqj) [n:127.0.0.1:44107_wqj c:control_collection s:shard1 r:core_node1 x:collection1] o.a.s.c.SolrDeletionPolicy SolrDeletionPolicy.onCommit: commits: num=1
   [junit4]   2> 	commit{dir=MockDirectoryWrapper(RAMDirectory@43aa4d lockFactory=org.apache.lucene.store.SingleInstanceLockFactory@61b1ad),segFN=segments_1,generation=1}
   [junit4]   2> 1748623 INFO  (coreLoadExecutor-6326-thread-1-processing-n:127.0.0.1:44107_wqj) [n:127.0.0.1:44107_wqj c:control_collection s:shard1 r:core_node1 x:collection1] o.a.s.c.SolrDeletionPolicy newest commit generation = 1
   [junit4]   2> 1748624 INFO  (OldIndexDirectoryCleanupThreadForCore-collection1) [n:127.0.0.1:44107_wqj c:control_collection s:shard1 r:core_node1 x:collection1] o.a.s.c.SolrCore Looking for old index directories to cleanup for core collection1 in /home/jenkins/workspace/Lucene-Solr-5.5-Linux/solr/build/solr-core/test/J2/../../../../../../../../../home/jenkins/workspace/Lucene-Solr-5.5-Linux/solr/build/solr-core/test/J2/temp/solr.core.TestDynamicLoading_50EB9EBCEB400688-001/control-001/cores/collection1/data/
   [junit4]   2> 1748624 WARN  (OldIndexDirectoryCleanupThreadForCore-collection1) [n:127.0.0.1:44107_wqj c:control_collection s:shard1 r:core_node1 x:collection1] o.a.s.c.DirectoryFactory /home/jenkins/workspace/Lucene-Solr-5.5-Linux/solr/build/solr-core/test/J2/../../../../../../../../../home/jenkins/workspace/Lucene-Solr-5.5-Linux/solr/build/solr-core/test/J2/temp/solr.core.TestDynamicLoading_50EB9EBCEB400688-001/control-001/cores/collection1/data/ does not point to a valid data directory; skipping clean-up of old index directories.
   [junit4]   2> 1748628 INFO  (coreLoadExecutor-6326-thread-1-processing-n:127.0.0.1:44107_wqj) [n:127.0.0.1:44107_wqj c:control_collection s:shard1 r:core_node1 x:collection1] o.a.s.u.p.UpdateRequestProcessorChain creating updateRequestProcessorChain "nodistrib"
   [junit4]   2> 1748628 INFO  (coreLoadExecutor-6326-thread-1-processing-n:127.0.0.1:44107_wqj) [n:127.0.0.1:44107_wqj c:control_collection s:shard1 r:core_node1 x:collection1] o.a.s.u.p.UpdateRequestProcessorChain creating updateRequestProcessorChain "dedupe"
   [junit4]   2> 1748628 INFO  (coreLoadExecutor-6326-thread-1-processing-n:127.0.0.1:44107_wqj) [n:127.0.0.1:44107_wqj c:control_collection s:shard1 r:core_node1 x:collection1] o.a.s.u.p.UpdateRequestProcessorChain inserting DistributedUpdateProcessorFactory into updateRequestProcessorChain "dedupe"
   [junit4]   2> 1748628 INFO  (coreLoadExecutor-6326-thread-1-processing-n:127.0.0.1:44107_wqj) [n:127.0.0.1:44107_wqj c:control_collection s:shard1 r:core_node1 x:collection1] o.a.s.u.p.UpdateRequestProcessorChain creating updateRequestProcessorChain "stored_sig"
   [junit4]   2> 1748628 INFO  (coreLoadExecutor-6326-thread-1-processing-n:127.0.0.1:44107_wqj) [n:127.0.0.1:44107_wqj c:control_collection s:shard1 r:core_node1 x:collection1] o.a.s.u.p.UpdateRequestProcessorChain inserting DistributedUpdateProcessorFactory into updateRequestProcessorChain "stored_sig"
   [junit4]   2> 1748628 INFO  (coreLoadExecutor-6326-thread-1-processing-n:127.0.0.1:44107_wqj) [n:127.0.0.1:44107_wqj c:control_collection s:shard1 r:core_node1 x:collection1] o.a.s.u.p.UpdateRequestProcessorChain creating updateRequestProcessorChain "distrib-dup-test-chain-explicit"
   [junit4]   2> 1748629 INFO  (coreLoadExecutor-6326-thread-1-processing-n:127.0.0.1:44107_wqj) [n:127.0.0.1:44107_wqj c:control_collection s:shard1 r:core_node1 x:collection1] o.a.s.u.p.UpdateRequestProcessorChain creating updateRequestProcessorChain "distrib-dup-test-chain-implicit"
   [junit4]   2> 1748629 INFO  (coreLoadExecutor-6326-thread-1-processing-n:127.0.0.1:44107_wqj) [n:127.0.0.1:44107_wqj c:control_collection s:shard1 r:core_node1 x:collection1] o.a.s.u.p.UpdateRequestProcessorChain inserting DistributedUpdateProcessorFactory into updateRequestProcessorChain "distrib-dup-test-chain-implicit"
   [junit4]   2> 1748629 INFO  (coreLoadExecutor-6326-thread-1-processing-n:127.0.0.1:44107_wqj) [n:127.0.0.1:44107_wqj c:control_collection s:shard1 r:core_node1 x:collection1] o.a.s.c.SolrCore no updateRequestProcessorChain defined as default, creating implicit default
   [junit4]   2> 1748629 WARN  (coreLoadExecutor-6326-thread-1-processing-n:127.0.0.1:44107_wqj) [n:127.0.0.1:44107_wqj c:control_collection s:shard1 r:core_node1 x:collection1] o.a.s.c.RequestHandlers INVALID paramSet a in requestHandler {type = requestHandler,name = /dump,class = DumpRequestHandler,args = {defaults={a=A,b=B}}}
   [junit4]   2> 1748631 INFO  (coreLoadExecutor-6326-thread-1-processing-n:127.0.0.1:44107_wqj) [n:127.0.0.1:44107_wqj c:control_collection s:shard1 r:core_node1 x:collection1] o.a.s.h.l.XMLLoader xsltCacheLifetimeSeconds=60
   [junit4]   2> 1748632 INFO  (coreLoadExecutor-6326-thread-1-processing-n:127.0.0.1:44107_wqj) [n:127.0.0.1:44107_wqj c:control_collection s:shard1 r:core_node1 x:collection1] o.a.s.h.l.XMLLoader xsltCacheLifetimeSeconds=60
   [junit4]   2> 1748633 INFO  (coreLoadExecutor-6326-thread-1-processing-n:127.0.0.1:44107_wqj) [n:127.0.0.1:44107_wqj c:control_collection s:shard1 r:core_node1 x:collection1] o.a.s.h.l.XMLLoader xsltCacheLifetimeSeconds=60
   [junit4]   2> 1748634 INFO  (coreLoadExecutor-6326-thread-1-processing-n:127.0.0.1:44107_wqj) [n:127.0.0.1:44107_wqj c:control_collection s:shard1 r:core_node1 x:collection1] o.a.s.h.l.XMLLoader xsltCacheLifetimeSeconds=60
   [junit4]   2> 1748637 INFO  (coreLoadExecutor-6326-thread-1-processing-n:127.0.0.1:44107_wqj) [n:127.0.0.1:44107_wqj c:control_collection s:shard1 r:core_node1 x:collection1] o.a.s.c.RequestHandlers Registered paths: /admin/mbeans,/admin/file,/replication,/admin/plugins,/get,/schema,/admin/logging,/update/json/docs,/dump,/admin/threads,/update/csv,/admin/segments,/admin/luke,/update/json,/update,/admin/ping,standard,/admin/properties,/admin/system,/config
   [junit4]   2> 1748640 INFO  (coreLoadExecutor-6326-thread-1-processing-n:127.0.0.1:44107_wqj) [n:127.0.0.1:44107_wqj c:control_collection s:shard1 r:core_node1 x:collection1] o.a.s.c.SolrCore Using default statsCache cache: org.apache.solr.search.stats.LocalStatsCache
   [junit4]   2> 1748640 INFO  (coreLoadExecutor-6326-thread-1-processing-n:127.0.0.1:44107_wqj) [n:127.0.0.1:44107_wqj c:control_collection s:shard1 r:core_node1 x:collection1] o.a.s.u.UpdateHandler Using UpdateLog implementation: org.apache.solr.update.UpdateLog
   [junit4]   2> 1748640 INFO  (coreLoadExecutor-6326-thread-1-processing-n:127.0.0.1:44107_wqj) [n:127.0.0.1:44107_wqj c:control_collection s:shard1 r:core_node1 x:collection1] o.a.s.u.UpdateLog Initializing UpdateLog: dataDir= defaultSyncLevel=FLUSH numRecordsToKeep=100 maxNumLogsToKeep=10 numVersionBuckets=65536
   [junit4]   2> 1748641 INFO  (coreLoadExecutor-6326-thread-1-processing-n:127.0.0.1:44107_wqj) [n:127.0.0.1:44107_wqj c:control_collection s:shard1 r:core_node1 x:collection1] o.a.s.u.CommitTracker Hard AutoCommit: disabled
   [junit4]   2> 1748641 INFO  (coreLoadExecutor-6326-thread-1-processing-n:127.0.0.1:44107_wqj) [n:127.0.0.1:44107_wqj c:control_collection s:shard1 r:core_node1 x:collection1] o.a.s.u.CommitTracker Soft AutoCommit: disabled
   [junit4]   2> 1748641 INFO  (coreLoadExecutor-6326-thread-1-processing-n:127.0.0.1:44107_wqj) [n:127.0.0.1:44107_wqj c:control_collection s:shard1 r:core_node1 x:collection1] o.a.s.u.RandomMergePolicy RandomMergePolicy wrapping class org.apache.lucene.index.TieredMergePolicy: [TieredMergePolicy: maxMergeAtOnce=46, maxMergeAtOnceExplicit=14, maxMergedSegmentMB=51.001953125, floorSegmentMB=1.8134765625, forceMergeDeletesPctAllowed=17.654152196464345, segmentsPerTier=48.0, maxCFSSegmentSizeMB=8.796093022207999E12, noCFSRatio=1.0
   [junit4]   2> 1748642 INFO  (coreLoadExecutor-6326-thread-1-processing-n:127.0.0.1:44107_wqj) [n:127.0.0.1:44107_wqj c:control_collection s:shard1 r:core_node1 x:collection1] o.a.s.c.SolrDeletionPolicy SolrDeletionPolicy.onInit: commits: num=1
   [junit4]   2> 	commit{dir=MockDirectoryWrapper(RAMDirectory@43aa4d lockFactory=org.apache.lucene.store.SingleInstanceLockFactory@61b1ad),segFN=segments_1,generation=1}
   [junit4]   2> 1748642 INFO  (coreLoadExecutor-6326-thread-1-processing-n:127.0.0.1:44107_wqj) [n:127.0.0.1:44107_wqj c:control_collection s:shard1 r:core_node1 x:collection1] o.a.s.c.SolrDeletionPolicy newest commit generation = 1
   [junit4]   2> 1748642 INFO  (coreLoadExecutor-6326-thread-1-processing-n:127.0.0.1:44107_wqj) [n:127.0.0.1:44107_wqj c:control_collection s:shard1 r:core_node1 x:collection1] o.a.s.s.SolrIndexSearcher Opening Searcher@1d7629d[collection1] main
   [junit4]   2> 1748642 INFO  (coreLoadExecutor-6326-thread-1-processing-n:127.0.0.1:44107_wqj) [n:127.0.0.1:44107_wqj c:control_collection s:shard1 r:core_node1 x:collection1] o.a.s.c.c.ZkStateReader Load collection config from: [/collections/control_collection]
   [junit4]   2> 1748642 INFO  (coreLoadExecutor-6326-thread-1-processing-n:127.0.0.1:44107_wqj) [n:127.0.0.1:44107_wqj c:control_collection s:shard1 r:core_node1 x:collection1] o.a.s.c.c.ZkStateReader path=[/collections/control_collection] [configName]=[conf1] specified config exists in ZooKeeper
   [junit4]   2> 1748642 INFO  (coreLoadExecutor-6326-thread-1-processing-n:127.0.0.1:44107_wqj) [n:127.0.0.1:44107_wqj c:control_collection s:shard1 r:core_node1 x:collection1] o.a.s.r.ManagedResourceStorage Setting up ZooKeeper-based storage for the RestManager with znodeBase: /configs/conf1
   [junit4]   2> 1748643 INFO  (coreLoadExecutor-6326-thread-1-processing-n:127.0.0.1:44107_wqj) [n:127.0.0.1:44107_wqj c:control_collection s:shard1 r:core_node1 x:collection1] o.a.s.r.ManagedResourceStorage Configured ZooKeeperStorageIO with znodeBase: /configs/conf1
   [junit4]   2> 1748643 INFO  (coreLoadExecutor-6326-thread-1-processing-n:127.0.0.1:44107_wqj) [n:127.0.0.1:44107_wqj c:control_collection s:shard1 r:core_node1 x:collection1] o.a.s.r.RestManager Initializing RestManager with initArgs: {}
   [junit4]   2> 1748643 INFO  (coreLoadExecutor-6326-thread-1-processing-n:127.0.0.1:44107_wqj) [n:127.0.0.1:44107_wqj c:control_collection s:shard1 r:core_node1 x:collection1] o.a.s.r.ManagedResourceStorage Reading _rest_managed.json using ZooKeeperStorageIO:path=/configs/conf1
   [junit4]   2> 1748643 INFO  (coreLoadExecutor-6326-thread-1-processing-n:127.0.0.1:44107_wqj) [n:127.0.0.1:44107_wqj c:control_collection s:shard1 r:core_node1 x:collection1] o.a.s.r.ManagedResourceStorage No data found for znode /configs/conf1/_rest_managed.json
   [junit4]   2> 1748643 INFO  (coreLoadExecutor-6326-thread-1-processing-n:127.0.0.1:44107_wqj) [n:127.0.0.1:44107_wqj c:control_collection s:shard1 r:core_node1 x:collection1] o.a.s.r.ManagedResourceStorage Loaded null at path _rest_managed.json using ZooKeeperStorageIO:path=/configs/conf1
   [junit4]   2> 1748643 INFO  (coreLoadExecutor-6326-thread-1-processing-n:127.0.0.1:44107_wqj) [n:127.0.0.1:44107_wqj c:control_collection s:shard1 r:core_node1 x:collection1] o.a.s.r.RestManager Initializing 0 registered ManagedResources
   [junit4]   2> 1748643 INFO  (coreLoadExecutor-6326-thread-1-processing-n:127.0.0.1:44107_wqj) [n:127.0.0.1:44107_wqj c:control_collection s:shard1 r:core_node1 x:collection1] o.a.s.h.ReplicationHandler Commits will be reserved for  10000
   [junit4]   2> 1748644 INFO  (searcherExecutor-6327-thread-1-processing-x:collection1 c:control_collection s:shard1 n:127.0.0.1:44107_wqj r:core_node1) [n:127.0.0.1:44107_wqj c:control_collection s:shard1 r:core_node1 x:collection1] o.a.s.c.SolrCore [collection1] Registered new searcher Searcher@1d7629d[collection1] main{ExitableDirectoryReader(UninvertingDirectoryReader())}
   [junit4]   2> 1748644 INFO  (coreLoadExecutor-6326-thread-1-processing-n:127.0.0.1:44107_wqj) [n:127.0.0.1:44107_wqj c:control_collection s:shard1 r:core_node1 x:collection1] o.a.s.u.UpdateLog Looking up max value of version field to seed version buckets
   [junit4]   2> 1748644 INFO  (coreLoadExecutor-6326-thread-1-processing-n:127.0.0.1:44107_wqj) [n:127.0.0.1:44107_wqj c:control_collection s:shard1 r:core_node1 x:collection1] o.a.s.u.VersionInfo Refreshing highest value of _version_ for 65536 version buckets from index
   [junit4]   2> 1748645 INFO  (coreLoadExecutor-6326-thread-1-processing-n:127.0.0.1:44107_wqj) [n:127.0.0.1:44107_wqj c:control_collection s:shard1 r:core_node1 x:collection1] o.a.s.u.VersionInfo No terms found for _version_, cannot seed version bucket highest value from index
   [junit4]   2> 1748645 INFO  (coreLoadExecutor-6326-thread-1-processing-n:127.0.0.1:44107_wqj) [n:127.0.0.1:44107_wqj c:control_collection s:shard1 r:core_node1 x:collection1] o.a.s.u.UpdateLog Could not find max version in index or recent updates, using new clock 1544337591861510144
   [junit4]   2> 1748646 INFO  (coreLoadExecutor-6326-thread-1-processing-n:127.0.0.1:44107_wqj) [n:127.0.0.1:44107_wqj c:control_collection s:shard1 r:core_node1 x:collection1] o.a.s.u.UpdateLog Took 1.0ms to seed version buckets with highest version 1544337591861510144
   [junit4]   2> 1748646 INFO  (coreLoadExecutor-6326-thread-1-processing-n:127.0.0.1:44107_wqj) [n:127.0.0.1:44107_wqj c:control_collection s:shard1 r:core_node1 x:collection1] o.a.s.c.ZkController watch zkdir /configs/conf1
   [junit4]   2> 1748647 INFO  (coreLoadExecutor-6326-thread-1-processing-n:127.0.0.1:44107_wqj) [n:127.0.0.1:44107_wqj c:control_collection s:shard1 r:core_node1 x:collection1] o.a.s.c.CoreContainer registering core: collection1
   [junit4]   2> 1748647 INFO  (coreZkRegister-6320-thread-1-processing-x:collection1 c:control_collection s:shard1 n:127.0.0.1:44107_wqj r:core_node1) [n:127.0.0.1:44107_wqj c:control_collection s:shard1 r:core_node1 x:collection1] o.a.s.c.ZkController Register replica - core:collection1 address:http://127.0.0.1:44107/wqj collection:control_collection shard:shard1
   [junit4]   2> 1748647 INFO  (coreZkRegister-6320-thread-1-processing-x:collection1 c:control_collection s:shard1 n:127.0.0.1:44107_wqj r:core_node1) [n:127.0.0.1:44107_wqj c:control_collection s:shard1 r:core_node1 x:collection1] o.a.s.c.c.SolrZkClient makePath: /collections/control_collection/leader_elect/shard1/election
   [junit4]   2> 1748649 INFO  (coreZkRegister-6320-thread-1-processing-x:collection1 c:control_collection s:shard1 n:127.0.0.1:44107_wqj r:core_node1) [n:127.0.0.1:44107_wqj c:control_collection s:shard1 r:core_node1 x:collection1] o.a.s.c.LeaderElector Joined leadership election with path: /collections/control_collection/leader_elect/shard1/election/96521099380981764-core_node1-n_0000000000
   [junit4]   2> 1748649 INFO  (coreZkRegister-6320-thread-1-processing-x:collection1 c:control_collection s:shard1 n:127.0.0.1:44107_wqj r:core_node1) [n:127.0.0.1:44107_wqj c:control_collection s:shard1 r:core_node1 x:collection1] o.a.s.c.ShardLeaderElectionContext Running the leader process for shard=shard1 and weAreReplacement=false and leaderVoteWait=10000
   [junit4]   2> 1748651 INFO  (coreZkRegister-6320-thread-1-processing-x:collection1 c:control_collection s:shard1 n:127.0.0.1:44107_wqj r:core_node1) [n:127.0.0.1:44107_wqj c:control_collection s:shard1 r:core_node1 x:collection1] o.a.s.c.ShardLeaderElectionContext Enough replicas found to continue.
   [junit4]   2> 1748651 INFO  (coreZkRegister-6320-thread-1-processing-x:collection1 c:control_collection s:shard1 n:127.0.0.1:44107_wqj r:core_node1) [n:127.0.0.1:44107_wqj c:control_collection s:shard1 r:core_node1 x:collection1] o.a.s.c.ShardLeaderElectionContext I may be the new leader - try and sync
   [junit4]   2> 1748651 INFO  (coreZkRegister-6320-thread-1-processing-x:collection1 c:control_collection s:shard1 n:127.0.0.1:44107_wqj r:core_node1) [n:127.0.0.1:44107_wqj c:control_collection s:shard1 r:core_node1 x:collection1] o.a.s.c.SyncStrategy Sync replicas to http://127.0.0.1:44107/wqj/collection1/
   [junit4]   2> 1748651 INFO  (coreZkRegister-6320-thread-1-processing-x:collection1 c:control_collection s:shard1 n:127.0.0.1:44107_wqj r:core_node1) [n:127.0.0.1:44107_wqj c:control_collection s:shard1 r:core_node1 x:collection1] o.a.s.c.SyncStrategy Sync Success - now sync replicas to me
   [junit4]   2> 1748651 INFO  (OverseerStateUpdate-96521099380981764-127.0.0.1:44107_wqj-n_0000000000) [n:127.0.0.1:44107_wqj    ] o.a.s.c.Overseer processMessage: queueSize: 1, message = {
   [junit4]   2>   "operation":"leader",
   [junit4]   2>   "shard":"shard1",
   [junit4]   2>   "collection":"control_collection"} current state version: 1
   [junit4]   2> 1748651 INFO  (coreZkRegister-6320-thread-1-processing-x:collection1 c:control_collection s:shard1 n:127.0.0.1:44107_wqj r:core_node1) [n:127.0.0.1:44107_wqj c:control_collection s:shard1 r:core_node1 x:collection1] o.a.s.c.SyncStrategy http://127.0.0.1:44107/wqj/collection1/ has no replicas
   [junit4]   2> 1748652 INFO  (coreZkRegister-6320-thread-1-processing-x:collection1 c:control_collection s:shard1 n:127.0.0.1:44107_wqj r:core_node1) [n:127.0.0.1:44107_wqj c:control_collection s:shard1 r:core_node1 x:collection1] o.a.s.c.c.SolrZkClient makePath: /collections/control_collection/leaders/shard1
   [junit4]   2> 1748653 INFO  (coreZkRegister-6320-thread-1-processing-x:collection1 c:control_collection s:shard1 n:127.0.0.1:44107_wqj r:core_node1) [n:127.0.0.1:44107_wqj c:control_collection s:shard1 r:core_node1 x:collection1] o.a.s.c.ShardLeaderElectionContextBase Creating leader registration node /collections/control_collection/leaders/shard1/leader after winning as /collections/control_collection/leader_elect/shard1/election/96521099380981764-core_node1-n_0000000000
   [junit4]   2> 1748654 INFO  (coreZkRegister-6320-thread-1-processing-x:collection1 c:control_collection s:shard1 n:127.0.0.1:44107_wqj r:core_node1) [n:127.0.0.1:44107_wqj c:control_collection s:shard1 r:core_node1 x:collection1] o.a.s.c.ShardLeaderElectionContext I am the new leader: http://127.0.0.1:44107/wqj/collection1/ shard1
   [junit4]   2> 1748654 INFO  (OverseerStateUpdate-96521099380981764-127.0.0.1:44107_wqj-n_0000000000) [n:127.0.0.1:44107_wqj    ] o.a.s.c.Overseer processMessage: queueSize: 1, message = {
   [junit4]   2>   "operation":"leader",
   [junit4]   2>   "shard":"shard1",
   [junit4]   2>   "collection":"control_collection",
   [junit4]   2>   "base_url":"http://127.0.0.1:44107/wqj",
   [junit4]   2>   "core":"collection1",
   [junit4]   2>   "state":"active"} current state version: 1
   [junit4]   2> 1748756 INFO  (zkCallback-1876-thread-1-processing-n:127.0.0.1:44107_wqj) [n:127.0.0.1:44107_wqj    ] o.a.s.c.c.ZkStateReader A cluster state change: [WatchedEvent state:SyncConnected type:NodeDataChanged path:/clusterstate.json], has occurred - updating... (live nodes size: [1])
   [junit4]   2> 1748789 INFO  (TEST-TestDynamicLoading.testDynamicLoading-seed#[50EB9EBCEB400688]) [    ] o.a.s.c.c.SolrZkClient Using default ZkCredentialsProvider
   [junit4]   2> 1748789 INFO  (TEST-TestDynamicLoading.testDynamicLoading-seed#[50EB9EBCEB400688]) [    ] o.a.s.c.c.ConnectionManager Waiting for client to connect to ZooKeeper
   [junit4]   2> 1748790 INFO  (zkCallback-1878-thread-1) [    ] o.a.s.c.c.ConnectionManager Watcher org.apache.solr.common.cloud.ConnectionManager@91dd59 name:ZooKeeperConnection Watcher:127.0.0.1:42447/solr got event WatchedEvent state:SyncConnected type:None path:null path:null type:None
   [junit4]   2> 1748790 INFO  (TEST-TestDynamicLoading.testDynamicLoading-seed#[50EB9EBCEB400688]) [    ] o.a.s.c.c.ConnectionManager Client is connected to ZooKeeper
   [junit4]   2> 1748791 INFO  (TEST-TestDynamicLoading.testDynamicLoading-seed#[50EB9EBCEB400688]) [    ] o.a.s.c.c.SolrZkClient Using default ZkACLProvider
   [junit4]   2> 1748791 INFO  (TEST-TestDynamicLoading.testDynamicLoading-seed#[50EB9EBCEB400688]) [    ] o.a.s.c.c.ZkStateReader Updating cluster state from ZooKeeper... 
   [junit4]   2> 1748792 INFO  (TEST-TestDynamicLoading.testDynamicLoading-seed#[50EB9EBCEB400688]) [    ] o.a.s.c.ChaosMonkey monkey: init - expire sessions:false cause connection loss:false
   [junit4]   2> 1748792 INFO  (TEST-TestDynamicLoading.testDynamicLoading-seed#[50EB9EBCEB400688]) [    ] o.a.s.c.AbstractFullDistribZkTestBase Creating collection1 with stateFormat=2
   [junit4]   2> 1748792 INFO  (TEST-TestDynamicLoading.testDynamicLoading-seed#[50EB9EBCEB400688]) [    ] o.a.s.c.c.SolrZkClient Using default ZkCredentialsProvider
   [junit4]   2> 1748792 INFO  (TEST-TestDynamicLoading.testDynamicLoading-seed#[50EB9EBCEB400688]) [    ] o.a.s.c.c.ConnectionManager Waiting for client to connect to ZooKeeper
   [junit4]   2> 1748793 INFO  (zkCallback-1879-thread-1) [    ] o.a.s.c.c.ConnectionManager Watcher org.apache.solr.common.cloud.ConnectionManager@1cdff15 name:ZooKeeperConnection Watcher:127.0.0.1:42447/solr got event WatchedEvent state:SyncConnected type:None path:null path:null type:None
   [junit4]   2> 1748793 INFO  (TEST-TestDynamicLoading.testDynamicLoading-seed#[50EB9EBCEB400688]) [    ] o.a.s.c.c.ConnectionManager Client is connected to ZooKeeper
   [junit4]   2> 1748794 INFO  (TEST-TestDynamicLoading.testDynamicLoading-seed#[50EB9EBCEB400688]) [    ] o.a.s.c.c.SolrZkClient Using default ZkACLProvider
   [junit4]   2> 1748796 INFO  (OverseerStateUpdate-96521099380981764-127.0.0.1:44107_wqj-n_0000000000) [n:127.0.0.1:44107_wqj    ] o.a.s.c.Overseer processMessage: queueSize: 1, message = {
   [junit4]   2>   "operation":"create",
   [junit4]   2>   "name":"collection1",
   [junit4]   2>   "numShards":"2",
   [junit4]   2>   "stateFormat":"2"} current state version: 2
   [junit4]   2> 1748796 INFO  (OverseerStateUpdate-96521099380981764-127.0.0.1:44107_wqj-n_0000000000) [n:127.0.0.1:44107_wqj    ] o.a.s.c.o.ClusterStateMutator building a new cName: collection1
   [junit4]   2> 1748812 INFO  (coreZkRegister-6320-thread-1-processing-x:collection1 c:control_collection s:shard1 n:127.0.0.1:44107_wqj r:core_node1) [n:127.0.0.1:44107_wqj c:control_collection s:shard1 r:core_node1 x:collection1] o.a.s.c.ZkController We are http://127.0.0.1:44107/wqj/collection1/ and leader is http://127.0.0.1:44107/wqj/collection1/
   [junit4]   2> 1748812 INFO  (coreZkRegister-6320-thread-1-processing-x:collection1 c:control_collection s:shard1 n:127.0.0.1:44107_wqj r:core_node1) [n:127.0.0.1:44107_wqj c:control_collection s:shard1 r:core_node1 x:collection1] o.a.s.c.ZkController No LogReplay needed for core=collection1 baseURL=http://127.0.0.1:44107/wqj
   [junit4]   2> 1748812 INFO  (coreZkRegister-6320-thread-1-processing-x:collection1 c:control_collection s:shard1 n:127.0.0.1:44107_wqj r:core_node1) [n:127.0.0.1:44107_wqj c:control_collection s:shard1 r:core_node1 x:collection1] o.a.s.c.ZkController I am the leader, no recovery necessary
   [junit4]   2> 1748812 INFO  (coreZkRegister-6320-thread-1-processing-x:collection1 c:control_collection s:shard1 n:127.0.0.1:44107_wqj r:core_node1) [n:127.0.0.1:44107_wqj c:control_collection s:shard1 r:core_node1 x:collection1] o.a.s.c.ZkController publishing state=active
   [junit4]   2> 1748812 INFO  (coreZkRegister-6320-thread-1-processing-x:collection1 c:control_collection s:shard1 n:127.0.0.1:44107_wqj r:core_node1) [n:127.0.0.1:44107_wqj c:control_collection s:shard1 r:core_node1 x:collection1] o.a.s.c.ZkController numShards not found on descriptor - reading it from system property
   [junit4]   2> 1748813 INFO  (OverseerStateUpdate-96521099380981764-127.0.0.1:44107_wqj-n_0000000000) [n:127.0.0.1:44107_wqj    ] o.a.s.c.Overseer processMessage: queueSize: 1, message = {
   [junit4]   2>   "core_node_name":"core_node1",
   [junit4]   2>   "core":"collection1",
   [junit4]   2>   "roles":null,
   [junit4]   2>   "collection":"control_collection",
   [junit4]   2>   "shard":"shard1",
   [junit4]   2>   "operation":"state",
   [junit4]   2>   "node_name":"127.0.0.1:44107_wqj",
   [junit4]   2>   "base_url":"http://127.0.0.1:44107/wqj",
   [junit4]   2>   "state":"active",
   [junit4]   2>   "numShards":"2"} current state version: 2
   [junit4]   2> 1748814 INFO  (OverseerStateUpdate-96521099380981764-127.0.0.1:44107_wqj-n_0000000000) [n:127.0.0.1:44107_wqj    ] o.a.s.c.o.ReplicaMutator Update state numShards=2 message={
   [junit4]   2>   "core_node_name":"core_node1",
   [junit4]   2>   "core":"collection1",
   [junit4]   2>   "roles":null,
   [junit4]   2>   "collection":"control_collection",
   [junit4]   2>   "shard":"shard1",
   [junit4]   2>   "operation":"state",
   [junit4]   2>   "node_name":"127.0.0.1:44107_wqj",
   [junit4]   2>   "base_url":"http://127.0.0.1:44107/wqj",
   [junit4]   2>   "state":"active",
   [junit4]   2>   "numShards":"2"}
   [junit4]   2> 1748814 INFO  (OverseerStateUpdate-96521099380981764-127.0.0.1:44107_wqj-n_0000000000) [n:127.0.0.1:44107_wqj    ] o.a.s.c.o.ZkStateWriter going to create_collection /collections/collection1/state.json
   [junit4]   2> 1748872 INFO  (TEST-TestDynamicLoading.testDynamicLoading-seed#[50EB9EBCEB400688]) [    ] o.a.s.SolrTestCaseJ4 Writing core.properties file to /home/jenkins/workspace/Lucene-Solr-5.5-Linux/solr/build/solr-core/test/J2/temp/solr.core.TestDynamicLoading_50EB9EBCEB400688-001/shard-1-001/cores/collection1
   [junit4]   2> 1748873 INFO  (TEST-TestDynamicLoading.testDynamicLoading-seed#[50EB9EBCEB400688]) [    ] o.a.s.c.AbstractFullDistribZkTestBase create jetty 1 in directory /home/jenkins/workspace/Lucene-Solr-5.5-Linux/solr/build/solr-core/test/J2/temp/solr.core.TestDynamicLoading_50EB9EBCEB400688-001/shard-1-001
   [junit4]   2> 1748873 INFO  (TEST-TestDynamicLoading.testDynamicLoading-seed#[50EB9EBCEB400688]) [    ] o.e.j.s.Server jetty-9.2.13.v20150730
   [junit4]   2> 1748874 INFO  (TEST-TestDynamicLoading.testDynamicLoading-seed#[50EB9EBCEB400688]) [    ] o.e.j.s.h.ContextHandler Started o.e.j.s.ServletContextHandler@1492dd3{/wqj,null,AVAILABLE}
   [junit4]   2> 1748874 INFO  (TEST-TestDynamicLoading.testDynamicLoading-seed#[50EB9EBCEB400688]) [    ] o.e.j.s.ServerConnector Started ServerConnector@c4a71d{HTTP/1.1}{127.0.0.1:34719}
   [junit4]   2> 1748874 INFO  (TEST-TestDynamicLoading.testDynamicLoading-seed#[50EB9EBCEB400688]) [    ] o.e.j.s.Server Started @1750078ms
   [junit4]   2> 1748874 INFO  (TEST-TestDynamicLoading.testDynamicLoading-seed#[50EB9EBCEB400688]) [    ] o.a.s.c.s.e.JettySolrRunner Jetty properties: {solr.data.dir=/home/jenkins/workspace/Lucene-Solr-5.5-Linux/solr/build/solr-core/test/J2/temp/solr.core.TestDynamicLoading_50EB9EBCEB400688-001/tempDir-001/jetty1, hostContext=/wqj, hostPort=34719, coreRootDirectory=/home/jenkins/workspace/Lucene-Solr-5.5-Linux/solr/build/solr-core/test/J2/temp/solr.core.TestDynamicLoading_50EB9EBCEB400688-001/shard-1-001/cores, solrconfig=solrconfig.xml}
   [junit4]   2> 1748874 INFO  (TEST-TestDynamicLoading.testDynamicLoading-seed#[50EB9EBCEB400688]) [    ] o.a.s.s.SolrDispatchFilter SolrDispatchFilter.init(): sun.misc.Launcher$AppClassLoader@121ea24
   [junit4]   2> 1748875 INFO  (TEST-TestDynamicLoading.testDynamicLoading-seed#[50EB9EBCEB400688]) [    ] o.a.s.c.SolrResourceLoader new SolrResourceLoader for directory: '/home/jenkins/workspace/Lucene-Solr-5.5-Linux/solr/build/solr-core/test/J2/temp/solr.core.TestDynamicLoading_50EB9EBCEB400688-001/shard-1-001'
   [junit4]   2> 1748875 INFO  (TEST-TestDynamicLoading.testDynamicLoading-seed#[50EB9EBCEB400688]) [    ] o.a.s.c.SolrResourceLoader JNDI not configured for solr (NoInitialContextEx)
   [junit4]   2> 1748875 INFO  (TEST-TestDynamicLoading.testDynamicLoading-seed#[50EB9EBCEB400688]) [    ] o.a.s.c.SolrResourceLoader solr home defaulted to 'solr/' (could not find system property or JNDI)
   [junit4]   2> 1748875 INFO  (TEST-TestDynamicLoading.testDynamicLoading-seed#[50EB9EBCEB400688]) [    ] o.a.s.c.c.SolrZkClient Using default ZkCredentialsProvider
   [junit4]   2> 1748875 INFO  (TEST-TestDynamicLoading.testDynamicLoading-seed#[50EB9EBCEB400688]) [    ] o.a.s.c.c.ConnectionManager Waiting for client to connect to ZooKeeper
   [junit4]   2> 1748876 INFO  (zkCallback-1880-thread-1) [    ] o.a.s.c.c.ConnectionManager Watcher org.apache.solr.common.cloud.ConnectionManager@1ef5a0a name:ZooKeeperConnection Watcher:127.0.0.1:42447/solr got event WatchedEvent state:SyncConnected type:None path:null path:null type:None
   [junit4]   2> 1748876 INFO  (TEST-TestDynamicLoading.testDynamicLoading-seed#[50EB9EBCEB400688]) [    ] o.a.s.c.c.ConnectionManager Client is connected to ZooKeeper
   [junit4]   2> 1748877 INFO  (TEST-TestDynamicLoading.testDynamicLoading-seed#[50EB9EBCEB400688]) [    ] o.a.s.c.c.SolrZkClient Using default ZkACLProvider
   [junit4]   2> 1748877 INFO  (TEST-TestDynamicLoading.testDynamicLoading-seed#[50EB9EBCEB400688]) [    ] o.a.s.s.SolrDispatchFilter Loading solr.xml from SolrHome (not found in ZooKeeper)
   [junit4]   2> 1748877 INFO  (TEST-TestDynamicLoading.testDynamicLoading-seed#[50EB9EBCEB400688]) [    ] o.a.s.c.SolrXmlConfig Loading container configuration from /home/jenkins/workspace/Lucene-Solr-5.5-Linux/solr/build/solr-core/test/J2/temp/solr.core.TestDynamicLoading_50EB9EBCEB400688-001/shard-1-001/solr.xml
   [junit4]   2> 1748896 INFO  (TEST-TestDynamicLoading.testDynamicLoading-seed#[50EB9EBCEB400688]) [    ] o.a.s.c.CorePropertiesLocator Config-defined core root directory: /home/jenkins/workspace/Lucene-Solr-5.5-Linux/solr/build/solr-core/test/J2/temp/solr.core.TestDynamicLoading_50EB9EBCEB400688-001/shard-1-001/cores
   [junit4]   2> 1748896 INFO  (TEST-TestDynamicLoading.testDynamicLoading-seed#[50EB9EBCEB400688]) [    ] o.a.s.c.CoreContainer New CoreContainer 33011130
   [junit4]   2> 1748896 INFO  (TEST-TestDynamicLoading.testDynamicLoading-seed#[50EB9EBCEB400688]) [    ] o.a.s.c.CoreContainer Loading cores into CoreContainer [instanceDir=/home/jenkins/workspace/Lucene-Solr-5.5-Linux/solr/build/solr-core/test/J2/temp/solr.core.TestDynamicLoading_50EB9EBCEB400688-001/shard-1-001]
   [junit4]   2> 1748896 WARN  (TEST-TestDynamicLoading.testDynamicLoading-seed#[50EB9EBCEB400688]) [    ] o.a.s.c.CoreContainer Couldn't add files from /home/jenkins/workspace/Lucene-Solr-5.5-Linux/solr/build/solr-core/test/J2/temp/solr.core.TestDynamicLoading_50EB9EBCEB400688-001/shard-1-001/lib to classpath: /home/jenkins/workspace/Lucene-Solr-5.5-Linux/solr/build/solr-core/test/J2/temp/solr.core.TestDynamicLoading_50EB9EBCEB400688-001/shard-1-001/lib
   [junit4]   2> 1748896 INFO  (TEST-TestDynamicLoading.testDynamicLoading-seed#[50EB9EBCEB400688]) [    ] o.a.s.h.c.HttpShardHandlerFactory created with socketTimeout : 90000,urlScheme : ,connTimeout : 15000,maxConnectionsPerHost : 20,maxConnections : 10000,corePoolSize : 0,maximumPoolSize : 2147483647,maxThreadIdleTime : 5,sizeOfQueue : -1,fairnessPolicy : false,useRetries : false,connectionsEvictorSleepDelay : 5000,maxConnectionIdleTime : 40000,
   [junit4]   2> 1748897 INFO  (TEST-TestDynamicLoading.testDynamicLoading-seed#[50EB9EBCEB400688]) [    ] o.a.s.u.UpdateShardHandler Creating UpdateShardHandler HTTP client with params: socketTimeout=340000&connTimeout=45000&retry=true
   [junit4]   2> 1748898 INFO  (TEST-TestDynamicLoading.testDynamicLoading-seed#[50EB9EBCEB400688]) [    ] o.a.s.l.LogWatcher SLF4J impl is org.slf4j.impl.Log4jLoggerFactory
   [junit4]   2> 1748898 INFO  (TEST-TestDynamicLoading.testDynamicLoading-seed#[50EB9EBCEB400688]) [    ] o.a.s.l.LogWatcher Registering Log Listener [Log4j (org.slf4j.impl.Log4jLoggerFactory)]
   [junit4]   2> 1748898 INFO  (TEST-TestDynamicLoading.testDynamicLoading-seed#[50EB9EBCEB400688]) [    ] o.a.s.c.ZkContainer Zookeeper client=127.0.0.1:42447/solr
   [junit4]   2> 1748898 INFO  (TEST-TestDynamicLoading.testDynamicLoading-seed#[50EB9EBCEB400688]) [    ] o.a.s.c.ZkController zkHost includes chroot
   [junit4]   2> 1748898 INFO  (TEST-TestDynamicLoading.testDynamicLoading-seed#[50EB9EBCEB400688]) [    ] o.a.s.c.c.SolrZkClient Using default ZkCredentialsProvider
   [junit4]   2> 1748898 INFO  (TEST-TestDynamicLoading.testDynamicLoading-seed#[50EB9EBCEB400688]) [    ] o.a.s.c.c.ConnectionManager Waiting for client to connect to ZooKeeper
   [junit4]   2> 1748899 INFO  (zkCallback-1883-thread-1) [    ] o.a.s.c.c.ConnectionManager Watcher org.apache.solr.common.cloud.ConnectionManager@4110a1 name:ZooKeeperConnection Watcher:127.0.0.1:42447 got event WatchedEvent state:SyncConnected type:None path:null path:null type:None
   [junit4]   2> 1748899 INFO  (TEST-TestDynamicLoading.testDynamicLoading-seed#[50EB9EBCEB400688]) [    ] o.a.s.c.c.ConnectionManager Client is connected to ZooKeeper
   [junit4]   2> 1748900 INFO  (TEST-TestDynamicLoading.testDynamicLoading-seed#[50EB9EBCEB400688]) [    ] o.a.s.c.c.SolrZkClient Using default ZkACLProvider
   [junit4]   2> 1748900 INFO  (TEST-TestDynamicLoading.testDynamicLoading-seed#[50EB9EBCEB400688]) [n:127.0.0.1:34719_wqj    ] o.a.s.c.ZkController Added new OnReconnect listener org.apache.solr.cloud.ZkController$6@1632dd4
   [junit4]   2> 1748901 INFO  (TEST-TestDynamicLoading.testDynamicLoading-seed#[50EB9EBCEB400688]) [n:127.0.0.1:34719_wqj    ] o.a.s.c.c.ConnectionManager Waiting for client to connect to ZooKeeper
   [junit4]   2> 1748901 INFO  (zkCallback-1884-thread-1-processing-n:127.0.0.1:34719_wqj) [n:127.0.0.1:34719_wqj    ] o.a.s.c.c.ConnectionManager Watcher org.apache.solr.common.cloud.ConnectionManager@532ee1 name:ZooKeeperConnection Watcher:127.0.0.1:42447/solr got event WatchedEvent state:SyncConnected type:None path:null path:null type:None
   [junit4]   2> 1748901 INFO  (TEST-TestDynamicLoading.testDynamicLoading-seed#[50EB9EBCEB400688]) [n:127.0.0.1:34719_wqj    ] o.a.s.c.c.ConnectionManager Client is connected to ZooKeeper
   [junit4]   2> 1748905 INFO  (TEST-TestDynamicLoading.testDynamicLoading-seed#[50EB9EBCEB400688]) [n:127.0.0.1:34719_wqj    ] o.a.s.c.c.ZkStateReader Updating cluster state from ZooKeeper... 
   [junit4]   2> 1748916 INFO  (zkCallback-1878-thread-1) [    ] o.a.s.c.c.ZkStateReader A cluster state change: [WatchedEvent state:SyncConnected type:NodeDataChanged path:/clusterstate.json], has occurred - updating... (live nodes size: [1])
   [junit4]   2> 1748916 INFO  (zkCallback-1884-thread-1-processing-n:127.0.0.1:34719_wqj) [n:127.0.0.1:34719_wqj    ] o.a.s.c.c.ZkStateReader A cluster state change: [WatchedEvent state:SyncConnected type:NodeDataChanged path:/clusterstate.json], has occurred - updating... (live nodes size: [1])
   [junit4]   2> 1748916 INFO  (zkCallback-1876-thread-2-processing-n:127.0.0.1:44107_wqj) [n:127.0.0.1:44107_wqj    ] o.a.s.c.c.ZkStateReader A cluster state change: [WatchedEvent state:SyncConnected type:NodeDataChanged path:/clusterstate.json], has occurred - updating... (live nodes size: [1])
   [junit4]   2> 1749908 INFO  (TEST-TestDynamicLoading.testDynamicLoading-seed#[50EB9EBCEB400688]) [n:127.0.0.1:34719_wqj    ] o.a.s.c.ZkController Register node as live in ZooKeeper:/live_nodes/127.0.0.1:34719_wqj
   [junit4]   2> 1749908 INFO  (TEST-TestDynamicLoading.testDynamicLoading-seed#[50EB9EBCEB400688]) [n:127.0.0.1:34719_wqj    ] o.a.s.c.c.SolrZkClient makePath: /live_nodes/127.0.0.1:34719_wqj
   [junit4]   2> 1749909 INFO  (zkCallback-1878-thread-1) [    ] o.a.s.c.c.ZkStateReader A live node change: [WatchedEvent state:SyncConnected type:NodeChildrenChanged path:/live_nodes], has occurred - updating... (live nodes size: [1])
   [junit4]   2> 1749909 INFO  (zkCallback-1884-thread-1-processing-n:127.0.0.1:34719_wqj) [n:127.0.0.1:34719_wqj    ] o.a.s.c.c.ZkStateReader A live node change: [WatchedEvent state:SyncConnected type:NodeChildrenChanged path:/live_nodes], has occurred - updating... (live nodes size: [1])
   [junit4]   2> 1749909 INFO  (zkCallback-1876-thread-2-processing-n:127.0.0.1:44107_wqj) [n:127.0.0.1:44107_wqj    ] o.a.s.c.c.ZkStateReader A live node change: [WatchedEvent state:SyncConnected type:NodeChildrenChanged path:/live_nodes], has occurred - updating... (live nodes size: [1])
   [junit4]   2> 1749909 INFO  (TEST-TestDynamicLoading.testDynamicLoading-seed#[50EB9EBCEB400688]) [n:127.0.0.1:34719_wqj    ] o.a.s.c.Overseer Overseer (id=null) closing
   [junit4]   2> 1749911 INFO  (TEST-TestDynamicLoading.testDynamicLoading-seed#[50EB9EBCEB400688]) [n:127.0.0.1:34719_wqj    ] o.a.s.c.LeaderElector Joined leadership election with path: /overseer_elect/election/96521099380981769-127.0.0.1:34719_wqj-n_0000000001
   [junit4]   2> 1749911 INFO  (TEST-TestDynamicLoading.testDynamicLoading-seed#[50EB9EBCEB400688]) [n:127.0.0.1:34719_wqj    ] o.a.s.c.LeaderElector Watching path /overseer_elect/election/96521099380981764-127.0.0.1:44107_wqj-n_0000000000 to know if I could be the leader
   [junit4]   2> 1749940 INFO  (TEST-TestDynamicLoading.testDynamicLoading-seed#[50EB9EBCEB400688]) [n:127.0.0.1:34719_wqj    ] o.a.s.c.CoreContainer Security conf doesn't exist. Skipping setup for authorization module.
   [junit4]   2> 1749940 INFO  (TEST-TestDynamicLoading.testDynamicLoading-seed#[50EB9EBCEB400688]) [n:127.0.0.1:34719_wqj    ] o.a.s.c.CoreContainer No authentication plugin used.
   [junit4]   2> 1749941 INFO  (TEST-TestDynamicLoading.testDynamicLoading-seed#[50EB9EBCEB400688]) [n:127.0.0.1:34719_wqj    ] o.a.s.c.CorePropertiesLocator Looking for core definitions underneath /home/jenkins/workspace/Lucene-Solr-5.5-Linux/solr/build/solr-core/test/J2/temp/solr.core.TestDynamicLoading_50EB9EBCEB400688-001/shard-1-001/cores
   [junit4]   2> 1749942 INFO  (TEST-TestDynamicLoading.testDynamicLoading-seed#[50EB9EBCEB400688]) [n:127.0.0.1:34719_wqj    ] o.a.s.c.CoreDescriptor Created CoreDescriptor: {dataDir=data/, config=solrconfig.xml, configSetProperties=configsetprops.json, transient=false, coreNodeName=, schema=schema.xml, loadOnStartup=true, name=collection1, collection=collection1, shard=}
   [junit4]   2> 1749942 INFO  (TEST-TestDynamicLoading.testDynamicLoading-seed#[50EB9EBCEB400688]) [n:127.0.0.1:34719_wqj    ] o.a.s.c.CorePropertiesLocator Found core collection1 in /home/jenkins/workspace/Lucene-Solr-5.5-Linux/solr/build/solr-core/test/J2/temp/solr.core.TestDynamicLoading_50EB9EBCEB400688-001/shard-1-001/cores/collection1
   [junit4]   2> 1749942 INFO  (TEST-TestDynamicLoading.testDynamicLoading-seed#[50EB9EBCEB400688]) [n:127.0.0.1:34719_wqj    ] o.a.s.c.CorePropertiesLocator Found 1 core definitions
   [junit4]   2> 1749942 INFO  (TEST-TestDynamicLoading.testDynamicLoading-seed#[50EB9EBCEB400688]) [n:127.0.0.1:34719_wqj    ] o.a.s.s.SolrDispatchFilter user.dir=/home/jenkins/workspace/Lucene-Solr-5.5-Linux/solr/build/solr-core/test/J2
   [junit4]   2> 1749943 INFO  (TEST-TestDynamicLoading.testDynamicLoading-seed#[50EB9EBCEB400688]) [n:127.0.0.1:34719_wqj    ] o.a.s.s.SolrDispatchFilter SolrDispatchFilter.init() done
   [junit4]   2> 1749943 INFO  (coreLoadExecutor-6337-thread-1-processing-n:127.0.0.1:34719_wqj) [n:127.0.0.1:34719_wqj c:collection1   x:collection1] o.a.s.c.ZkController publishing state=down
   [junit4]   2> 1749943 INFO  (coreLoadExecutor-6337-thread-1-processing-n:127.0.0.1:34719_wqj) [n:127.0.0.1:34719_wqj c:collection1   x:collection1] o.a.s.c.ZkController numShards not found on descriptor - reading it from system property
   [junit4]   2> 1749944 INFO  (coreLoadExecutor-6337-thread-1-processing-n:127.0.0.1:34719_wqj) [n:127.0.0.1:34719_wqj c:collection1   x:collection1] o.a.s.c.ZkController Registering watch for collection collection1
   [junit4]   2> 1749944 INFO  (coreLoadExecutor-6337-thread-1-processing-n:127.0.0.1:34719_wqj) [n:127.0.0.1:34719_wqj c:collection1   x:collection1] o.a.s.c.c.ZkStateReader addZkWatch [collection1]
   [junit4]   2> 1749944 INFO  (OverseerStateUpdate-96521099380981764-127.0.0.1:44107_wqj-n_0000000000) [n:127.0.0.1:44107_wqj    ] o.a.s.c.Overseer processMessage: queueSize: 1, message = {
   [junit4]   2>   "core":"collection1",
   [junit4]   2>   "roles":null,
   [junit4]   2>   "collection":"collection1",
   [junit4]   2>   "shard":null,
   [junit4]   2>   "operation":"state",
   [junit4]   2>   "node_name":"127.0.0.1:34719_wqj",
   [junit4]   2>   "base_url":"http://127.0.0.1:34719/wqj",
   [junit4]   2>   "state":"down",
   [junit4]   2>   "numShards":"2"} current state version: 3
   [junit4]   2> 1749944 INFO  (OverseerStateUpdate-96521099380981764-127.0.0.1:44107_wqj-n_0000000000) [n:127.0.0.1:44107_wqj    ] o.a.s.c.o.ReplicaMutator Update state numShards=2 message={
   [junit4]   2>   "core":"collection1",
   [junit4]   2>   "roles":null,
   [junit4]   2>   "collection":"collection1",
   [junit4]   2>   "shard":null,
   [junit4]   2>   "operation":"state",
   [junit4]   2>   "node_name":"127.0.0.1:34719_wqj",
   [junit4]   2>   "base_url":"http://127.0.0.1:34719/wqj",
   [junit4]   2>   "state":"down",
   [junit4]   2>   "numShards":"2"}
   [junit4]   2> 1749944 INFO  (coreLoadExecutor-6337-thread-1-processing-n:127.0.0.1:34719_wqj) [n:127.0.0.1:34719_wqj c:collection1   x:collection1] o.a.s.c.c.ZkStateReader Add data for [collection1] ver [0]
   [junit4]   2> 1749944 INFO  (OverseerStateUpdate-96521099380981764-127.0.0.1:44107_wqj-n_0000000000) [n:127.0.0.1:44107_wqj    ] o.a.s.c.o.ReplicaMutator Collection already exists with numShards=2
   [junit4]   2> 1749944 INFO  (coreLoadExecutor-6337-thread-1-processing-n:127.0.0.1:34719_wqj) [n:127.0.0.1:34719_wqj c:collection1   x:collection1] o.a.s.c.ZkController look for our core node name
   [junit4]   2> 1749944 INFO  (OverseerStateUpdate-96521099380981764-127.0.0.1:44107_wqj-n_0000000000) [n:127.0.0.1:44107_wqj    ] o.a.s.c.o.ReplicaMutator Assigning new node to shard shard=shard1
   [junit4]   2> 1750046 INFO  (OverseerStateUpdate-96521099380981764-127.0.0.1:44107_wqj-n_0000000000) [n:127.0.0.1:44107_wqj    ] o.a.s.c.o.ZkStateWriter going to update_collection /collections/collection1/state.json version: 0
   [junit4]   2> 1750046 INFO  (zkCallback-1884-thread-1-processing-n:127.0.0.1:34719_wqj) [n:127.0.0.1:34719_wqj    ] o.a.s.c.c.ZkStateReader A cluster state change: [WatchedEvent state:SyncConnected type:NodeDataChanged path:/collections/collection1/state.json] for collection [collection1] has occurred - updating... (live nodes size: [2])
   [junit4]   2> 1750047 INFO  (zkCallback-1884-thread-1-processing-n:127.0.0.1:34719_wqj) [n:127.0.0.1:34719_wqj    ] o.a.s.c.c.ZkStateReader Updating data for [collection1] from [0] to [1]
   [junit4]   2> 1750945 INFO  (coreLoadExecutor-6337-thread-1-processing-n:127.0.0.1:34719_wqj) [n:127.0.0.1:34719_wqj c:collection1   x:collection1] o.a.s.c.ZkController waiting to find shard id in clusterstate for collection1
   [junit4]   2> 1750945 INFO  (coreLoadExecutor-6337-thread-1-processing-n:127.0.0.1:34719_wqj) [n:127.0.0.1:34719_wqj c:collection1   x:collection1] o.a.s.c.ZkController Check for collection zkNode:collection1
   [junit4]   2> 1750945 INFO  (coreLoadExecutor-6337-thread-1-processing-n:127.0.0.1:34719_wqj) [n:127.0.0.1:34719_wqj c:collection1   x:collection1] o.a.s.c.ZkController Collection zkNode exists
   [junit4]   2> 1750945 INFO  (coreLoadExecutor-6337-thread-1-processing-n:127.0.0.1:34719_wqj) [n:127.0.0.1:34719_wqj c:collection1   x:collection1] o.a.s.c.c.ZkStateReader Load collection config from: [/collections/collection1]
   [junit4]   2> 1750945 INFO  (coreLoadExecutor-6337-thread-1-processing-n:127.0.0.1:34719_wqj) [n:127.0.0.1:34719_wqj c:collection1   x:collection1] o.a.s.c.c.ZkStateReader path=[/collections/collection1] [configName]=[conf1] specified config exists in ZooKeeper
   [junit4]   2> 1750945 INFO  (coreLoadExecutor-6337-thread-1-processing-n:127.0.0.1:34719_wqj) [n:127.0.0.1:34719_wqj c:collection1   x:collection1] o.a.s.c.SolrResourceLoader new SolrResourceLoader for directory: '/home/jenkins/workspace/Lucene-Solr-5.5-Linux/solr/build/solr-core/test/J2/temp/solr.core.TestDynamicLoading_50EB9EBCEB400688-001/shard-1-001/cores/collection1'
   [junit4]   2> 1750945 INFO  (coreLoadExecutor-6337-thread-1-processing-n:127.0.0.1:34719_wqj) [n:127.0.0.1:34719_wqj c:collection1   x:collection1] o.a.s.c.SolrResourceLoader JNDI not configured for solr (NoInitialContextEx)
   [junit4]   2> 1750945 INFO  (coreLoadExecutor-6337-thread-1-processing-n:127.0.0.1:34719_wqj) [n:127.0.0.1:34719_wqj c:collection1   x:collection1] o.a.s.c.SolrResourceLoader solr home defaulted to 'solr/' (could not find system property or JNDI)
   [junit4]   2> 1750947 INFO  (coreLoadExecutor-6337-thread-1-processing-n:127.0.0.1:34719_wqj) [n:127.0.0.1:34719_wqj c:collection1   x:collection1] o.a.s.c.Config loaded config solrconfig.xml with version 0 
   [junit4]   2> 1750952 INFO  (coreLoadExecutor-6337-thread-1-processing-n:127.0.0.1:34719_wqj) [n:127.0.0.1:34719_wqj c:collection1   x:collection1] o.a.s.c.SolrConfig current version of requestparams : -1
   [junit4]   2> 1750969 INFO  (coreLoadExecutor-6337-thread-1-processing-n:127.0.0.1:34719_wqj) [n:127.0.0.1:34719_wqj c:collection1   x:collection1] o.a.s.c.SolrConfig Using Lucene MatchVersion: 5.5.3
   [junit4]   2> 1750994 INFO  (coreLoadExecutor-6337-thread-1-processing-n:127.0.0.1:34719_wqj) [n:127.0.0.1:34719_wqj c:collection1   x:collection1] o.a.s.c.SolrConfig Loaded SolrConfig: solrconfig.xml
   [junit4]   2> 1751001 INFO  (coreLoadExecutor-6337-thread-1-processing-n:127.0.0.1:34719_wqj) [n:127.0.0.1:34719_wqj c:collection1   x:collection1] o.a.s.s.IndexSchema [collection1] Schema name=test
   [junit4]   2> 1751265 INFO  (coreLoadExecutor-6337-thread-1-processing-n:127.0.0.1:34719_wqj) [n:127.0.0.1:34719_wqj c:collection1   x:collection1] o.a.s.s.OpenExchangeRatesOrgProvider Initialized with rates=open-exchange-rates.json, refreshInterval=1440.
   [junit4]   2> 1751274 INFO  (coreLoadExecutor-6337-thread-1-processing-n:127.0.0.1:34719_wqj) [n:127.0.0.1:34719_wqj c:collection1   x:collection1] o.a.s.s.IndexSchema default search field in schema is text
   [junit4]   2> 1751275 INFO  (coreLoadExecutor-6337-thread-1-processing-n:127.0.0.1:34719_wqj) [n:127.0.0.1:34719_wqj c:collection1   x:collection1] o.a.s.s.IndexSchema unique key field: id
   [junit4]   2> 1751282 INFO  (coreLoadExecutor-6337-thread-1-processing-n:127.0.0.1:34719_wqj) [n:127.0.0.1:34719_wqj c:collection1   x:collection1] o.a.s.s.FileExchangeRateProvider Reloading exchange rates from file currency.xml
   [junit4]   2> 1751284 INFO  (coreLoadExecutor-6337-thread-1-processing-n:127.0.0.1:34719_wqj) [n:127.0.0.1:34719_wqj c:collection1   x:collection1] o.a.s.s.FileExchangeRateProvider Reloading exchange rates from file currency.xml
   [junit4]   2> 1751286 INFO  (coreLoadExecutor-6337-thread-1-processing-n:127.0.0.1:34719_wqj) [n:127.0.0.1:34719_wqj c:collection1   x:collection1] o.a.s.s.OpenExchangeRatesOrgProvider Reloading exchange rates from open-exchange-rates.json
   [junit4]   2> 1751287 INFO  (coreLoadExecutor-6337-thread-1-processing-n:127.0.0.1:34719_wqj) [n:127.0.0.1:34719_wqj c:collection1   x:collection1] o.a.s.s.OpenExchangeRatesOrgProvider Reloading exchange rates from open-exchange-rates.json
   [junit4]   2> 1751288 INFO  (coreLoadExecutor-6337-thread-1-processing-n:127.0.0.1:34719_wqj) [n:127.0.0.1:34719_wqj c:collection1   x:collection1] o.a.s.c.ConfigSetProperties Did not find ConfigSet properties, assuming default properties: Can't find resource 'configsetprops.json' in classpath or '/configs/conf1', cwd=/home/jenkins/workspace/Lucene-Solr-5.5-Linux/solr/build/solr-core/test/J2
   [junit4]   2> 1751288 INFO  (coreLoadExecutor-6337-thread-1-processing-n:127.0.0.1:34719_wqj) [n:127.0.0.1:34719_wqj c:collection1   x:collection1] o.a.s.c.CoreContainer Creating SolrCore 'collection1' using configuration from collection collection1
   

[...truncated too long message...]

 org.apache.solr.cloud.ElectionContext.cancelElection(ElectionContext.java:86)
   [junit4]   2> 	at org.apache.solr.cloud.ShardLeaderElectionContextBase.cancelElection(ElectionContext.java:143)
   [junit4]   2> 	at org.apache.solr.cloud.ShardLeaderElectionContext.cancelElection(ElectionContext.java:279)
   [junit4]   2> 	at org.apache.solr.cloud.ShardLeaderElectionContext.runLeaderProcess(ElectionContext.java:455)
   [junit4]   2> 	at org.apache.solr.cloud.LeaderElector.runIamLeaderProcess(LeaderElector.java:171)
   [junit4]   2> 	at org.apache.solr.cloud.LeaderElector.checkIfIamLeader(LeaderElector.java:136)
   [junit4]   2> 	at org.apache.solr.cloud.LeaderElector.access$200(LeaderElector.java:57)
   [junit4]   2> 	at org.apache.solr.cloud.LeaderElector$ElectionWatcher.process(LeaderElector.java:349)
   [junit4]   2> 	at org.apache.solr.common.cloud.SolrZkClient$3$1.run(SolrZkClient.java:264)
   [junit4]   2> 	at java.util.concurrent.Executors$RunnableAdapter.call(Executors.java:471)
   [junit4]   2> 	at java.util.concurrent.FutureTask.run(FutureTask.java:262)
   [junit4]   2> 	at org.apache.solr.common.util.ExecutorUtil$MDCAwareThreadPoolExecutor$1.run(ExecutorUtil.java:231)
   [junit4]   2> 	at java.util.concurrent.ThreadPoolExecutor.runWorker(ThreadPoolExecutor.java:1145)
   [junit4]   2> 	at java.util.concurrent.ThreadPoolExecutor$Worker.run(ThreadPoolExecutor.java:615)
   [junit4]   2> 	at java.lang.Thread.run(Thread.java:745)
   [junit4]   2> 1801935 INFO  (TEST-TestDynamicLoading.testDynamicLoading-seed#[50EB9EBCEB400688]) [    ] o.e.j.s.ServerConnector Stopped ServerConnector@19b1cfd{HTTP/1.1}{127.0.0.1:0}
   [junit4]   2> 1801935 INFO  (TEST-TestDynamicLoading.testDynamicLoading-seed#[50EB9EBCEB400688]) [    ] o.e.j.s.h.ContextHandler Stopped o.e.j.s.ServletContextHandler@170537c{/wqj,null,UNAVAILABLE}
   [junit4]   2> 1801936 INFO  (TEST-TestDynamicLoading.testDynamicLoading-seed#[50EB9EBCEB400688]) [    ] o.a.s.c.ZkTestServer connecting to 127.0.0.1:42447 42447
   [junit4]   2> 1801952 INFO  (Thread-4923) [    ] o.a.s.c.ZkTestServer connecting to 127.0.0.1:42447 42447
   [junit4]   2> 1801953 WARN  (Thread-4923) [    ] o.a.s.c.ZkTestServer Watch limit violations: 
   [junit4]   2> Maximum concurrent create/delete watches above limit:
   [junit4]   2> 
   [junit4]   2> 	40	/solr/configs/conf1
   [junit4]   2> 	6	/solr/aliases.json
   [junit4]   2> 	5	/solr/security.json
   [junit4]   2> 	2	/solr/configs/.system
   [junit4]   2> 
   [junit4]   2> Maximum concurrent data watches above limit:
   [junit4]   2> 
   [junit4]   2> 	6	/solr/clusterstate.json
   [junit4]   2> 	4	/solr/collections/collection1/state.json
   [junit4]   2> 	2	/solr/collections/.system/state.json
   [junit4]   2> 
   [junit4]   2> Maximum concurrent children watches above limit:
   [junit4]   2> 
   [junit4]   2> 	50	/solr/overseer/collection-queue-work
   [junit4]   2> 	30	/solr/overseer/queue
   [junit4]   2> 	17	/solr/overseer/queue-work
   [junit4]   2> 	6	/solr/collections
   [junit4]   2> 	6	/solr/live_nodes
   [junit4]   2> 
   [junit4]   2> NOTE: reproduce with: ant test  -Dtestcase=TestDynamicLoading -Dtests.method=testDynamicLoading -Dtests.seed=50EB9EBCEB400688 -Dtests.multiplier=3 -Dtests.slow=true -Dtests.locale=mk-MK -Dtests.timezone=Etc/Universal -Dtests.asserts=true -Dtests.file.encoding=UTF-8
   [junit4] FAILURE 55.0s J2 | TestDynamicLoading.testDynamicLoading <<<
   [junit4]    > Throwable #1: java.lang.AssertionError: Could not get expected value  'X val changed' for path 'x' full output: {
   [junit4]    >   "responseHeader":{
   [junit4]    >     "status":0,
   [junit4]    >     "QTime":0},
   [junit4]    >   "params":{"wt":"json"},
   [junit4]    >   "context":{
   [junit4]    >     "path":"/test1",
   [junit4]    >     "webapp":"/wqj",
   [junit4]    >     "httpMethod":"GET"},
   [junit4]    >   "class":"org.apache.solr.core.BlobStoreTestRequestHandler",
   [junit4]    >   "x":"X val"}
   [junit4]    > 	at __randomizedtesting.SeedInfo.seed([50EB9EBCEB400688:88A6B3EB1C9DA328]:0)
   [junit4]    > 	at org.apache.solr.core.TestSolrConfigHandler.testForResponseElement(TestSolrConfigHandler.java:480)
   [junit4]    > 	at org.apache.solr.core.TestDynamicLoading.testDynamicLoading(TestDynamicLoading.java:255)
   [junit4]    > 	at org.apache.solr.BaseDistributedSearchTestCase$ShardsRepeatRule$ShardsFixedStatement.callStatement(BaseDistributedSearchTestCase.java:996)
   [junit4]    > 	at org.apache.solr.BaseDistributedSearchTestCase$ShardsRepeatRule$ShardsStatement.evaluate(BaseDistributedSearchTestCase.java:971)
   [junit4]    > 	at java.lang.Thread.run(Thread.java:745)
   [junit4]   2> 1801956 INFO  (SUITE-TestDynamicLoading-seed#[50EB9EBCEB400688]-worker) [    ] o.a.s.SolrTestCaseJ4 ###deleteCore
   [junit4]   2> NOTE: leaving temporary files on disk at: /home/jenkins/workspace/Lucene-Solr-5.5-Linux/solr/build/solr-core/test/J2/temp/solr.core.TestDynamicLoading_50EB9EBCEB400688-001
   [junit4]   2> Sep 02, 2016 5:45:50 AM com.carrotsearch.randomizedtesting.ThreadLeakControl checkThreadLeaks
   [junit4]   2> WARNING: Will linger awaiting termination of 1 leaked thread(s).
   [junit4]   2> NOTE: test params are: codec=Asserting(Lucene54): {md5=PostingsFormat(name=LuceneVarGapDocFreqInterval), blobName=FSTOrd50, _version_=PostingsFormat(name=LuceneVarGapDocFreqInterval), size=Lucene50(blocksize=128), id=TestBloomFilteredLucenePostings(BloomFilteringPostingsFormat(Lucene50(blocksize=128))), version=FSTOrd50, timestamp=PostingsFormat(name=LuceneVarGapDocFreqInterval)}, docValues:{}, sim=RandomSimilarity(queryNorm=false,coord=no): {}, locale=mk-MK, timezone=Etc/Universal
   [junit4]   2> NOTE: Linux 4.4.0-31-generic i386/Oracle Corporation 1.7.0_80 (32-bit)/cpus=12,threads=1,free=129621904,total=467664896
   [junit4]   2> NOTE: All tests run in this JVM: [VMParamsZkACLAndCredentialsProvidersTest, DataDrivenBlockJoinTest, CustomCollectionTest, TestOverriddenPrefixQueryForCustomFieldType, TestGroupingSearch, BadComponentTest, TestSearcherReuse, SuggesterTest, TestTrieFacet, SuggesterWFSTTest, TestInitParams, TestStressReorder, TestBulkSchemaAPI, TestSolrXml, TestSolrDeletionPolicy1, OverseerRolesTest, RequestHandlersTest, TestChildDocTransformer, HighlighterConfigTest, LeaderInitiatedRecoveryOnShardRestartTest, BadCopyFieldTest, TestUseDocValuesAsStored2, TestSolrJ, CurrencyFieldXmlFileTest, SSLMigrationTest, DocValuesMultiTest, TestWriterPerf, QueryParsingTest, TestSha256AuthenticationProvider, RecoveryZkTest, HdfsRestartWhileUpdatingTest, TestCharFilters, TestFieldSortValues, PluginInfoTest, SolrCloudExampleTest, TestElisionMultitermQuery, TestRestoreCore, TestCoreDiscovery, CollectionReloadTest, RegexBoostProcessorTest, TestAuthorizationFramework, TestConfigSetImmutable, SearchHandlerTest, TestManagedResource, TestXIncludeConfig, TestCollapseQParserPlugin, ConfigSetsAPITest, TestStressRecovery, DirectSolrConnectionTest, TestSchemaResource, CollectionsAPIAsyncDistributedZkTest, HdfsNNFailoverTest, TestFieldCollectionResource, TestSolrQueryParser, StatelessScriptUpdateProcessorFactoryTest, TestZkChroot, JavabinLoaderTest, TestJettySolrRunner, TestPostingsSolrHighlighter, TestClassicSimilarityFactory, LukeRequestHandlerTest, TestUniqueKeyFieldResource, TestRandomRequestDistribution, TestJmxMonitoredMap, HLLSerializationTest, DistributedSuggestComponentTest, TestSolr4Spatial2, TermVectorComponentDistributedTest, TestReRankQParserPlugin, HdfsDirectoryFactoryTest, SliceStateTest, DocValuesMissingTest, TestTolerantSearch, TestShardHandlerFactory, FullSolrCloudDistribCmdsTest, UnloadDistributedZkTest, SolrTestCaseJ4Test, TestDownShardTolerantSearch, TestNamedUpdateProcessors, FieldMutatingUpdateProcessorTest, TestDistribIDF, ReplicationFactorTest, SolrCoreCheckLockOnStartupTest, TestTestInjection, HardAutoCommitTest, TestConfigSetsAPIZkFailure, DistributedQueueTest, TestSort, HdfsChaosMonkeyNothingIsSafeTest, FieldAnalysisRequestHandlerTest, TestPerFieldSimilarity, TestReload, InfoHandlerTest, BasicDistributedZkTest, ChaosMonkeySafeLeaderTest, BasicDistributedZk2Test, SyncSliceTest, OpenCloseCoreStressTest, OverseerTest, BasicZkTest, TestReplicationHandler, TestSolr4Spatial, StatsComponentTest, TestFunctionQuery, TestLazyCores, TestIndexSearcher, AnalysisAfterCoreReloadTest, CoreAdminHandlerTest, SuggesterTSTTest, SpatialFilterTest, PolyFieldTest, TestWordDelimiterFilterFactory, DirectUpdateHandlerOptimizeTest, DistanceFunctionTest, DebugComponentTest, TestSurroundQueryParser, TestQueryUtils, TestReversedWildcardFilterFactory, TestQueryTypes, TestOmitPositions, DocumentBuilderTest, PathHierarchyTokenizerFactoryTest, MoreLikeThisHandlerTest, IndexSchemaRuntimeFieldTest, TestJmxIntegration, ReturnFieldsTest, TestCSVResponseWriter, JsonLoaderTest, TestPartialUpdateDeduplication, SOLR749Test, UpdateParamsTest, ResponseLogComponentTest, TestSolrDeletionPolicy2, MultiTermTest, SampleTest, NumericFieldsTest, TestFuzzyAnalyzedSuggestions, TestCodecSupport, TestDFRSimilarityFactory, TestLMJelinekMercerSimilarityFactory, TestFastWriter, ResourceLoaderTest, ScriptEngineTest, TestSystemIdResolver, SpellingQueryConverterTest, TestUtils, CircularListTest, TestRTGBase, CursorPagingTest, TestDistributedMissingSort, ConnectionReuseTest, DeleteInactiveReplicaTest, DeleteShardTest, DistribCursorPagingTest, ForceLeaderTest, SaslZkACLProviderTest, SharedFSAutoReplicaFailoverTest, SimpleCollectionCreateDeleteTest, TestCloudDeleteByQuery, TestCloudInspectUtil, TestCollectionAPI, TestLeaderInitiatedRecoveryThread, TestOnReconnectListenerSupport, TestReplicaProperties, TestSolrCloudWithKerberosAlt, HdfsBasicDistributedZk2Test, HdfsUnloadDistributedZkTest, StressHdfsTest, TestClusterStateMutator, ZkStateWriterTest, RuleEngineTest, CoreSorterTest, DirectoryFactoryTest, ExitableDirectoryReaderTest, QueryResultKeyTest, TestDynamicLoading]
   [junit4] Completed [475/575 (1!)] on J2 in 55.53s, 1 test, 1 failure <<< FAILURES!

[...truncated 49439 lines...]


Mime
View raw message