lucene-dev mailing list archives

Site index · List index
Message view « Date » · « Thread »
Top « Date » · « Thread »
From Policeman Jenkins Server <jenk...@thetaphi.de>
Subject [JENKINS] Lucene-Solr-master-Linux (32bit/jdk1.8.0_102) - Build # 17739 - Still Unstable!
Date Thu, 01 Sep 2016 09:34:13 GMT
Build: http://jenkins.thetaphi.de/job/Lucene-Solr-master-Linux/17739/
Java: 32bit/jdk1.8.0_102 -server -XX:+UseSerialGC

1 tests failed.
FAILED:  org.apache.solr.cloud.LeaderFailoverAfterPartitionTest.test

Error Message:
org.apache.solr.client.solrj.SolrServerException: No live SolrServers available to handle this request:[http://127.0.0.1:40652/av_/sd/c8n_1x3_lf_shard1_replica2]

Stack Trace:
org.apache.solr.client.solrj.SolrServerException: org.apache.solr.client.solrj.SolrServerException: No live SolrServers available to handle this request:[http://127.0.0.1:40652/av_/sd/c8n_1x3_lf_shard1_replica2]
	at __randomizedtesting.SeedInfo.seed([CB039F029D7B694A:4357A0D8338704B2]:0)
	at org.apache.solr.client.solrj.impl.CloudSolrClient.directUpdate(CloudSolrClient.java:769)
	at org.apache.solr.client.solrj.impl.CloudSolrClient.sendRequest(CloudSolrClient.java:1161)
	at org.apache.solr.client.solrj.impl.CloudSolrClient.requestWithRetryOnStaleState(CloudSolrClient.java:1050)
	at org.apache.solr.client.solrj.impl.CloudSolrClient.request(CloudSolrClient.java:992)
	at org.apache.solr.cloud.AbstractFullDistribZkTestBase.sendDocsWithRetry(AbstractFullDistribZkTestBase.java:753)
	at org.apache.solr.cloud.AbstractFullDistribZkTestBase.sendDocsWithRetry(AbstractFullDistribZkTestBase.java:741)
	at org.apache.solr.cloud.LeaderFailoverAfterPartitionTest.testRf3WithLeaderFailover(LeaderFailoverAfterPartitionTest.java:178)
	at org.apache.solr.cloud.LeaderFailoverAfterPartitionTest.test(LeaderFailoverAfterPartitionTest.java:57)
	at sun.reflect.NativeMethodAccessorImpl.invoke0(Native Method)
	at sun.reflect.NativeMethodAccessorImpl.invoke(NativeMethodAccessorImpl.java:62)
	at sun.reflect.DelegatingMethodAccessorImpl.invoke(DelegatingMethodAccessorImpl.java:43)
	at java.lang.reflect.Method.invoke(Method.java:498)
	at com.carrotsearch.randomizedtesting.RandomizedRunner.invoke(RandomizedRunner.java:1764)
	at com.carrotsearch.randomizedtesting.RandomizedRunner$8.evaluate(RandomizedRunner.java:871)
	at com.carrotsearch.randomizedtesting.RandomizedRunner$9.evaluate(RandomizedRunner.java:907)
	at com.carrotsearch.randomizedtesting.RandomizedRunner$10.evaluate(RandomizedRunner.java:921)
	at org.apache.solr.BaseDistributedSearchTestCase$ShardsRepeatRule$ShardsFixedStatement.callStatement(BaseDistributedSearchTestCase.java:985)
	at org.apache.solr.BaseDistributedSearchTestCase$ShardsRepeatRule$ShardsStatement.evaluate(BaseDistributedSearchTestCase.java:960)
	at com.carrotsearch.randomizedtesting.rules.SystemPropertiesRestoreRule$1.evaluate(SystemPropertiesRestoreRule.java:57)
	at org.apache.lucene.util.TestRuleSetupTeardownChained$1.evaluate(TestRuleSetupTeardownChained.java:49)
	at org.apache.lucene.util.AbstractBeforeAfterRule$1.evaluate(AbstractBeforeAfterRule.java:45)
	at org.apache.lucene.util.TestRuleThreadAndTestName$1.evaluate(TestRuleThreadAndTestName.java:48)
	at org.apache.lucene.util.TestRuleIgnoreAfterMaxFailures$1.evaluate(TestRuleIgnoreAfterMaxFailures.java:64)
	at org.apache.lucene.util.TestRuleMarkFailure$1.evaluate(TestRuleMarkFailure.java:47)
	at com.carrotsearch.randomizedtesting.rules.StatementAdapter.evaluate(StatementAdapter.java:36)
	at com.carrotsearch.randomizedtesting.ThreadLeakControl$StatementRunner.run(ThreadLeakControl.java:367)
	at com.carrotsearch.randomizedtesting.ThreadLeakControl.forkTimeoutingTask(ThreadLeakControl.java:809)
	at com.carrotsearch.randomizedtesting.ThreadLeakControl$3.evaluate(ThreadLeakControl.java:460)
	at com.carrotsearch.randomizedtesting.RandomizedRunner.runSingleTest(RandomizedRunner.java:880)
	at com.carrotsearch.randomizedtesting.RandomizedRunner$5.evaluate(RandomizedRunner.java:781)
	at com.carrotsearch.randomizedtesting.RandomizedRunner$6.evaluate(RandomizedRunner.java:816)
	at com.carrotsearch.randomizedtesting.RandomizedRunner$7.evaluate(RandomizedRunner.java:827)
	at com.carrotsearch.randomizedtesting.rules.StatementAdapter.evaluate(StatementAdapter.java:36)
	at com.carrotsearch.randomizedtesting.rules.SystemPropertiesRestoreRule$1.evaluate(SystemPropertiesRestoreRule.java:57)
	at org.apache.lucene.util.AbstractBeforeAfterRule$1.evaluate(AbstractBeforeAfterRule.java:45)
	at com.carrotsearch.randomizedtesting.rules.StatementAdapter.evaluate(StatementAdapter.java:36)
	at org.apache.lucene.util.TestRuleStoreClassName$1.evaluate(TestRuleStoreClassName.java:41)
	at com.carrotsearch.randomizedtesting.rules.NoShadowingOrOverridesOnMethodsRule$1.evaluate(NoShadowingOrOverridesOnMethodsRule.java:40)
	at com.carrotsearch.randomizedtesting.rules.NoShadowingOrOverridesOnMethodsRule$1.evaluate(NoShadowingOrOverridesOnMethodsRule.java:40)
	at com.carrotsearch.randomizedtesting.rules.StatementAdapter.evaluate(StatementAdapter.java:36)
	at com.carrotsearch.randomizedtesting.rules.StatementAdapter.evaluate(StatementAdapter.java:36)
	at com.carrotsearch.randomizedtesting.rules.StatementAdapter.evaluate(StatementAdapter.java:36)
	at org.apache.lucene.util.TestRuleAssertionsRequired$1.evaluate(TestRuleAssertionsRequired.java:53)
	at org.apache.lucene.util.TestRuleMarkFailure$1.evaluate(TestRuleMarkFailure.java:47)
	at org.apache.lucene.util.TestRuleIgnoreAfterMaxFailures$1.evaluate(TestRuleIgnoreAfterMaxFailures.java:64)
	at org.apache.lucene.util.TestRuleIgnoreTestSuites$1.evaluate(TestRuleIgnoreTestSuites.java:54)
	at com.carrotsearch.randomizedtesting.rules.StatementAdapter.evaluate(StatementAdapter.java:36)
	at com.carrotsearch.randomizedtesting.ThreadLeakControl$StatementRunner.run(ThreadLeakControl.java:367)
	at java.lang.Thread.run(Thread.java:745)
Caused by: org.apache.solr.client.solrj.SolrServerException: No live SolrServers available to handle this request:[http://127.0.0.1:40652/av_/sd/c8n_1x3_lf_shard1_replica2]
	at org.apache.solr.client.solrj.impl.LBHttpSolrClient.request(LBHttpSolrClient.java:394)
	at org.apache.solr.client.solrj.impl.CloudSolrClient.directUpdate(CloudSolrClient.java:763)
	... 48 more
Caused by: org.apache.solr.client.solrj.SolrServerException: Server refused connection at: http://127.0.0.1:40652/av_/sd/c8n_1x3_lf_shard1_replica2
	at org.apache.solr.client.solrj.impl.HttpSolrClient.executeMethod(HttpSolrClient.java:615)
	at org.apache.solr.client.solrj.impl.HttpSolrClient.request(HttpSolrClient.java:261)
	at org.apache.solr.client.solrj.impl.HttpSolrClient.request(HttpSolrClient.java:250)
	at org.apache.solr.client.solrj.impl.LBHttpSolrClient.doRequest(LBHttpSolrClient.java:415)
	at org.apache.solr.client.solrj.impl.LBHttpSolrClient.request(LBHttpSolrClient.java:383)
	... 49 more
Caused by: org.apache.http.conn.HttpHostConnectException: Connect to 127.0.0.1:40652 [/127.0.0.1] failed: Connection refused
	at org.apache.http.impl.conn.DefaultHttpClientConnectionOperator.connect(DefaultHttpClientConnectionOperator.java:151)
	at org.apache.http.impl.conn.PoolingHttpClientConnectionManager.connect(PoolingHttpClientConnectionManager.java:353)
	at org.apache.http.impl.execchain.MainClientExec.establishRoute(MainClientExec.java:380)
	at org.apache.http.impl.execchain.MainClientExec.execute(MainClientExec.java:236)
	at org.apache.http.impl.execchain.ProtocolExec.execute(ProtocolExec.java:184)
	at org.apache.http.impl.execchain.RetryExec.execute(RetryExec.java:88)
	at org.apache.http.impl.execchain.RedirectExec.execute(RedirectExec.java:110)
	at org.apache.http.impl.client.InternalHttpClient.doExecute(InternalHttpClient.java:184)
	at org.apache.http.impl.client.CloseableHttpClient.execute(CloseableHttpClient.java:82)
	at org.apache.http.impl.client.CloseableHttpClient.execute(CloseableHttpClient.java:55)
	at org.apache.solr.client.solrj.impl.HttpSolrClient.executeMethod(HttpSolrClient.java:513)
	... 53 more
Caused by: java.net.ConnectException: Connection refused
	at java.net.PlainSocketImpl.socketConnect(Native Method)
	at java.net.AbstractPlainSocketImpl.doConnect(AbstractPlainSocketImpl.java:350)
	at java.net.AbstractPlainSocketImpl.connectToAddress(AbstractPlainSocketImpl.java:206)
	at java.net.AbstractPlainSocketImpl.connect(AbstractPlainSocketImpl.java:188)
	at java.net.SocksSocketImpl.connect(SocksSocketImpl.java:392)
	at java.net.Socket.connect(Socket.java:589)
	at org.apache.http.conn.socket.PlainConnectionSocketFactory.connectSocket(PlainConnectionSocketFactory.java:74)
	at org.apache.http.impl.conn.DefaultHttpClientConnectionOperator.connect(DefaultHttpClientConnectionOperator.java:134)
	... 63 more




Build Log:
[...truncated 12049 lines...]
   [junit4] Suite: org.apache.solr.cloud.LeaderFailoverAfterPartitionTest
   [junit4]   2> Creating dataDir: /home/jenkins/workspace/Lucene-Solr-master-Linux/solr/build/solr-core/test/J0/temp/solr.cloud.LeaderFailoverAfterPartitionTest_CB039F029D7B694A-001/init-core-data-001
   [junit4]   2> 1420632 INFO  (SUITE-LeaderFailoverAfterPartitionTest-seed#[CB039F029D7B694A]-worker) [    ] o.a.s.SolrTestCaseJ4 Randomized ssl (false) and clientAuth (false) via: @org.apache.solr.SolrTestCaseJ4$SuppressSSL(bugUrl=https://issues.apache.org/jira/browse/SOLR-5776)
   [junit4]   2> 1420632 INFO  (SUITE-LeaderFailoverAfterPartitionTest-seed#[CB039F029D7B694A]-worker) [    ] o.a.s.BaseDistributedSearchTestCase Setting hostContext system property: /av_/sd
   [junit4]   2> 1420634 INFO  (TEST-LeaderFailoverAfterPartitionTest.test-seed#[CB039F029D7B694A]) [    ] o.a.s.c.ZkTestServer STARTING ZK TEST SERVER
   [junit4]   2> 1420634 INFO  (Thread-2649) [    ] o.a.s.c.ZkTestServer client port:0.0.0.0/0.0.0.0:0
   [junit4]   2> 1420634 INFO  (Thread-2649) [    ] o.a.s.c.ZkTestServer Starting server
   [junit4]   2> 1420734 INFO  (TEST-LeaderFailoverAfterPartitionTest.test-seed#[CB039F029D7B694A]) [    ] o.a.s.c.ZkTestServer start zk server on port:38826
   [junit4]   2> 1420734 INFO  (TEST-LeaderFailoverAfterPartitionTest.test-seed#[CB039F029D7B694A]) [    ] o.a.s.c.c.SolrZkClient Using default ZkCredentialsProvider
   [junit4]   2> 1420735 INFO  (TEST-LeaderFailoverAfterPartitionTest.test-seed#[CB039F029D7B694A]) [    ] o.a.s.c.c.ConnectionManager Waiting for client to connect to ZooKeeper
   [junit4]   2> 1420736 INFO  (zkCallback-2075-thread-1) [    ] o.a.s.c.c.ConnectionManager Watcher org.apache.solr.common.cloud.ConnectionManager@397410 name:ZooKeeperConnection Watcher:127.0.0.1:38826 got event WatchedEvent state:SyncConnected type:None path:null path:null type:None
   [junit4]   2> 1420736 INFO  (TEST-LeaderFailoverAfterPartitionTest.test-seed#[CB039F029D7B694A]) [    ] o.a.s.c.c.ConnectionManager Client is connected to ZooKeeper
   [junit4]   2> 1420736 INFO  (TEST-LeaderFailoverAfterPartitionTest.test-seed#[CB039F029D7B694A]) [    ] o.a.s.c.c.SolrZkClient Using default ZkACLProvider
   [junit4]   2> 1420736 INFO  (TEST-LeaderFailoverAfterPartitionTest.test-seed#[CB039F029D7B694A]) [    ] o.a.s.c.c.SolrZkClient makePath: /solr
   [junit4]   2> 1420737 INFO  (TEST-LeaderFailoverAfterPartitionTest.test-seed#[CB039F029D7B694A]) [    ] o.a.s.c.c.SolrZkClient Using default ZkCredentialsProvider
   [junit4]   2> 1420737 INFO  (TEST-LeaderFailoverAfterPartitionTest.test-seed#[CB039F029D7B694A]) [    ] o.a.s.c.c.ConnectionManager Waiting for client to connect to ZooKeeper
   [junit4]   2> 1420738 INFO  (zkCallback-2076-thread-1) [    ] o.a.s.c.c.ConnectionManager Watcher org.apache.solr.common.cloud.ConnectionManager@1d4dd3b name:ZooKeeperConnection Watcher:127.0.0.1:38826/solr got event WatchedEvent state:SyncConnected type:None path:null path:null type:None
   [junit4]   2> 1420738 INFO  (TEST-LeaderFailoverAfterPartitionTest.test-seed#[CB039F029D7B694A]) [    ] o.a.s.c.c.ConnectionManager Client is connected to ZooKeeper
   [junit4]   2> 1420738 INFO  (TEST-LeaderFailoverAfterPartitionTest.test-seed#[CB039F029D7B694A]) [    ] o.a.s.c.c.SolrZkClient Using default ZkACLProvider
   [junit4]   2> 1420738 INFO  (TEST-LeaderFailoverAfterPartitionTest.test-seed#[CB039F029D7B694A]) [    ] o.a.s.c.c.SolrZkClient makePath: /collections/collection1
   [junit4]   2> 1420739 INFO  (TEST-LeaderFailoverAfterPartitionTest.test-seed#[CB039F029D7B694A]) [    ] o.a.s.c.c.SolrZkClient makePath: /collections/collection1/shards
   [junit4]   2> 1420739 INFO  (TEST-LeaderFailoverAfterPartitionTest.test-seed#[CB039F029D7B694A]) [    ] o.a.s.c.c.SolrZkClient makePath: /collections/control_collection
   [junit4]   2> 1420740 INFO  (TEST-LeaderFailoverAfterPartitionTest.test-seed#[CB039F029D7B694A]) [    ] o.a.s.c.c.SolrZkClient makePath: /collections/control_collection/shards
   [junit4]   2> 1420740 INFO  (TEST-LeaderFailoverAfterPartitionTest.test-seed#[CB039F029D7B694A]) [    ] o.a.s.c.AbstractZkTestCase put /home/jenkins/workspace/Lucene-Solr-master-Linux/solr/core/src/test-files/solr/collection1/conf/solrconfig-tlog.xml to /configs/conf1/solrconfig.xml
   [junit4]   2> 1420740 INFO  (TEST-LeaderFailoverAfterPartitionTest.test-seed#[CB039F029D7B694A]) [    ] o.a.s.c.c.SolrZkClient makePath: /configs/conf1/solrconfig.xml
   [junit4]   2> 1420741 INFO  (TEST-LeaderFailoverAfterPartitionTest.test-seed#[CB039F029D7B694A]) [    ] o.a.s.c.AbstractZkTestCase put /home/jenkins/workspace/Lucene-Solr-master-Linux/solr/core/src/test-files/solr/collection1/conf/schema.xml to /configs/conf1/schema.xml
   [junit4]   2> 1420741 INFO  (TEST-LeaderFailoverAfterPartitionTest.test-seed#[CB039F029D7B694A]) [    ] o.a.s.c.c.SolrZkClient makePath: /configs/conf1/schema.xml
   [junit4]   2> 1420742 INFO  (TEST-LeaderFailoverAfterPartitionTest.test-seed#[CB039F029D7B694A]) [    ] o.a.s.c.AbstractZkTestCase put /home/jenkins/workspace/Lucene-Solr-master-Linux/solr/core/src/test-files/solr/collection1/conf/solrconfig.snippet.randomindexconfig.xml to /configs/conf1/solrconfig.snippet.randomindexconfig.xml
   [junit4]   2> 1420742 INFO  (TEST-LeaderFailoverAfterPartitionTest.test-seed#[CB039F029D7B694A]) [    ] o.a.s.c.c.SolrZkClient makePath: /configs/conf1/solrconfig.snippet.randomindexconfig.xml
   [junit4]   2> 1420743 INFO  (TEST-LeaderFailoverAfterPartitionTest.test-seed#[CB039F029D7B694A]) [    ] o.a.s.c.AbstractZkTestCase put /home/jenkins/workspace/Lucene-Solr-master-Linux/solr/core/src/test-files/solr/collection1/conf/stopwords.txt to /configs/conf1/stopwords.txt
   [junit4]   2> 1420743 INFO  (TEST-LeaderFailoverAfterPartitionTest.test-seed#[CB039F029D7B694A]) [    ] o.a.s.c.c.SolrZkClient makePath: /configs/conf1/stopwords.txt
   [junit4]   2> 1420743 INFO  (TEST-LeaderFailoverAfterPartitionTest.test-seed#[CB039F029D7B694A]) [    ] o.a.s.c.AbstractZkTestCase put /home/jenkins/workspace/Lucene-Solr-master-Linux/solr/core/src/test-files/solr/collection1/conf/protwords.txt to /configs/conf1/protwords.txt
   [junit4]   2> 1420743 INFO  (TEST-LeaderFailoverAfterPartitionTest.test-seed#[CB039F029D7B694A]) [    ] o.a.s.c.c.SolrZkClient makePath: /configs/conf1/protwords.txt
   [junit4]   2> 1420744 INFO  (TEST-LeaderFailoverAfterPartitionTest.test-seed#[CB039F029D7B694A]) [    ] o.a.s.c.AbstractZkTestCase put /home/jenkins/workspace/Lucene-Solr-master-Linux/solr/core/src/test-files/solr/collection1/conf/currency.xml to /configs/conf1/currency.xml
   [junit4]   2> 1420745 INFO  (TEST-LeaderFailoverAfterPartitionTest.test-seed#[CB039F029D7B694A]) [    ] o.a.s.c.c.SolrZkClient makePath: /configs/conf1/currency.xml
   [junit4]   2> 1420745 INFO  (TEST-LeaderFailoverAfterPartitionTest.test-seed#[CB039F029D7B694A]) [    ] o.a.s.c.AbstractZkTestCase put /home/jenkins/workspace/Lucene-Solr-master-Linux/solr/core/src/test-files/solr/collection1/conf/enumsConfig.xml to /configs/conf1/enumsConfig.xml
   [junit4]   2> 1420745 INFO  (TEST-LeaderFailoverAfterPartitionTest.test-seed#[CB039F029D7B694A]) [    ] o.a.s.c.c.SolrZkClient makePath: /configs/conf1/enumsConfig.xml
   [junit4]   2> 1420746 INFO  (TEST-LeaderFailoverAfterPartitionTest.test-seed#[CB039F029D7B694A]) [    ] o.a.s.c.AbstractZkTestCase put /home/jenkins/workspace/Lucene-Solr-master-Linux/solr/core/src/test-files/solr/collection1/conf/open-exchange-rates.json to /configs/conf1/open-exchange-rates.json
   [junit4]   2> 1420746 INFO  (TEST-LeaderFailoverAfterPartitionTest.test-seed#[CB039F029D7B694A]) [    ] o.a.s.c.c.SolrZkClient makePath: /configs/conf1/open-exchange-rates.json
   [junit4]   2> 1420746 INFO  (TEST-LeaderFailoverAfterPartitionTest.test-seed#[CB039F029D7B694A]) [    ] o.a.s.c.AbstractZkTestCase put /home/jenkins/workspace/Lucene-Solr-master-Linux/solr/core/src/test-files/solr/collection1/conf/mapping-ISOLatin1Accent.txt to /configs/conf1/mapping-ISOLatin1Accent.txt
   [junit4]   2> 1420746 INFO  (TEST-LeaderFailoverAfterPartitionTest.test-seed#[CB039F029D7B694A]) [    ] o.a.s.c.c.SolrZkClient makePath: /configs/conf1/mapping-ISOLatin1Accent.txt
   [junit4]   2> 1420747 INFO  (TEST-LeaderFailoverAfterPartitionTest.test-seed#[CB039F029D7B694A]) [    ] o.a.s.c.AbstractZkTestCase put /home/jenkins/workspace/Lucene-Solr-master-Linux/solr/core/src/test-files/solr/collection1/conf/old_synonyms.txt to /configs/conf1/old_synonyms.txt
   [junit4]   2> 1420747 INFO  (TEST-LeaderFailoverAfterPartitionTest.test-seed#[CB039F029D7B694A]) [    ] o.a.s.c.c.SolrZkClient makePath: /configs/conf1/old_synonyms.txt
   [junit4]   2> 1420747 INFO  (TEST-LeaderFailoverAfterPartitionTest.test-seed#[CB039F029D7B694A]) [    ] o.a.s.c.AbstractZkTestCase put /home/jenkins/workspace/Lucene-Solr-master-Linux/solr/core/src/test-files/solr/collection1/conf/synonyms.txt to /configs/conf1/synonyms.txt
   [junit4]   2> 1420747 INFO  (TEST-LeaderFailoverAfterPartitionTest.test-seed#[CB039F029D7B694A]) [    ] o.a.s.c.c.SolrZkClient makePath: /configs/conf1/synonyms.txt
   [junit4]   2> 1420811 INFO  (TEST-LeaderFailoverAfterPartitionTest.test-seed#[CB039F029D7B694A]) [    ] o.a.s.SolrTestCaseJ4 Writing core.properties file to /home/jenkins/workspace/Lucene-Solr-master-Linux/solr/build/solr-core/test/J0/temp/solr.cloud.LeaderFailoverAfterPartitionTest_CB039F029D7B694A-001/control-001/cores/collection1
   [junit4]   2> 1420813 INFO  (TEST-LeaderFailoverAfterPartitionTest.test-seed#[CB039F029D7B694A]) [    ] o.e.j.s.Server jetty-9.3.8.v20160314
   [junit4]   2> 1420814 INFO  (TEST-LeaderFailoverAfterPartitionTest.test-seed#[CB039F029D7B694A]) [    ] o.e.j.s.h.ContextHandler Started o.e.j.s.ServletContextHandler@1632662{/av_/sd,null,AVAILABLE}
   [junit4]   2> 1420814 INFO  (TEST-LeaderFailoverAfterPartitionTest.test-seed#[CB039F029D7B694A]) [    ] o.e.j.s.ServerConnector Started ServerConnector@1bda23d{HTTP/1.1,[http/1.1]}{127.0.0.1:43807}
   [junit4]   2> 1420814 INFO  (TEST-LeaderFailoverAfterPartitionTest.test-seed#[CB039F029D7B694A]) [    ] o.e.j.s.Server Started @1422537ms
   [junit4]   2> 1420814 INFO  (TEST-LeaderFailoverAfterPartitionTest.test-seed#[CB039F029D7B694A]) [    ] o.a.s.c.s.e.JettySolrRunner Jetty properties: {solr.data.dir=/home/jenkins/workspace/Lucene-Solr-master-Linux/solr/build/solr-core/test/J0/temp/solr.cloud.LeaderFailoverAfterPartitionTest_CB039F029D7B694A-001/tempDir-001/control/data, hostContext=/av_/sd, hostPort=40652, coreRootDirectory=/home/jenkins/workspace/Lucene-Solr-master-Linux/solr/build/solr-core/test/J0/temp/solr.cloud.LeaderFailoverAfterPartitionTest_CB039F029D7B694A-001/control-001/cores}
   [junit4]   2> 1420815 INFO  (TEST-LeaderFailoverAfterPartitionTest.test-seed#[CB039F029D7B694A]) [    ] o.a.s.s.SolrDispatchFilter SolrDispatchFilter.init(): sun.misc.Launcher$AppClassLoader@1d16e93
   [junit4]   2> 1420815 INFO  (TEST-LeaderFailoverAfterPartitionTest.test-seed#[CB039F029D7B694A]) [    ] o.a.s.c.SolrResourceLoader new SolrResourceLoader for directory: '/home/jenkins/workspace/Lucene-Solr-master-Linux/solr/build/solr-core/test/J0/temp/solr.cloud.LeaderFailoverAfterPartitionTest_CB039F029D7B694A-001/control-001'
   [junit4]   2> 1420815 INFO  (TEST-LeaderFailoverAfterPartitionTest.test-seed#[CB039F029D7B694A]) [    ] o.a.s.c.SolrResourceLoader JNDI not configured for solr (NoInitialContextEx)
   [junit4]   2> 1420815 INFO  (TEST-LeaderFailoverAfterPartitionTest.test-seed#[CB039F029D7B694A]) [    ] o.a.s.c.SolrResourceLoader solr home defaulted to 'solr/' (could not find system property or JNDI)
   [junit4]   2> 1420815 INFO  (TEST-LeaderFailoverAfterPartitionTest.test-seed#[CB039F029D7B694A]) [    ] o.a.s.c.c.SolrZkClient Using default ZkCredentialsProvider
   [junit4]   2> 1420816 INFO  (TEST-LeaderFailoverAfterPartitionTest.test-seed#[CB039F029D7B694A]) [    ] o.a.s.c.c.ConnectionManager Waiting for client to connect to ZooKeeper
   [junit4]   2> 1420816 INFO  (zkCallback-2077-thread-1) [    ] o.a.s.c.c.ConnectionManager Watcher org.apache.solr.common.cloud.ConnectionManager@2609df name:ZooKeeperConnection Watcher:127.0.0.1:38826/solr got event WatchedEvent state:SyncConnected type:None path:null path:null type:None
   [junit4]   2> 1420816 INFO  (TEST-LeaderFailoverAfterPartitionTest.test-seed#[CB039F029D7B694A]) [    ] o.a.s.c.c.ConnectionManager Client is connected to ZooKeeper
   [junit4]   2> 1420817 INFO  (TEST-LeaderFailoverAfterPartitionTest.test-seed#[CB039F029D7B694A]) [    ] o.a.s.c.c.SolrZkClient Using default ZkACLProvider
   [junit4]   2> 1420817 INFO  (TEST-LeaderFailoverAfterPartitionTest.test-seed#[CB039F029D7B694A]) [    ] o.a.s.s.SolrDispatchFilter Loading solr.xml from SolrHome (not found in ZooKeeper)
   [junit4]   2> 1420817 INFO  (TEST-LeaderFailoverAfterPartitionTest.test-seed#[CB039F029D7B694A]) [    ] o.a.s.c.SolrXmlConfig Loading container configuration from /home/jenkins/workspace/Lucene-Solr-master-Linux/solr/build/solr-core/test/J0/temp/solr.cloud.LeaderFailoverAfterPartitionTest_CB039F029D7B694A-001/control-001/solr.xml
   [junit4]   2> 1420821 INFO  (TEST-LeaderFailoverAfterPartitionTest.test-seed#[CB039F029D7B694A]) [    ] o.a.s.c.CorePropertiesLocator Config-defined core root directory: /home/jenkins/workspace/Lucene-Solr-master-Linux/solr/build/solr-core/test/J0/temp/solr.cloud.LeaderFailoverAfterPartitionTest_CB039F029D7B694A-001/control-001/cores
   [junit4]   2> 1420821 INFO  (TEST-LeaderFailoverAfterPartitionTest.test-seed#[CB039F029D7B694A]) [    ] o.a.s.c.CoreContainer New CoreContainer 218400
   [junit4]   2> 1420821 INFO  (TEST-LeaderFailoverAfterPartitionTest.test-seed#[CB039F029D7B694A]) [    ] o.a.s.c.CoreContainer Loading cores into CoreContainer [instanceDir=/home/jenkins/workspace/Lucene-Solr-master-Linux/solr/build/solr-core/test/J0/temp/solr.cloud.LeaderFailoverAfterPartitionTest_CB039F029D7B694A-001/control-001]
   [junit4]   2> 1420821 WARN  (TEST-LeaderFailoverAfterPartitionTest.test-seed#[CB039F029D7B694A]) [    ] o.a.s.c.CoreContainer Couldn't add files from /home/jenkins/workspace/Lucene-Solr-master-Linux/solr/build/solr-core/test/J0/temp/solr.cloud.LeaderFailoverAfterPartitionTest_CB039F029D7B694A-001/control-001/lib to classpath: /home/jenkins/workspace/Lucene-Solr-master-Linux/solr/build/solr-core/test/J0/temp/solr.cloud.LeaderFailoverAfterPartitionTest_CB039F029D7B694A-001/control-001/lib
   [junit4]   2> 1420821 INFO  (TEST-LeaderFailoverAfterPartitionTest.test-seed#[CB039F029D7B694A]) [    ] o.a.s.h.c.HttpShardHandlerFactory created with socketTimeout : 90000,urlScheme : ,connTimeout : 15000,maxConnectionsPerHost : 20,maxConnections : 10000,corePoolSize : 0,maximumPoolSize : 2147483647,maxThreadIdleTime : 5,sizeOfQueue : -1,fairnessPolicy : false,
   [junit4]   2> 1420823 INFO  (TEST-LeaderFailoverAfterPartitionTest.test-seed#[CB039F029D7B694A]) [    ] o.a.s.u.UpdateShardHandler Created UpdateShardHandler HTTP client with params: socketTimeout=340000&connTimeout=45000&maxConnections=100000&maxConnectionsPerHost=100000
   [junit4]   2> 1420823 INFO  (TEST-LeaderFailoverAfterPartitionTest.test-seed#[CB039F029D7B694A]) [    ] o.a.s.l.LogWatcher SLF4J impl is org.slf4j.impl.Log4jLoggerFactory
   [junit4]   2> 1420823 INFO  (TEST-LeaderFailoverAfterPartitionTest.test-seed#[CB039F029D7B694A]) [    ] o.a.s.l.LogWatcher Registering Log Listener [Log4j (org.slf4j.impl.Log4jLoggerFactory)]
   [junit4]   2> 1420823 INFO  (TEST-LeaderFailoverAfterPartitionTest.test-seed#[CB039F029D7B694A]) [    ] o.a.s.c.ZkContainer Zookeeper client=127.0.0.1:38826/solr
   [junit4]   2> 1420823 INFO  (TEST-LeaderFailoverAfterPartitionTest.test-seed#[CB039F029D7B694A]) [    ] o.a.s.c.ZkController zkHost includes chroot
   [junit4]   2> 1420823 INFO  (TEST-LeaderFailoverAfterPartitionTest.test-seed#[CB039F029D7B694A]) [    ] o.a.s.c.c.SolrZkClient Using default ZkCredentialsProvider
   [junit4]   2> 1420824 INFO  (TEST-LeaderFailoverAfterPartitionTest.test-seed#[CB039F029D7B694A]) [    ] o.a.s.c.c.ConnectionManager Waiting for client to connect to ZooKeeper
   [junit4]   2> 1420824 INFO  (zkCallback-2080-thread-1) [    ] o.a.s.c.c.ConnectionManager Watcher org.apache.solr.common.cloud.ConnectionManager@1d682c6 name:ZooKeeperConnection Watcher:127.0.0.1:38826 got event WatchedEvent state:SyncConnected type:None path:null path:null type:None
   [junit4]   2> 1420824 INFO  (TEST-LeaderFailoverAfterPartitionTest.test-seed#[CB039F029D7B694A]) [    ] o.a.s.c.c.ConnectionManager Client is connected to ZooKeeper
   [junit4]   2> 1420825 INFO  (TEST-LeaderFailoverAfterPartitionTest.test-seed#[CB039F029D7B694A]) [    ] o.a.s.c.c.SolrZkClient Using default ZkACLProvider
   [junit4]   2> 1420825 INFO  (TEST-LeaderFailoverAfterPartitionTest.test-seed#[CB039F029D7B694A]) [n:127.0.0.1:40652_av_%2Fsd    ] o.a.s.c.ZkController Added new OnReconnect listener org.apache.solr.cloud.ZkController$$Lambda$92/6714560@53b1f9
   [junit4]   2> 1420825 INFO  (TEST-LeaderFailoverAfterPartitionTest.test-seed#[CB039F029D7B694A]) [n:127.0.0.1:40652_av_%2Fsd    ] o.a.s.c.c.ConnectionManager Waiting for client to connect to ZooKeeper
   [junit4]   2> 1420826 INFO  (zkCallback-2081-thread-1-processing-n:127.0.0.1:40652_av_%2Fsd) [n:127.0.0.1:40652_av_%2Fsd    ] o.a.s.c.c.ConnectionManager Watcher org.apache.solr.common.cloud.ConnectionManager@1200ee9 name:ZooKeeperConnection Watcher:127.0.0.1:38826/solr got event WatchedEvent state:SyncConnected type:None path:null path:null type:None
   [junit4]   2> 1420826 INFO  (TEST-LeaderFailoverAfterPartitionTest.test-seed#[CB039F029D7B694A]) [n:127.0.0.1:40652_av_%2Fsd    ] o.a.s.c.c.ConnectionManager Client is connected to ZooKeeper
   [junit4]   2> 1420827 INFO  (TEST-LeaderFailoverAfterPartitionTest.test-seed#[CB039F029D7B694A]) [n:127.0.0.1:40652_av_%2Fsd    ] o.a.s.c.c.SolrZkClient makePath: /overseer/queue
   [junit4]   2> 1420827 INFO  (TEST-LeaderFailoverAfterPartitionTest.test-seed#[CB039F029D7B694A]) [n:127.0.0.1:40652_av_%2Fsd    ] o.a.s.c.c.SolrZkClient makePath: /overseer/collection-queue-work
   [junit4]   2> 1420829 INFO  (TEST-LeaderFailoverAfterPartitionTest.test-seed#[CB039F029D7B694A]) [n:127.0.0.1:40652_av_%2Fsd    ] o.a.s.c.c.SolrZkClient makePath: /overseer/collection-map-running
   [junit4]   2> 1420829 INFO  (TEST-LeaderFailoverAfterPartitionTest.test-seed#[CB039F029D7B694A]) [n:127.0.0.1:40652_av_%2Fsd    ] o.a.s.c.c.SolrZkClient makePath: /overseer/collection-map-completed
   [junit4]   2> 1420830 INFO  (TEST-LeaderFailoverAfterPartitionTest.test-seed#[CB039F029D7B694A]) [n:127.0.0.1:40652_av_%2Fsd    ] o.a.s.c.c.SolrZkClient makePath: /overseer/collection-map-failure
   [junit4]   2> 1420830 INFO  (TEST-LeaderFailoverAfterPartitionTest.test-seed#[CB039F029D7B694A]) [n:127.0.0.1:40652_av_%2Fsd    ] o.a.s.c.c.SolrZkClient makePath: /live_nodes
   [junit4]   2> 1420830 INFO  (TEST-LeaderFailoverAfterPartitionTest.test-seed#[CB039F029D7B694A]) [n:127.0.0.1:40652_av_%2Fsd    ] o.a.s.c.c.SolrZkClient makePath: /aliases.json
   [junit4]   2> 1420831 INFO  (TEST-LeaderFailoverAfterPartitionTest.test-seed#[CB039F029D7B694A]) [n:127.0.0.1:40652_av_%2Fsd    ] o.a.s.c.c.SolrZkClient makePath: /clusterstate.json
   [junit4]   2> 1420831 INFO  (TEST-LeaderFailoverAfterPartitionTest.test-seed#[CB039F029D7B694A]) [n:127.0.0.1:40652_av_%2Fsd    ] o.a.s.c.c.SolrZkClient makePath: /security.json
   [junit4]   2> 1420831 INFO  (TEST-LeaderFailoverAfterPartitionTest.test-seed#[CB039F029D7B694A]) [n:127.0.0.1:40652_av_%2Fsd    ] o.a.s.c.c.ZkStateReader Updating cluster state from ZooKeeper... 
   [junit4]   2> 1420831 INFO  (TEST-LeaderFailoverAfterPartitionTest.test-seed#[CB039F029D7B694A]) [n:127.0.0.1:40652_av_%2Fsd    ] o.a.s.c.c.ZkStateReader Loaded empty cluster properties
   [junit4]   2> 1420831 INFO  (TEST-LeaderFailoverAfterPartitionTest.test-seed#[CB039F029D7B694A]) [n:127.0.0.1:40652_av_%2Fsd    ] o.a.s.c.c.ZkStateReader Updated live nodes from ZooKeeper... (0) -> (0)
   [junit4]   2> 1420832 INFO  (TEST-LeaderFailoverAfterPartitionTest.test-seed#[CB039F029D7B694A]) [n:127.0.0.1:40652_av_%2Fsd    ] o.a.s.c.c.SolrZkClient makePath: /overseer_elect
   [junit4]   2> 1420833 INFO  (TEST-LeaderFailoverAfterPartitionTest.test-seed#[CB039F029D7B694A]) [n:127.0.0.1:40652_av_%2Fsd    ] o.a.s.c.c.SolrZkClient makePath: /overseer_elect/election
   [junit4]   2> 1420833 INFO  (TEST-LeaderFailoverAfterPartitionTest.test-seed#[CB039F029D7B694A]) [n:127.0.0.1:40652_av_%2Fsd    ] o.a.s.c.Overseer Overseer (id=null) closing
   [junit4]   2> 1420833 INFO  (TEST-LeaderFailoverAfterPartitionTest.test-seed#[CB039F029D7B694A]) [n:127.0.0.1:40652_av_%2Fsd    ] o.a.s.c.LeaderElector Joined leadership election with path: /overseer_elect/election/96516265690464260-127.0.0.1:40652_av_%2Fsd-n_0000000000
   [junit4]   2> 1420833 INFO  (TEST-LeaderFailoverAfterPartitionTest.test-seed#[CB039F029D7B694A]) [n:127.0.0.1:40652_av_%2Fsd    ] o.a.s.c.OverseerElectionContext I am going to be the leader 127.0.0.1:40652_av_%2Fsd
   [junit4]   2> 1420833 INFO  (TEST-LeaderFailoverAfterPartitionTest.test-seed#[CB039F029D7B694A]) [n:127.0.0.1:40652_av_%2Fsd    ] o.a.s.c.c.SolrZkClient makePath: /overseer_elect/leader
   [junit4]   2> 1420833 INFO  (TEST-LeaderFailoverAfterPartitionTest.test-seed#[CB039F029D7B694A]) [n:127.0.0.1:40652_av_%2Fsd    ] o.a.s.c.Overseer Overseer (id=96516265690464260-127.0.0.1:40652_av_%2Fsd-n_0000000000) starting
   [junit4]   2> 1420834 INFO  (TEST-LeaderFailoverAfterPartitionTest.test-seed#[CB039F029D7B694A]) [n:127.0.0.1:40652_av_%2Fsd    ] o.a.s.c.c.SolrZkClient makePath: /overseer/queue-work
   [junit4]   2> 1420835 INFO  (TEST-LeaderFailoverAfterPartitionTest.test-seed#[CB039F029D7B694A]) [n:127.0.0.1:40652_av_%2Fsd    ] o.a.s.c.OverseerAutoReplicaFailoverThread Starting OverseerAutoReplicaFailoverThread autoReplicaFailoverWorkLoopDelay=10000 autoReplicaFailoverWaitAfterExpiration=10000 autoReplicaFailoverBadNodeExpiration=60000
   [junit4]   2> 1420835 INFO  (OverseerCollectionConfigSetProcessor-96516265690464260-127.0.0.1:40652_av_%2Fsd-n_0000000000) [n:127.0.0.1:40652_av_%2Fsd    ] o.a.s.c.OverseerTaskProcessor Process current queue of overseer operations
   [junit4]   2> 1420836 INFO  (OverseerStateUpdate-96516265690464260-127.0.0.1:40652_av_%2Fsd-n_0000000000) [n:127.0.0.1:40652_av_%2Fsd    ] o.a.s.c.Overseer Starting to work on the main queue
   [junit4]   2> 1420836 INFO  (TEST-LeaderFailoverAfterPartitionTest.test-seed#[CB039F029D7B694A]) [n:127.0.0.1:40652_av_%2Fsd    ] o.a.s.c.ZkController Register node as live in ZooKeeper:/live_nodes/127.0.0.1:40652_av_%2Fsd
   [junit4]   2> 1420836 INFO  (TEST-LeaderFailoverAfterPartitionTest.test-seed#[CB039F029D7B694A]) [n:127.0.0.1:40652_av_%2Fsd    ] o.a.s.c.c.SolrZkClient makePath: /live_nodes/127.0.0.1:40652_av_%2Fsd
   [junit4]   2> 1420836 INFO  (OverseerStateUpdate-96516265690464260-127.0.0.1:40652_av_%2Fsd-n_0000000000) [n:127.0.0.1:40652_av_%2Fsd    ] o.a.s.c.c.ZkStateReader Updated live nodes from ZooKeeper... (0) -> (0)
   [junit4]   2> 1420836 INFO  (zkCallback-2081-thread-1-processing-n:127.0.0.1:40652_av_%2Fsd) [n:127.0.0.1:40652_av_%2Fsd    ] o.a.s.c.c.ZkStateReader A live node change: [WatchedEvent state:SyncConnected type:NodeChildrenChanged path:/live_nodes], has occurred - updating... (live nodes size: [0])
   [junit4]   2> 1420836 INFO  (zkCallback-2081-thread-1-processing-n:127.0.0.1:40652_av_%2Fsd) [n:127.0.0.1:40652_av_%2Fsd    ] o.a.s.c.c.ZkStateReader Updated live nodes from ZooKeeper... (0) -> (1)
   [junit4]   2> 1420855 INFO  (TEST-LeaderFailoverAfterPartitionTest.test-seed#[CB039F029D7B694A]) [n:127.0.0.1:40652_av_%2Fsd    ] o.a.s.c.CoreContainer Security conf doesn't exist. Skipping setup for authorization module.
   [junit4]   2> 1420855 INFO  (TEST-LeaderFailoverAfterPartitionTest.test-seed#[CB039F029D7B694A]) [n:127.0.0.1:40652_av_%2Fsd    ] o.a.s.c.CoreContainer No authentication plugin used.
   [junit4]   2> 1420855 INFO  (TEST-LeaderFailoverAfterPartitionTest.test-seed#[CB039F029D7B694A]) [n:127.0.0.1:40652_av_%2Fsd    ] o.a.s.c.CorePropertiesLocator Looking for core definitions underneath /home/jenkins/workspace/Lucene-Solr-master-Linux/solr/build/solr-core/test/J0/temp/solr.cloud.LeaderFailoverAfterPartitionTest_CB039F029D7B694A-001/control-001/cores
   [junit4]   2> 1420856 INFO  (TEST-LeaderFailoverAfterPartitionTest.test-seed#[CB039F029D7B694A]) [n:127.0.0.1:40652_av_%2Fsd    ] o.a.s.c.CoreDescriptor Created CoreDescriptor: {name=collection1, config=solrconfig.xml, transient=false, schema=schema.xml, loadOnStartup=true, configSetProperties=configsetprops.json, collection=control_collection, coreNodeName=, dataDir=data/, shard=}
   [junit4]   2> 1420856 INFO  (TEST-LeaderFailoverAfterPartitionTest.test-seed#[CB039F029D7B694A]) [n:127.0.0.1:40652_av_%2Fsd    ] o.a.s.c.CorePropertiesLocator Found core collection1 in /home/jenkins/workspace/Lucene-Solr-master-Linux/solr/build/solr-core/test/J0/temp/solr.cloud.LeaderFailoverAfterPartitionTest_CB039F029D7B694A-001/control-001/cores/collection1
   [junit4]   2> 1420856 INFO  (TEST-LeaderFailoverAfterPartitionTest.test-seed#[CB039F029D7B694A]) [n:127.0.0.1:40652_av_%2Fsd    ] o.a.s.c.CorePropertiesLocator Found 1 core definitions
   [junit4]   2> 1420856 INFO  (coreLoadExecutor-5592-thread-1-processing-n:127.0.0.1:40652_av_%2Fsd) [n:127.0.0.1:40652_av_%2Fsd c:control_collection   x:collection1] o.a.s.c.ZkController publishing state=down
   [junit4]   2> 1420857 INFO  (coreLoadExecutor-5592-thread-1-processing-n:127.0.0.1:40652_av_%2Fsd) [n:127.0.0.1:40652_av_%2Fsd c:control_collection   x:collection1] o.a.s.c.ZkController numShards not found on descriptor - reading it from system property
   [junit4]   2> 1420857 INFO  (TEST-LeaderFailoverAfterPartitionTest.test-seed#[CB039F029D7B694A]) [n:127.0.0.1:40652_av_%2Fsd    ] o.a.s.s.SolrDispatchFilter user.dir=/home/jenkins/workspace/Lucene-Solr-master-Linux/solr/build/solr-core/test/J0
   [junit4]   2> 1420857 INFO  (TEST-LeaderFailoverAfterPartitionTest.test-seed#[CB039F029D7B694A]) [n:127.0.0.1:40652_av_%2Fsd    ] o.a.s.s.SolrDispatchFilter SolrDispatchFilter.init() done
   [junit4]   2> 1420857 INFO  (coreLoadExecutor-5592-thread-1-processing-n:127.0.0.1:40652_av_%2Fsd) [n:127.0.0.1:40652_av_%2Fsd c:control_collection   x:collection1] o.a.s.c.ZkController Collection control_collection not visible yet, but flagging it so a watch is registered when it becomes visible
   [junit4]   2> 1420857 INFO  (OverseerStateUpdate-96516265690464260-127.0.0.1:40652_av_%2Fsd-n_0000000000) [n:127.0.0.1:40652_av_%2Fsd    ] o.a.s.c.Overseer processMessage: queueSize: 1, message = {
   [junit4]   2>   "core":"collection1",
   [junit4]   2>   "roles":null,
   [junit4]   2>   "base_url":"http://127.0.0.1:40652/av_/sd",
   [junit4]   2>   "node_name":"127.0.0.1:40652_av_%2Fsd",
   [junit4]   2>   "numShards":"1",
   [junit4]   2>   "state":"down",
   [junit4]   2>   "shard":null,
   [junit4]   2>   "collection":"control_collection",
   [junit4]   2>   "operation":"state"} current state version: 0
   [junit4]   2> 1420857 INFO  (coreLoadExecutor-5592-thread-1-processing-n:127.0.0.1:40652_av_%2Fsd) [n:127.0.0.1:40652_av_%2Fsd c:control_collection   x:collection1] o.a.s.c.c.ZkStateReader Deleting data for [control_collection]
   [junit4]   2> 1420857 INFO  (OverseerStateUpdate-96516265690464260-127.0.0.1:40652_av_%2Fsd-n_0000000000) [n:127.0.0.1:40652_av_%2Fsd    ] o.a.s.c.o.ReplicaMutator Update state numShards=1 message={
   [junit4]   2>   "core":"collection1",
   [junit4]   2>   "roles":null,
   [junit4]   2>   "base_url":"http://127.0.0.1:40652/av_/sd",
   [junit4]   2>   "node_name":"127.0.0.1:40652_av_%2Fsd",
   [junit4]   2>   "numShards":"1",
   [junit4]   2>   "state":"down",
   [junit4]   2>   "shard":null,
   [junit4]   2>   "collection":"control_collection",
   [junit4]   2>   "operation":"state"}
   [junit4]   2> 1420857 INFO  (OverseerStateUpdate-96516265690464260-127.0.0.1:40652_av_%2Fsd-n_0000000000) [n:127.0.0.1:40652_av_%2Fsd    ] o.a.s.c.o.ClusterStateMutator building a new cName: control_collection
   [junit4]   2> 1420858 INFO  (OverseerStateUpdate-96516265690464260-127.0.0.1:40652_av_%2Fsd-n_0000000000) [n:127.0.0.1:40652_av_%2Fsd    ] o.a.s.c.o.ReplicaMutator Assigning new node to shard shard=shard1
   [junit4]   2> 1420858 INFO  (coreLoadExecutor-5592-thread-1-processing-n:127.0.0.1:40652_av_%2Fsd) [n:127.0.0.1:40652_av_%2Fsd c:control_collection   x:collection1] o.a.s.c.ZkController look for our core node name
   [junit4]   2> 1420858 INFO  (zkCallback-2081-thread-1-processing-n:127.0.0.1:40652_av_%2Fsd) [n:127.0.0.1:40652_av_%2Fsd    ] o.a.s.c.c.ZkStateReader A cluster state change: [WatchedEvent state:SyncConnected type:NodeDataChanged path:/clusterstate.json], has occurred - updating... (live nodes size: [1])
   [junit4]   2> 1421858 INFO  (coreLoadExecutor-5592-thread-1-processing-n:127.0.0.1:40652_av_%2Fsd) [n:127.0.0.1:40652_av_%2Fsd c:control_collection   x:collection1] o.a.s.c.ZkController waiting to find shard id in clusterstate for collection1
   [junit4]   2> 1421858 INFO  (coreLoadExecutor-5592-thread-1-processing-n:127.0.0.1:40652_av_%2Fsd) [n:127.0.0.1:40652_av_%2Fsd c:control_collection   x:collection1] o.a.s.c.ZkController Check for collection zkNode:control_collection
   [junit4]   2> 1421858 INFO  (coreLoadExecutor-5592-thread-1-processing-n:127.0.0.1:40652_av_%2Fsd) [n:127.0.0.1:40652_av_%2Fsd c:control_collection   x:collection1] o.a.s.c.ZkController Collection zkNode exists
   [junit4]   2> 1421858 INFO  (coreLoadExecutor-5592-thread-1-processing-n:127.0.0.1:40652_av_%2Fsd) [n:127.0.0.1:40652_av_%2Fsd c:control_collection   x:collection1] o.a.s.c.c.ZkStateReader Load collection config from: [/collections/control_collection]
   [junit4]   2> 1421859 INFO  (coreLoadExecutor-5592-thread-1-processing-n:127.0.0.1:40652_av_%2Fsd) [n:127.0.0.1:40652_av_%2Fsd c:control_collection   x:collection1] o.a.s.c.c.ZkStateReader path=[/collections/control_collection] [configName]=[conf1] specified config exists in ZooKeeper
   [junit4]   2> 1421859 INFO  (coreLoadExecutor-5592-thread-1-processing-n:127.0.0.1:40652_av_%2Fsd) [n:127.0.0.1:40652_av_%2Fsd c:control_collection   x:collection1] o.a.s.c.SolrResourceLoader new SolrResourceLoader for directory: '/home/jenkins/workspace/Lucene-Solr-master-Linux/solr/build/solr-core/test/J0/temp/solr.cloud.LeaderFailoverAfterPartitionTest_CB039F029D7B694A-001/control-001/cores/collection1'
   [junit4]   2> 1421859 INFO  (coreLoadExecutor-5592-thread-1-processing-n:127.0.0.1:40652_av_%2Fsd) [n:127.0.0.1:40652_av_%2Fsd c:control_collection   x:collection1] o.a.s.c.SolrResourceLoader JNDI not configured for solr (NoInitialContextEx)
   [junit4]   2> 1421859 INFO  (coreLoadExecutor-5592-thread-1-processing-n:127.0.0.1:40652_av_%2Fsd) [n:127.0.0.1:40652_av_%2Fsd c:control_collection   x:collection1] o.a.s.c.SolrResourceLoader solr home defaulted to 'solr/' (could not find system property or JNDI)
   [junit4]   2> 1421860 INFO  (coreLoadExecutor-5592-thread-1-processing-n:127.0.0.1:40652_av_%2Fsd) [n:127.0.0.1:40652_av_%2Fsd c:control_collection   x:collection1] o.a.s.c.Config loaded config solrconfig.xml with version 0 
   [junit4]   2> 1421863 INFO  (coreLoadExecutor-5592-thread-1-processing-n:127.0.0.1:40652_av_%2Fsd) [n:127.0.0.1:40652_av_%2Fsd c:control_collection   x:collection1] o.a.s.c.SolrConfig current version of requestparams : -1
   [junit4]   2> 1421865 WARN  (coreLoadExecutor-5592-thread-1-processing-n:127.0.0.1:40652_av_%2Fsd) [n:127.0.0.1:40652_av_%2Fsd c:control_collection   x:collection1] o.a.s.c.Config Beginning with Solr 5.5, <mergePolicy> is deprecated, use <mergePolicyFactory> instead.
   [junit4]   2> 1421866 INFO  (coreLoadExecutor-5592-thread-1-processing-n:127.0.0.1:40652_av_%2Fsd) [n:127.0.0.1:40652_av_%2Fsd c:control_collection   x:collection1] o.a.s.c.SolrConfig Using Lucene MatchVersion: 7.0.0
   [junit4]   2> 1421872 INFO  (coreLoadExecutor-5592-thread-1-processing-n:127.0.0.1:40652_av_%2Fsd) [n:127.0.0.1:40652_av_%2Fsd c:control_collection   x:collection1] o.a.s.c.SolrConfig Loaded SolrConfig: solrconfig.xml
   [junit4]   2> 1421876 INFO  (coreLoadExecutor-5592-thread-1-processing-n:127.0.0.1:40652_av_%2Fsd) [n:127.0.0.1:40652_av_%2Fsd c:control_collection   x:collection1] o.a.s.s.IndexSchema [collection1] Schema name=test
   [junit4]   2> 1421945 INFO  (coreLoadExecutor-5592-thread-1-processing-n:127.0.0.1:40652_av_%2Fsd) [n:127.0.0.1:40652_av_%2Fsd c:control_collection   x:collection1] o.a.s.s.OpenExchangeRatesOrgProvider Initialized with rates=open-exchange-rates.json, refreshInterval=1440.
   [junit4]   2> 1421949 INFO  (coreLoadExecutor-5592-thread-1-processing-n:127.0.0.1:40652_av_%2Fsd) [n:127.0.0.1:40652_av_%2Fsd c:control_collection   x:collection1] o.a.s.s.IndexSchema default search field in schema is text
   [junit4]   2> 1421949 INFO  (coreLoadExecutor-5592-thread-1-processing-n:127.0.0.1:40652_av_%2Fsd) [n:127.0.0.1:40652_av_%2Fsd c:control_collection   x:collection1] o.a.s.s.IndexSchema unique key field: id
   [junit4]   2> 1421953 INFO  (coreLoadExecutor-5592-thread-1-processing-n:127.0.0.1:40652_av_%2Fsd) [n:127.0.0.1:40652_av_%2Fsd c:control_collection   x:collection1] o.a.s.s.FileExchangeRateProvider Reloading exchange rates from file currency.xml
   [junit4]   2> 1421954 INFO  (coreLoadExecutor-5592-thread-1-processing-n:127.0.0.1:40652_av_%2Fsd) [n:127.0.0.1:40652_av_%2Fsd c:control_collection   x:collection1] o.a.s.s.FileExchangeRateProvider Reloading exchange rates from file currency.xml
   [junit4]   2> 1421955 INFO  (coreLoadExecutor-5592-thread-1-processing-n:127.0.0.1:40652_av_%2Fsd) [n:127.0.0.1:40652_av_%2Fsd c:control_collection   x:collection1] o.a.s.s.OpenExchangeRatesOrgProvider Reloading exchange rates from open-exchange-rates.json
   [junit4]   2> 1421955 INFO  (coreLoadExecutor-5592-thread-1-processing-n:127.0.0.1:40652_av_%2Fsd) [n:127.0.0.1:40652_av_%2Fsd c:control_collection   x:collection1] o.a.s.s.OpenExchangeRatesOrgProvider Reloading exchange rates from open-exchange-rates.json
   [junit4]   2> 1421957 INFO  (coreLoadExecutor-5592-thread-1-processing-n:127.0.0.1:40652_av_%2Fsd) [n:127.0.0.1:40652_av_%2Fsd c:control_collection   x:collection1] o.a.s.c.ConfigSetProperties Did not find ConfigSet properties, assuming default properties: Can't find resource 'configsetprops.json' in classpath or '/configs/conf1', cwd=/home/jenkins/workspace/Lucene-Solr-master-Linux/solr/build/solr-core/test/J0
   [junit4]   2> 1421957 INFO  (coreLoadExecutor-5592-thread-1-processing-n:127.0.0.1:40652_av_%2Fsd) [n:127.0.0.1:40652_av_%2Fsd c:control_collection   x:collection1] o.a.s.c.CoreContainer Creating SolrCore 'collection1' using configuration from collection control_collection
   [junit4]   2> 1421957 INFO  (coreLoadExecutor-5592-thread-1-processing-n:127.0.0.1:40652_av_%2Fsd) [n:127.0.0.1:40652_av_%2Fsd c:control_collection s:shard1 r:core_node1 x:collection1] o.a.s.c.SolrCore org.apache.solr.core.MockDirectoryFactory
   [junit4]   2> 1421957 INFO  (coreLoadExecutor-5592-thread-1-processing-n:127.0.0.1:40652_av_%2Fsd) [n:127.0.0.1:40652_av_%2Fsd c:control_collection s:shard1 r:core_node1 x:collection1] o.a.s.c.SolrCore [[collection1] ] Opening new SolrCore at [/home/jenkins/workspace/Lucene-Solr-master-Linux/solr/build/solr-core/test/J0/temp/solr.cloud.LeaderFailoverAfterPartitionTest_CB039F029D7B694A-001/control-001/cores/collection1], dataDir=[/home/jenkins/workspace/Lucene-Solr-master-Linux/solr/build/solr-core/test/J0/temp/solr.cloud.LeaderFailoverAfterPartitionTest_CB039F029D7B694A-001/control-001/cores/collection1/data/]
   [junit4]   2> 1421957 INFO  (coreLoadExecutor-5592-thread-1-processing-n:127.0.0.1:40652_av_%2Fsd) [n:127.0.0.1:40652_av_%2Fsd c:control_collection s:shard1 r:core_node1 x:collection1] o.a.s.c.JmxMonitoredMap JMX monitoring is enabled. Adding Solr mbeans to JMX Server: com.sun.jmx.mbeanserver.JmxMBeanServer@1ba3f79
   [junit4]   2> 1421958 INFO  (coreLoadExecutor-5592-thread-1-processing-n:127.0.0.1:40652_av_%2Fsd) [n:127.0.0.1:40652_av_%2Fsd c:control_collection s:shard1 r:core_node1 x:collection1] o.a.s.c.CachingDirectoryFactory return new directory for /home/jenkins/workspace/Lucene-Solr-master-Linux/solr/build/solr-core/test/J0/temp/solr.cloud.LeaderFailoverAfterPartitionTest_CB039F029D7B694A-001/control-001/cores/collection1/data/snapshot_metadata
   [junit4]   2> 1421958 INFO  (coreLoadExecutor-5592-thread-1-processing-n:127.0.0.1:40652_av_%2Fsd) [n:127.0.0.1:40652_av_%2Fsd c:control_collection s:shard1 r:core_node1 x:collection1] o.a.s.c.s.SolrSnapshotMetaDataManager Loading from snapshot metadata file...
   [junit4]   2> 1421958 INFO  (coreLoadExecutor-5592-thread-1-processing-n:127.0.0.1:40652_av_%2Fsd) [n:127.0.0.1:40652_av_%2Fsd c:control_collection s:shard1 r:core_node1 x:collection1] o.a.s.c.CachingDirectoryFactory return new directory for /home/jenkins/workspace/Lucene-Solr-master-Linux/solr/build/solr-core/test/J0/temp/solr.cloud.LeaderFailoverAfterPartitionTest_CB039F029D7B694A-001/control-001/cores/collection1/data
   [junit4]   2> 1421958 INFO  (coreLoadExecutor-5592-thread-1-processing-n:127.0.0.1:40652_av_%2Fsd) [n:127.0.0.1:40652_av_%2Fsd c:control_collection s:shard1 r:core_node1 x:collection1] o.a.s.c.SolrCore New index directory detected: old=null new=/home/jenkins/workspace/Lucene-Solr-master-Linux/solr/build/solr-core/test/J0/temp/solr.cloud.LeaderFailoverAfterPartitionTest_CB039F029D7B694A-001/control-001/cores/collection1/data/index/
   [junit4]   2> 1421958 WARN  (coreLoadExecutor-5592-thread-1-processing-n:127.0.0.1:40652_av_%2Fsd) [n:127.0.0.1:40652_av_%2Fsd c:control_collection s:shard1 r:core_node1 x:collection1] o.a.s.c.SolrCore [collection1] Solr index directory '/home/jenkins/workspace/Lucene-Solr-master-Linux/solr/build/solr-core/test/J0/temp/solr.cloud.LeaderFailoverAfterPartitionTest_CB039F029D7B694A-001/control-001/cores/collection1/data/index' doesn't exist. Creating new index...
   [junit4]   2> 1421958 INFO  (coreLoadExecutor-5592-thread-1-processing-n:127.0.0.1:40652_av_%2Fsd) [n:127.0.0.1:40652_av_%2Fsd c:control_collection s:shard1 r:core_node1 x:collection1] o.a.s.c.CachingDirectoryFactory return new directory for /home/jenkins/workspace/Lucene-Solr-master-Linux/solr/build/solr-core/test/J0/temp/solr.cloud.LeaderFailoverAfterPartitionTest_CB039F029D7B694A-001/control-001/cores/collection1/data/index
   [junit4]   2> 1421959 INFO  (coreLoadExecutor-5592-thread-1-processing-n:127.0.0.1:40652_av_%2Fsd) [n:127.0.0.1:40652_av_%2Fsd c:control_collection s:shard1 r:core_node1 x:collection1] o.a.s.u.RandomMergePolicy RandomMergePolicy wrapping class org.apache.lucene.index.TieredMergePolicy: [TieredMergePolicy: maxMergeAtOnce=23, maxMergeAtOnceExplicit=39, maxMergedSegmentMB=39.84765625, floorSegmentMB=0.3427734375, forceMergeDeletesPctAllowed=5.843637048207322, segmentsPerTier=36.0, maxCFSSegmentSizeMB=8.796093022207999E12, noCFSRatio=0.0
   [junit4]   2> 1421959 INFO  (coreLoadExecutor-5592-thread-1-processing-n:127.0.0.1:40652_av_%2Fsd) [n:127.0.0.1:40652_av_%2Fsd c:control_collection s:shard1 r:core_node1 x:collection1] o.a.s.c.SolrDeletionPolicy SolrDeletionPolicy.onCommit: commits: num=1
   [junit4]   2> 	commit{dir=MockDirectoryWrapper(RAMDirectory@210a28 lockFactory=org.apache.lucene.store.SingleInstanceLockFactory@702199),segFN=segments_1,generation=1}
   [junit4]   2> 1421959 INFO  (coreLoadExecutor-5592-thread-1-processing-n:127.0.0.1:40652_av_%2Fsd) [n:127.0.0.1:40652_av_%2Fsd c:control_collection s:shard1 r:core_node1 x:collection1] o.a.s.c.SolrDeletionPolicy newest commit generation = 1
   [junit4]   2> 1421959 INFO  (OldIndexDirectoryCleanupThreadForCore-collection1) [n:127.0.0.1:40652_av_%2Fsd c:control_collection s:shard1 r:core_node1 x:collection1] o.a.s.c.SolrCore Looking for old index directories to cleanup for core collection1 in /home/jenkins/workspace/Lucene-Solr-master-Linux/solr/build/solr-core/test/J0/temp/solr.cloud.LeaderFailoverAfterPartitionTest_CB039F029D7B694A-001/control-001/cores/collection1/data/
   [junit4]   2> 1421959 WARN  (OldIndexDirectoryCleanupThreadForCore-collection1) [n:127.0.0.1:40652_av_%2Fsd c:control_collection s:shard1 r:core_node1 x:collection1] o.a.s.c.DirectoryFactory /home/jenkins/workspace/Lucene-Solr-master-Linux/solr/build/solr-core/test/J0/temp/solr.cloud.LeaderFailoverAfterPartitionTest_CB039F029D7B694A-001/control-001/cores/collection1/data/ does not point to a valid data directory; skipping clean-up of old index directories.
   [junit4]   2> 1421961 INFO  (coreLoadExecutor-5592-thread-1-processing-n:127.0.0.1:40652_av_%2Fsd) [n:127.0.0.1:40652_av_%2Fsd c:control_collection s:shard1 r:core_node1 x:collection1] o.a.s.u.p.UpdateRequestProcessorChain creating updateRequestProcessorChain "nodistrib"
   [junit4]   2> 1421961 INFO  (coreLoadExecutor-5592-thread-1-processing-n:127.0.0.1:40652_av_%2Fsd) [n:127.0.0.1:40652_av_%2Fsd c:control_collection s:shard1 r:core_node1 x:collection1] o.a.s.u.p.UpdateRequestProcessorChain creating updateRequestProcessorChain "dedupe"
   [junit4]   2> 1421961 INFO  (coreLoadExecutor-5592-thread-1-processing-n:127.0.0.1:40652_av_%2Fsd) [n:127.0.0.1:40652_av_%2Fsd c:control_collection s:shard1 r:core_node1 x:collection1] o.a.s.u.p.UpdateRequestProcessorChain inserting DistributedUpdateProcessorFactory into updateRequestProcessorChain "dedupe"
   [junit4]   2> 1421961 INFO  (coreLoadExecutor-5592-thread-1-processing-n:127.0.0.1:40652_av_%2Fsd) [n:127.0.0.1:40652_av_%2Fsd c:control_collection s:shard1 r:core_node1 x:collection1] o.a.s.u.p.UpdateRequestProcessorChain creating updateRequestProcessorChain "stored_sig"
   [junit4]   2> 1421961 INFO  (coreLoadExecutor-5592-thread-1-processing-n:127.0.0.1:40652_av_%2Fsd) [n:127.0.0.1:40652_av_%2Fsd c:control_collection s:shard1 r:core_node1 x:collection1] o.a.s.u.p.UpdateRequestProcessorChain inserting DistributedUpdateProcessorFactory into updateRequestProcessorChain "stored_sig"
   [junit4]   2> 1421961 INFO  (coreLoadExecutor-5592-thread-1-processing-n:127.0.0.1:40652_av_%2Fsd) [n:127.0.0.1:40652_av_%2Fsd c:control_collection s:shard1 r:core_node1 x:collection1] o.a.s.u.p.UpdateRequestProcessorChain creating updateRequestProcessorChain "distrib-dup-test-chain-explicit"
   [junit4]   2> 1421961 INFO  (coreLoadExecutor-5592-thread-1-processing-n:127.0.0.1:40652_av_%2Fsd) [n:127.0.0.1:40652_av_%2Fsd c:control_collection s:shard1 r:core_node1 x:collection1] o.a.s.u.p.UpdateRequestProcessorChain creating updateRequestProcessorChain "distrib-dup-test-chain-implicit"
   [junit4]   2> 1421962 INFO  (coreLoadExecutor-5592-thread-1-processing-n:127.0.0.1:40652_av_%2Fsd) [n:127.0.0.1:40652_av_%2Fsd c:control_collection s:shard1 r:core_node1 x:collection1] o.a.s.u.p.UpdateRequestProcessorChain inserting DistributedUpdateProcessorFactory into updateRequestProcessorChain "distrib-dup-test-chain-implicit"
   [junit4]   2> 1421962 INFO  (coreLoadExecutor-5592-thread-1-processing-n:127.0.0.1:40652_av_%2Fsd) [n:127.0.0.1:40652_av_%2Fsd c:control_collection s:shard1 r:core_node1 x:collection1] o.a.s.c.SolrCore no updateRequestProcessorChain defined as default, creating implicit default
   [junit4]   2> 1421962 WARN  (coreLoadExecutor-5592-thread-1-processing-n:127.0.0.1:40652_av_%2Fsd) [n:127.0.0.1:40652_av_%2Fsd c:control_collection s:shard1 r:core_node1 x:collection1] o.a.s.c.RequestHandlers INVALID paramSet a in requestHandler {type = requestHandler,name = /dump,class = DumpRequestHandler,args = {defaults={a=A,b=B}}}
   [junit4]   2> 1421963 INFO  (coreLoadExecutor-5592-thread-1-processing-n:127.0.0.1:40652_av_%2Fsd) [n:127.0.0.1:40652_av_%2Fsd c:control_collection s:shard1 r:core_node1 x:collection1] o.a.s.h.l.XMLLoader xsltCacheLifetimeSeconds=60
   [junit4]   2> 1421963 INFO  (coreLoadExecutor-5592-thread-1-processing-n:127.0.0.1:40652_av_%2Fsd) [n:127.0.0.1:40652_av_%2Fsd c:control_collection s:shard1 r:core_node1 x:collection1] o.a.s.h.l.XMLLoader xsltCacheLifetimeSeconds=60
   [junit4]   2> 1421964 INFO  (coreLoadExecutor-5592-thread-1-processing-n:127.0.0.1:40652_av_%2Fsd) [n:127.0.0.1:40652_av_%2Fsd c:control_collection s:shard1 r:core_node1 x:collection1] o.a.s.h.l.XMLLoader xsltCacheLifetimeSeconds=60
   [junit4]   2> 1421964 INFO  (coreLoadExecutor-5592-thread-1-processing-n:127.0.0.1:40652_av_%2Fsd) [n:127.0.0.1:40652_av_%2Fsd c:control_collection s:shard1 r:core_node1 x:collection1] o.a.s.h.l.XMLLoader xsltCacheLifetimeSeconds=60
   [junit4]   2> 1421966 INFO  (coreLoadExecutor-5592-thread-1-processing-n:127.0.0.1:40652_av_%2Fsd) [n:127.0.0.1:40652_av_%2Fsd c:control_collection s:shard1 r:core_node1 x:collection1] o.a.s.c.RequestHandlers Registered paths: /admin/mbeans,standard,/update/json/docs,/admin/luke,/export,/get,/admin/properties,/update/json,/admin/threads,/dump,/update/csv,/sql,/graph,/admin/segments,/admin/system,/replication,/config,/stream,/schema,/admin/plugins,/admin/logging,/admin/ping,/update,/admin/file,/terms
   [junit4]   2> 1421966 INFO  (coreLoadExecutor-5592-thread-1-processing-n:127.0.0.1:40652_av_%2Fsd) [n:127.0.0.1:40652_av_%2Fsd c:control_collection s:shard1 r:core_node1 x:collection1] o.a.s.c.SolrCore Using default statsCache cache: org.apache.solr.search.stats.LocalStatsCache
   [junit4]   2> 1421966 INFO  (coreLoadExecutor-5592-thread-1-processing-n:127.0.0.1:40652_av_%2Fsd) [n:127.0.0.1:40652_av_%2Fsd c:control_collection s:shard1 r:core_node1 x:collection1] o.a.s.u.UpdateHandler Using UpdateLog implementation: org.apache.solr.update.UpdateLog
   [junit4]   2> 1421966 INFO  (coreLoadExecutor-5592-thread-1-processing-n:127.0.0.1:40652_av_%2Fsd) [n:127.0.0.1:40652_av_%2Fsd c:control_collection s:shard1 r:core_node1 x:collection1] o.a.s.u.UpdateLog Initializing UpdateLog: dataDir= defaultSyncLevel=FLUSH numRecordsToKeep=100 maxNumLogsToKeep=10 numVersionBuckets=65536
   [junit4]   2> 1421967 INFO  (coreLoadExecutor-5592-thread-1-processing-n:127.0.0.1:40652_av_%2Fsd) [n:127.0.0.1:40652_av_%2Fsd c:control_collection s:shard1 r:core_node1 x:collection1] o.a.s.u.CommitTracker Hard AutoCommit: disabled
   [junit4]   2> 1421967 INFO  (coreLoadExecutor-5592-thread-1-processing-n:127.0.0.1:40652_av_%2Fsd) [n:127.0.0.1:40652_av_%2Fsd c:control_collection s:shard1 r:core_node1 x:collection1] o.a.s.u.CommitTracker Soft AutoCommit: disabled
   [junit4]   2> 1421967 INFO  (coreLoadExecutor-5592-thread-1-processing-n:127.0.0.1:40652_av_%2Fsd) [n:127.0.0.1:40652_av_%2Fsd c:control_collection s:shard1 r:core_node1 x:collection1] o.a.s.u.RandomMergePolicy RandomMergePolicy wrapping class org.apache.lucene.index.TieredMergePolicy: [TieredMergePolicy: maxMergeAtOnce=19, maxMergeAtOnceExplicit=36, maxMergedSegmentMB=43.43359375, floorSegmentMB=1.6279296875, forceMergeDeletesPctAllowed=27.692793894147208, segmentsPerTier=45.0, maxCFSSegmentSizeMB=8.796093022207999E12, noCFSRatio=0.1952826814839603
   [junit4]   2> 1421967 INFO  (coreLoadExecutor-5592-thread-1-processing-n:127.0.0.1:40652_av_%2Fsd) [n:127.0.0.1:40652_av_%2Fsd c:control_collection s:shard1 r:core_node1 x:collection1] o.a.s.c.SolrDeletionPolicy SolrDeletionPolicy.onInit: commits: num=1
   [junit4]   2> 	commit{dir=MockDirectoryWrapper(RAMDirectory@210a28 lockFactory=org.apache.lucene.store.SingleInstanceLockFactory@702199),segFN=segments_1,generation=1}
   [junit4]   2> 1421967 INFO  (coreLoadExecutor-5592-thread-1-processing-n:127.0.0.1:40652_av_%2Fsd) [n:127.0.0.1:40652_av_%2Fsd c:control_collection s:shard1 r:core_node1 x:collection1] o.a.s.c.SolrDeletionPolicy newest commit generation = 1
   [junit4]   2> 1421967 INFO  (coreLoadExecutor-5592-thread-1-processing-n:127.0.0.1:40652_av_%2Fsd) [n:127.0.0.1:40652_av_%2Fsd c:control_collection s:shard1 r:core_node1 x:collection1] o.a.s.s.SolrIndexSearcher Opening [Searcher@185d88e[collection1] main]
   [junit4]   2> 1421967 INFO  (coreLoadExecutor-5592-thread-1-processing-n:127.0.0.1:40652_av_%2Fsd) [n:127.0.0.1:40652_av_%2Fsd c:control_collection s:shard1 r:core_node1 x:collection1] o.a.s.c.c.ZkStateReader Load collection config from: [/collections/control_collection]
   [junit4]   2> 1421968 INFO  (coreLoadExecutor-5592-thread-1-processing-n:127.0.0.1:40652_av_%2Fsd) [n:127.0.0.1:40652_av_%2Fsd c:control_collection s:shard1 r:core_node1 x:collection1] o.a.s.c.c.ZkStateReader path=[/collections/control_collection] [configName]=[conf1] specified config exists in ZooKeeper
   [junit4]   2> 1421968 INFO  (coreLoadExecutor-5592-thread-1-processing-n:127.0.0.1:40652_av_%2Fsd) [n:127.0.0.1:40652_av_%2Fsd c:control_collection s:shard1 r:core_node1 x:collection1] o.a.s.r.ManagedResourceStorage Setting up ZooKeeper-based storage for the RestManager with znodeBase: /configs/conf1
   [junit4]   2> 1421968 INFO  (coreLoadExecutor-5592-thread-1-processing-n:127.0.0.1:40652_av_%2Fsd) [n:127.0.0.1:40652_av_%2Fsd c:control_collection s:shard1 r:core_node1 x:collection1] o.a.s.r.ManagedResourceStorage Configured ZooKeeperStorageIO with znodeBase: /configs/conf1
   [junit4]   2> 1421968 INFO  (coreLoadExecutor-5592-thread-1-processing-n:127.0.0.1:40652_av_%2Fsd) [n:127.0.0.1:40652_av_%2Fsd c:control_collection s:shard1 r:core_node1 x:collection1] o.a.s.r.RestManager Initializing RestManager with initArgs: {}
   [junit4]   2> 1421968 INFO  (coreLoadExecutor-5592-thread-1-processing-n:127.0.0.1:40652_av_%2Fsd) [n:127.0.0.1:40652_av_%2Fsd c:control_collection s:shard1 r:core_node1 x:collection1] o.a.s.r.ManagedResourceStorage Reading _rest_managed.json using ZooKeeperStorageIO:path=/configs/conf1
   [junit4]   2> 1421968 INFO  (coreLoadExecutor-5592-thread-1-processing-n:127.0.0.1:40652_av_%2Fsd) [n:127.0.0.1:40652_av_%2Fsd c:control_collection s:shard1 r:core_node1 x:collection1] o.a.s.r.ManagedResourceStorage No data found for znode /configs/conf1/_rest_managed.json
   [junit4]   2> 1421968 INFO  (coreLoadExecutor-5592-thread-1-processing-n:127.0.0.1:40652_av_%2Fsd) [n:127.0.0.1:40652_av_%2Fsd c:control_collection s:shard1 r:core_node1 x:collection1] o.a.s.r.ManagedResourceStorage Loaded null at path _rest_managed.json using ZooKeeperStorageIO:path=/configs/conf1
   [junit4]   2> 1421968 INFO  (coreLoadExecutor-5592-thread-1-processing-n:127.0.0.1:40652_av_%2Fsd) [n:127.0.0.1:40652_av_%2Fsd c:control_collection s:shard1 r:core_node1 x:collection1] o.a.s.r.RestManager Initializing 0 registered ManagedResources
   [junit4]   2> 1421968 INFO  (coreLoadExecutor-5592-thread-1-processing-n:127.0.0.1:40652_av_%2Fsd) [n:127.0.0.1:40652_av_%2Fsd c:control_collection s:shard1 r:core_node1 x:collection1] o.a.s.h.ReplicationHandler Commits will be reserved for  10000
   [junit4]   2> 1421969 INFO  (searcherExecutor-5593-thread-1-processing-n:127.0.0.1:40652_av_%2Fsd x:collection1 s:shard1 c:control_collection r:core_node1) [n:127.0.0.1:40652_av_%2Fsd c:control_collection s:shard1 r:core_node1 x:collection1] o.a.s.c.SolrCore [collection1] Registered new searcher Searcher@185d88e[collection1] main{ExitableDirectoryReader(UninvertingDirectoryReader())}
   [junit4]   2> 1421969 INFO  (coreLoadExecutor-5592-thread-1-processing-n:127.0.0.1:40652_av_%2Fsd) [n:127.0.0.1:40652_av_%2Fsd c:control_collection s:shard1 r:core_node1 x:collection1] o.a.s.u.UpdateLog Looking up max value of version field to seed version buckets
   [junit4]   2> 1421969 INFO  (coreLoadExecutor-5592-thread-1-processing-n:127.0.0.1:40652_av_%2Fsd) [n:127.0.0.1:40652_av_%2Fsd c:control_collection s:shard1 r:core_node1 x:collection1] o.a.s.u.VersionInfo Refreshing highest value of _version_ for 65536 version buckets from index
   [junit4]   2> 1421969 INFO  (coreLoadExecutor-5592-thread-1-processing-n:127.0.0.1:40652_av_%2Fsd) [n:127.0.0.1:40652_av_%2Fsd c:control_collection s:shard1 r:core_node1 x:collection1] o.a.s.u.VersionInfo No terms found for _version_, cannot seed version bucket highest value from index
   [junit4]   2> 1421969 INFO  (coreLoadExecutor-5592-thread-1-processing-n:127.0.0.1:40652_av_%2Fsd) [n:127.0.0.1:40652_av_%2Fsd c:control_collection s:shard1 r:core_node1 x:collection1] o.a.s.u.UpdateLog Could not find max version in index or recent updates, using new clock 1544260252446228480
   [junit4]   2> 1421971 INFO  (coreLoadExecutor-5592-thread-1-processing-n:127.0.0.1:40652_av_%2Fsd) [n:127.0.0.1:40652_av_%2Fsd c:control_collection s:shard1 r:core_node1 x:collection1] o.a.s.u.UpdateLog Took 1.0ms to seed version buckets with highest version 1544260252446228480
   [junit4]   2> 1421971 INFO  (coreLoadExecutor-5592-thread-1-processing-n:127.0.0.1:40652_av_%2Fsd) [n:127.0.0.1:40652_av_%2Fsd c:control_collection s:shard1 r:core_node1 x:collection1] o.a.s.c.ZkController watch zkdir /configs/conf1
   [junit4]   2> 1421971 INFO  (coreLoadExecutor-5592-thread-1-processing-n:127.0.0.1:40652_av_%2Fsd) [n:127.0.0.1:40652_av_%2Fsd c:control_collection s:shard1 r:core_node1 x:collection1] o.a.s.c.CoreContainer registering core: collection1
   [junit4]   2> 1421971 INFO  (coreZkRegister-5585-thread-1-processing-n:127.0.0.1:40652_av_%2Fsd x:collection1 s:shard1 c:control_collection r:core_node1) [n:127.0.0.1:40652_av_%2Fsd c:control_collection s:shard1 r:core_node1 x:collection1] o.a.s.c.ZkController Register replica - core:collection1 address:http://127.0.0.1:40652/av_/sd collection:control_collection shard:shard1
   [junit4]   2> 1421972 INFO  (coreZkRegister-5585-thread-1-processing-n:127.0.0.1:40652_av_%2Fsd x:collection1 s:shard1 c:control_collection r:core_node1) [n:127.0.0.1:40652_av_%2Fsd c:control_collection s:shard1 r:core_node1 x:collection1] o.a.s.c.c.SolrZkClient makePath: /collections/control_collection/leader_elect/shard1/election
   [junit4]   2> 1421972 INFO  (coreZkRegister-5585-thread-1-processing-n:127.0.0.1:40652_av_%2Fsd x:collection1 s:shard1 c:control_collection r:core_node1) [n:127.0.0.1:40652_av_%2Fsd c:control_collection s:shard1 r:core_node1 x:collection1] o.a.s.c.LeaderElector Joined leadership election with path: /collections/control_collection/leader_elect/shard1/election/96516265690464260-core_node1-n_0000000000
   [junit4]   2> 1421973 INFO  (coreZkRegister-5585-thread-1-processing-n:127.0.0.1:40652_av_%2Fsd x:collection1 s:shard1 c:control_collection r:core_node1) [n:127.0.0.1:40652_av_%2Fsd c:control_collection s:shard1 r:core_node1 x:collection1] o.a.s.c.ShardLeaderElectionContext Running the leader process for shard=shard1 and weAreReplacement=false and leaderVoteWait=10000
   [junit4]   2> 1421973 INFO  (coreZkRegister-5585-thread-1-processing-n:127.0.0.1:40652_av_%2Fsd x:collection1 s:shard1 c:control_collection r:core_node1) [n:127.0.0.1:40652_av_%2Fsd c:control_collection s:shard1 r:core_node1 x:collection1] o.a.s.c.ShardLeaderElectionContext Enough replicas found to continue.
   [junit4]   2> 1421973 INFO  (coreZkRegister-5585-thread-1-processing-n:127.0.0.1:40652_av_%2Fsd x:collection1 s:shard1 c:control_collection r:core_node1) [n:127.0.0.1:40652_av_%2Fsd c:control_collection s:shard1 r:core_node1 x:collection1] o.a.s.c.ShardLeaderElectionContext I may be the new leader - try and sync
   [junit4]   2> 1421973 INFO  (coreZkRegister-5585-thread-1-processing-n:127.0.0.1:40652_av_%2Fsd x:collection1 s:shard1 c:control_collection r:core_node1) [n:127.0.0.1:40652_av_%2Fsd c:control_collection s:shard1 r:core_node1 x:collection1] o.a.s.c.SyncStrategy Sync replicas to http://127.0.0.1:40652/av_/sd/collection1/
   [junit4]   2> 1421973 INFO  (OverseerStateUpdate-96516265690464260-127.0.0.1:40652_av_%2Fsd-n_0000000000) [n:127.0.0.1:40652_av_%2Fsd    ] o.a.s.c.Overseer processMessage: queueSize: 1, message = {
   [junit4]   2>   "operation":"leader",
   [junit4]   2>   "shard":"shard1",
   [junit4]   2>   "collection":"control_collection"} current state version: 1
   [junit4]   2> 1421973 INFO  (coreZkRegister-5585-thread-1-processing-n:127.0.0.1:40652_av_%2Fsd x:collection1 s:shard1 c:control_collection r:core_node1) [n:127.0.0.1:40652_av_%2Fsd c:control_collection s:shard1 r:core_node1 x:collection1] o.a.s.c.SyncStrategy Sync Success - now sync replicas to me
   [junit4]   2> 1421973 INFO  (coreZkRegister-5585-thread-1-processing-n:127.0.0.1:40652_av_%2Fsd x:collection1 s:shard1 c:control_collection r:core_node1) [n:127.0.0.1:40652_av_%2Fsd c:control_collection s:shard1 r:core_node1 x:collection1] o.a.s.c.SyncStrategy http://127.0.0.1:40652/av_/sd/collection1/ has no replicas
   [junit4]   2> 1421974 INFO  (coreZkRegister-5585-thread-1-processing-n:127.0.0.1:40652_av_%2Fsd x:collection1 s:shard1 c:control_collection r:core_node1) [n:127.0.0.1:40652_av_%2Fsd c:control_collection s:shard1 r:core_node1 x:collection1] o.a.s.c.c.SolrZkClient makePath: /collections/control_collection/leaders/shard1
   [junit4]   2> 1421974 INFO  (coreZkRegister-5585-thread-1-processing-n:127.0.0.1:40652_av_%2Fsd x:collection1 s:shard1 c:control_collection r:core_node1) [n:127.0.0.1:40652_av_%2Fsd c:control_collection s:shard1 r:core_node1 x:collection1] o.a.s.c.ShardLeaderElectionContextBase Creating leader registration node /collections/control_collection/leaders/shard1/leader after winning as /collections/control_collection/leader_elect/shard1/election/96516265690464260-core_node1-n_0000000000
   [junit4]   2> 1421975 INFO  (coreZkRegister-5585-thread-1-processing-n:127.0.0.1:40652_av_%2Fsd x:collection1 s:shard1 c:control_collection r:core_node1) [n:127.0.0.1:40652_av_%2Fsd c:control_collection s:shard1 r:core_node1 x:collection1] o.a.s.c.ShardLeaderElectionContext I am the new leader: http://127.0.0.1:40652/av_/sd/collection1/ shard1
   [junit4]   2> 1421975 INFO  (OverseerStateUpdate-96516265690464260-127.0.0.1:40652_av_%2Fsd-n_0000000000) [n:127.0.0.1:40652_av_%2Fsd    ] o.a.s.c.Overseer processMessage: queueSize: 1, message = {
   [junit4]   2>   "operation":"leader",
   [junit4]   2>   "shard":"shard1",
   [junit4]   2>   "collection":"control_collection",
   [junit4]   2>   "base_url":"http://127.0.0.1:40652/av_/sd",
   [junit4]   2>   "core":"collection1",
   [junit4]   2>   "state":"active"} current state version: 1
   [junit4]   2> 1422076 INFO  (zkCallback-2081-thread-1-processing-n:127.0.0.1:40652_av_%2Fsd) [n:127.0.0.1:40652_av_%2Fsd    ] o.a.s.c.c.ZkStateReader A cluster state change: [WatchedEvent state:SyncConnected type:NodeDataChanged path:/clusterstate.json], has occurred - updating... (live nodes size: [1])
   [junit4]   2> 1422125 INFO  (coreZkRegister-5585-thread-1-processing-n:127.0.0.1:40652_av_%2Fsd x:collection1 s:shard1 c:control_collection r:core_node1) [n:127.0.0.1:40652_av_%2Fsd c:control_collection s:shard1 r:core_node1 x:collection1] o.a.s.c.ZkController We are http://127.0.0.1:40652/av_/sd/collection1/ and leader is http://127.0.0.1:40652/av_/sd/collection1/
   [junit4]   2> 1422125 INFO  (coreZkRegister-5585-thread-1-processing-n:127.0.0.1:40652_av_%2Fsd x:collection1 s:shard1 c:control_collection r:core_node1) [n:127.0.0.1:40652_av_%2Fsd c:control_collection s:shard1 r:core_node1 x:collection1] o.a.s.c.ZkController No LogReplay needed for core=collection1 baseURL=http://127.0.0.1:40652/av_/sd
   [junit4]   2> 1422125 INFO  (coreZkRegister-5585-thread-1-processing-n:127.0.0.1:40652_av_%2Fsd x:collection1 s:shard1 c:control_collection r:core_node1) [n:127.0.0.1:40652_av_%2Fsd c:control_collection s:shard1 r:core_node1 x:collection1] o.a.s.c.ZkController I am the leader, no recovery necessary
   [junit4]   2> 1422125 INFO  (coreZkRegister-5585-thread-1-processing-n:127.0.0.1:40652_av_%2Fsd x:collection1 s:shard1 c:control_collection r:core_node1) [n:127.0.0.1:40652_av_%2Fsd c:control_collection s:shard1 r:core_node1 x:collection1] o.a.s.c.ZkController publishing state=active
   [junit4]   2> 1422125 INFO  (coreZkRegister-5585-thread-1-processing-n:127.0.0.1:40652_av_%2Fsd x:collection1 s:shard1 c:control_collection r:core_node1) [n:127.0.0.1:40652_av_%2Fsd c:control_collection s:shard1 r:core_node1 x:collection1] o.a.s.c.ZkController numShards not found on descriptor - reading it from system property
   [junit4]   2> 1422126 INFO  (coreZkRegister-5585-thread-1-processing-n:127.0.0.1:40652_av_%2Fsd x:collection1 s:shard1 c:control_collection r:core_node1) [n:127.0.0.1:40652_av_%2Fsd c:control_collection s:shard1 r:core_node1 x:collection1] o.a.s.c.c.ZkStateReader Checking legacy cluster state for collection control_collection
   [junit4]   2> 1422126 INFO  (OverseerStateUpdate-96516265690464260-127.0.0.1:40652_av_%2Fsd-n_0000000000) [n:127.0.0.1:40652_av_%2Fsd    ] o.a.s.c.Overseer processMessage: queueSize: 1, message = {
   [junit4]   2>   "core":"collection1",
   [junit4]   2>   "core_node_name":"core_node1",
   [junit4]   2>   "roles":null,
   [junit4]   2>   "base_url":"http://127.0.0.1:40652/av_/sd",
   [junit4]   2>   "node_name":"127.0.0.1:40652_av_%2Fsd",
   [junit4]   2>   "numShards":"1",
   [junit4]   2>   "state":"active",
   [junit4]   2>   "shard":"shard1",
   [junit4]   2>   "collection":"control_collection",
   [junit4]   2>   "operation":"state"} current state version: 2
   [junit4]   2> 1422126 INFO  (OverseerStateUpdate-96516265690464260-127.0.0.1:40652_av_%2Fsd-n_0000000000) [n:127.0.0.1:40652_av_%2Fsd    ] o.a.s.c.o.ReplicaMutator Update state numShards=1 message={
   [junit4]   2>   "core":"collection1",
   [junit4]   2>   "core_node_name":"core_node1",
   [junit4]   2>   "roles":null,
   [junit4]   2>   "base_url":"http://127.0.0.1:40652/av_/sd",
   [junit4]   2>   "node_name":"127.0.0.1:40652_av_%2Fsd",
   [junit4]   2>   "numShards":"1",
   [junit4]   2>   "state":"active",
   [junit4]   2>   "shard":"shard1",
   [junit4]   2>   "collection":"control_collection",
   [junit4]   2>   "operation":"state"}
   [junit4]   2> 1422227 INFO  (zkCallback-2081-thread-2-processing-n:127.0.0.1:40652_av_%2Fsd) [n:127.0.0.1:40652_av_%2Fsd    ] o.a.s.c.c.ZkStateReader A cluster state change: [WatchedEvent state:SyncConnected type:NodeDataChanged path:/clusterstate.json], has occurred - updating... (live nodes size: [1])
   [junit4]   2> 1422360 INFO  (TEST-LeaderFailoverAfterPartitionTest.test-seed#[CB039F029D7B694A]) [    ] o.a.s.c.c.SolrZkClient Using default ZkCredentialsProvider
   [junit4]   2> 1422360 INFO  (TEST-LeaderFailoverAfterPartitionTest.test-seed#[CB039F029D7B694A]) [    ] o.a.s.c.c.ConnectionManager Waiting for client to connect to ZooKeeper
   [junit4]   2> 1422361 INFO  (zkCallback-2085-thread-1) [    ] o.a.s.c.c.ConnectionManager Watcher org.apache.solr.common.cloud.ConnectionManager@1b35447 name:ZooKeeperConnection Watcher:127.0.0.1:38826/solr got event WatchedEvent state:SyncConnected type:None path:null path:null type:None
   [junit4]   2> 1422361 INFO  (TEST-LeaderFailoverAfterPartitionTest.test-seed#[CB039F029D7B694A]) [    ] o.a.s.c.c.ConnectionManager Client is connected to ZooKeeper
   [junit4]   2> 1422361 INFO  (TEST-LeaderFailoverAfterPartitionTest.test-seed#[CB039F029D7B694A]) [    ] o.a.s.c.c.SolrZkClient Using default ZkACLProvider
   [junit4]   2> 1422361 INFO  (TEST-LeaderFailoverAfterPartitionTest.test-seed#[CB039F029D7B694A]) [    ] o.a.s.c.c.ZkStateReader Updating cluster state from ZooKeeper... 
   [junit4]   2> 1422362 INFO  (TEST-LeaderFailoverAfterPartitionTest.test-seed#[CB039F029D7B694A]) [    ] o.a.s.c.c.ZkStateReader Loaded empty cluster properties
   [junit4]   2> 1422362 INFO  (TEST-LeaderFailoverAfterPartitionTest.test-seed#[CB039F029D7B694A]) [    ] o.a.s.c.c.ZkStateReader Updated live nodes from ZooKeeper... (0) -> (1)
   [junit4]   2> 1422362 INFO  (TEST-LeaderFailoverAfterPartitionTest.test-seed#[CB039F029D7B694A]) [    ] o.a.s.c.ChaosMonkey monkey: init - expire sessions:false cause connection loss:false
   [junit4]   2> 1422362 INFO  (TEST-LeaderFailoverAfterPartitionTest.test-seed#[CB039F029D7B694A]) [    ] o.a.s.c.AbstractFullDistribZkTestBase Creating collection1 with stateFormat=2
   [junit4]   2> 1422362 INFO  (TEST-LeaderFailoverAfterPartitionTest.test-seed#[CB039F029D7B694A]) [    ] o.a.s.c.c.SolrZkClient Using default ZkCredentialsProvider
   [junit4]   2> 1422363 INFO  (TEST-LeaderFailoverAfterPartitionTest.test-seed#[CB039F029D7B694A]) [    ] o.a.s.c.c.ConnectionManager Waiting for client to connect to ZooKeeper
   [junit4]   2> 1422363 INFO  (zkCallback-2086-thread-1) [    ] o.a.s.c.c.ConnectionManager Watcher org.apache.solr.common.cloud.ConnectionManager@eafb61 name:ZooKeeperConnection Watcher:127.0.0.1:38826/solr got event WatchedEvent state:SyncConnected type:None path:null path:null type:None
   [junit4]   2> 1422363 INFO  (TEST-LeaderFailoverAfterPartitionTest.test-seed#[CB039F029D7B694A]) [    ] o.a.s.c.c.ConnectionManager Client is connected to ZooKeeper
   [junit4]   2> 1422364 INFO  (TEST-LeaderFailoverAfterPartitionTest.test-seed#[CB039F029D7B694A]) [    ] o.a.s.c.c.SolrZkClient Using default ZkACLProvider
   [junit4]   2> 1422365 INFO  (OverseerStateUpdate-96516265690464260-127.0.0.1:40652_av_%2Fsd-n_0000000000) [n:127.0.0.1:40652_av_%2Fsd    ] o.a.s.c.Overseer processMessage: queueSize: 1, message = {
   [junit4]   2>   "operation":"create",
   [junit4]   2>   "name":"collection1",
   [junit4]   2>   "numShards":"2",
   [junit4]   2>   "stateFormat":"2"} current state version: 3
   [junit4]   2> 1422366 INFO  (OverseerStateUpdate-96516265690464260-127.0.0.1:40652_av_%2Fsd-n_0000000000) [n:127.0.0.1:40652_av_%2Fsd    ] o.a.s.c.o.ClusterStateMutator building a new cName: collection1
   [junit4]   2> 1422434 INFO  (TEST-LeaderFailoverAfterPartitionTest.test-seed#[CB039F029D7B694A]) [    ] o.a.s.SolrTestCaseJ4 Writing core.properties file to /home/jenkins/workspace/Lucene-Solr-master-Linux/solr/build/solr-core/test/J0/temp/solr.cloud.LeaderFailoverAfterPartitionTest_CB039F029D7B694A-001/shard-1-001/cores/collection1
   [junit4]   2> 1422435 INFO  (TEST-LeaderFailoverAfterPartitionTest.test-seed#[CB039F029D7B694A]) [    ] o.a.s.c.AbstractFullDistribZkTestBase create jetty 1 in directory /home/jenkins/workspace/Lucene-Solr-master-Linux/solr/build/solr-core/test/J0/temp/solr.cloud.LeaderFailoverAfterPartitionTest_CB039F029D7B694A-001/shard-1-001
   [junit4]   2> 1422435 INFO  (TEST-LeaderFailoverAfterPartitionTest.test-seed#[CB039F029D7B694A]) [    ] o.e.j.s.Server jetty-9.3.8.v20160314
   [junit4]   2> 1422436 INFO  (TEST-LeaderFailoverAfterPartitionTest.test-seed#[CB039F029D7B694A]) [    ] o.e.j.s.h.ContextHandler Started o.e.j.s.ServletContextHandler@14c417c{/av_/sd,null,AVAILABLE}
   [junit4]   2> 1422437 INFO  (TEST-LeaderFailoverAfterPartitionTest.test-seed#[CB039F029D7B694A]) [    ] o.e.j.s.ServerConnector Started ServerConnector@5e60bb{HTTP/1.1,[http/1.1]}{127.0.0.1:44041}
   [junit4]   2> 1422437 INFO  (TEST-LeaderFailoverAfterPartitionTest.test-seed#[CB039F029D7B694A]) [    ] o.e.j.s.Server Started @1424160ms
   [junit4]   2> 1422437 INFO  (TEST-LeaderFailoverAfterPartitionTest.test-seed#[CB039F029D7B694A]) [    ] o.a.s.c.s.e.JettySolrRunner Jetty properties: {solr.data.dir=/home/jenkins/workspace/Lucene-Solr-master-Linux/solr/build/solr-core/test/J0/temp/solr.cloud.LeaderFailoverAfterPartitionTest_CB039F029D7B694A-001/tempDir-001/jetty1, solrconfig=solrconfig.xml, hostContext=/av_/sd, hostPort=33383, coreRootDirectory=/home/jenkins/workspace/Lucene-Solr-master-Linux/solr/build/solr-core/test/J0/temp/solr.cloud.LeaderFailoverAfterPartitionTest_CB039F029D7B694A-001/shard-1-001/cores}
   [junit4]   2> 1422437 INFO  (TEST-LeaderFailoverAfterPartitionTest.test-seed#[CB039F029D7B694A]) [    ] o.a.s.s.SolrDispatchFilter SolrDispatchFilter.init(): sun.misc.Launcher$AppClassLoader@1d16e93
   [junit4]   2> 1422437 INFO  (TEST-LeaderFailoverAfterPartitionTest.test-seed#[CB039F029D7B694A]) [    ] o.a.s.c.SolrResourceLoader new SolrResourceLoader for directory: '/home/jenkins/workspace/Lucene-Solr-master-Linux/solr/build/solr-core/test/J0/temp/solr.cloud.LeaderFailoverAfterPartitionTest_CB039F029D7B694A-001/shard-1-001'
   [junit4]   2> 1422438 INFO  (TEST-LeaderFailoverAfterPartitionTest.test-seed#[CB039F029D7B694A]) [    ] o.a.s.c.SolrResourceLoader JNDI not configured for solr (NoInitialContextEx)
   [junit4]   2> 1422438 INFO  (TEST-LeaderFailoverAfterPartitionTest.test-seed#[CB039F029D7B694A]) [    ] o.a.s.c.SolrResourceLoader solr home defaulted to 'solr/' (could not find system property or JNDI)
   [junit4]   2> 1422438 INFO  (TEST-LeaderFailoverAfterPartitionTest.test-seed#[CB039F029D7B694A]) [    ] o.a.s.c.c.SolrZkClient Using default ZkCredentialsProvider
   [junit4]   2> 1422438 INFO  (TEST-LeaderFailoverAfterPartitionTest.test-seed#[CB039F029D7B694A]) [    ] o.a.s.c.c.ConnectionManager Waiting for client to connect to ZooKeeper
   [junit4]   2> 1422439 INFO  (zkCallback-2087-thread-1) [    ] o.a.s.c.c.ConnectionManager Watcher org.apache.solr.common.cloud.ConnectionManager@7e58c name:ZooKeeperConnection Watcher:127.0.0.1:38826/solr got event WatchedEvent state:SyncConnected type:None path:null path:null type:None
   [junit4]   2> 1422439 INFO  (TEST-LeaderFailoverAfterPartitionTest.test-seed#[CB039F029D7B694A]) [    ] o.a.s.c.c.ConnectionManager Client is connected to ZooKeeper
   [junit4]   2> 1422439 INFO  (TEST-LeaderFailoverAfterPartitionTest.test-seed#[CB039F029D7B694A]) [    ] o.a.s.c.c.SolrZkClient Using default ZkACLProvider
   [junit4]   2> 1422440 INFO  (TEST-LeaderFailoverAfterPartitionTest.test-seed#[CB039F029D7B694A]) [    ] o.a.s.s.SolrDispatchFilter Loading solr.xml from SolrHome (not found in ZooKeeper)
   [junit4]   2> 1422440 INFO  (TEST-LeaderFailoverAfterPartitionTest.test-seed#[CB039F029D7B694A]) [    ] o.a.s.c.SolrXmlConfig Loading container configuration from /home/jenkins/workspace/Lucene-Solr-master-Linux/solr/build/solr-core/test/J0/temp/solr.cloud.LeaderFailoverAfterPartitionTest_CB039F029D7B694A-001/shard-1-001/solr.xml
   [junit4]   2> 1422443 INFO  (TEST-LeaderFailoverAfterPartitionTest.test-seed#[CB039F029D7B694A]) [    ] o.a.s.c.CorePropertiesLocator Config-defined core root directory: /home/jenkins/workspace/Lucene-Solr-master-Linux/solr/build/solr-core/test/J0/temp/solr.cloud.LeaderFailoverAfterPartitionTest_CB039F029D7B694A-001/shard-1-001/cores
   [junit4]   2> 1422443 INFO  (TEST-LeaderFailoverAfterPartitionTest.test-seed#[CB039F029D7B694A]) [    ] o.a.s.c.CoreContainer New CoreContainer 18702451
   [junit4]   2> 1422443 INFO  (TEST-LeaderFailoverAfterPartitionTest.test-seed#[CB039F029D7B694A]) [    ] o.a.s.c.CoreContainer Loading cores into CoreContainer [instanceDir=/home/jenkins/workspace/Lucene-Solr-master-Linux/solr/build/solr-core/test/J0/temp/solr.cloud.LeaderFailoverAfterPartitionTest_CB039F029D7B694A-001/shard-1-001]
   [junit4]   2> 1422444 WARN  (TEST-LeaderFailoverAfterPartitionTest.test-seed#[CB039F029D7B694A]) [    ] o.a.s.c.CoreContainer Couldn't add files from /home/jenkins/workspace/Lucene-Solr-master-Linux/solr/build/solr-core/test/J0/temp/solr.cloud.LeaderFailoverAfterPartitionTest_CB039F029D7B694A-001/shard-1-001/lib to classpath: /home/jenkins/workspace/Lucene-Solr-master-Linux/solr/build/solr-core/test/J0/temp/solr.cloud.LeaderFailoverAfterPartitionTest_CB039F029D7B694A-001/shard-1-001/lib
   [junit4]   2> 1422444 INFO  (TEST-LeaderFailoverAfterPartitionTest.test-seed#[CB039F029D7B694A]) [    ] o.a.s.h.c.HttpShardHandlerFactory created with socketTimeout : 90000,urlScheme : ,connTimeout : 15000,maxConnectionsPerHost : 20,maxConnections : 10000,corePoolSize : 0,maximumPoolSize : 2147483647,maxThreadIdleTime : 5,sizeOfQueue : -1,fairnessPolicy : false,
   [junit4]   2> 1422446 INFO  (TEST-LeaderFailoverAfterPartitionTest.test-seed#[CB039F029D7B694A]) [    ] o.a.s.u.UpdateShardHandler Created UpdateShardHandler HTTP client with params: socketTimeout=340000&connTimeout=45000&maxConnections=100000&maxConnectionsPerHost=100000
   [junit4]   2> 1422446 INFO  (TEST-LeaderFailoverAfterPartitionTest.test-seed#[CB039F029D7B694A]) [    ] o.a.s.l.LogWatcher SLF4J impl is org.slf4j.impl.Log4jLoggerFactory
   [junit4]   2> 1422446 INFO  (TEST-LeaderFailoverAfterPartitionTest.test-seed#[CB039F029D7B694A]) [    ] o.a.s.l.LogWatcher Registering Log Listener [Log4j (org.slf4j.impl.Log4jLoggerFactory)]
   [junit4]   2> 1422446 INFO  (TEST-LeaderFailoverAfterPartitionTest.test-seed#[CB039F029D7B694A]) [    ] o.a.s.c.ZkContainer Zookeeper client=127.0.0.1:38826/solr
   [junit4]   2> 1422446 INFO  (TEST-LeaderFailoverAfterPartitionTest.test-seed#[CB039F029D7B694A]) [    ] o.a.s.c.ZkController zkHost includes chroot
   [junit4]   2> 1422446 INFO  (TEST-LeaderFailoverAfterPartitionTest.test-seed#[CB039F029D7B694A]) [    ] o.a.s.c.c.SolrZkClient Using default ZkCredentialsProvider
   [junit4]   2> 1422446 INFO  (TEST-LeaderFailoverAfterPartitionTest.test-seed#[CB039F029D7B694A]) [    ] o.a.s.c.c.ConnectionManager Waiting for client to connect to ZooKeeper
   [junit4]   2> 1422447 INFO  (zkCallback-2090-thread-1) [    ] o.a.s.c.c.ConnectionManager Watcher org.apache.solr.common.cloud.ConnectionManager@1374158 name:ZooKeeperConnection Watcher:127.0.0.1:38826 got event WatchedEvent state:SyncConnected type:None path:null path:null type:None
   [junit4]   2> 1422447 INFO  (TEST-LeaderFailoverAfterPartitionTest.test-seed#[CB039F029D7B694A]) [    ] o.a.s.c.c.ConnectionManager Client is connected to ZooKeeper
   [junit4]   2> 1422447 INFO  (TEST-LeaderFailoverAfterPartitionTest.test-seed#[CB039F029D7B694A]) [    ] o.a.s.c.c.SolrZkClient Using default ZkACLProvider
   [junit4]   2> 1422448 INFO  (TEST-LeaderFailoverAfterPartitionTest.test-seed#[CB039F029D7B694A]) [n:127.0.0.1:33383_av_%2Fsd    ] o.a.s.c.ZkController Added new OnReconnect listener org.apache.solr.cloud.ZkController$$Lambda$92/6714560@a2fc3b
   [junit4]   2> 1422449 INFO  (TEST-LeaderFailoverAfterPartitionTest.test-seed#[CB039F029D7B694A]) [n:127.0.0.1:33383_av_%2Fsd    ] o.a.s.c.c.ConnectionManager Waiting for client to connect to ZooKeeper
   [junit4]   2> 1422449 INFO  (zkCallback-2091-thread-1-processing-n:127.0.0.1:33383_av_%2Fsd) [n:127.0.0.1:33383_av_%2Fsd    ] o.a.s.c.c.ConnectionManager Watcher org.apache.solr.common.cloud.ConnectionManager@d0752c name:ZooKeeperConnection Watcher:127.0.0.1:38826/solr got event WatchedEvent state:SyncConnected type:None path:null path:null type:None
   [junit4]   2> 1422449 INFO  (TEST-LeaderFailoverAfterPartitionTest.test-seed#[CB039F029D7B694A]) [n:127.0.0.1:33383_av_%2Fsd    ] o.a.s.c.c.ConnectionManager Client is connected to ZooKeeper
   [junit4]   2> 1422451 INFO  (TEST-LeaderFailoverAfterPartitionTest.test-seed#[CB039F029D7B694A]) [n:127.0.0.1:33383_av_%2Fsd    ] o.a.s.c.c.ZkStateReader Updating cluster state from ZooKeeper... 
   [junit4]   2> 1422452 INFO  (TEST-LeaderFailoverAfterPartitionTest.test-seed#[CB039F029D7B694A]) [n:127.0.0.1:33383_av_%2Fsd    ] o.a.s.c.c.ZkStateReader Loaded empty cluster properties
   [junit4]   2> 1422452 INFO  (TEST-LeaderFailoverAfterPartitionTest.test-seed#[CB039F029D7B694A]) [n:127.0.0.1:33383_av_%2Fsd    ] o.a.s.c.c.ZkStateReader Updated live nodes from ZooKeeper... (0) -> (1)
   [junit4]   2> 1422453 INFO  (TEST-LeaderFailoverAfterPartitionTest.test-seed#[CB039F029D7B694A]) [n:127.0.0.1:33383_av_%2Fsd    ] o.a.s.c.Overseer Overseer (id=null) closing
   [junit4]   2> 1422453 INFO  (TEST-LeaderFailoverAfterPartitionTest.test-seed#[CB039F029D7B694A]) [n:127.0.0.1:33383_av_%2Fsd    ] o.a.s.c.LeaderElector Joined leadership election with path: /overseer_elect/election/96516265690464265-127.0.0.1:33383_av_%2Fsd-n_0000000001
   [junit4]   2> 1422453 INFO  (TEST-LeaderFailoverAfterPartitionTest.test-seed#[CB039F029D7B694A]) [n:127.0.0.1:33383_av_%2Fsd    ] o.a.s.c.LeaderElector Watching path /overseer_elect/election/96516265690464260-127.0.0.1:40652_av_%2Fsd-n_0000000000 to know if I could be the leader
   [junit4]   2> 1422453 INFO  (TEST-LeaderFailoverAfterPartitionTest.test-seed#[CB039F029D7B694A]) [n:127.0.0.1:33383_av_%2Fsd    ] o.a.s.c.ZkController Publish node=127.0.0.1:33383_av_%2Fsd as DOWN
   [junit4]   2> 1422454 INFO  (TEST-LeaderFailoverAfterPartitionTest.test-seed#[CB039F029D7B694A]) [n:127.0.0.1:33383_av_%2Fsd    ] o.a.s.c.ZkController Register node as live in ZooKeeper:/live_nodes/127.0.0.1:33383_av_%2Fsd
   [junit4]   2> 1422454 INFO  (TEST-LeaderFailoverAfterPartitionTest.test-seed#[CB039F029D7B694A]) [n:127.0.0.1:33383_av_%2Fsd    ] o.a.s.c.c.SolrZkClient makePath: /live_nodes/127.0.0.1:33383_av_%2Fsd
   [junit4]   2> 1422454 INFO  (OverseerStateUpdate-96516265690464260-127.0.0.1:40652_av_%2Fsd-n_0000000000) [n:127.0.0.1:40652_av_%2Fsd    ] o.a.s.c.Overseer processMessage: queueSize: 1, message = {
   [junit4]   2>   "operation":"downnode",
   [junit4]   2>   "node_name":"127.0.0.1:33383_av_%2Fsd"} current state version: 3
   [junit4]   2> 1422454 INFO  (OverseerStateUpdate-96516265690464260-127.0.0.1:40652_av_%2Fsd-n_0000000000) [n:127.0.0.1:40652_av_%2Fsd    ] o.a.s.c.o.NodeMutator DownNode state invoked for node: 127.0.0.1:33383_av_%2Fsd
   [junit4]   2> 1422454 INFO  (zkCallback-2091-thread-1-processing-n:127.0.0.1:33383_av_%2Fsd) [n:127.0.0.1:33383_av_%2Fsd    ] o.a.s.c.c.ZkStateReader A live node change: [WatchedEvent state:SyncConnected type:NodeChildrenChanged path:/live_nodes], has occurred - updating... (live nodes size: [1])
   [junit4]   2> 1422454 INFO  (zkCallback-2085-thread-1) [    ] o.a.s.c.c.ZkStateReader A live node change: [WatchedEvent state:SyncConnected type:NodeChildrenChanged path:/live_nodes], has occurred - updating... (live nodes size: [1])
   [junit4]   2> 1422454 INFO  (zkCallback-2081-thread-1-processing-n:127.0.0.1:40652_av_%2Fsd) [n:127.0.0.1:40652_av_%2Fsd    ] o.a.s.c.c.ZkStateReader A live node change: [WatchedEvent state:SyncConnected type:NodeChildrenChanged path:/live_nodes], has occurred - updating... (live nodes size: [1])
   [junit4]   2> 1422454 INFO  (OverseerStateUpdate-96516265690464260-127.0.0.1:40652_av_%2Fsd-n_0000000000) [n:127.0.0.1:40652_av_%2Fsd    ] o.a.s.c.o.ZkStateWriter going to create_collection /collections/collection1/state.json
   [junit4]   2> 1422454 INFO  (zkCallback-2091-thread-1-processing-n:127.0.0.1:33383_av_%2Fsd) [n:127.0.0.1:33383_av_%2Fsd    ] o.a.s.c.c.ZkStateReader Updated live nodes from ZooKeeper... (1) -> (2)
   [junit4]   2> 1422454 INFO  (zkCallback-2085-thread-1) [    ] o.a.s.c.c.ZkStateReader Updated live nodes from ZooKeeper... (1) -> (2)
   [junit4]   2> 1422454 INFO  (zkCallback-2081-thread-1-processing-n:127.0.0.1:40652_av_%2Fsd) [n:127.0.0.1:40652_av_%2Fsd    ] o.a.s.c.c.ZkStateReader Updated live nodes from ZooKeeper... (1) -> (2)
   [junit4]   2> 1422455 INFO  (zkCallback-2091-thread-1-processing-n:127.0.0.1:33383_av_%2Fsd) [n:127.0.0.1:33383_av_%2Fsd    ] o.a.s.c.c.ZkStateReader A cluster state change: [WatchedEvent state:SyncConnected type:NodeDataChanged path:/clusterstate.json], has occurred - updating... (live nodes size: [2])
   [junit4]   2> 1422455 INFO  (zkCallback-2081-thread-1-processing-n:127.0.0.1:40652_av_%2Fsd) [n:127.0.0.1:40652_av_%2Fsd    ] o.a.s.c.c.ZkStateReader A cluster state change: [WatchedEvent state:SyncConnected type:NodeDataChanged path:/clusterstate.json], has occurred - updating... (live nodes size: [2])
   [junit4]   2> 1422455 INFO  (zkCallback-2085-thread-1) [    ] o.a.s.c.c.ZkStateReader A cluster state change: [WatchedEvent state:SyncConnected type:NodeDataChanged path:/clusterstate.json], has occurred - updating... (live nodes size: [2])
   [junit4]   2> 1422474 INFO  (TEST-LeaderFailoverAfterPartitionTest.test-seed#[CB039F029D7B694A]) [n:127.0.0.1:33383_av_%2Fsd    ] o.a.s.c.CoreContainer Security conf doesn't exist. Skipping setup for authorization module.
   [junit4]   2> 1422474 INFO  (TEST-LeaderFailoverAfterPartitionTest.test-seed#[CB039F029D7B694A]) [n:127.0.0.1:33383_av_%2Fsd    ] o.a.s.c.CoreContainer No authentication plugin used.
   [junit4]   2> 1422475 INFO  (TEST-LeaderFailoverAfterPartitionTest.test-seed#[CB039F029D7B694A]) [n:127.0.0.1:33383_av_%2Fsd    ] o.a.s.c.CorePropertiesLocator Looking for core definitions underneath /home/jenkins/workspace/Lucene-Solr-master-Linux/solr/build/solr-core/test/J0/temp/solr.cloud.LeaderFailoverAfterPartitionTest_CB039F029D7B694A-001/shard-1-001/cores
   [junit4]   2> 1422475 INFO  (TEST-LeaderFailoverAfterPartitionTest.test-seed#[CB039F029D7B694A]) [n:127.0.0.1:33383_av_%2Fsd    ] o.a.s.c.CoreDescriptor Created CoreDescriptor: {name=collection1, config=solrconfig.xml, transient=false, schema=schema.xml, loadOnStartup=true, configSetProperties=configsetprops.json, collection=collection1, coreNodeName=, dataDir=data/, shard=}
   [junit4]   2> 1422475 INFO  (TEST-LeaderFailoverAfterPartitionTest.test-seed#[CB039F029D7B694A]) [n:127.0.0.1:33383_av_%2Fsd    ] o.a.s.c.CorePropertiesLocator Found core collection1 in /home/jenkins/workspace/Lucene-Solr-master-Linux/solr/build/solr-core/test/J0/temp/solr.cloud.LeaderFailoverAfterPartitionTest_CB039F029D7B694A-001/shard-1-001/cores/collection1
   [junit4]   2> 1422475 INFO  (TEST-LeaderFailoverAfterPartitionTest.test-seed#[CB039F029D7B694A]) [n:127.0.0.1:33383_av_%2Fsd    ] o.a.s.c.CorePropertiesLocator Found 1 core definitions
   [junit4]   2> 1422476 INFO  (TEST-LeaderFailoverAfterPartitionTest.test-seed#[CB039F029D7B694A]) [n:127.0.0.1:33383_av_%2Fsd    ] o.a.s.s.SolrDispatchFilter user.dir=/home/jenkins/workspace/Lucene-Solr-master-Linux/solr/build/solr-core/test/J0
   [junit4]   2> 1422476 INFO  (TEST-LeaderFailoverAfterPartitionTest.test-seed#[CB039F029D7B694A]) [n:127.0.0.1:33383_av_%2Fsd    ] o.a.s.s.SolrDispatchFilter SolrDispatchFilt

[...truncated too long message...]

nt.solrj.impl.CloudSolrClient.directUpdate(CloudSolrClient.java:769)
   [junit4]    > 	at org.apache.solr.client.solrj.impl.CloudSolrClient.sendRequest(CloudSolrClient.java:1161)
   [junit4]    > 	at org.apache.solr.client.solrj.impl.CloudSolrClient.requestWithRetryOnStaleState(CloudSolrClient.java:1050)
   [junit4]    > 	at org.apache.solr.client.solrj.impl.CloudSolrClient.request(CloudSolrClient.java:992)
   [junit4]    > 	at org.apache.solr.cloud.AbstractFullDistribZkTestBase.sendDocsWithRetry(AbstractFullDistribZkTestBase.java:753)
   [junit4]    > 	at org.apache.solr.cloud.AbstractFullDistribZkTestBase.sendDocsWithRetry(AbstractFullDistribZkTestBase.java:741)
   [junit4]    > 	at org.apache.solr.cloud.LeaderFailoverAfterPartitionTest.testRf3WithLeaderFailover(LeaderFailoverAfterPartitionTest.java:178)
   [junit4]    > 	at org.apache.solr.cloud.LeaderFailoverAfterPartitionTest.test(LeaderFailoverAfterPartitionTest.java:57)
   [junit4]    > 	at org.apache.solr.BaseDistributedSearchTestCase$ShardsRepeatRule$ShardsFixedStatement.callStatement(BaseDistributedSearchTestCase.java:985)
   [junit4]    > 	at org.apache.solr.BaseDistributedSearchTestCase$ShardsRepeatRule$ShardsStatement.evaluate(BaseDistributedSearchTestCase.java:960)
   [junit4]    > 	at java.lang.Thread.run(Thread.java:745)
   [junit4]    > Caused by: org.apache.solr.client.solrj.SolrServerException: No live SolrServers available to handle this request:[http://127.0.0.1:40652/av_/sd/c8n_1x3_lf_shard1_replica2]
   [junit4]    > 	at org.apache.solr.client.solrj.impl.LBHttpSolrClient.request(LBHttpSolrClient.java:394)
   [junit4]    > 	at org.apache.solr.client.solrj.impl.CloudSolrClient.directUpdate(CloudSolrClient.java:763)
   [junit4]    > 	... 48 more
   [junit4]    > Caused by: org.apache.solr.client.solrj.SolrServerException: Server refused connection at: http://127.0.0.1:40652/av_/sd/c8n_1x3_lf_shard1_replica2
   [junit4]    > 	at org.apache.solr.client.solrj.impl.HttpSolrClient.executeMethod(HttpSolrClient.java:615)
   [junit4]    > 	at org.apache.solr.client.solrj.impl.HttpSolrClient.request(HttpSolrClient.java:261)
   [junit4]    > 	at org.apache.solr.client.solrj.impl.HttpSolrClient.request(HttpSolrClient.java:250)
   [junit4]    > 	at org.apache.solr.client.solrj.impl.LBHttpSolrClient.doRequest(LBHttpSolrClient.java:415)
   [junit4]    > 	at org.apache.solr.client.solrj.impl.LBHttpSolrClient.request(LBHttpSolrClient.java:383)
   [junit4]    > 	... 49 more
   [junit4]    > Caused by: org.apache.http.conn.HttpHostConnectException: Connect to 127.0.0.1:40652 [/127.0.0.1] failed: Connection refused
   [junit4]    > 	at org.apache.http.impl.conn.DefaultHttpClientConnectionOperator.connect(DefaultHttpClientConnectionOperator.java:151)
   [junit4]    > 	at org.apache.http.impl.conn.PoolingHttpClientConnectionManager.connect(PoolingHttpClientConnectionManager.java:353)
   [junit4]    > 	at org.apache.http.impl.execchain.MainClientExec.establishRoute(MainClientExec.java:380)
   [junit4]    > 	at org.apache.http.impl.execchain.MainClientExec.execute(MainClientExec.java:236)
   [junit4]    > 	at org.apache.http.impl.execchain.ProtocolExec.execute(ProtocolExec.java:184)
   [junit4]    > 	at org.apache.http.impl.execchain.RetryExec.execute(RetryExec.java:88)
   [junit4]    > 	at org.apache.http.impl.execchain.RedirectExec.execute(RedirectExec.java:110)
   [junit4]    > 	at org.apache.http.impl.client.InternalHttpClient.doExecute(InternalHttpClient.java:184)
   [junit4]    > 	at org.apache.http.impl.client.CloseableHttpClient.execute(CloseableHttpClient.java:82)
   [junit4]    > 	at org.apache.http.impl.client.CloseableHttpClient.execute(CloseableHttpClient.java:55)
   [junit4]    > 	at org.apache.solr.client.solrj.impl.HttpSolrClient.executeMethod(HttpSolrClient.java:513)
   [junit4]    > 	... 53 more
   [junit4]    > Caused by: java.net.ConnectException: Connection refused
   [junit4]    > 	at java.net.PlainSocketImpl.socketConnect(Native Method)
   [junit4]    > 	at java.net.AbstractPlainSocketImpl.doConnect(AbstractPlainSocketImpl.java:350)
   [junit4]    > 	at java.net.AbstractPlainSocketImpl.connectToAddress(AbstractPlainSocketImpl.java:206)
   [junit4]    > 	at java.net.AbstractPlainSocketImpl.connect(AbstractPlainSocketImpl.java:188)
   [junit4]    > 	at java.net.SocksSocketImpl.connect(SocksSocketImpl.java:392)
   [junit4]    > 	at java.net.Socket.connect(Socket.java:589)
   [junit4]    > 	at org.apache.http.conn.socket.PlainConnectionSocketFactory.connectSocket(PlainConnectionSocketFactory.java:74)
   [junit4]    > 	at org.apache.http.impl.conn.DefaultHttpClientConnectionOperator.connect(DefaultHttpClientConnectionOperator.java:134)
   [junit4]    > 	... 63 more
   [junit4]   2> 1486728 INFO  (SUITE-LeaderFailoverAfterPartitionTest-seed#[CB039F029D7B694A]-worker) [    ] o.a.s.SolrTestCaseJ4 ###deleteCore
   [junit4]   2> NOTE: leaving temporary files on disk at: /home/jenkins/workspace/Lucene-Solr-master-Linux/solr/build/solr-core/test/J0/temp/solr.cloud.LeaderFailoverAfterPartitionTest_CB039F029D7B694A-001
   [junit4]   2> Sep 01, 2016 9:16:45 AM com.carrotsearch.randomizedtesting.ThreadLeakControl checkThreadLeaks
   [junit4]   2> WARNING: Will linger awaiting termination of 1 leaked thread(s).
   [junit4]   2> NOTE: test params are: codec=Asserting(Lucene62): {range_facet_l_dv=PostingsFormat(name=Memory doPackFST= true), _version_=BlockTreeOrds(blocksize=128), multiDefault=PostingsFormat(name=Memory doPackFST= false), a_t=BlockTreeOrds(blocksize=128), intDefault=BlockTreeOrds(blocksize=128), id=PostingsFormat(name=Memory doPackFST= true), range_facet_i_dv=BlockTreeOrds(blocksize=128), text=Lucene50(blocksize=128), range_facet_l=BlockTreeOrds(blocksize=128), timestamp=BlockTreeOrds(blocksize=128)}, docValues:{range_facet_l_dv=DocValuesFormat(name=Memory), range_facet_i_dv=DocValuesFormat(name=Lucene54), timestamp=DocValuesFormat(name=Lucene54)}, maxPointsInLeafNode=1414, maxMBSortInHeap=6.921433632291446, sim=ClassicSimilarity, locale=ar-BH, timezone=Europe/Sofia
   [junit4]   2> NOTE: Linux 4.4.0-31-generic i386/Oracle Corporation 1.8.0_102 (32-bit)/cpus=12,threads=1,free=167815152,total=326705152
   [junit4]   2> NOTE: All tests run in this JVM: [TestHdfsCloudBackupRestore, PeerSyncTest, BigEndianAscendingWordDeserializerTest, TestPKIAuthenticationPlugin, CleanupOldIndexTest, DateRangeFieldTest, TestPhraseSuggestions, SuggestComponentContextFilterQueryTest, TestRestManager, AnalyticsQueryTest, HdfsBasicDistributedZkTest, TestSolrCloudWithSecureImpersonation, PathHierarchyTokenizerFactoryTest, ResponseHeaderTest, TestBlobHandler, FileBasedSpellCheckerTest, DisMaxRequestHandlerTest, TestBadConfig, TestTolerantUpdateProcessorCloud, DirectoryFactoryTest, TriLevelCompositeIdRoutingTest, OverseerModifyCollectionTest, RemoteQueryErrorTest, TestHighFrequencyDictionaryFactory, TestInitParams, DistribCursorPagingTest, DocExpirationUpdateProcessorFactoryTest, QueryResultKeyTest, TestDynamicLoading, TestDynamicFieldResource, SyncSliceTest, TestRealTimeGet, TestSolrXml, RuleEngineTest, TestFieldTypeCollectionResource, TestDocTermOrds, BasicAuthIntegrationTest, TestArbitraryIndexDir, EchoParamsTest, TestAnalyzedSuggestions, WrapperMergePolicyFactoryTest, TestSolr4Spatial, TestUniqueKeyFieldResource, TestGeoJSONResponseWriter, SharedFSAutoReplicaFailoverUtilsTest, TestOmitPositions, CoreAdminCreateDiscoverTest, TestSQLHandler, HdfsCollectionsAPIDistributedZkTest, TestMergePolicyConfig, DateFieldTest, TestNoOpRegenerator, TestCrossCoreJoin, AsyncCallRequestStatusResponseTest, PolyFieldTest, ActionThrottleTest, TestAtomicUpdateErrorCases, TestManagedSchema, TestCloudPseudoReturnFields, RankQueryTest, CursorPagingTest, TestLRUCache, HdfsThreadLeakTest, TestRTGBase, XsltUpdateRequestHandlerTest, TestMacroExpander, TestMiniSolrCloudClusterBase, RAMDirectoryFactoryTest, TestGraphTermsQParserPlugin, DistributedFacetPivotWhiteBoxTest, SOLR749Test, TestCloudDeleteByQuery, TestRangeQuery, DistributedSuggestComponentTest, TestSimpleQParserPlugin, TestLMDirichletSimilarityFactory, TestSizeLimitedDistributedMap, RequiredFieldsTest, AddBlockUpdateTest, HdfsRecoveryZkTest, JavabinLoaderTest, TestDFISimilarityFactory, PreAnalyzedFieldTest, TestScoreJoinQPNoScore, DistributedQueryElevationComponentTest, RestartWhileUpdatingTest, SolrCoreTest, InfoHandlerTest, ReturnFieldsTest, DistributedFacetPivotLongTailTest, TestHdfsUpdateLog, TestRTimerTree, TestIBSimilarityFactory, TestJsonFacets, TestRecoveryHdfs, CdcrRequestHandlerTest, TestDistributedSearch, TestCSVLoader, TestReplicationHandler, TestRandomDVFaceting, ConnectionManagerTest, TestConfigSetImmutable, QueryEqualityTest, OverseerTest, LeaderElectionIntegrationTest, BasicZkTest, FullSolrCloudDistribCmdsTest, TestRandomFaceting, AutoCommitTest, TestHashPartitioner, TestCoreContainer, SimpleFacetsTest, StatsComponentTest, TestFiltering, NoCacheHeaderTest, SchemaVersionSpecificBehaviorTest, TestPseudoReturnFields, StatelessScriptUpdateProcessorFactoryTest, DocValuesMultiTest, SolrInfoMBeanTest, TestSurroundQueryParser, LukeRequestHandlerTest, TestQueryTypes, XmlUpdateRequestHandlerTest, TermVectorComponentTest, IndexSchemaRuntimeFieldTest, TestCollationField, UpdateRequestProcessorFactoryTest, UniqFieldsUpdateProcessorFactoryTest, CSVRequestHandlerTest, TestBinaryResponseWriter, AlternateDirectoryTest, CopyFieldTest, TestDocSet, NumericFieldsTest, TestElisionMultitermQuery, TestConfig, TestFuzzyAnalyzedSuggestions, TestLuceneMatchVersion, TestLMJelinekMercerSimilarityFactory, ResourceLoaderTest, OpenExchangeRatesOrgProviderTest, PluginInfoTest, ChaosMonkeyNothingIsSafeTest, CollectionStateFormat2Test, CollectionsAPIAsyncDistributedZkTest, CollectionsAPISolrJTest, DeleteInactiveReplicaTest, DeleteNodeTest, DistribDocExpirationUpdateProcessorTest, DistributedVersionInfoTest, LeaderFailoverAfterPartitionTest]
   [junit4] Completed [479/632 (1!)] on J0 in 66.86s, 1 test, 1 error <<< FAILURES!

[...truncated 52925 lines...]


Mime
View raw message