lucene-dev mailing list archives

Site index · List index
Message view « Date » · « Thread »
Top « Date » · « Thread »
From Policeman Jenkins Server <jenk...@thetaphi.de>
Subject [JENKINS] Lucene-Solr-6.x-Linux (32bit/jdk1.8.0_102) - Build # 1692 - Unstable!
Date Fri, 09 Sep 2016 16:52:08 GMT
Build: http://jenkins.thetaphi.de/job/Lucene-Solr-6.x-Linux/1692/
Java: 32bit/jdk1.8.0_102 -client -XX:+UseSerialGC

1 tests failed.
FAILED:  org.apache.solr.security.BasicAuthIntegrationTest.testBasicAuth

Error Message:
IOException occured when talking to server at: https://127.0.0.1:36140/solr

Stack Trace:
org.apache.solr.client.solrj.SolrServerException: IOException occured when talking to server at: https://127.0.0.1:36140/solr
	at __randomizedtesting.SeedInfo.seed([A02E38E6F47D283A:1C404EF4502EAB40]:0)
	at org.apache.solr.client.solrj.impl.HttpSolrClient.executeMethod(HttpSolrClient.java:606)
	at org.apache.solr.client.solrj.impl.HttpSolrClient.request(HttpSolrClient.java:261)
	at org.apache.solr.client.solrj.impl.HttpSolrClient.request(HttpSolrClient.java:250)
	at org.apache.solr.client.solrj.SolrClient.request(SolrClient.java:1219)
	at org.apache.solr.security.BasicAuthIntegrationTest.testBasicAuth(BasicAuthIntegrationTest.java:158)
	at sun.reflect.NativeMethodAccessorImpl.invoke0(Native Method)
	at sun.reflect.NativeMethodAccessorImpl.invoke(NativeMethodAccessorImpl.java:62)
	at sun.reflect.DelegatingMethodAccessorImpl.invoke(DelegatingMethodAccessorImpl.java:43)
	at java.lang.reflect.Method.invoke(Method.java:498)
	at com.carrotsearch.randomizedtesting.RandomizedRunner.invoke(RandomizedRunner.java:1764)
	at com.carrotsearch.randomizedtesting.RandomizedRunner$8.evaluate(RandomizedRunner.java:871)
	at com.carrotsearch.randomizedtesting.RandomizedRunner$9.evaluate(RandomizedRunner.java:907)
	at com.carrotsearch.randomizedtesting.RandomizedRunner$10.evaluate(RandomizedRunner.java:921)
	at com.carrotsearch.randomizedtesting.rules.SystemPropertiesRestoreRule$1.evaluate(SystemPropertiesRestoreRule.java:57)
	at org.apache.lucene.util.TestRuleSetupTeardownChained$1.evaluate(TestRuleSetupTeardownChained.java:49)
	at org.apache.lucene.util.AbstractBeforeAfterRule$1.evaluate(AbstractBeforeAfterRule.java:45)
	at org.apache.lucene.util.TestRuleThreadAndTestName$1.evaluate(TestRuleThreadAndTestName.java:48)
	at org.apache.lucene.util.TestRuleIgnoreAfterMaxFailures$1.evaluate(TestRuleIgnoreAfterMaxFailures.java:64)
	at org.apache.lucene.util.TestRuleMarkFailure$1.evaluate(TestRuleMarkFailure.java:47)
	at com.carrotsearch.randomizedtesting.rules.StatementAdapter.evaluate(StatementAdapter.java:36)
	at com.carrotsearch.randomizedtesting.ThreadLeakControl$StatementRunner.run(ThreadLeakControl.java:367)
	at com.carrotsearch.randomizedtesting.ThreadLeakControl.forkTimeoutingTask(ThreadLeakControl.java:809)
	at com.carrotsearch.randomizedtesting.ThreadLeakControl$3.evaluate(ThreadLeakControl.java:460)
	at com.carrotsearch.randomizedtesting.RandomizedRunner.runSingleTest(RandomizedRunner.java:880)
	at com.carrotsearch.randomizedtesting.RandomizedRunner$5.evaluate(RandomizedRunner.java:781)
	at com.carrotsearch.randomizedtesting.RandomizedRunner$6.evaluate(RandomizedRunner.java:816)
	at com.carrotsearch.randomizedtesting.RandomizedRunner$7.evaluate(RandomizedRunner.java:827)
	at com.carrotsearch.randomizedtesting.rules.StatementAdapter.evaluate(StatementAdapter.java:36)
	at com.carrotsearch.randomizedtesting.rules.SystemPropertiesRestoreRule$1.evaluate(SystemPropertiesRestoreRule.java:57)
	at org.apache.lucene.util.AbstractBeforeAfterRule$1.evaluate(AbstractBeforeAfterRule.java:45)
	at com.carrotsearch.randomizedtesting.rules.StatementAdapter.evaluate(StatementAdapter.java:36)
	at org.apache.lucene.util.TestRuleStoreClassName$1.evaluate(TestRuleStoreClassName.java:41)
	at com.carrotsearch.randomizedtesting.rules.NoShadowingOrOverridesOnMethodsRule$1.evaluate(NoShadowingOrOverridesOnMethodsRule.java:40)
	at com.carrotsearch.randomizedtesting.rules.NoShadowingOrOverridesOnMethodsRule$1.evaluate(NoShadowingOrOverridesOnMethodsRule.java:40)
	at com.carrotsearch.randomizedtesting.rules.StatementAdapter.evaluate(StatementAdapter.java:36)
	at com.carrotsearch.randomizedtesting.rules.StatementAdapter.evaluate(StatementAdapter.java:36)
	at com.carrotsearch.randomizedtesting.rules.StatementAdapter.evaluate(StatementAdapter.java:36)
	at org.apache.lucene.util.TestRuleAssertionsRequired$1.evaluate(TestRuleAssertionsRequired.java:53)
	at org.apache.lucene.util.TestRuleMarkFailure$1.evaluate(TestRuleMarkFailure.java:47)
	at org.apache.lucene.util.TestRuleIgnoreAfterMaxFailures$1.evaluate(TestRuleIgnoreAfterMaxFailures.java:64)
	at org.apache.lucene.util.TestRuleIgnoreTestSuites$1.evaluate(TestRuleIgnoreTestSuites.java:54)
	at com.carrotsearch.randomizedtesting.rules.StatementAdapter.evaluate(StatementAdapter.java:36)
	at com.carrotsearch.randomizedtesting.ThreadLeakControl$StatementRunner.run(ThreadLeakControl.java:367)
	at java.lang.Thread.run(Thread.java:745)
Caused by: javax.net.ssl.SSLHandshakeException: sun.security.validator.ValidatorException: PKIX path building failed: sun.security.provider.certpath.SunCertPathBuilderException: unable to find valid certification path to requested target
	at sun.security.ssl.Alerts.getSSLException(Alerts.java:192)
	at sun.security.ssl.SSLSocketImpl.fatal(SSLSocketImpl.java:1949)
	at sun.security.ssl.Handshaker.fatalSE(Handshaker.java:302)
	at sun.security.ssl.Handshaker.fatalSE(Handshaker.java:296)
	at sun.security.ssl.ClientHandshaker.serverCertificate(ClientHandshaker.java:1509)
	at sun.security.ssl.ClientHandshaker.processMessage(ClientHandshaker.java:216)
	at sun.security.ssl.Handshaker.processLoop(Handshaker.java:979)
	at sun.security.ssl.Handshaker.process_record(Handshaker.java:914)
	at sun.security.ssl.SSLSocketImpl.readRecord(SSLSocketImpl.java:1062)
	at sun.security.ssl.SSLSocketImpl.performInitialHandshake(SSLSocketImpl.java:1375)
	at sun.security.ssl.SSLSocketImpl.startHandshake(SSLSocketImpl.java:1403)
	at sun.security.ssl.SSLSocketImpl.startHandshake(SSLSocketImpl.java:1387)
	at org.apache.http.conn.ssl.SSLSocketFactory.connectSocket(SSLSocketFactory.java:543)
	at org.apache.http.conn.ssl.SSLSocketFactory.connectSocket(SSLSocketFactory.java:409)
	at org.apache.http.impl.conn.DefaultClientConnectionOperator.openConnection(DefaultClientConnectionOperator.java:177)
	at org.apache.http.impl.conn.ManagedClientConnectionImpl.open(ManagedClientConnectionImpl.java:304)
	at org.apache.http.impl.client.DefaultRequestDirector.tryConnect(DefaultRequestDirector.java:611)
	at org.apache.http.impl.client.DefaultRequestDirector.execute(DefaultRequestDirector.java:446)
	at org.apache.http.impl.client.AbstractHttpClient.doExecute(AbstractHttpClient.java:882)
	at org.apache.http.impl.client.CloseableHttpClient.execute(CloseableHttpClient.java:82)
	at org.apache.http.impl.client.CloseableHttpClient.execute(CloseableHttpClient.java:107)
	at org.apache.http.impl.client.CloseableHttpClient.execute(CloseableHttpClient.java:55)
	at org.apache.solr.client.solrj.impl.HttpSolrClient.executeMethod(HttpSolrClient.java:497)
	... 43 more
Caused by: sun.security.validator.ValidatorException: PKIX path building failed: sun.security.provider.certpath.SunCertPathBuilderException: unable to find valid certification path to requested target
	at sun.security.validator.PKIXValidator.doBuild(PKIXValidator.java:387)
	at sun.security.validator.PKIXValidator.engineValidate(PKIXValidator.java:292)
	at sun.security.validator.Validator.validate(Validator.java:260)
	at sun.security.ssl.X509TrustManagerImpl.validate(X509TrustManagerImpl.java:324)
	at sun.security.ssl.X509TrustManagerImpl.checkTrusted(X509TrustManagerImpl.java:229)
	at sun.security.ssl.X509TrustManagerImpl.checkServerTrusted(X509TrustManagerImpl.java:124)
	at sun.security.ssl.ClientHandshaker.serverCertificate(ClientHandshaker.java:1491)
	... 61 more
Caused by: sun.security.provider.certpath.SunCertPathBuilderException: unable to find valid certification path to requested target
	at sun.security.provider.certpath.SunCertPathBuilder.build(SunCertPathBuilder.java:141)
	at sun.security.provider.certpath.SunCertPathBuilder.engineBuild(SunCertPathBuilder.java:126)
	at java.security.cert.CertPathBuilder.build(CertPathBuilder.java:280)
	at sun.security.validator.PKIXValidator.doBuild(PKIXValidator.java:382)
	... 67 more




Build Log:
[...truncated 12537 lines...]
   [junit4] Suite: org.apache.solr.security.BasicAuthIntegrationTest
   [junit4]   2> Creating dataDir: /home/jenkins/workspace/Lucene-Solr-6.x-Linux/solr/build/solr-core/test/J0/temp/solr.security.BasicAuthIntegrationTest_A02E38E6F47D283A-001/init-core-data-001
   [junit4]   2> 2074419 INFO  (SUITE-BasicAuthIntegrationTest-seed#[A02E38E6F47D283A]-worker) [    ] o.a.s.SolrTestCaseJ4 Randomized ssl (true) and clientAuth (false) via: @org.apache.solr.util.RandomizeSSL(reason=, ssl=NaN, value=NaN, clientAuth=NaN)
   [junit4]   2> 2074421 INFO  (SUITE-BasicAuthIntegrationTest-seed#[A02E38E6F47D283A]-worker) [    ] o.a.s.c.ZkTestServer STARTING ZK TEST SERVER
   [junit4]   2> 2074421 INFO  (Thread-3109) [    ] o.a.s.c.ZkTestServer client port:0.0.0.0/0.0.0.0:0
   [junit4]   2> 2074421 INFO  (Thread-3109) [    ] o.a.s.c.ZkTestServer Starting server
   [junit4]   2> 2074521 INFO  (SUITE-BasicAuthIntegrationTest-seed#[A02E38E6F47D283A]-worker) [    ] o.a.s.c.ZkTestServer start zk server on port:43933
   [junit4]   2> 2074521 INFO  (SUITE-BasicAuthIntegrationTest-seed#[A02E38E6F47D283A]-worker) [    ] o.a.s.c.c.SolrZkClient Using default ZkCredentialsProvider
   [junit4]   2> 2074521 INFO  (SUITE-BasicAuthIntegrationTest-seed#[A02E38E6F47D283A]-worker) [    ] o.a.s.c.c.ConnectionManager Waiting for client to connect to ZooKeeper
   [junit4]   2> 2074525 INFO  (zkCallback-23786-thread-1) [    ] o.a.s.c.c.ConnectionManager Watcher org.apache.solr.common.cloud.ConnectionManager@600603 name:ZooKeeperConnection Watcher:127.0.0.1:43933 got event WatchedEvent state:SyncConnected type:None path:null path:null type:None
   [junit4]   2> 2074525 INFO  (SUITE-BasicAuthIntegrationTest-seed#[A02E38E6F47D283A]-worker) [    ] o.a.s.c.c.ConnectionManager Client is connected to ZooKeeper
   [junit4]   2> 2074525 INFO  (SUITE-BasicAuthIntegrationTest-seed#[A02E38E6F47D283A]-worker) [    ] o.a.s.c.c.SolrZkClient Using default ZkACLProvider
   [junit4]   2> 2074525 INFO  (SUITE-BasicAuthIntegrationTest-seed#[A02E38E6F47D283A]-worker) [    ] o.a.s.c.c.SolrZkClient makePath: /solr/solr.xml
   [junit4]   2> 2074527 INFO  (SUITE-BasicAuthIntegrationTest-seed#[A02E38E6F47D283A]-worker) [    ] o.a.s.c.c.SolrZkClient makePath: /solr/clusterprops.json
   [junit4]   2> 2074529 WARN  (NIOServerCxn.Factory:0.0.0.0/0.0.0.0:0) [    ] o.a.z.s.NIOServerCnxn caught end of stream exception
   [junit4]   2> EndOfStreamException: Unable to read additional data from client sessionid 0x1570fd579470000, likely client has closed socket
   [junit4]   2> 	at org.apache.zookeeper.server.NIOServerCnxn.doIO(NIOServerCnxn.java:228)
   [junit4]   2> 	at org.apache.zookeeper.server.NIOServerCnxnFactory.run(NIOServerCnxnFactory.java:208)
   [junit4]   2> 	at java.lang.Thread.run(Thread.java:745)
   [junit4]   2> 2074533 INFO  (jetty-launcher-23785-thread-2) [    ] o.e.j.s.Server jetty-9.3.8.v20160314
   [junit4]   2> 2074534 INFO  (jetty-launcher-23785-thread-2) [    ] o.e.j.s.h.ContextHandler Started o.e.j.s.ServletContextHandler@1e538fa{/solr,null,AVAILABLE}
   [junit4]   2> 2074534 INFO  (jetty-launcher-23785-thread-1) [    ] o.e.j.s.Server jetty-9.3.8.v20160314
   [junit4]   2> 2074536 INFO  (jetty-launcher-23785-thread-1) [    ] o.e.j.s.h.ContextHandler Started o.e.j.s.ServletContextHandler@1ffb0d8{/solr,null,AVAILABLE}
   [junit4]   2> 2074537 INFO  (jetty-launcher-23785-thread-3) [    ] o.e.j.s.Server jetty-9.3.8.v20160314
   [junit4]   2> 2074538 INFO  (jetty-launcher-23785-thread-3) [    ] o.e.j.s.h.ContextHandler Started o.e.j.s.ServletContextHandler@1cf45b5{/solr,null,AVAILABLE}
   [junit4]   2> 2074542 INFO  (jetty-launcher-23785-thread-2) [    ] o.e.j.s.ServerConnector Started ServerConnector@1031727{SSL,[ssl, http/1.1]}{127.0.0.1:36140}
   [junit4]   2> 2074542 INFO  (jetty-launcher-23785-thread-2) [    ] o.e.j.s.Server Started @2075816ms
   [junit4]   2> 2074542 INFO  (jetty-launcher-23785-thread-2) [    ] o.a.s.c.s.e.JettySolrRunner Jetty properties: {hostContext=/solr, hostPort=36140}
   [junit4]   2> 2074542 INFO  (jetty-launcher-23785-thread-2) [    ] o.a.s.s.SolrDispatchFilter SolrDispatchFilter.init(): sun.misc.Launcher$AppClassLoader@1d16e93
   [junit4]   2> 2074542 INFO  (jetty-launcher-23785-thread-2) [    ] o.a.s.c.SolrResourceLoader new SolrResourceLoader for directory: '/home/jenkins/workspace/Lucene-Solr-6.x-Linux/solr/build/solr-core/test/J0/temp/solr.security.BasicAuthIntegrationTest_A02E38E6F47D283A-001/tempDir-001/node2'
   [junit4]   2> 2074542 INFO  (jetty-launcher-23785-thread-2) [    ] o.a.s.c.SolrResourceLoader JNDI not configured for solr (NoInitialContextEx)
   [junit4]   2> 2074542 INFO  (jetty-launcher-23785-thread-2) [    ] o.a.s.c.SolrResourceLoader solr home defaulted to 'solr/' (could not find system property or JNDI)
   [junit4]   2> 2074542 INFO  (jetty-launcher-23785-thread-2) [    ] o.a.s.c.c.SolrZkClient Using default ZkCredentialsProvider
   [junit4]   2> 2074543 INFO  (jetty-launcher-23785-thread-2) [    ] o.a.s.c.c.ConnectionManager Waiting for client to connect to ZooKeeper
   [junit4]   2> 2074544 INFO  (zkCallback-23787-thread-1) [    ] o.a.s.c.c.ConnectionManager Watcher org.apache.solr.common.cloud.ConnectionManager@295fa5 name:ZooKeeperConnection Watcher:127.0.0.1:43933/solr got event WatchedEvent state:SyncConnected type:None path:null path:null type:None
   [junit4]   2> 2074544 INFO  (jetty-launcher-23785-thread-2) [    ] o.a.s.c.c.ConnectionManager Client is connected to ZooKeeper
   [junit4]   2> 2074545 INFO  (jetty-launcher-23785-thread-1) [    ] o.e.j.s.ServerConnector Started ServerConnector@419a17{SSL,[ssl, http/1.1]}{127.0.0.1:43754}
   [junit4]   2> 2074545 INFO  (jetty-launcher-23785-thread-2) [    ] o.a.s.c.c.SolrZkClient Using default ZkACLProvider
   [junit4]   2> 2074545 INFO  (jetty-launcher-23785-thread-1) [    ] o.e.j.s.Server Started @2075818ms
   [junit4]   2> 2074545 INFO  (jetty-launcher-23785-thread-1) [    ] o.a.s.c.s.e.JettySolrRunner Jetty properties: {hostContext=/solr, hostPort=43754}
   [junit4]   2> 2074545 INFO  (jetty-launcher-23785-thread-2) [    ] o.a.s.s.SolrDispatchFilter solr.xml found in ZooKeeper. Loading...
   [junit4]   2> 2074545 INFO  (jetty-launcher-23785-thread-1) [    ] o.a.s.s.SolrDispatchFilter SolrDispatchFilter.init(): sun.misc.Launcher$AppClassLoader@1d16e93
   [junit4]   2> 2074545 INFO  (jetty-launcher-23785-thread-1) [    ] o.a.s.c.SolrResourceLoader new SolrResourceLoader for directory: '/home/jenkins/workspace/Lucene-Solr-6.x-Linux/solr/build/solr-core/test/J0/temp/solr.security.BasicAuthIntegrationTest_A02E38E6F47D283A-001/tempDir-001/node1'
   [junit4]   2> 2074545 INFO  (jetty-launcher-23785-thread-3) [    ] o.e.j.s.ServerConnector Started ServerConnector@a1ed1e{SSL,[ssl, http/1.1]}{127.0.0.1:41831}
   [junit4]   2> 2074545 INFO  (jetty-launcher-23785-thread-1) [    ] o.a.s.c.SolrResourceLoader JNDI not configured for solr (NoInitialContextEx)
   [junit4]   2> 2074545 INFO  (jetty-launcher-23785-thread-3) [    ] o.e.j.s.Server Started @2075819ms
   [junit4]   2> 2074546 INFO  (jetty-launcher-23785-thread-1) [    ] o.a.s.c.SolrResourceLoader solr home defaulted to 'solr/' (could not find system property or JNDI)
   [junit4]   2> 2074546 INFO  (jetty-launcher-23785-thread-3) [    ] o.a.s.c.s.e.JettySolrRunner Jetty properties: {hostContext=/solr, hostPort=41831}
   [junit4]   2> 2074546 INFO  (jetty-launcher-23785-thread-1) [    ] o.a.s.c.c.SolrZkClient Using default ZkCredentialsProvider
   [junit4]   2> 2074546 INFO  (jetty-launcher-23785-thread-3) [    ] o.a.s.s.SolrDispatchFilter SolrDispatchFilter.init(): sun.misc.Launcher$AppClassLoader@1d16e93
   [junit4]   2> 2074546 INFO  (jetty-launcher-23785-thread-3) [    ] o.a.s.c.SolrResourceLoader new SolrResourceLoader for directory: '/home/jenkins/workspace/Lucene-Solr-6.x-Linux/solr/build/solr-core/test/J0/temp/solr.security.BasicAuthIntegrationTest_A02E38E6F47D283A-001/tempDir-001/node3'
   [junit4]   2> 2074546 INFO  (jetty-launcher-23785-thread-1) [    ] o.a.s.c.c.ConnectionManager Waiting for client to connect to ZooKeeper
   [junit4]   2> 2074546 INFO  (jetty-launcher-23785-thread-3) [    ] o.a.s.c.SolrResourceLoader JNDI not configured for solr (NoInitialContextEx)
   [junit4]   2> 2074547 INFO  (jetty-launcher-23785-thread-3) [    ] o.a.s.c.SolrResourceLoader solr home defaulted to 'solr/' (could not find system property or JNDI)
   [junit4]   2> 2074547 INFO  (jetty-launcher-23785-thread-3) [    ] o.a.s.c.c.SolrZkClient Using default ZkCredentialsProvider
   [junit4]   2> 2074548 INFO  (jetty-launcher-23785-thread-3) [    ] o.a.s.c.c.ConnectionManager Waiting for client to connect to ZooKeeper
   [junit4]   2> 2074549 INFO  (zkCallback-23788-thread-1) [    ] o.a.s.c.c.ConnectionManager Watcher org.apache.solr.common.cloud.ConnectionManager@b5c060 name:ZooKeeperConnection Watcher:127.0.0.1:43933/solr got event WatchedEvent state:SyncConnected type:None path:null path:null type:None
   [junit4]   2> 2074549 INFO  (jetty-launcher-23785-thread-1) [    ] o.a.s.c.c.ConnectionManager Client is connected to ZooKeeper
   [junit4]   2> 2074549 INFO  (zkCallback-23789-thread-1) [    ] o.a.s.c.c.ConnectionManager Watcher org.apache.solr.common.cloud.ConnectionManager@f55d8 name:ZooKeeperConnection Watcher:127.0.0.1:43933/solr got event WatchedEvent state:SyncConnected type:None path:null path:null type:None
   [junit4]   2> 2074549 INFO  (jetty-launcher-23785-thread-1) [    ] o.a.s.c.c.SolrZkClient Using default ZkACLProvider
   [junit4]   2> 2074549 INFO  (jetty-launcher-23785-thread-3) [    ] o.a.s.c.c.ConnectionManager Client is connected to ZooKeeper
   [junit4]   2> 2074549 INFO  (jetty-launcher-23785-thread-3) [    ] o.a.s.c.c.SolrZkClient Using default ZkACLProvider
   [junit4]   2> 2074549 INFO  (jetty-launcher-23785-thread-1) [    ] o.a.s.s.SolrDispatchFilter solr.xml found in ZooKeeper. Loading...
   [junit4]   2> 2074550 INFO  (jetty-launcher-23785-thread-3) [    ] o.a.s.s.SolrDispatchFilter solr.xml found in ZooKeeper. Loading...
   [junit4]   2> 2074554 INFO  (jetty-launcher-23785-thread-1) [    ] o.a.s.c.CorePropertiesLocator Config-defined core root directory: /home/jenkins/workspace/Lucene-Solr-6.x-Linux/solr/build/solr-core/test/J0/temp/solr.security.BasicAuthIntegrationTest_A02E38E6F47D283A-001/tempDir-001/node1/.
   [junit4]   2> 2074554 INFO  (jetty-launcher-23785-thread-2) [    ] o.a.s.c.CorePropertiesLocator Config-defined core root directory: /home/jenkins/workspace/Lucene-Solr-6.x-Linux/solr/build/solr-core/test/J0/temp/solr.security.BasicAuthIntegrationTest_A02E38E6F47D283A-001/tempDir-001/node2/.
   [junit4]   2> 2074554 INFO  (jetty-launcher-23785-thread-1) [    ] o.a.s.c.CoreContainer New CoreContainer 26649718
   [junit4]   2> 2074554 INFO  (jetty-launcher-23785-thread-2) [    ] o.a.s.c.CoreContainer New CoreContainer 24801436
   [junit4]   2> 2074554 INFO  (jetty-launcher-23785-thread-1) [    ] o.a.s.c.CoreContainer Loading cores into CoreContainer [instanceDir=/home/jenkins/workspace/Lucene-Solr-6.x-Linux/solr/build/solr-core/test/J0/temp/solr.security.BasicAuthIntegrationTest_A02E38E6F47D283A-001/tempDir-001/node1]
   [junit4]   2> 2074555 INFO  (jetty-launcher-23785-thread-2) [    ] o.a.s.c.CoreContainer Loading cores into CoreContainer [instanceDir=/home/jenkins/workspace/Lucene-Solr-6.x-Linux/solr/build/solr-core/test/J0/temp/solr.security.BasicAuthIntegrationTest_A02E38E6F47D283A-001/tempDir-001/node2]
   [junit4]   2> 2074554 WARN  (NIOServerCxn.Factory:0.0.0.0/0.0.0.0:0) [    ] o.a.z.s.NIOServerCnxn caught end of stream exception
   [junit4]   2> EndOfStreamException: Unable to read additional data from client sessionid 0x1570fd579470003, likely client has closed socket
   [junit4]   2> 	at org.apache.zookeeper.server.NIOServerCnxn.doIO(NIOServerCnxn.java:228)
   [junit4]   2> 	at org.apache.zookeeper.server.NIOServerCnxnFactory.run(NIOServerCnxnFactory.java:208)
   [junit4]   2> 	at java.lang.Thread.run(Thread.java:745)
   [junit4]   2> 2074554 INFO  (jetty-launcher-23785-thread-3) [    ] o.a.s.c.CorePropertiesLocator Config-defined core root directory: /home/jenkins/workspace/Lucene-Solr-6.x-Linux/solr/build/solr-core/test/J0/temp/solr.security.BasicAuthIntegrationTest_A02E38E6F47D283A-001/tempDir-001/node3/.
   [junit4]   2> 2074555 WARN  (jetty-launcher-23785-thread-2) [    ] o.a.s.c.CoreContainer Couldn't add files from /home/jenkins/workspace/Lucene-Solr-6.x-Linux/solr/build/solr-core/test/J0/temp/solr.security.BasicAuthIntegrationTest_A02E38E6F47D283A-001/tempDir-001/node2/lib to classpath: /home/jenkins/workspace/Lucene-Solr-6.x-Linux/solr/build/solr-core/test/J0/temp/solr.security.BasicAuthIntegrationTest_A02E38E6F47D283A-001/tempDir-001/node2/lib
   [junit4]   2> 2074555 WARN  (jetty-launcher-23785-thread-1) [    ] o.a.s.c.CoreContainer Couldn't add files from /home/jenkins/workspace/Lucene-Solr-6.x-Linux/solr/build/solr-core/test/J0/temp/solr.security.BasicAuthIntegrationTest_A02E38E6F47D283A-001/tempDir-001/node1/lib to classpath: /home/jenkins/workspace/Lucene-Solr-6.x-Linux/solr/build/solr-core/test/J0/temp/solr.security.BasicAuthIntegrationTest_A02E38E6F47D283A-001/tempDir-001/node1/lib
   [junit4]   2> 2074555 INFO  (jetty-launcher-23785-thread-2) [    ] o.a.s.h.c.HttpShardHandlerFactory created with socketTimeout : 90000,urlScheme : https,connTimeout : 15000,maxConnectionsPerHost : 20,maxConnections : 10000,corePoolSize : 0,maximumPoolSize : 2147483647,maxThreadIdleTime : 5,sizeOfQueue : -1,fairnessPolicy : false,useRetries : false,connectionsEvictorSleepDelay : 5000,maxConnectionIdleTime : 40000,
   [junit4]   2> 2074556 INFO  (jetty-launcher-23785-thread-1) [    ] o.a.s.h.c.HttpShardHandlerFactory created with socketTimeout : 90000,urlScheme : https,connTimeout : 15000,maxConnectionsPerHost : 20,maxConnections : 10000,corePoolSize : 0,maximumPoolSize : 2147483647,maxThreadIdleTime : 5,sizeOfQueue : -1,fairnessPolicy : false,useRetries : false,connectionsEvictorSleepDelay : 5000,maxConnectionIdleTime : 40000,
   [junit4]   2> 2074555 WARN  (NIOServerCxn.Factory:0.0.0.0/0.0.0.0:0) [    ] o.a.z.s.NIOServerCnxn caught end of stream exception
   [junit4]   2> EndOfStreamException: Unable to read additional data from client sessionid 0x1570fd579470001, likely client has closed socket
   [junit4]   2> 	at org.apache.zookeeper.server.NIOServerCnxn.doIO(NIOServerCnxn.java:228)
   [junit4]   2> 	at org.apache.zookeeper.server.NIOServerCnxnFactory.run(NIOServerCnxnFactory.java:208)
   [junit4]   2> 	at java.lang.Thread.run(Thread.java:745)
   [junit4]   2> 2074555 INFO  (jetty-launcher-23785-thread-3) [    ] o.a.s.c.CoreContainer New CoreContainer 13225363
   [junit4]   2> 2074556 INFO  (jetty-launcher-23785-thread-3) [    ] o.a.s.c.CoreContainer Loading cores into CoreContainer [instanceDir=/home/jenkins/workspace/Lucene-Solr-6.x-Linux/solr/build/solr-core/test/J0/temp/solr.security.BasicAuthIntegrationTest_A02E38E6F47D283A-001/tempDir-001/node3]
   [junit4]   2> 2074556 WARN  (jetty-launcher-23785-thread-3) [    ] o.a.s.c.CoreContainer Couldn't add files from /home/jenkins/workspace/Lucene-Solr-6.x-Linux/solr/build/solr-core/test/J0/temp/solr.security.BasicAuthIntegrationTest_A02E38E6F47D283A-001/tempDir-001/node3/lib to classpath: /home/jenkins/workspace/Lucene-Solr-6.x-Linux/solr/build/solr-core/test/J0/temp/solr.security.BasicAuthIntegrationTest_A02E38E6F47D283A-001/tempDir-001/node3/lib
   [junit4]   2> 2074556 INFO  (jetty-launcher-23785-thread-3) [    ] o.a.s.h.c.HttpShardHandlerFactory created with socketTimeout : 90000,urlScheme : https,connTimeout : 15000,maxConnectionsPerHost : 20,maxConnections : 10000,corePoolSize : 0,maximumPoolSize : 2147483647,maxThreadIdleTime : 5,sizeOfQueue : -1,fairnessPolicy : false,useRetries : false,connectionsEvictorSleepDelay : 5000,maxConnectionIdleTime : 40000,
   [junit4]   2> 2074557 INFO  (jetty-launcher-23785-thread-1) [    ] o.a.s.u.UpdateShardHandler Creating UpdateShardHandler HTTP client with params: socketTimeout=340000&connTimeout=45000&retry=true
   [junit4]   2> 2074557 INFO  (jetty-launcher-23785-thread-2) [    ] o.a.s.u.UpdateShardHandler Creating UpdateShardHandler HTTP client with params: socketTimeout=340000&connTimeout=45000&retry=true
   [junit4]   2> 2074557 INFO  (jetty-launcher-23785-thread-3) [    ] o.a.s.u.UpdateShardHandler Creating UpdateShardHandler HTTP client with params: socketTimeout=340000&connTimeout=45000&retry=true
   [junit4]   2> 2074557 INFO  (jetty-launcher-23785-thread-1) [    ] o.a.s.l.LogWatcher SLF4J impl is org.slf4j.impl.Log4jLoggerFactory
   [junit4]   2> 2074557 INFO  (jetty-launcher-23785-thread-1) [    ] o.a.s.l.LogWatcher Registering Log Listener [Log4j (org.slf4j.impl.Log4jLoggerFactory)]
   [junit4]   2> 2074557 INFO  (jetty-launcher-23785-thread-2) [    ] o.a.s.l.LogWatcher SLF4J impl is org.slf4j.impl.Log4jLoggerFactory
   [junit4]   2> 2074558 INFO  (jetty-launcher-23785-thread-2) [    ] o.a.s.l.LogWatcher Registering Log Listener [Log4j (org.slf4j.impl.Log4jLoggerFactory)]
   [junit4]   2> 2074558 INFO  (jetty-launcher-23785-thread-1) [    ] o.a.s.c.ZkContainer Zookeeper client=127.0.0.1:43933/solr
   [junit4]   2> 2074558 INFO  (jetty-launcher-23785-thread-1) [    ] o.a.s.c.ZkController zkHost includes chroot
   [junit4]   2> 2074558 INFO  (jetty-launcher-23785-thread-2) [    ] o.a.s.c.ZkContainer Zookeeper client=127.0.0.1:43933/solr
   [junit4]   2> 2074558 INFO  (jetty-launcher-23785-thread-1) [    ] o.a.s.c.c.SolrZkClient Using default ZkCredentialsProvider
   [junit4]   2> 2074558 INFO  (jetty-launcher-23785-thread-2) [    ] o.a.s.c.ZkController zkHost includes chroot
   [junit4]   2> 2074558 INFO  (jetty-launcher-23785-thread-3) [    ] o.a.s.l.LogWatcher SLF4J impl is org.slf4j.impl.Log4jLoggerFactory
   [junit4]   2> 2074558 INFO  (jetty-launcher-23785-thread-2) [    ] o.a.s.c.c.SolrZkClient Using default ZkCredentialsProvider
   [junit4]   2> 2074558 INFO  (jetty-launcher-23785-thread-3) [    ] o.a.s.l.LogWatcher Registering Log Listener [Log4j (org.slf4j.impl.Log4jLoggerFactory)]
   [junit4]   2> 2074558 INFO  (jetty-launcher-23785-thread-1) [    ] o.a.s.c.c.ConnectionManager Waiting for client to connect to ZooKeeper
   [junit4]   2> 2074558 INFO  (jetty-launcher-23785-thread-3) [    ] o.a.s.c.ZkContainer Zookeeper client=127.0.0.1:43933/solr
   [junit4]   2> 2074558 INFO  (jetty-launcher-23785-thread-2) [    ] o.a.s.c.c.ConnectionManager Waiting for client to connect to ZooKeeper
   [junit4]   2> 2074558 INFO  (jetty-launcher-23785-thread-3) [    ] o.a.s.c.ZkController zkHost includes chroot
   [junit4]   2> 2074558 INFO  (jetty-launcher-23785-thread-3) [    ] o.a.s.c.c.SolrZkClient Using default ZkCredentialsProvider
   [junit4]   2> 2074559 INFO  (jetty-launcher-23785-thread-3) [    ] o.a.s.c.c.ConnectionManager Waiting for client to connect to ZooKeeper
   [junit4]   2> 2074560 INFO  (zkCallback-23796-thread-1) [    ] o.a.s.c.c.ConnectionManager Watcher org.apache.solr.common.cloud.ConnectionManager@1cabf38 name:ZooKeeperConnection Watcher:127.0.0.1:43933 got event WatchedEvent state:SyncConnected type:None path:null path:null type:None
   [junit4]   2> 2074560 INFO  (jetty-launcher-23785-thread-1) [    ] o.a.s.c.c.ConnectionManager Client is connected to ZooKeeper
   [junit4]   2> 2074560 INFO  (zkCallback-23797-thread-1) [    ] o.a.s.c.c.ConnectionManager Watcher org.apache.solr.common.cloud.ConnectionManager@3573e1 name:ZooKeeperConnection Watcher:127.0.0.1:43933 got event WatchedEvent state:SyncConnected type:None path:null path:null type:None
   [junit4]   2> 2074561 INFO  (jetty-launcher-23785-thread-2) [    ] o.a.s.c.c.ConnectionManager Client is connected to ZooKeeper
   [junit4]   2> 2074561 INFO  (zkCallback-23798-thread-1) [    ] o.a.s.c.c.ConnectionManager Watcher org.apache.solr.common.cloud.ConnectionManager@15e02f0 name:ZooKeeperConnection Watcher:127.0.0.1:43933 got event WatchedEvent state:SyncConnected type:None path:null path:null type:None
   [junit4]   2> 2074561 INFO  (jetty-launcher-23785-thread-1) [    ] o.a.s.c.c.SolrZkClient Using default ZkACLProvider
   [junit4]   2> 2074561 INFO  (jetty-launcher-23785-thread-2) [    ] o.a.s.c.c.SolrZkClient Using default ZkACLProvider
   [junit4]   2> 2074561 INFO  (jetty-launcher-23785-thread-3) [    ] o.a.s.c.c.ConnectionManager Client is connected to ZooKeeper
   [junit4]   2> 2074561 INFO  (jetty-launcher-23785-thread-3) [    ] o.a.s.c.c.SolrZkClient Using default ZkACLProvider
   [junit4]   2> 2074562 INFO  (jetty-launcher-23785-thread-1) [n:127.0.0.1:43754_solr    ] o.a.s.c.ZkController Added new OnReconnect listener org.apache.solr.cloud.ZkController$$Lambda$11/13464963@125ded1
   [junit4]   2> 2074562 INFO  (jetty-launcher-23785-thread-2) [n:127.0.0.1:36140_solr    ] o.a.s.c.ZkController Added new OnReconnect listener org.apache.solr.cloud.ZkController$$Lambda$11/13464963@458035
   [junit4]   2> 2074562 INFO  (jetty-launcher-23785-thread-1) [n:127.0.0.1:43754_solr    ] o.a.s.c.c.ConnectionManager Waiting for client to connect to ZooKeeper
   [junit4]   2> 2074562 INFO  (jetty-launcher-23785-thread-2) [n:127.0.0.1:36140_solr    ] o.a.s.c.c.ConnectionManager Waiting for client to connect to ZooKeeper
   [junit4]   2> 2074562 INFO  (jetty-launcher-23785-thread-3) [n:127.0.0.1:41831_solr    ] o.a.s.c.ZkController Added new OnReconnect listener org.apache.solr.cloud.ZkController$$Lambda$11/13464963@1e377e7
   [junit4]   2> 2074562 INFO  (jetty-launcher-23785-thread-3) [n:127.0.0.1:41831_solr    ] o.a.s.c.c.ConnectionManager Waiting for client to connect to ZooKeeper
   [junit4]   2> 2074563 INFO  (zkCallback-23800-thread-1-processing-n:127.0.0.1:36140_solr) [n:127.0.0.1:36140_solr    ] o.a.s.c.c.ConnectionManager Watcher org.apache.solr.common.cloud.ConnectionManager@2f8403 name:ZooKeeperConnection Watcher:127.0.0.1:43933/solr got event WatchedEvent state:SyncConnected type:None path:null path:null type:None
   [junit4]   2> 2074563 INFO  (jetty-launcher-23785-thread-2) [n:127.0.0.1:36140_solr    ] o.a.s.c.c.ConnectionManager Client is connected to ZooKeeper
   [junit4]   2> 2074563 INFO  (zkCallback-23799-thread-1-processing-n:127.0.0.1:43754_solr) [n:127.0.0.1:43754_solr    ] o.a.s.c.c.ConnectionManager Watcher org.apache.solr.common.cloud.ConnectionManager@24d91f name:ZooKeeperConnection Watcher:127.0.0.1:43933/solr got event WatchedEvent state:SyncConnected type:None path:null path:null type:None
   [junit4]   2> 2074563 INFO  (jetty-launcher-23785-thread-1) [n:127.0.0.1:43754_solr    ] o.a.s.c.c.ConnectionManager Client is connected to ZooKeeper
   [junit4]   2> 2074563 INFO  (zkCallback-23801-thread-1-processing-n:127.0.0.1:41831_solr) [n:127.0.0.1:41831_solr    ] o.a.s.c.c.ConnectionManager Watcher org.apache.solr.common.cloud.ConnectionManager@f21955 name:ZooKeeperConnection Watcher:127.0.0.1:43933/solr got event WatchedEvent state:SyncConnected type:None path:null path:null type:None
   [junit4]   2> 2074563 INFO  (jetty-launcher-23785-thread-3) [n:127.0.0.1:41831_solr    ] o.a.s.c.c.ConnectionManager Client is connected to ZooKeeper
   [junit4]   2> 2074564 INFO  (jetty-launcher-23785-thread-2) [n:127.0.0.1:36140_solr    ] o.a.s.c.c.SolrZkClient makePath: /overseer/queue
   [junit4]   2> 2074564 INFO  (jetty-launcher-23785-thread-1) [n:127.0.0.1:43754_solr    ] o.a.s.c.c.SolrZkClient makePath: /overseer/queue
   [junit4]   2> 2074564 INFO  (jetty-launcher-23785-thread-3) [n:127.0.0.1:41831_solr    ] o.a.s.c.c.SolrZkClient makePath: /overseer/queue
   [junit4]   2> 2074565 INFO  (jetty-launcher-23785-thread-1) [n:127.0.0.1:43754_solr    ] o.a.s.c.c.SolrZkClient makePath: /overseer/collection-queue-work
   [junit4]   2> 2074565 INFO  (jetty-launcher-23785-thread-2) [n:127.0.0.1:36140_solr    ] o.a.s.c.c.SolrZkClient makePath: /overseer/collection-queue-work
   [junit4]   2> 2074565 INFO  (jetty-launcher-23785-thread-3) [n:127.0.0.1:41831_solr    ] o.a.s.c.c.SolrZkClient makePath: /overseer/collection-queue-work
   [junit4]   2> 2074567 INFO  (jetty-launcher-23785-thread-2) [n:127.0.0.1:36140_solr    ] o.a.s.c.c.SolrZkClient makePath: /overseer/collection-map-running
   [junit4]   2> 2074567 INFO  (jetty-launcher-23785-thread-3) [n:127.0.0.1:41831_solr    ] o.a.s.c.c.SolrZkClient makePath: /overseer/collection-map-running
   [junit4]   2> 2074568 INFO  (jetty-launcher-23785-thread-1) [n:127.0.0.1:43754_solr    ] o.a.s.c.c.SolrZkClient makePath: /overseer/collection-map-running
   [junit4]   2> 2074569 INFO  (jetty-launcher-23785-thread-3) [n:127.0.0.1:41831_solr    ] o.a.s.c.c.SolrZkClient makePath: /overseer/collection-map-completed
   [junit4]   2> 2074569 INFO  (jetty-launcher-23785-thread-1) [n:127.0.0.1:43754_solr    ] o.a.s.c.c.SolrZkClient makePath: /overseer/collection-map-completed
   [junit4]   2> 2074569 INFO  (jetty-launcher-23785-thread-2) [n:127.0.0.1:36140_solr    ] o.a.s.c.c.SolrZkClient makePath: /overseer/collection-map-completed
   [junit4]   2> 2074570 INFO  (jetty-launcher-23785-thread-2) [n:127.0.0.1:36140_solr    ] o.a.s.c.c.SolrZkClient makePath: /overseer/collection-map-failure
   [junit4]   2> 2074570 INFO  (jetty-launcher-23785-thread-1) [n:127.0.0.1:43754_solr    ] o.a.s.c.c.SolrZkClient makePath: /overseer/collection-map-failure
   [junit4]   2> 2074570 INFO  (jetty-launcher-23785-thread-3) [n:127.0.0.1:41831_solr    ] o.a.s.c.c.SolrZkClient makePath: /overseer/collection-map-failure
   [junit4]   2> 2074573 INFO  (jetty-launcher-23785-thread-2) [n:127.0.0.1:36140_solr    ] o.a.s.c.c.SolrZkClient makePath: /live_nodes
   [junit4]   2> 2074573 INFO  (jetty-launcher-23785-thread-3) [n:127.0.0.1:41831_solr    ] o.a.s.c.c.SolrZkClient makePath: /live_nodes
   [junit4]   2> 2074574 INFO  (jetty-launcher-23785-thread-1) [n:127.0.0.1:43754_solr    ] o.a.s.c.c.SolrZkClient makePath: /live_nodes
   [junit4]   2> 2074574 INFO  (jetty-launcher-23785-thread-3) [n:127.0.0.1:41831_solr    ] o.a.s.c.c.SolrZkClient makePath: /collections
   [junit4]   2> 2074574 INFO  (jetty-launcher-23785-thread-1) [n:127.0.0.1:43754_solr    ] o.a.s.c.c.SolrZkClient makePath: /collections
   [junit4]   2> 2074575 INFO  (jetty-launcher-23785-thread-2) [n:127.0.0.1:36140_solr    ] o.a.s.c.c.SolrZkClient makePath: /collections
   [junit4]   2> 2074575 INFO  (jetty-launcher-23785-thread-1) [n:127.0.0.1:43754_solr    ] o.a.s.c.c.SolrZkClient makePath: /aliases.json
   [junit4]   2> 2074575 INFO  (jetty-launcher-23785-thread-3) [n:127.0.0.1:41831_solr    ] o.a.s.c.c.SolrZkClient makePath: /aliases.json
   [junit4]   2> 2074575 INFO  (jetty-launcher-23785-thread-2) [n:127.0.0.1:36140_solr    ] o.a.s.c.c.SolrZkClient makePath: /aliases.json
   [junit4]   2> 2074576 INFO  (jetty-launcher-23785-thread-3) [n:127.0.0.1:41831_solr    ] o.a.s.c.c.SolrZkClient makePath: /clusterstate.json
   [junit4]   2> 2074576 INFO  (jetty-launcher-23785-thread-2) [n:127.0.0.1:36140_solr    ] o.a.s.c.c.SolrZkClient makePath: /clusterstate.json
   [junit4]   2> 2074576 INFO  (jetty-launcher-23785-thread-1) [n:127.0.0.1:43754_solr    ] o.a.s.c.c.SolrZkClient makePath: /clusterstate.json
   [junit4]   2> 2074598 INFO  (jetty-launcher-23785-thread-2) [n:127.0.0.1:36140_solr    ] o.a.s.c.c.SolrZkClient makePath: /security.json
   [junit4]   2> 2074599 INFO  (jetty-launcher-23785-thread-1) [n:127.0.0.1:43754_solr    ] o.a.s.c.c.SolrZkClient makePath: /security.json
   [junit4]   2> 2074599 INFO  (jetty-launcher-23785-thread-3) [n:127.0.0.1:41831_solr    ] o.a.s.c.c.SolrZkClient makePath: /security.json
   [junit4]   2> 2074599 INFO  (jetty-launcher-23785-thread-1) [n:127.0.0.1:43754_solr    ] o.a.s.c.c.ZkStateReader Updating cluster state from ZooKeeper... 
   [junit4]   2> 2074600 INFO  (jetty-launcher-23785-thread-3) [n:127.0.0.1:41831_solr    ] o.a.s.c.c.ZkStateReader Updating cluster state from ZooKeeper... 
   [junit4]   2> 2074600 INFO  (jetty-launcher-23785-thread-2) [n:127.0.0.1:36140_solr    ] o.a.s.c.c.ZkStateReader Updating cluster state from ZooKeeper... 
   [junit4]   2> 2074600 INFO  (jetty-launcher-23785-thread-2) [n:127.0.0.1:36140_solr    ] o.a.s.c.c.ZkStateReader Loaded cluster properties: {urlScheme=https}
   [junit4]   2> 2074600 INFO  (jetty-launcher-23785-thread-1) [n:127.0.0.1:43754_solr    ] o.a.s.c.c.ZkStateReader Loaded cluster properties: {urlScheme=https}
   [junit4]   2> 2074600 INFO  (jetty-launcher-23785-thread-3) [n:127.0.0.1:41831_solr    ] o.a.s.c.c.ZkStateReader Loaded cluster properties: {urlScheme=https}
   [junit4]   2> 2074600 INFO  (jetty-launcher-23785-thread-2) [n:127.0.0.1:36140_solr    ] o.a.s.c.c.ZkStateReader Updated live nodes from ZooKeeper... (0) -> (0)
   [junit4]   2> 2074600 INFO  (jetty-launcher-23785-thread-1) [n:127.0.0.1:43754_solr    ] o.a.s.c.c.ZkStateReader Updated live nodes from ZooKeeper... (0) -> (0)
   [junit4]   2> 2074600 INFO  (jetty-launcher-23785-thread-3) [n:127.0.0.1:41831_solr    ] o.a.s.c.c.ZkStateReader Updated live nodes from ZooKeeper... (0) -> (0)
   [junit4]   2> 2074602 INFO  (jetty-launcher-23785-thread-1) [n:127.0.0.1:43754_solr    ] o.a.s.c.c.SolrZkClient makePath: /overseer_elect
   [junit4]   2> 2074602 INFO  (jetty-launcher-23785-thread-2) [n:127.0.0.1:36140_solr    ] o.a.s.c.c.SolrZkClient makePath: /overseer_elect
   [junit4]   2> 2074603 INFO  (jetty-launcher-23785-thread-3) [n:127.0.0.1:41831_solr    ] o.a.s.c.c.SolrZkClient makePath: /overseer_elect
   [junit4]   2> 2074603 INFO  (jetty-launcher-23785-thread-2) [n:127.0.0.1:36140_solr    ] o.a.s.c.c.SolrZkClient makePath: /overseer_elect/election
   [junit4]   2> 2074603 INFO  (jetty-launcher-23785-thread-3) [n:127.0.0.1:41831_solr    ] o.a.s.c.c.SolrZkClient makePath: /overseer_elect/election
   [junit4]   2> 2074603 INFO  (jetty-launcher-23785-thread-1) [n:127.0.0.1:43754_solr    ] o.a.s.c.c.SolrZkClient makePath: /overseer_elect/election
   [junit4]   2> 2074604 INFO  (jetty-launcher-23785-thread-1) [n:127.0.0.1:43754_solr    ] o.a.s.c.Overseer Overseer (id=null) closing
   [junit4]   2> 2074604 INFO  (jetty-launcher-23785-thread-3) [n:127.0.0.1:41831_solr    ] o.a.s.c.Overseer Overseer (id=null) closing
   [junit4]   2> 2074604 INFO  (jetty-launcher-23785-thread-2) [n:127.0.0.1:36140_solr    ] o.a.s.c.Overseer Overseer (id=null) closing
   [junit4]   2> 2074605 INFO  (jetty-launcher-23785-thread-1) [n:127.0.0.1:43754_solr    ] o.a.s.c.LeaderElector Joined leadership election with path: /overseer_elect/election/96563326548901896-127.0.0.1:43754_solr-n_0000000000
   [junit4]   2> 2074605 INFO  (jetty-launcher-23785-thread-3) [n:127.0.0.1:41831_solr    ] o.a.s.c.LeaderElector Joined leadership election with path: /overseer_elect/election/96563326548901897-127.0.0.1:41831_solr-n_0000000001
   [junit4]   2> 2074605 INFO  (jetty-launcher-23785-thread-2) [n:127.0.0.1:36140_solr    ] o.a.s.c.LeaderElector Joined leadership election with path: /overseer_elect/election/96563326548901895-127.0.0.1:36140_solr-n_0000000002
   [junit4]   2> 2074605 INFO  (jetty-launcher-23785-thread-1) [n:127.0.0.1:43754_solr    ] o.a.s.c.OverseerElectionContext I am going to be the leader 127.0.0.1:43754_solr
   [junit4]   2> 2074605 INFO  (jetty-launcher-23785-thread-1) [n:127.0.0.1:43754_solr    ] o.a.s.c.c.SolrZkClient makePath: /overseer_elect/leader
   [junit4]   2> 2074605 INFO  (jetty-launcher-23785-thread-3) [n:127.0.0.1:41831_solr    ] o.a.s.c.LeaderElector Watching path /overseer_elect/election/96563326548901896-127.0.0.1:43754_solr-n_0000000000 to know if I could be the leader
   [junit4]   2> 2074605 INFO  (jetty-launcher-23785-thread-2) [n:127.0.0.1:36140_solr    ] o.a.s.c.LeaderElector Watching path /overseer_elect/election/96563326548901897-127.0.0.1:41831_solr-n_0000000001 to know if I could be the leader
   [junit4]   2> 2074606 INFO  (jetty-launcher-23785-thread-3) [n:127.0.0.1:41831_solr    ] o.a.s.c.ZkController Register node as live in ZooKeeper:/live_nodes/127.0.0.1:41831_solr
   [junit4]   2> 2074606 INFO  (jetty-launcher-23785-thread-3) [n:127.0.0.1:41831_solr    ] o.a.s.c.c.SolrZkClient makePath: /live_nodes/127.0.0.1:41831_solr
   [junit4]   2> 2074606 INFO  (jetty-launcher-23785-thread-2) [n:127.0.0.1:36140_solr    ] o.a.s.c.ZkController Register node as live in ZooKeeper:/live_nodes/127.0.0.1:36140_solr
   [junit4]   2> 2074606 INFO  (jetty-launcher-23785-thread-2) [n:127.0.0.1:36140_solr    ] o.a.s.c.c.SolrZkClient makePath: /live_nodes/127.0.0.1:36140_solr
   [junit4]   2> 2074606 INFO  (jetty-launcher-23785-thread-1) [n:127.0.0.1:43754_solr    ] o.a.s.c.Overseer Overseer (id=96563326548901896-127.0.0.1:43754_solr-n_0000000000) starting
   [junit4]   2> 2074607 INFO  (zkCallback-23801-thread-1-processing-n:127.0.0.1:41831_solr) [n:127.0.0.1:41831_solr    ] o.a.s.c.c.ZkStateReader A live node change: [WatchedEvent state:SyncConnected type:NodeChildrenChanged path:/live_nodes], has occurred - updating... (live nodes size: [0])
   [junit4]   2> 2074607 INFO  (zkCallback-23799-thread-1-processing-n:127.0.0.1:43754_solr) [n:127.0.0.1:43754_solr    ] o.a.s.c.c.ZkStateReader A live node change: [WatchedEvent state:SyncConnected type:NodeChildrenChanged path:/live_nodes], has occurred - updating... (live nodes size: [0])
   [junit4]   2> 2074607 INFO  (zkCallback-23800-thread-1-processing-n:127.0.0.1:36140_solr) [n:127.0.0.1:36140_solr    ] o.a.s.c.c.ZkStateReader A live node change: [WatchedEvent state:SyncConnected type:NodeChildrenChanged path:/live_nodes], has occurred - updating... (live nodes size: [0])
   [junit4]   2> 2074609 INFO  (zkCallback-23799-thread-1-processing-n:127.0.0.1:43754_solr) [n:127.0.0.1:43754_solr    ] o.a.s.c.c.ZkStateReader Updated live nodes from ZooKeeper... (0) -> (2)
   [junit4]   2> 2074609 INFO  (zkCallback-23801-thread-1-processing-n:127.0.0.1:41831_solr) [n:127.0.0.1:41831_solr    ] o.a.s.c.c.ZkStateReader Updated live nodes from ZooKeeper... (0) -> (2)
   [junit4]   2> 2074609 INFO  (zkCallback-23800-thread-1-processing-n:127.0.0.1:36140_solr) [n:127.0.0.1:36140_solr    ] o.a.s.c.c.ZkStateReader Updated live nodes from ZooKeeper... (0) -> (2)
   [junit4]   2> 2074613 INFO  (jetty-launcher-23785-thread-1) [n:127.0.0.1:43754_solr    ] o.a.s.c.c.SolrZkClient makePath: /overseer/queue-work
   [junit4]   2> 2074623 INFO  (jetty-launcher-23785-thread-1) [n:127.0.0.1:43754_solr    ] o.a.s.c.OverseerAutoReplicaFailoverThread Starting OverseerAutoReplicaFailoverThread autoReplicaFailoverWorkLoopDelay=10000 autoReplicaFailoverWaitAfterExpiration=30000 autoReplicaFailoverBadNodeExpiration=60000
   [junit4]   2> 2074624 INFO  (OverseerStateUpdate-96563326548901896-127.0.0.1:43754_solr-n_0000000000) [n:127.0.0.1:43754_solr    ] o.a.s.c.Overseer Starting to work on the main queue
   [junit4]   2> 2074625 INFO  (OverseerStateUpdate-96563326548901896-127.0.0.1:43754_solr-n_0000000000) [n:127.0.0.1:43754_solr    ] o.a.s.c.c.ZkStateReader Updated live nodes from ZooKeeper... (2) -> (2)
   [junit4]   2> 2074626 INFO  (OverseerCollectionConfigSetProcessor-96563326548901896-127.0.0.1:43754_solr-n_0000000000) [n:127.0.0.1:43754_solr    ] o.a.s.c.OverseerTaskProcessor Process current queue of overseer operations
   [junit4]   2> 2074626 INFO  (jetty-launcher-23785-thread-1) [n:127.0.0.1:43754_solr    ] o.a.s.c.ZkController Publish node=127.0.0.1:43754_solr as DOWN
   [junit4]   2> 2074628 INFO  (jetty-launcher-23785-thread-1) [n:127.0.0.1:43754_solr    ] o.a.s.c.ZkController Register node as live in ZooKeeper:/live_nodes/127.0.0.1:43754_solr
   [junit4]   2> 2074628 INFO  (jetty-launcher-23785-thread-1) [n:127.0.0.1:43754_solr    ] o.a.s.c.c.SolrZkClient makePath: /live_nodes/127.0.0.1:43754_solr
   [junit4]   2> 2074628 INFO  (OverseerStateUpdate-96563326548901896-127.0.0.1:43754_solr-n_0000000000) [n:127.0.0.1:43754_solr    ] o.a.s.c.Overseer processMessage: queueSize: 1, message = {
   [junit4]   2>   "operation":"downnode",
   [junit4]   2>   "node_name":"127.0.0.1:43754_solr"} current state version: 0
   [junit4]   2> 2074628 INFO  (OverseerStateUpdate-96563326548901896-127.0.0.1:43754_solr-n_0000000000) [n:127.0.0.1:43754_solr    ] o.a.s.c.o.NodeMutator DownNode state invoked for node: 127.0.0.1:43754_solr
   [junit4]   2> 2074629 INFO  (zkCallback-23801-thread-1-processing-n:127.0.0.1:41831_solr) [n:127.0.0.1:41831_solr    ] o.a.s.c.c.ZkStateReader A live node change: [WatchedEvent state:SyncConnected type:NodeChildrenChanged path:/live_nodes], has occurred - updating... (live nodes size: [2])
   [junit4]   2> 2074629 INFO  (zkCallback-23799-thread-1-processing-n:127.0.0.1:43754_solr) [n:127.0.0.1:43754_solr    ] o.a.s.c.c.ZkStateReader A live node change: [WatchedEvent state:SyncConnected type:NodeChildrenChanged path:/live_nodes], has occurred - updating... (live nodes size: [2])
   [junit4]   2> 2074629 INFO  (zkCallback-23800-thread-1-processing-n:127.0.0.1:36140_solr) [n:127.0.0.1:36140_solr    ] o.a.s.c.c.ZkStateReader A live node change: [WatchedEvent state:SyncConnected type:NodeChildrenChanged path:/live_nodes], has occurred - updating... (live nodes size: [2])
   [junit4]   2> 2074629 INFO  (zkCallback-23799-thread-1-processing-n:127.0.0.1:43754_solr) [n:127.0.0.1:43754_solr    ] o.a.s.c.c.ZkStateReader Updated live nodes from ZooKeeper... (2) -> (3)
   [junit4]   2> 2074629 INFO  (zkCallback-23800-thread-1-processing-n:127.0.0.1:36140_solr) [n:127.0.0.1:36140_solr    ] o.a.s.c.c.ZkStateReader Updated live nodes from ZooKeeper... (2) -> (3)
   [junit4]   2> 2074629 INFO  (zkCallback-23801-thread-1-processing-n:127.0.0.1:41831_solr) [n:127.0.0.1:41831_solr    ] o.a.s.c.c.ZkStateReader Updated live nodes from ZooKeeper... (2) -> (3)
   [junit4]   2> 2074676 INFO  (jetty-launcher-23785-thread-3) [n:127.0.0.1:41831_solr    ] o.a.s.c.CoreContainer Security conf doesn't exist. Skipping setup for authorization module.
   [junit4]   2> 2074676 INFO  (jetty-launcher-23785-thread-3) [n:127.0.0.1:41831_solr    ] o.a.s.c.CoreContainer No authentication plugin used.
   [junit4]   2> 2074677 INFO  (jetty-launcher-23785-thread-3) [n:127.0.0.1:41831_solr    ] o.a.s.c.CorePropertiesLocator Looking for core definitions underneath /home/jenkins/workspace/Lucene-Solr-6.x-Linux/solr/build/solr-core/test/J0/temp/solr.security.BasicAuthIntegrationTest_A02E38E6F47D283A-001/tempDir-001/node3/.
   [junit4]   2> 2074677 INFO  (jetty-launcher-23785-thread-3) [n:127.0.0.1:41831_solr    ] o.a.s.c.CorePropertiesLocator Found 0 core definitions
   [junit4]   2> 2074678 INFO  (jetty-launcher-23785-thread-3) [n:127.0.0.1:41831_solr    ] o.a.s.s.SolrDispatchFilter user.dir=/home/jenkins/workspace/Lucene-Solr-6.x-Linux/solr/build/solr-core/test/J0
   [junit4]   2> 2074678 INFO  (jetty-launcher-23785-thread-3) [n:127.0.0.1:41831_solr    ] o.a.s.s.SolrDispatchFilter SolrDispatchFilter.init() done
   [junit4]   2> 2074694 INFO  (jetty-launcher-23785-thread-2) [n:127.0.0.1:36140_solr    ] o.a.s.c.CoreContainer Security conf doesn't exist. Skipping setup for authorization module.
   [junit4]   2> 2074694 INFO  (jetty-launcher-23785-thread-2) [n:127.0.0.1:36140_solr    ] o.a.s.c.CoreContainer No authentication plugin used.
   [junit4]   2> 2074695 INFO  (jetty-launcher-23785-thread-2) [n:127.0.0.1:36140_solr    ] o.a.s.c.CorePropertiesLocator Looking for core definitions underneath /home/jenkins/workspace/Lucene-Solr-6.x-Linux/solr/build/solr-core/test/J0/temp/solr.security.BasicAuthIntegrationTest_A02E38E6F47D283A-001/tempDir-001/node2/.
   [junit4]   2> 2074695 INFO  (jetty-launcher-23785-thread-2) [n:127.0.0.1:36140_solr    ] o.a.s.c.CorePropertiesLocator Found 0 core definitions
   [junit4]   2> 2074696 INFO  (jetty-launcher-23785-thread-2) [n:127.0.0.1:36140_solr    ] o.a.s.s.SolrDispatchFilter user.dir=/home/jenkins/workspace/Lucene-Solr-6.x-Linux/solr/build/solr-core/test/J0
   [junit4]   2> 2074696 INFO  (jetty-launcher-23785-thread-2) [n:127.0.0.1:36140_solr    ] o.a.s.s.SolrDispatchFilter SolrDispatchFilter.init() done
   [junit4]   2> 2074714 INFO  (jetty-launcher-23785-thread-1) [n:127.0.0.1:43754_solr    ] o.a.s.c.CoreContainer Security conf doesn't exist. Skipping setup for authorization module.
   [junit4]   2> 2074714 INFO  (jetty-launcher-23785-thread-1) [n:127.0.0.1:43754_solr    ] o.a.s.c.CoreContainer No authentication plugin used.
   [junit4]   2> 2074714 INFO  (jetty-launcher-23785-thread-1) [n:127.0.0.1:43754_solr    ] o.a.s.c.CorePropertiesLocator Looking for core definitions underneath /home/jenkins/workspace/Lucene-Solr-6.x-Linux/solr/build/solr-core/test/J0/temp/solr.security.BasicAuthIntegrationTest_A02E38E6F47D283A-001/tempDir-001/node1/.
   [junit4]   2> 2074714 INFO  (jetty-launcher-23785-thread-1) [n:127.0.0.1:43754_solr    ] o.a.s.c.CorePropertiesLocator Found 0 core definitions
   [junit4]   2> 2074716 INFO  (jetty-launcher-23785-thread-1) [n:127.0.0.1:43754_solr    ] o.a.s.s.SolrDispatchFilter user.dir=/home/jenkins/workspace/Lucene-Solr-6.x-Linux/solr/build/solr-core/test/J0
   [junit4]   2> 2074716 INFO  (jetty-launcher-23785-thread-1) [n:127.0.0.1:43754_solr    ] o.a.s.s.SolrDispatchFilter SolrDispatchFilter.init() done
   [junit4]   2> 2074716 INFO  (SUITE-BasicAuthIntegrationTest-seed#[A02E38E6F47D283A]-worker) [    ] o.a.s.c.c.SolrZkClient Using default ZkCredentialsProvider
   [junit4]   2> 2074717 INFO  (SUITE-BasicAuthIntegrationTest-seed#[A02E38E6F47D283A]-worker) [    ] o.a.s.c.c.ConnectionManager Waiting for client to connect to ZooKeeper
   [junit4]   2> 2074718 INFO  (zkCallback-23805-thread-1) [    ] o.a.s.c.c.ConnectionManager Watcher org.apache.solr.common.cloud.ConnectionManager@1acca6c name:ZooKeeperConnection Watcher:127.0.0.1:43933 got event WatchedEvent state:SyncConnected type:None path:null path:null type:None
   [junit4]   2> 2074718 INFO  (SUITE-BasicAuthIntegrationTest-seed#[A02E38E6F47D283A]-worker) [    ] o.a.s.c.c.ConnectionManager Client is connected to ZooKeeper
   [junit4]   2> 2074718 INFO  (SUITE-BasicAuthIntegrationTest-seed#[A02E38E6F47D283A]-worker) [    ] o.a.s.c.c.SolrZkClient Using default ZkACLProvider
   [junit4]   2> 2074719 INFO  (SUITE-BasicAuthIntegrationTest-seed#[A02E38E6F47D283A]-worker) [    ] o.a.s.c.c.SolrZkClient Using default ZkCredentialsProvider
   [junit4]   2> 2074720 INFO  (SUITE-BasicAuthIntegrationTest-seed#[A02E38E6F47D283A]-worker) [    ] o.a.s.c.c.ConnectionManager Waiting for client to connect to ZooKeeper
   [junit4]   2> 2074720 INFO  (zkCallback-23808-thread-1) [    ] o.a.s.c.c.ConnectionManager Watcher org.apache.solr.common.cloud.ConnectionManager@109bbab name:ZooKeeperConnection Watcher:127.0.0.1:43933/solr got event WatchedEvent state:SyncConnected type:None path:null path:null type:None
   [junit4]   2> 2074721 INFO  (SUITE-BasicAuthIntegrationTest-seed#[A02E38E6F47D283A]-worker) [    ] o.a.s.c.c.ConnectionManager Client is connected to ZooKeeper
   [junit4]   2> 2074721 INFO  (SUITE-BasicAuthIntegrationTest-seed#[A02E38E6F47D283A]-worker) [    ] o.a.s.c.c.SolrZkClient Using default ZkACLProvider
   [junit4]   2> 2074721 INFO  (SUITE-BasicAuthIntegrationTest-seed#[A02E38E6F47D283A]-worker) [    ] o.a.s.c.c.ZkStateReader Updating cluster state from ZooKeeper... 
   [junit4]   2> 2074721 INFO  (SUITE-BasicAuthIntegrationTest-seed#[A02E38E6F47D283A]-worker) [    ] o.a.s.c.c.ZkStateReader Loaded cluster properties: {urlScheme=https}
   [junit4]   2> 2074722 INFO  (SUITE-BasicAuthIntegrationTest-seed#[A02E38E6F47D283A]-worker) [    ] o.a.s.c.c.ZkStateReader Updated live nodes from ZooKeeper... (0) -> (3)
   [junit4]   2> 2074722 INFO  (SUITE-BasicAuthIntegrationTest-seed#[A02E38E6F47D283A]-worker) [    ] o.a.s.c.c.SolrZkClient makePath: /configs/conf/solrconfig.xml
   [junit4]   2> 2074724 INFO  (SUITE-BasicAuthIntegrationTest-seed#[A02E38E6F47D283A]-worker) [    ] o.a.s.c.c.SolrZkClient makePath: /configs/conf/schema.xml
   [junit4]   2> 2074801 INFO  (qtp19393231-91481) [n:127.0.0.1:41831_solr    ] o.a.s.h.a.CollectionsHandler Invoked Collection Action :create with params replicationFactor=1&collection.configName=conf&name=authCollection&action=CREATE&numShards=3&wt=javabin&version=2 and sendToOCPQueue=true
   [junit4]   2> 2074803 INFO  (OverseerCollectionConfigSetProcessor-96563326548901896-127.0.0.1:43754_solr-n_0000000000) [n:127.0.0.1:43754_solr    ] o.a.s.c.OverseerTaskProcessor Overseer Collection Message Handler: Get the message id:/overseer/collection-queue-work/qn-0000000000 message:{
   [junit4]   2>   "name":"authCollection",
   [junit4]   2>   "fromApi":"true",
   [junit4]   2>   "replicationFactor":"1",
   [junit4]   2>   "collection.configName":"conf",
   [junit4]   2>   "numShards":"3",
   [junit4]   2>   "stateFormat":"2",
   [junit4]   2>   "operation":"create"}
   [junit4]   2> 2074803 INFO  (OverseerThreadFactory-10002-thread-1-processing-n:127.0.0.1:43754_solr) [n:127.0.0.1:43754_solr    ] o.a.s.c.OverseerCollectionMessageHandler OverseerCollectionMessageHandler.processMessage : create , {
   [junit4]   2>   "name":"authCollection",
   [junit4]   2>   "fromApi":"true",
   [junit4]   2>   "replicationFactor":"1",
   [junit4]   2>   "collection.configName":"conf",
   [junit4]   2>   "numShards":"3",
   [junit4]   2>   "stateFormat":"2",
   [junit4]   2>   "operation":"create"}
   [junit4]   2> 2074803 INFO  (OverseerThreadFactory-10002-thread-1-processing-n:127.0.0.1:43754_solr) [n:127.0.0.1:43754_solr    ] o.a.s.c.CreateCollectionCmd Create collection authCollection
   [junit4]   2> 2074803 INFO  (OverseerThreadFactory-10002-thread-1-processing-n:127.0.0.1:43754_solr) [n:127.0.0.1:43754_solr    ] o.a.s.c.OverseerCollectionMessageHandler creating collections conf node /collections/authCollection 
   [junit4]   2> 2074804 INFO  (OverseerThreadFactory-10002-thread-1-processing-n:127.0.0.1:43754_solr) [n:127.0.0.1:43754_solr    ] o.a.s.c.c.SolrZkClient makePath: /collections/authCollection
   [junit4]   2> 2074804 INFO  (zkCallback-23799-thread-1-processing-n:127.0.0.1:43754_solr) [n:127.0.0.1:43754_solr    ] o.a.s.c.c.ZkStateReader A collections change: [WatchedEvent state:SyncConnected type:NodeChildrenChanged path:/collections], has occurred - updating...
   [junit4]   2> 2074804 INFO  (zkCallback-23801-thread-1-processing-n:127.0.0.1:41831_solr) [n:127.0.0.1:41831_solr    ] o.a.s.c.c.ZkStateReader A collections change: [WatchedEvent state:SyncConnected type:NodeChildrenChanged path:/collections], has occurred - updating...
   [junit4]   2> 2074804 INFO  (zkCallback-23800-thread-1-processing-n:127.0.0.1:36140_solr) [n:127.0.0.1:36140_solr    ] o.a.s.c.c.ZkStateReader A collections change: [WatchedEvent state:SyncConnected type:NodeChildrenChanged path:/collections], has occurred - updating...
   [junit4]   2> 2074804 INFO  (zkCallback-23808-thread-1) [    ] o.a.s.c.c.ZkStateReader A collections change: [WatchedEvent state:SyncConnected type:NodeChildrenChanged path:/collections], has occurred - updating...
   [junit4]   2> 2074806 INFO  (OverseerStateUpdate-96563326548901896-127.0.0.1:43754_solr-n_0000000000) [n:127.0.0.1:43754_solr    ] o.a.s.c.Overseer processMessage: queueSize: 1, message = {
   [junit4]   2>   "name":"authCollection",
   [junit4]   2>   "fromApi":"true",
   [junit4]   2>   "replicationFactor":"1",
   [junit4]   2>   "collection.configName":"conf",
   [junit4]   2>   "numShards":"3",
   [junit4]   2>   "stateFormat":"2",
   [junit4]   2>   "operation":"create"} current state version: 0
   [junit4]   2> 2074806 INFO  (OverseerStateUpdate-96563326548901896-127.0.0.1:43754_solr-n_0000000000) [n:127.0.0.1:43754_solr    ] o.a.s.c.o.ClusterStateMutator building a new cName: authCollection
   [junit4]   2> 2074807 INFO  (OverseerStateUpdate-96563326548901896-127.0.0.1:43754_solr-n_0000000000) [n:127.0.0.1:43754_solr    ] o.a.s.c.o.ZkStateWriter going to create_collection /collections/authCollection/state.json
   [junit4]   2> 2074907 INFO  (OverseerThreadFactory-10002-thread-1-processing-n:127.0.0.1:43754_solr) [n:127.0.0.1:43754_solr    ] o.a.s.c.CreateCollectionCmd Creating SolrCores for new collection authCollection, shardNames [shard1, shard2, shard3] , replicationFactor : 1
   [junit4]   2> 2074907 INFO  (OverseerThreadFactory-10002-thread-1-processing-n:127.0.0.1:43754_solr) [n:127.0.0.1:43754_solr    ] o.a.s.c.CreateCollectionCmd Creating core authCollection_shard2_replica1 as part of shard shard2 of collection authCollection on 127.0.0.1:36140_solr
   [junit4]   2> 2074908 INFO  (OverseerThreadFactory-10002-thread-1-processing-n:127.0.0.1:43754_solr) [n:127.0.0.1:43754_solr    ] o.a.s.c.CreateCollectionCmd Creating core authCollection_shard3_replica1 as part of shard shard3 of collection authCollection on 127.0.0.1:43754_solr
   [junit4]   2> 2074908 INFO  (OverseerThreadFactory-10002-thread-1-processing-n:127.0.0.1:43754_solr) [n:127.0.0.1:43754_solr    ] o.a.s.c.CreateCollectionCmd Creating core authCollection_shard1_replica1 as part of shard shard1 of collection authCollection on 127.0.0.1:41831_solr
   [junit4]   2> 2074920 INFO  (qtp19393231-91483) [n:127.0.0.1:41831_solr    ] o.a.s.h.a.CoreAdminOperation core create command qt=/admin/cores&collection.configName=conf&name=authCollection_shard1_replica1&action=CREATE&numShards=3&collection=authCollection&shard=shard1&wt=javabin&version=2
   [junit4]   2> 2074921 INFO  (qtp19393231-91483) [n:127.0.0.1:41831_solr    ] o.a.s.c.CoreDescriptor Created CoreDescriptor: {name=authCollection_shard1_replica1, collection.configName=conf, config=solrconfig.xml, transient=false, schema=schema.xml, loadOnStartup=true, configSetProperties=configsetprops.json, collection=authCollection, numShards=3, dataDir=data/, shard=shard1}
   [junit4]   2> 2074921 INFO  (qtp19393231-91483) [n:127.0.0.1:41831_solr c:authCollection s:shard1  x:authCollection_shard1_replica1] o.a.s.c.ZkController publishing state=down
   [junit4]   2> 2074922 INFO  (qtp19393231-91483) [n:127.0.0.1:41831_solr c:authCollection s:shard1  x:authCollection_shard1_replica1] o.a.s.c.ZkController Registering watch for collection authCollection
   [junit4]   2> 2074922 INFO  (OverseerStateUpdate-96563326548901896-127.0.0.1:43754_solr-n_0000000000) [n:127.0.0.1:43754_solr    ] o.a.s.c.Overseer processMessage: queueSize: 1, message = {
   [junit4]   2>   "core":"authCollection_shard1_replica1",
   [junit4]   2>   "roles":null,
   [junit4]   2>   "base_url":"https://127.0.0.1:41831/solr",
   [junit4]   2>   "node_name":"127.0.0.1:41831_solr",
   [junit4]   2>   "numShards":"3",
   [junit4]   2>   "state":"down",
   [junit4]   2>   "shard":"shard1",
   [junit4]   2>   "collection":"authCollection",
   [junit4]   2>   "operation":"state"} current state version: 0
   [junit4]   2> 2074922 INFO  (qtp19393231-91483) [n:127.0.0.1:41831_solr c:authCollection s:shard1  x:authCollection_shard1_replica1] o.a.s.c.c.ZkStateReader Add data for [authCollection] ver [0]
   [junit4]   2> 2074923 INFO  (OverseerStateUpdate-96563326548901896-127.0.0.1:43754_solr-n_0000000000) [n:127.0.0.1:43754_solr    ] o.a.s.c.o.ReplicaMutator Update state numShards=3 message={
   [junit4]   2>   "core":"authCollection_shard1_replica1",
   [junit4]   2>   "roles":null,
   [junit4]   2>   "base_url":"https://127.0.0.1:41831/solr",
   [junit4]   2>   "node_name":"127.0.0.1:41831_solr",
   [junit4]   2>   "numShards":"3",
   [junit4]   2>   "state":"down",
   [junit4]   2>   "shard":"shard1",
   [junit4]   2>   "collection":"authCollection",
   [junit4]   2>   "operation":"state"}
   [junit4]   2> 2074923 INFO  (qtp19393231-91483) [n:127.0.0.1:41831_solr c:authCollection s:shard1  x:authCollection_shard1_replica1] o.a.s.c.ZkController look for our core node name
   [junit4]   2> 2074983 INFO  (qtp612084-91466) [n:127.0.0.1:43754_solr    ] o.a.s.h.a.CoreAdminOperation core create command qt=/admin/cores&collection.configName=conf&name=authCollection_shard3_replica1&action=CREATE&numShards=3&collection=authCollection&shard=shard3&wt=javabin&version=2
   [junit4]   2> 2074984 INFO  (qtp612084-91466) [n:127.0.0.1:43754_solr    ] o.a.s.c.CoreDescriptor Created CoreDescriptor: {name=authCollection_shard3_replica1, collection.configName=conf, config=solrconfig.xml, transient=false, schema=schema.xml, loadOnStartup=true, configSetProperties=configsetprops.json, collection=authCollection, numShards=3, dataDir=data/, shard=shard3}
   [junit4]   2> 2074984 INFO  (qtp23404581-91463) [n:127.0.0.1:36140_solr    ] o.a.s.h.a.CoreAdminOperation core create command qt=/admin/cores&collection.configName=conf&name=authCollection_shard2_replica1&action=CREATE&numShards=3&collection=authCollection&shard=shard2&wt=javabin&version=2
   [junit4]   2> 2074984 INFO  (qtp612084-91466) [n:127.0.0.1:43754_solr c:authCollection s:shard3  x:authCollection_shard3_replica1] o.a.s.c.ZkController publishing state=down
   [junit4]   2> 2074984 INFO  (qtp23404581-91463) [n:127.0.0.1:36140_solr    ] o.a.s.c.CoreDescriptor Created CoreDescriptor: {name=authCollection_shard2_replica1, collection.configName=conf, config=solrconfig.xml, transient=false, schema=schema.xml, loadOnStartup=true, configSetProperties=configsetprops.json, collection=authCollection, numShards=3, dataDir=data/, shard=shard2}
   [junit4]   2> 2074985 INFO  (qtp23404581-91463) [n:127.0.0.1:36140_solr c:authCollection s:shard2  x:authCollection_shard2_replica1] o.a.s.c.ZkController publishing state=down
   [junit4]   2> 2074985 INFO  (qtp612084-91466) [n:127.0.0.1:43754_solr c:authCollection s:shard3  x:authCollection_shard3_replica1] o.a.s.c.ZkController Registering watch for collection authCollection
   [junit4]   2> 2074985 INFO  (OverseerStateUpdate-96563326548901896-127.0.0.1:43754_solr-n_0000000000) [n:127.0.0.1:43754_solr    ] o.a.s.c.Overseer processMessage: queueSize: 1, message = {
   [junit4]   2>   "core":"authCollection_shard3_replica1",
   [junit4]   2>   "roles":null,
   [junit4]   2>   "base_url":"https://127.0.0.1:43754/solr",
   [junit4]   2>   "node_name":"127.0.0.1:43754_solr",
   [junit4]   2>   "numShards":"3",
   [junit4]   2>   "state":"down",
   [junit4]   2>   "shard":"shard3",
   [junit4]   2>   "collection":"authCollection",
   [junit4]   2>   "operation":"state"} current state version: 0
   [junit4]   2> 2074985 INFO  (qtp612084-91466) [n:127.0.0.1:43754_solr c:authCollection s:shard3  x:authCollection_shard3_replica1] o.a.s.c.c.ZkStateReader Add data for [authCollection] ver [0]
   [junit4]   2> 2074985 INFO  (OverseerStateUpdate-96563326548901896-127.0.0.1:43754_solr-n_0000000000) [n:127.0.0.1:43754_solr    ] o.a.s.c.o.ReplicaMutator Update state numShards=3 message={
   [junit4]   2>   "core":"authCollection_shard3_replica1",
   [junit4]   2>   "roles":null,
   [junit4]   2>   "base_url":"https://127.0.0.1:43754/solr",
   [junit4]   2>   "node_name":"127.0.0.1:43754_solr",
   [junit4]   2>   "numShards":"3",
   [junit4]   2>   "state":"down",
   [junit4]   2>   "shard":"shard3",
   [junit4]   2>   "collection":"authCollection",
   [junit4]   2>   "operation":"state"}
   [junit4]   2> 2074985 INFO  (qtp23404581-91463) [n:127.0.0.1:36140_solr c:authCollection s:shard2  x:authCollection_shard2_replica1] o.a.s.c.ZkController Registering watch for collection authCollection
   [junit4]   2> 2074985 INFO  (qtp612084-91466) [n:127.0.0.1:43754_solr c:authCollection s:shard3  x:authCollection_shard3_replica1] o.a.s.c.ZkController look for our core node name
   [junit4]   2> 2074986 INFO  (qtp23404581-91463) [n:127.0.0.1:36140_solr c:authCollection s:shard2  x:authCollection_shard2_replica1] o.a.s.c.c.ZkStateReader Add data for [authCollection] ver [0]
   [junit4]   2> 2074986 INFO  (qtp23404581-91463) [n:127.0.0.1:36140_solr c:authCollection s:shard2  x:authCollection_shard2_replica1] o.a.s.c.ZkController look for our core node name
   [junit4]   2> 2074987 INFO  (OverseerStateUpdate-96563326548901896-127.0.0.1:43754_solr-n_0000000000) [n:127.0.0.1:43754_solr    ] o.a.s.c.Overseer processMessage: queueSize: 1, message = {
   [junit4]   2>   "core":"authCollection_shard2_replica1",
   [junit4]   2>   "roles":null,
   [junit4]   2>   "base_url":"https://127.0.0.1:36140/solr",
   [junit4]   2>   "node_name":"127.0.0.1:36140_solr",
   [junit4]   2>   "numShards":"3",
   [junit4]   2>   "state":"down",
   [junit4]   2>   "shard":"shard2",
   [junit4]   2>   "collection":"authCollection",
   [junit4]   2>   "operation":"state"} current state version: 0
   [junit4]   2> 2074987 INFO  (OverseerStateUpdate-96563326548901896-127.0.0.1:43754_solr-n_0000000000) [n:127.0.0.1:43754_solr    ] o.a.s.c.o.ReplicaMutator Update state numShards=3 message={
   [junit4]   2>   "core":"authCollection_shard2_replica1",
   [junit4]   2>   "roles":null,
   [junit4]   2>   "base_url":"https://127.0.0.1:36140/solr",
   [junit4]   2>   "node_name":"127.0.0.1:36140_solr",
   [junit4]   2>   "numShards":"3",
   [junit4]   2>   "state":"down",
   [junit4]   2>   "shard":"shard2",
   [junit4]   2>   "collection":"authCollection",
   [junit4]   2>   "operation":"state"}
   [junit4]   2> 2075089 INFO  (OverseerStateUpdate-96563326548901896-127.0.0.1:43754_solr-n_0000000000) [n:127.0.0.1:43754_solr    ] o.a.s.c.o.ZkStateWriter going to update_collection /collections/authCollection/state.json version: 0
   [junit4]   2> 2075089 INFO  (zkCallback-23800-thread-1-processing-n:127.0.0.1:36140_solr) [n:127.0.0.1:36140_solr    ] o.a.s.c.c.ZkStateReader A cluster state change: [WatchedEvent state:SyncConnected type:NodeDataChanged path:/collections/authCollection/state.json] for collection [authCollection] has occurred - updating... (live nodes size: [3])
   [junit4]   2> 2075089 INFO  (zkCallback-23799-thread-1-processing-n:127.0.0.1:43754_solr) [n:127.0.0.1:43754_solr    ] o.a.s.c.c.ZkStateReader A cluster state change: [WatchedEvent state:SyncConnected type:NodeDataChanged path:/collections/authCollection/state.json] for collection [authCollection] has occurred - updating... (live nodes size: [3])
   [junit4]   2> 2075089 INFO  (zkCallback-23801-thread-1-processing-n:127.0.0.1:41831_solr) [n:127.0.0.1:41831_solr    ] o.a.s.c.c.ZkStateReader A cluster state change: [WatchedEvent state:SyncConnected type:NodeDataChanged path:/collections/authCollection/state.json] for collection [authCollection] has occurred - updating... (live nodes size: [3])
   [junit4]   2> 2075090 INFO  (zkCallback-23800-thread-1-processing-n:127.0.0.1:36140_solr) [n:127.0.0.1:36140_solr    ] o.a.s.c.c.ZkStateReader Updating data for [authCollection] from [0] to [1]
   [junit4]   2> 2075090 INFO  (zkCallback-23799-thread-1-processing-n:127.0.0.1:43754_solr) [n:127.0.0.1:43754_solr    ] o.a.s.c.c.ZkStateReader Updating data for [authCollection] from [0] to [1]
   [junit4]   2> 2075090 INFO  (zkCallback-23801-thread-1-processing-n:127.0.0.1:41831_solr) [n:127.0.0.1:41831_solr    ] o.a.s.c.c.ZkStateReader Updating data for [authCollection] from [0] to [1]
   [junit4]   2> 2075923 INFO  (qtp19393231-91483) [n:127.0.0.1:41831_solr c:authCollection s:shard1  x:authCollection_shard1_replica1] o.a.s.c.ZkController waiting to find shard id in clusterstate for authCollection_shard1_replica1
   [junit4]   2> 2075923 INFO  (qtp19393231-91483) [n:127.0.0.1:41831_solr c:authCollection s:shard1  x:authCollection_shard1_replica1] o.a.s.c.ZkController Check for collection zkNode:authCollection
   [junit4]   2> 2075924 INFO  (qtp19393231-91483) [n:127.0.0.1:41831_solr c:authCollection s:shard1  x:authCollection_shard1_replica1] o.a.s.c.ZkController Collection zkNode exists
   [junit4]   2> 2075924 INFO  (qtp19393231-91483) [n:127.0.0.1:41831_solr c:authCollection s:shard1  x:authCollection_shard1_replica1] o.a.s.c.c.ZkStateReader Load collection config from: [/collections/authCollection]
   [junit4]   2> 2075924 INFO  (qtp19393231-91483) [n:127.0.0.1:41831_solr c:authCollection s:shard1  x:authCollection_shard1_replica1] o.a.s.c.c.ZkStateReader path=[/collections/authCollection] [configName]=[conf] specified config exists in ZooKeeper
   [junit4]   2> 2075924 INFO  (qtp19393231-91483) [n:127.0.0.1:41831_solr c:authCollection s:shard1  x:authCollection_shard1_replica1] o.a.s.c.SolrResourceLoader new SolrResourceLoader for directory: '/home/jenkins/workspace/Lucene-Solr-6.x-Linux/solr/build/solr-core/test/J0/temp/solr.security.BasicAuthIntegrationTest_A02E38E6F47D283A-001/tempDir-001/node3/authCollection_shard1_replica1'
   [junit4]   2> 2075924 INFO  (qtp19393231-91483) [n:127.0.0.1:41831_solr c:authCollection s:shard1  x:authCollection_shard1_replica1] o.a.s.c.SolrResourceLoader JNDI not configured for solr (NoInitialContextEx)
   [junit4]   2> 2075924 INFO  (qtp19393231-91483) [n:127.0.0.1:41831_solr c:authCollection s:shard1  x:authCollection_shard1_replica1] o.a.s.c.SolrResourceLoader solr home defaulted to 'solr/' (could not find system property or JNDI)
   [junit4]   2> 2075926 INFO  (qtp19393231-91483) [n:127.0.0.1:41831_solr c:authCollection s:shard1  x:authCollection_shard1_replica1] o.a.s.c.Config loaded config solrconfig.xml with version 0 
   [junit4]   2> 2075932 INFO  (qtp19393231-91483) [n:127.0.0.1:41831_solr c:authCollection s:shard1  x:authCollection_shard1_replica1] o.a.s.c.SolrConfig current version of requestparams : -1
   [junit4]   2> 2075935 INFO  (qtp19393231-91483) [n:127.0.0.1:41831_solr c:authCollection s:shard1  x:authCollection_shard1_replica1] o.a.s.c.SolrConfig Using Lucene MatchVersion: 6.3.0
   [junit4]   2> 2075943 INFO  (qtp19393231-91483) [n:127.0.0.1:41831_solr c:authCollection s:shard1  x:authCollection_shard1_replica1] o.a.s.c.SolrConfig Loaded SolrConfig: solrconfig.xml
   [junit4]   2> 2075948 INFO  (qtp19393231-91483) [n:127.0.0.1:41831_solr c:authCollection s:shard1  x:authCollection_shard1_replica1] o.a.s.s.IndexSchema [authCollection_shard1_replica1] Schema name=minimal
   [junit4]   2> 2075952 INFO  (qtp19393231-91483) [n:127.0.0.1:41831_solr c:authCollection s:shard1  x:authCollection_shard1_replica1] o.a.s.s.IndexSchema unique key field: id
   [junit4]   2> 2075954 INFO  (qtp19393231-91483) [n:127.0.0.1:41831_solr c:authCollection s:shard1  x:authCollection_shard1_replica1] o.a.s.c.ConfigSetProperties Did not find ConfigSet properties, assuming default properties: Can't find resource 'configsetprops.json' in classpath or '/configs/conf', cwd=/home/jenkins/workspace/Lucene-Solr-6.x-Linux/solr/build/solr-core/test/J0
   [junit4]   2> 2075954 INFO  (qtp19393231-91483) [n:127.0.0.1:41831_solr c:authCollection s:shard1  x:authCollection_shard1_replica1] o.a.s.c.CoreContainer Creating SolrCore 'authCollection_shard1_replica1' using configuration from collection authCollection
   [junit4]   2> 2075954 INFO  (qtp19393231-91483) [n:127.0.0.1:41831_solr c:authCollection s:shard1 r:core_node1 x:authCollection_shard1_replica1] o.a.s.c.SolrCore org.apache.solr.core.MockDirectoryFactory
   [junit4]   2> 2075954 INFO  (qtp19393231-91483) [n:127.0.0.1:41831_solr c:authCollection s:shard1 r:core_node1 x:authCollection_shard1_replica1] o.a.s.c.SolrCore [[authCollection_shard1_replica1] ] Opening new SolrCore at [/home/jenkins/workspace/Lucene-Solr-6.x-Linux/solr/build/solr-core/test/J0/temp/solr.security.BasicAuthIntegrationTest_A02E38E6F47D283A-001/tempDir-001/node3/authCollection_shard1_replica1], dataDir=[/home/jenkins/workspace/Lucene-Solr-6.x-Linux/solr/build/solr-core/test/J0/temp/solr.security.BasicAuthIntegrationTest_A02E38E6F47D283A-001/tempDir-001/node3/./authCollection_shard1_replica1/data/]
   [junit4]   2> 2075954 INFO  (qtp19393231-91483) [n:127.0.0.1:41831_solr c:authCollection s:shard1 r:core_node1 x:authCollection_shard1_replica1] o.a.s.c.SolrCore JMX monitoring not detected for core: authCollection_shard1_replica1
   [junit4]   2> 2075955 INFO  (qtp19393231-91483) [n:127.0.0.1:41831_solr c:authCollection s:shard1 r:core_node1 x:authCollection_shard1_replica1] o.a.s.c.CachingDirectoryFactory return new directory for /home/jenkins/workspace/Lucene-Solr-6.x-Linux/solr/build/solr-core/test/J0/temp/solr.security.BasicAuthIntegrationTest_A02E38E6F47D283A-001/tempDir-001/node3/./authCollection_shard1_replica1/data/snapshot_metadata
   [junit4]   2> 2075955 INFO  (qtp19393231-91483) [n:127.0.0.1:41831_solr c:authCollection s:shard1 r:core_node1 x:authCollection_shard1_replica1] o.a.s.c.s.SolrSnapshotMetaDataManager Loading from snapshot metadata file...
   [junit4]   2> 2075956 INFO  (qtp19393231-91483) [n:127.0.0.1:41831_solr c:authCollection s:shard1 r:core_node1 x:authCollection_shard1_replica1] o.a.s.c.CachingDirectoryFactory return new directory for /home/jenkins/workspace/Lucene-Solr-6.x-Linux/solr/build/solr-core/test/J0/temp/solr.security.BasicAuthIntegrationTest_A02E38E6F47D283A-001/tempDir-001/node3/./authCollection_shard1_replica1/data
   [junit4]   2> 2075956 INFO  (qtp19393231-91483) [n:127.0.0.1:41831_solr c:authCollection s:shard1 r:core_node1 x:authCollection_shard1_replica1] o.a.s.c.SolrCore New index directory detected: old=null new=/home/jenkins/workspace/Lucene-Solr-6.x-Linux/solr/build/solr-core/test/J0/temp/solr.security.BasicAuthIntegrationTest_A02E38E6F47D283A-001/tempDir-001/node3/./authCollection_shard1_replica1/data/index/
   [junit4]   2> 2075956 WARN  (qtp19393231-91483) [n:127.0.0.1:41831_solr c:authCollection s:shard1 r:core_node1 x:authCollection_shard1_replica1] o.a.s.c.SolrCore [authCollection_shard1_replica1] Solr index directory '/home/jenkins/workspace/Lucene-Solr-6.x-Linux/solr/build/solr-core/test/J0/temp/solr.security.BasicAuthIntegrationTest_A02E38E6F47D283A-001/tempDir-001/node3/./authCollection_shard1_replica1/data/index' doesn't exist. Creating new index...
   [junit4]   2> 2075957 INFO  (qtp19393231-91483) [n:127.0.0.1:41831_solr c:authCollection s:shard1 r:core_node1 x:authCollection_shard1_replica1] o.a.s.c.CachingDirectoryFactory return new directory for /home/jenkins/workspace/Lucene-Solr-6.x-Linux/solr/build/solr-core/test/J0/temp/solr.security.BasicAuthIntegrationTest_A02E38E6F47D283A-001/tempDir-001/node3/./authCollection_shard1_replica1/data/index
   [junit4]   2> 2075957 INFO  (qtp19393231-91483) [n:127.0.0.1:41831_solr c:authCollection s:shard1 r:core_node1 x:authCollection_shard1_replica1] o.a.s.c.SolrDeletionPolicy SolrDeletionPolicy.onCommit: commits: num=1
   [junit4]   2> 	commit{dir=MockDirectoryWrapper(RAMDirectory@17e384b lockFactory=org.apache.lucene.store.SingleInstanceLockFactory@2a8e9b),segFN=segments_1,generation=1}
   [junit4]   2> 2075957 INFO  (qtp19393231-91483) [n:127.0.0.1:41831_solr c:authCollection s:shard1 r:core_node1 x:authCollection_shard1_replica1] o.a.s.c.SolrDeletionPolicy newest commit generation = 1
   [junit4]   2> 2075958 INFO  (OldIndexDirectoryCleanupThreadForCore-authCollection_shard1_replica1) [n:127.0.0.1:41831_solr c:authCollection s:shard1 r:core_node1 x:authCollection_shard1_replica1] o.a.s.c.SolrCore Looking for old index directories to cleanup for core authCollection_shard1_replica1 in /home/jenkins/workspace/Lucene-Solr-6.x-Linux/solr/build/solr-core/test/J0/temp/solr.security.BasicAuthIntegrationTest_A02E38E6F47D283A-001/tempDir-001/node3/./authCollection_shard1_replica1/data/
   [junit4]   2> 2075958 WARN  (OldIndexDirectoryCleanupThreadForCore-authCollection_shard1_replica1) [n:127.0.0.1:41831_solr c:authCollection s:shard1 r:core_node1 x:authCollection_shard1_replica1] o.a.s.c.DirectoryFactory /home/jenkins/workspace/Lucene-Solr-6.x-Linux/solr/build/solr-core/test/J0/temp/solr.security.BasicAuthIntegrationTest_A02E38E6F47D283A-001/tempDir-001/node3/./authCollection_shard1_replica1/data/ does not point to a valid data directory; skipping clean-up of old index directories.
   [junit4]   2> 2075959 INFO  (qtp19393231-91483) [n:127.0.0.1:41831_solr c:authCollection s:shard1 r:core_node1 x:authCollection_shard1_replica1] o.a.s.c.SolrCore no updateRequestProcessorChain defined as default, creating implicit default
   [junit4]   2> 2075961 INFO  (qtp19393231-91483) [n:127.0.0.1:41831_solr c:authCollection s:shard1 r:core_node1 x:authCollection_shard1_replica1] o.a.s.h.l.XMLLoader xsltCacheLifetimeSeconds=60
   [junit4]   2> 2075962 INFO  (qtp19393231-91483) [n:127.0.0.1:41831_solr c:authCollection s:shard1 r:core_node1 x:authCollection_shard1_replica1] o.a.s.h.l.XMLLoader xsltCacheLifetimeSeconds=60
   [junit4]   2> 2075962 INFO  (qtp19393231-91483) [n:127.0.0.1:41831_solr c:authCollection s:shard1 r:core_node1 x:authCollection_shard1_replica1] o.a.s.h.l.XMLLoader xsltCacheLifetimeSeconds=60
   [junit4]   2> 2075964 INFO  (qtp19393231-91483) [n:127.0.0.1:41831_solr c:authCollection s:shard1 r:core_node1 x:authCollection_shard1_replica1] o.a.s.h.l.XMLLoader xsltCacheLifetimeSeconds=60
   [junit4]   2> 2075965 INFO  (qtp19393231-91483) [n:127.0.0.1:41831_solr c:authCollection s:shard1 r:core_node1 x:authCollection_shard1_replica1] o.a.s.c.RequestHandlers Registered paths: /admin/mbeans,/update/json/docs,/admin/luke,/export,/get,/admin/properties,/update/json,/admin/threads,/update/csv,/sql,/graph,/select,/admin/segments,/admin/system,/replication,/config,/stream,/schema,/admin/plugins,/admin/logging,/admin/ping,/update,/admin/file,/terms
   [junit4]   2> 2075966 INFO  (qtp19393231-91483) [n:127.0.0.1:41831_solr c:authCollection s:shard1 r:core_node1 x:authCollection_shard1_replica1] o.a.s.c.SolrCore Using default statsCache cache: org.apache.solr.search.stats.LocalStatsCache
   [junit4]   2> 2075966 INFO  (qtp19393231-91483) [n:127.0.0.1:41831_solr c:authCollection s:shard1 r:core_node1 x:authCollection_shard1_replica1] o.a.s.u.UpdateHandler Using UpdateLog implementation: org.apache.solr.update.UpdateLog
   [junit4]   2> 2075966 INFO  (qtp19393231-91483) [n:127.0.0.1:41831_solr c:authCollection s:shard1 r:core_node1 x:authCollection_shard1_replica1] o.a.s.u.UpdateLog Initializing UpdateLog: dataDir=null defaultSyncLevel=FLUSH numRecordsToKeep=100 maxNumLogsToKeep=10 numVersionBuckets=65536
   [junit4]   2> 2075967 INFO  (qtp19393231-91483) [n:127.0.0.1:41831_solr c:authCollection s:shard1 r:core_node1 x:authCollection_shard1_replica1] o.a.s.u.CommitTracker Hard AutoCommit: disabled
   [junit4]   2> 2075967 INFO  (qtp19393231-91483) [n:127.0.0.1:41831_solr c:authCollection s:shard1 r:core_node1 x:authCollection_shard1_replica1] o.a.s.u.CommitTracker Soft AutoCommit: disabled
   [junit4]   2> 2075968 INFO  (qtp19393231-91483) [n:127.0.0.1:41831_solr c:authCollection s:shard1 r:core_node1 x:authCollection_shard1_replica1] o.a.s.c.SolrDeletionPolicy SolrDeletionPolicy.onInit: commits: num=1
   [junit4]   2> 	commit{dir=MockDirectoryWrapper(RAMDirectory@17e384b lockFactory=org.apache.lucene.store.SingleInstanceLockFactory@2a8e9b),segFN=segments_1,generation=1}
   [junit4]   2> 2075968 INFO  (qtp19393231-91483) [n:127.0.0.1:41831_solr c:authCollection s:shard1 r:core_node1 x:authCollection_shard1_replica1] o.a.s.c.SolrDeletionPolicy newest commit generation = 1
   [junit4]   2> 2075968 INFO  (qtp19393231-91483) [n:127.0.0.1:41831_solr c:authCollection s:shard1 r:core_node1 x:authCollection_shard1_replica1] o.a.s.s.SolrIndexSearcher Opening [Searcher@750789[authCollection_shard1_replica1] main]
   [junit4]   2> 2075968 INFO  (qtp19393231-91483) [n:127.0.0.1:41831_solr c:authCollection s:shard1 r:core_node1 x:authCollection_shard1_replica1] o.a.s.c.c.ZkStateReader Load collection config from: [/collections/authCollection]
   [junit4]   2> 2075969 INFO  (qtp19393231-91483) [n:127.0.0.1:41831_solr c:authCollection s:shard1 r:core_node1 x:authCollection_shard1_replica1] o.a.s.c.c.ZkStateReader path=[/collections/authCollection] [configName]=[conf] specified config exists in ZooKeeper
   [junit4]   2> 2075969 INFO  (qtp19393231-91483) [n:127.0.0.1:41831_solr c:authCollection s:shard1 r:core_node1 x:authCollection_shard1_replica1] o.a.s.r.ManagedResourceStorage Setting up ZooKeeper-based storage for the RestManager with znodeBase: /configs/conf
   [junit4]   2> 2075969 INFO  (qtp19393231-91483) [n:127.0.0.1:41831_solr c:authCollection s:shard1 r:core_node1 x:authCollection_shard1_replica1] o.a.s.r.ManagedResourceStorage Configured ZooKeeperStorageIO with znodeBase: /configs/conf
   [junit4]   2> 2075969 INFO  (qtp19393231-91483) [n:127.0.0.1:41831_solr c:authCollection s:shard1 r:core_node1 x:authCollection_shard1_replica1] o.a.s.r.RestManager Initializing RestManager with initArgs: {}
   [junit4]   2> 2075969 INFO  (qtp19393231-91483) [n:127.0.0.1:41831_solr c:authCollection s:shard1 r:core_node1 x:authCollection_shard1_replica1] o.a.s.r.ManagedResourceStorage Reading _rest_managed.json using ZooKeeperStorageIO:path=/configs/conf
   [junit4]   2> 2075969 INFO  (qtp19393231-91483) [n:127.0.0.1:41831_solr c:authCollection s:shard1 r:core_node1 x:authCollection_shard1_replica1] o.a.s.r.ManagedResourceStorage No data found for znode /configs/conf/_rest_managed.json
   [junit4]   2> 2075970 INFO  (qtp19393231-91483) [n:127.0.0.1:41831_solr c:authCollection s:shard1 r:core_node1 x:authCollection_shard1_replica1] o.a.s.r.ManagedResourceStorage Loaded null at path _rest_managed.json using ZooKeeperStorageIO:path=/configs/conf
   [junit4]   2> 2075970 INFO  (qtp19393231-91483) [n:127.0.0.1:41831_solr c:authCollection s:shard1 r:core_node1 x:authCollection_shard1_replica1] o.a.s.r.RestManager Initializing 0 registered ManagedResources
   [junit4]   2> 2075970 INFO  (qtp19393231-91483) [n:127.0.0.1:41831_solr c:authCollection s:shard1 r:core_node1 x:authCollection_shard1_replica1] o.a.s.h.ReplicationHandler Commits will be reserved for  10000
   [junit4]   2> 2075970 INFO  (searcherExecutor-10009-thread-1-processing-n:127.0.0.1:41831_solr x:authCollection_shard1_replica1 s:shard1 c:authCollection r:core_node1) [n:127.0.0.1:41831_solr c:authCollection s:shard1 r:core_node1 x:authCollection_shard1_replica1] o.a.s.c.SolrCore [authCollection_shard1_replica1] Registered new searcher Searcher@750789[authCollection_shard1_replica1] main{ExitableDirectoryReader(UninvertingDirectoryReader())}
   [junit4]   2> 2075970 INFO  (qtp19393231-91483) [n:127.0.0.1:41831_solr c:authCollection s:shard1 r:core_node1 x:authCollection_shard1_replica1] o.a.s.u.UpdateLog Looking up max value of version field to seed version buckets
   [junit4]   2> 2075970 INFO  (qtp19393231-91483) [n:127.0.0.1:41831_solr c:authCollection s:shard1 r:core_node1 x:authCollection_shard1_replica1] o.a.s.u.VersionInfo Refreshing highest value of _version_ for 65536 version buckets from index
   [junit4]   2> 2075970 INFO  (qtp19393231-91483) [n:127.0.0.1:41831_solr c:authCollection s:shard1 r:core_node1 x:authCollection_shard1_replica1] o.a.s.u.VersionInfo No terms found for _version_, cannot seed version bucket highest value from index
   [junit4]   2> 2075970 INFO  (qtp19393231-91483) [n:127.0.0.1:41831_solr c:authCollection s:shard1 r:core_node1 x:authCollection_shard1_replica1] o.a.s.u.UpdateLog Could not find max version in index or recent updates, using new clock 1545013226405625856
   [junit4]   2> 2075972 INFO  (qtp19393231-91483) [n:127.0.0.1:41831_solr c:authCollection s:shard1 r:core_node1 x:authCollection_shard1_replica1] o.a.s.u.UpdateLog Took 1.0ms to seed version buckets with highest version 1545013226405625856
   [junit4]   2> 2075972 INFO  (qtp19393231-91483) [n:127.0.0.1:41831_solr c:authCollection s:shard1 r:core_node1 x:authCollection_shard1_replica1] o.a.s.c.ZkController watch zkdir /configs/conf
   [junit4]   2> 2075973 INFO  (qtp19393231-91483) [n:127.0.0.1:41831_solr c:authCollection s:shard1 r:core_node1 x:authCollection_shard1_replica1] o.a.s.c.CoreContainer registering core: authCollection_shard1_replica1
   [junit4]   2> 2075973 INFO  (qtp19393231-91483) [n:127.0.0.1:41831_solr c:authCollection s:shard1 r:core_node1 x:authCollection_shard1_replica1] o.a.s.c.ZkController Register replica - core:authCollection_shard1_replica1 address:https://127.0.0.1:41831/solr collection:authCollection shard:shard1
   [junit4]   2> 2075973 INFO  (qtp19393231-91483) [n:127.0.0.1:41831_solr c:authCollection s:shard1 r:core_node1 x:authCollection_shard1_replica1] o.a.s.c.c.SolrZkClient makePath: /collections/authCollection/leader_elect/shard1/election
   [junit4]   2> 2075976 INFO  (qtp19393231-91483) [n:127.0.0.1:41831_solr c:authCollection s:shard1 r:core_node1 x:authCollection_shard1_replica1] o.a.s.c.LeaderElector Joined leadership election with path: /collections/authCollection/leader_elect/shard1/election/96563326548901897-core_node1-n_0000000000
   [junit4]   2> 2075976 INFO  (qtp19393231-91483) [n:127.0.0.1:41831_solr c:authCollection s:shard1 r:core_node1 x:authCollection_shard1_replica1] o.a.s.c.ShardLeaderElectionContext Running the leader process for shard=shard1 and weAreReplacement=false and leaderVoteWait=10000
   [junit4]   2> 2075977 INFO  (qtp19393231-91483) [n:127.0.0.1:41831_solr c:authCollection s:shard1 r:core_node1 x:authCollection_shard1_replica1] o.a.s.c.ShardLeaderElectionContext Enough replicas found to continue.
   [junit4]   2> 2075978 INFO  (qtp19393231-91483) [n:127.0.0.1:41831_solr c:authCollection s:shard1 r:core_node1 x:authCollection_shard1_replica1] o.a.s.c.ShardLeaderElectionContext I may be the new leader - try and sync
   [junit4]   2> 2075978 INFO  (qtp19393231-91483) [n:127.0.0.1:41831_solr c:authCollection s:shard1 r:core_node1 x:authCollection_shard1_replica1] o.a.s.c.SyncStrategy Sync replicas to https://127.0.0.1:41831/solr/authCollection_shard1_replica1/
   [junit4]   2> 2075978 INFO  (OverseerStateUpdate-96563326548901896-127.0.0.1:43754_solr-n_0000000000) [n:127.0.0.1:43754_solr    ] o.a.s.c.Overseer processMessage: queueSize: 1, message = {
   [junit4]   2>   "operation":"leader",
   [junit4]   2>   "shard":"shard1",
   [junit4]   2>   "collection":"authCollection"} current state version: 0
   [junit4]   2> 2075978 INFO  (qtp19393231-91483) [n:127.0.0.1:41831_solr c:authCollection s:shard1 r:core_node1 x:authCollection_shard1_replica1] o.a.s.c.SyncStrategy Sync Success - now sync replicas to me
   [junit4]   2> 2075978 INFO  (qtp19393231-91483) [n:127.0.0.1:41831_solr c:authCollection s:shard1 r:core_node1 x:authCollection_shard1_replica1] o.a.s.c.SyncStrategy https://127.0.0.1:41831/solr/authCollection_shard1_replica1/ has no replicas
   [junit4]   2> 2075979 INFO  (qtp19393231-91483) [n:127.0.0.1:41831_solr c:authCollection s:shard1 r:core_node1 x:authCollection_shard1_replica1] o.a.s.c.c.SolrZkClient makePath: /collections/authCollection/leaders/shard1
   [junit4]   2> 2075980 INFO  (qtp19393231-91483) [n:127.0.0.1:41831_solr c:authCollection s:shard1 r:core_node1 x:authCollection_shard1_replica1] o.a.s.c.ShardLeaderElectionContextBase Creating leader registration node /collections/authCollection/leaders/shard1/leader after winning as /collections/authCollection/leader_elect/shard1/election/96563326548901897-core_node1-n_0000000000
   [junit4]   2> 2075982 INFO  (qtp19393231-91483) [n:127.0.0.1:41831_solr c:authCollection s:shard1 r:core_node1 x:authCollection_shard1_replica1] o.a.s.c.ShardLeaderElectionContext I am the new leader: https://127.0.0.1:41831/solr/authCollection_shard1_replica1/ shard1
   [junit4]   2> 2075982 INFO  (OverseerStateUpdate-96563326548901896-127.0.0.1:43754_solr-n_0000000000) [n:127.0.0.1:43754_solr    ] o.a.s.c.Overseer processMessage: queueSize: 1, message = {
   [junit4]   2>   "operation":"leader",
   [junit4]   2>   "shard":"shard1",
   [junit4]   2>   "collection":"authCollection",
   [junit4]   2>   "base_url":"https://127.0.0.1:41831/solr",
   [junit4]   2>   "core":"authCollection_shard1_replica1",
   [junit4]   2>   "state":"active"} current state version: 0
   [junit4]   2> 2075986 INFO  (qtp612084-91466) [n:127.0.0.1:43754_solr c:authCollection s:shard3  x:authCollection_shard3_replica1] o.a.s.c.ZkController waiting to find shard id in clusterstate for authCollection_shard3_replica1
   [junit4]   2> 2075986 INFO  (qtp612084-91466) [n:127.0.0.1:43754_solr c:authCollection s:shard3  x:authCollection_shard3_replica1] o.a.s.c.ZkController Check for collection zkNode:authCollection
   [junit4]   2> 2075986 INFO  (qtp23404581-91463) [n:127.0.0.1:36140_solr c:authCollection s:shard2  x:authCollection_shard2_replica1] o.a.s.c.ZkController waiting to find shard id in clusterstate for authCollection_shard2_replica1
   [junit4]   2> 2075986 INFO  (qtp23404581-91463) [n:127.0.0.1:36140_solr c:authCollection s:shard2  x:authCollection_shard2_replica1] o.a.s.c.ZkController Check for collection zkNode:authCollection
   [junit4]   2> 2075986 INFO  (qtp612084-91466) [n:127.0.0.1:43754_solr c:authCollection s:shard3  x:authCollection_shard3_replica1] o.a.s.c.ZkController Collection zkNode exists
   [junit4]   2> 2075986 INFO  (qtp612084-91466) [n:127.0.0.1:43754_solr c:authCollection s:shard3  x:authCollection_shard3_replica1] o.a.s.c.c.ZkStateReader Load collection config from: [/collections/authCollection]
   [junit4]   2> 2075986 INFO  (qtp23404581-91463) [n:127.0.0.1:36140_solr c:authCollection s:shard2  x:authCollection_shard2_replica1] o.a.s.c.ZkController Collection zkNode exists
   [junit4]   2> 2075986 INFO  (qtp23404581-91463) [n:127.0.0.1:36140_solr c:authCollection s:shard2  x:authCollection_shard2_replica1] o.a.s.c.c.ZkStateReader Load collection config from: [/collections/authCollection]
   [junit4]   2> 2075987 INFO  (qtp612084-91466) [n:127.0.0.1:43754_solr c:authCollection s:shard3  x:authCollection_shard3_replica1] o.a.s.c.c.ZkStateReader path=[/collections/authCollection] [configName]=[conf] specified config exists in ZooKeeper
   [junit4]   2> 2075988 INFO  (qtp612084-91466) [n:127.0.0.1:43754_solr c:authCollection s:shard3  x:authCollection_shard3_replica1] o.a.s.c.SolrResourceLoader new SolrResourceLoader for directory: '/home/jenkins/workspace/Lucene-Solr-6.x-Linux/solr/build/solr-core/test/J0/temp/solr.security.BasicAuthIntegrationTest_A02E38E6F47D283A-001/tempDir-001/node1/authCollection_shard3_replica1'
   [junit4]   2> 2075988 INFO  (qtp23404581-91463) [n:127.0.0.1:36140_solr c:authC

[...truncated too long message...]

FO  (coreCloseExecutor-10039-thread-1) [n:127.0.0.1:36140_solr c:authCollection s:shard2 r:core_node3 x:authCollection_shard2_replica1] o.a.s.c.CachingDirectoryFactory Closing directory, CoreContainer#isShutdown=true
   [junit4]   2> 2079177 INFO  (coreCloseExecutor-10039-thread-1) [n:127.0.0.1:36140_solr c:authCollection s:shard2 r:core_node3 x:authCollection_shard2_replica1] o.a.s.c.CachingDirectoryFactory Closing directory: /home/jenkins/workspace/Lucene-Solr-6.x-Linux/solr/build/solr-core/test/J0/temp/solr.security.BasicAuthIntegrationTest_A02E38E6F47D283A-001/tempDir-001/node2/./authCollection_shard2_replica1/data/snapshot_metadata
   [junit4]   2> 2079177 INFO  (jetty-launcher-23785-thread-3) [    ] o.a.s.c.Overseer Overseer (id=96563326548901896-127.0.0.1:43754_solr-n_0000000000) closing
   [junit4]   2> 2079187 INFO  (OverseerStateUpdate-96563326548901896-127.0.0.1:43754_solr-n_0000000000) [n:127.0.0.1:43754_solr    ] o.a.s.c.Overseer Overseer Loop exiting : 127.0.0.1:43754_solr
   [junit4]   2> 2079187 INFO  (zkCallback-23799-thread-2-processing-n:127.0.0.1:43754_solr) [n:127.0.0.1:43754_solr    ] o.a.s.c.c.ZkStateReader A live node change: [WatchedEvent state:SyncConnected type:NodeChildrenChanged path:/live_nodes], has occurred - updating... (live nodes size: [3])
   [junit4]   2> 2079187 INFO  (zkCallback-23800-thread-1-processing-n:127.0.0.1:36140_solr) [n:127.0.0.1:36140_solr    ] o.a.s.c.c.ZkStateReader A live node change: [WatchedEvent state:SyncConnected type:NodeChildrenChanged path:/live_nodes], has occurred - updating... (live nodes size: [3])
   [junit4]   2> 2079187 INFO  (zkCallback-23813-thread-1-processing-n:127.0.0.1:45253_solr) [n:127.0.0.1:45253_solr    ] o.a.s.c.c.ZkStateReader A live node change: [WatchedEvent state:SyncConnected type:NodeChildrenChanged path:/live_nodes], has occurred - updating... (live nodes size: [3])
   [junit4]   2> 2079187 WARN  (zkCallback-23800-thread-1-processing-n:127.0.0.1:36140_solr) [n:127.0.0.1:36140_solr    ] o.a.s.c.c.ZkStateReader ZooKeeper watch triggered, but Solr cannot talk to ZK: [KeeperErrorCode = Session expired for /live_nodes]
   [junit4]   2> 2079187 WARN  (zkCallback-23813-thread-1-processing-n:127.0.0.1:45253_solr) [n:127.0.0.1:45253_solr    ] o.a.s.c.c.ZkStateReader ZooKeeper watch triggered, but Solr cannot talk to ZK: [KeeperErrorCode = Session expired for /live_nodes]
   [junit4]   2> 2079187 INFO  (zkCallback-23799-thread-2-processing-n:127.0.0.1:43754_solr) [n:127.0.0.1:43754_solr    ] o.a.s.c.c.ZkStateReader Updated live nodes from ZooKeeper... (3) -> (1)
   [junit4]   2> 2079187 INFO  (jetty-launcher-23785-thread-2) [    ] o.e.j.s.h.ContextHandler Stopped o.e.j.s.ServletContextHandler@1e538fa{/solr,null,UNAVAILABLE}
   [junit4]   2> 2079187 INFO  (zkCallback-23799-thread-2-processing-n:127.0.0.1:43754_solr) [n:127.0.0.1:43754_solr    ] o.a.s.c.c.ZkStateReader A live node change: [WatchedEvent state:SyncConnected type:NodeChildrenChanged path:/live_nodes], has occurred - updating... (live nodes size: [1])
   [junit4]   2> 2079188 INFO  (jetty-launcher-23785-thread-1) [    ] o.e.j.s.h.ContextHandler Stopped o.e.j.s.ServletContextHandler@192a13e{/solr,null,UNAVAILABLE}
   [junit4]   2> 2080688 WARN  (zkCallback-23799-thread-2-processing-n:127.0.0.1:43754_solr) [n:127.0.0.1:43754_solr    ] o.a.s.c.c.ZkStateReader ZooKeeper watch triggered, but Solr cannot talk to ZK: [KeeperErrorCode = Session expired for /live_nodes]
   [junit4]   2> 2080688 INFO  (jetty-launcher-23785-thread-3) [    ] o.e.j.s.h.ContextHandler Stopped o.e.j.s.ServletContextHandler@1ffb0d8{/solr,null,UNAVAILABLE}
   [junit4]   2> 2080689 INFO  (SUITE-BasicAuthIntegrationTest-seed#[A02E38E6F47D283A]-worker) [    ] o.a.s.c.ZkTestServer connecting to 127.0.0.1:43933 43933
   [junit4]   2> 2080701 INFO  (Thread-3109) [    ] o.a.s.c.ZkTestServer connecting to 127.0.0.1:43933 43933
   [junit4]   2> 2080702 WARN  (Thread-3109) [    ] o.a.s.c.ZkTestServer Watch limit violations: 
   [junit4]   2> Maximum concurrent create/delete watches above limit:
   [junit4]   2> 
   [junit4]   2> 	5	/solr/aliases.json
   [junit4]   2> 	4	/solr/security.json
   [junit4]   2> 	4	/solr/configs/conf
   [junit4]   2> 
   [junit4]   2> Maximum concurrent data watches above limit:
   [junit4]   2> 
   [junit4]   2> 	5	/solr/clusterstate.json
   [junit4]   2> 	5	/solr/clusterprops.json
   [junit4]   2> 	4	/solr/collections/authCollection/state.json
   [junit4]   2> 	2	/solr/overseer_elect/election/96563326548901896-127.0.0.1:43754_solr-n_0000000000
   [junit4]   2> 
   [junit4]   2> Maximum concurrent children watches above limit:
   [junit4]   2> 
   [junit4]   2> 	11	/solr/overseer/queue
   [junit4]   2> 	5	/solr/collections
   [junit4]   2> 	5	/solr/overseer/collection-queue-work
   [junit4]   2> 	4	/solr/live_nodes
   [junit4]   2> 	3	/solr/overseer/queue-work
   [junit4]   2> 
   [junit4]   2> 2080702 INFO  (SUITE-BasicAuthIntegrationTest-seed#[A02E38E6F47D283A]-worker) [    ] o.a.s.SolrTestCaseJ4 ###deleteCore
   [junit4]   2> NOTE: leaving temporary files on disk at: /home/jenkins/workspace/Lucene-Solr-6.x-Linux/solr/build/solr-core/test/J0/temp/solr.security.BasicAuthIntegrationTest_A02E38E6F47D283A-001
   [junit4]   2> Sep 09, 2016 4:43:57 PM com.carrotsearch.randomizedtesting.ThreadLeakControl checkThreadLeaks
   [junit4]   2> WARNING: Will linger awaiting termination of 1 leaked thread(s).
   [junit4]   2> NOTE: test params are: codec=Asserting(Lucene62): {}, docValues:{}, maxPointsInLeafNode=716, maxMBSortInHeap=7.464034362581771, sim=ClassicSimilarity, locale=id, timezone=Mexico/BajaNorte
   [junit4]   2> NOTE: Linux 4.4.0-36-generic i386/Oracle Corporation 1.8.0_102 (32-bit)/cpus=12,threads=1,free=188471328,total=442908672
   [junit4]   2> NOTE: All tests run in this JVM: [TestConfigSetsAPIExclusivity, TestManagedResource, TestRandomDVFaceting, TestFastWriter, TestOrdValues, DistributedSpellCheckComponentTest, TestSearcherReuse, SortSpecParsingTest, PKIAuthenticationIntegrationTest, HdfsChaosMonkeySafeLeaderTest, SparseHLLTest, TestStressLiveNodes, OverseerTaskQueueTest, HdfsBasicDistributedZk2Test, TestSolrCLIRunExample, HighlighterConfigTest, BasicDistributedZkTest, TestCSVLoader, CollectionsAPISolrJTest, UUIDFieldTest, SolrCloudExampleTest, BasicZkTest, SyncSliceTest, SharedFSAutoReplicaFailoverUtilsTest, DateFieldTest, DistribCursorPagingTest, HighlighterMaxOffsetTest, OverseerModifyCollectionTest, QueryElevationComponentTest, LeaderElectionIntegrationTest, TestHighlightDedupGrouping, BlockJoinFacetDistribTest, TestLocalFSCloudBackupRestore, UniqFieldsUpdateProcessorFactoryTest, DocValuesMissingTest, AsyncCallRequestStatusResponseTest, TestNamedUpdateProcessors, TestStressUserVersions, TestJsonRequest, TestReplicaProperties, ReturnFieldsTest, TestFunctionQuery, TestConfigSets, BlockCacheTest, TestDefaultStatsCache, DocumentAnalysisRequestHandlerTest, RequestLoggingTest, OutOfBoxZkACLAndCredentialsProvidersTest, CursorPagingTest, HdfsDirectoryFactoryTest, TestStressRecovery, TestBulkSchemaConcurrent, DistributedFacetExistsSmallTest, RegexBoostProcessorTest, TestDefaultSearchFieldResource, FacetPivotSmallTest, TestSchemaSimilarityResource, DistributedQueryElevationComponentTest, TestRealTimeGet, TestRemoteStreaming, TestQueryWrapperFilter, HttpPartitionTest, TestReloadAndDeleteDocs, TestHdfsCloudBackupRestore, TestSolrDynamicMBean, TestIBSimilarityFactory, ConjunctionSolrSpellCheckerTest, DefaultValueUpdateProcessorTest, TestSolr4Spatial, TestJoin, FileBasedSpellCheckerTest, TestQuerySenderNoQuery, DeleteReplicaTest, HdfsRecoverLeaseTest, TestCrossCoreJoin, ClusterStateTest, TestComponentsName, TestFieldCache, ScriptEngineTest, SuggestComponentTest, TestFileDictionaryLookup, TestManagedSchemaAPI, TestPerFieldSimilarity, CheckHdfsIndexTest, TestPHPSerializedResponseWriter, ClassificationUpdateProcessorFactoryTest, TestXmlQParserPlugin, SignatureUpdateProcessorFactoryTest, TestDistribDocBasedVersion, TestStressLucene, SaslZkACLProviderTest, TestSSLRandomization, ConnectionReuseTest, TestOmitPositions, TestFieldCacheSort, BlobRepositoryCloudTest, SegmentsInfoRequestHandlerTest, PolyFieldTest, TestSolrCoreProperties, TestCloudDeleteByQuery, CollectionsAPIDistributedZkTest, TestRandomFaceting, TestFaceting, ZkControllerTest, TestStressReorder, TestStressVersions, HardAutoCommitTest, TestRangeQuery, SpellCheckComponentTest, BadIndexSchemaTest, TestSort, BasicFunctionalityTest, TestLazyCores, TestBadConfig, TestIndexSearcher, HighlighterTest, SoftAutoCommitTest, ShowFileRequestHandlerTest, CurrencyFieldOpenExchangeTest, AnalysisAfterCoreReloadTest, SolrRequestParserTest, TestFoldingMultitermQuery, SuggesterWFSTTest, SolrCoreCheckLockOnStartupTest, TestAtomicUpdateErrorCases, StatelessScriptUpdateProcessorFactoryTest, CacheHeaderTest, DisMaxRequestHandlerTest, StandardRequestHandlerTest, DirectSolrSpellCheckerTest, RequestHandlersTest, TermVectorComponentTest, IndexSchemaRuntimeFieldTest, TestCollationField, JSONWriterTest, BinaryUpdateRequestHandlerTest, SOLR749Test, AlternateDirectoryTest, SolrIndexConfigTest, NumericFieldsTest, TestElisionMultitermQuery, OutputWriterTest, ExternalFileFieldSortTest, DirectSolrConnectionTest, SpellPossibilityIteratorTest, TestCodecSupport, TestDFRSimilarityFactory, TimeZoneUtilsTest, TestFastLRUCache, RAMDirectoryFactoryTest, TestUtils, ZkNodePropsTest, SystemInfoHandlerTest, ActionThrottleTest, CdcrReplicationDistributedZkTest, CdcrReplicationHandlerTest, CdcrRequestHandlerTest, CdcrVersionReplicationTest, CleanupOldIndexTest, CollectionStateFormat2Test, CreateCollectionCleanupTest, DeleteNodeTest, DeleteStatusTest, DistribJoinFromCollectionTest, LeaderInitiatedRecoveryOnCommitTest, PeerSyncReplicationTest, TestExclusionRuleCollectionAccess, TestRandomFlRTGCloud, TestCloudSchemaless, TestExactSharedStatsCache, BasicAuthIntegrationTest]
   [junit4] Completed [606/630 (1!)] on J0 in 7.06s, 1 test, 1 error <<< FAILURES!

[...truncated 52670 lines...]


Mime
View raw message