lucene-dev mailing list archives

Site index · List index
Message view « Date » · « Thread »
Top « Date » · « Thread »
From Policeman Jenkins Server <jenk...@thetaphi.de>
Subject [JENKINS-EA] Lucene-Solr-6.x-Linux (64bit/jdk-9-ea+134) - Build # 1693 - Still Unstable!
Date Fri, 09 Sep 2016 20:35:37 GMT
Build: http://jenkins.thetaphi.de/job/Lucene-Solr-6.x-Linux/1693/
Java: 64bit/jdk-9-ea+134 -XX:-UseCompressedOops -XX:+UseG1GC

1 tests failed.
FAILED:  org.apache.solr.security.BasicAuthIntegrationTest.testBasicAuth

Error Message:
IOException occured when talking to server at: https://127.0.0.1:36768/solr

Stack Trace:
org.apache.solr.client.solrj.SolrServerException: IOException occured when talking to server at: https://127.0.0.1:36768/solr
	at __randomizedtesting.SeedInfo.seed([F9D989217B3EB010:45B7FF33DF6D336A]:0)
	at org.apache.solr.client.solrj.impl.HttpSolrClient.executeMethod(HttpSolrClient.java:606)
	at org.apache.solr.client.solrj.impl.HttpSolrClient.request(HttpSolrClient.java:261)
	at org.apache.solr.client.solrj.impl.HttpSolrClient.request(HttpSolrClient.java:250)
	at org.apache.solr.client.solrj.SolrClient.request(SolrClient.java:1219)
	at org.apache.solr.security.BasicAuthIntegrationTest.testBasicAuth(BasicAuthIntegrationTest.java:158)
	at jdk.internal.reflect.NativeMethodAccessorImpl.invoke0(java.base@9-ea/Native Method)
	at jdk.internal.reflect.NativeMethodAccessorImpl.invoke(java.base@9-ea/NativeMethodAccessorImpl.java:62)
	at jdk.internal.reflect.DelegatingMethodAccessorImpl.invoke(java.base@9-ea/DelegatingMethodAccessorImpl.java:43)
	at java.lang.reflect.Method.invoke(java.base@9-ea/Method.java:535)
	at com.carrotsearch.randomizedtesting.RandomizedRunner.invoke(RandomizedRunner.java:1764)
	at com.carrotsearch.randomizedtesting.RandomizedRunner$8.evaluate(RandomizedRunner.java:871)
	at com.carrotsearch.randomizedtesting.RandomizedRunner$9.evaluate(RandomizedRunner.java:907)
	at com.carrotsearch.randomizedtesting.RandomizedRunner$10.evaluate(RandomizedRunner.java:921)
	at com.carrotsearch.randomizedtesting.rules.SystemPropertiesRestoreRule$1.evaluate(SystemPropertiesRestoreRule.java:57)
	at org.apache.lucene.util.TestRuleSetupTeardownChained$1.evaluate(TestRuleSetupTeardownChained.java:49)
	at org.apache.lucene.util.AbstractBeforeAfterRule$1.evaluate(AbstractBeforeAfterRule.java:45)
	at org.apache.lucene.util.TestRuleThreadAndTestName$1.evaluate(TestRuleThreadAndTestName.java:48)
	at org.apache.lucene.util.TestRuleIgnoreAfterMaxFailures$1.evaluate(TestRuleIgnoreAfterMaxFailures.java:64)
	at org.apache.lucene.util.TestRuleMarkFailure$1.evaluate(TestRuleMarkFailure.java:47)
	at com.carrotsearch.randomizedtesting.rules.StatementAdapter.evaluate(StatementAdapter.java:36)
	at com.carrotsearch.randomizedtesting.ThreadLeakControl$StatementRunner.run(ThreadLeakControl.java:367)
	at com.carrotsearch.randomizedtesting.ThreadLeakControl.forkTimeoutingTask(ThreadLeakControl.java:809)
	at com.carrotsearch.randomizedtesting.ThreadLeakControl$3.evaluate(ThreadLeakControl.java:460)
	at com.carrotsearch.randomizedtesting.RandomizedRunner.runSingleTest(RandomizedRunner.java:880)
	at com.carrotsearch.randomizedtesting.RandomizedRunner$5.evaluate(RandomizedRunner.java:781)
	at com.carrotsearch.randomizedtesting.RandomizedRunner$6.evaluate(RandomizedRunner.java:816)
	at com.carrotsearch.randomizedtesting.RandomizedRunner$7.evaluate(RandomizedRunner.java:827)
	at com.carrotsearch.randomizedtesting.rules.StatementAdapter.evaluate(StatementAdapter.java:36)
	at com.carrotsearch.randomizedtesting.rules.SystemPropertiesRestoreRule$1.evaluate(SystemPropertiesRestoreRule.java:57)
	at org.apache.lucene.util.AbstractBeforeAfterRule$1.evaluate(AbstractBeforeAfterRule.java:45)
	at com.carrotsearch.randomizedtesting.rules.StatementAdapter.evaluate(StatementAdapter.java:36)
	at org.apache.lucene.util.TestRuleStoreClassName$1.evaluate(TestRuleStoreClassName.java:41)
	at com.carrotsearch.randomizedtesting.rules.NoShadowingOrOverridesOnMethodsRule$1.evaluate(NoShadowingOrOverridesOnMethodsRule.java:40)
	at com.carrotsearch.randomizedtesting.rules.NoShadowingOrOverridesOnMethodsRule$1.evaluate(NoShadowingOrOverridesOnMethodsRule.java:40)
	at com.carrotsearch.randomizedtesting.rules.StatementAdapter.evaluate(StatementAdapter.java:36)
	at com.carrotsearch.randomizedtesting.rules.StatementAdapter.evaluate(StatementAdapter.java:36)
	at com.carrotsearch.randomizedtesting.rules.StatementAdapter.evaluate(StatementAdapter.java:36)
	at org.apache.lucene.util.TestRuleAssertionsRequired$1.evaluate(TestRuleAssertionsRequired.java:53)
	at org.apache.lucene.util.TestRuleMarkFailure$1.evaluate(TestRuleMarkFailure.java:47)
	at org.apache.lucene.util.TestRuleIgnoreAfterMaxFailures$1.evaluate(TestRuleIgnoreAfterMaxFailures.java:64)
	at org.apache.lucene.util.TestRuleIgnoreTestSuites$1.evaluate(TestRuleIgnoreTestSuites.java:54)
	at com.carrotsearch.randomizedtesting.rules.StatementAdapter.evaluate(StatementAdapter.java:36)
	at com.carrotsearch.randomizedtesting.ThreadLeakControl$StatementRunner.run(ThreadLeakControl.java:367)
	at java.lang.Thread.run(java.base@9-ea/Thread.java:843)
Caused by: javax.net.ssl.SSLHandshakeException: sun.security.validator.ValidatorException: PKIX path building failed: sun.security.provider.certpath.SunCertPathBuilderException: unable to find valid certification path to requested target
	at sun.security.ssl.Alerts.getSSLException(java.base@9-ea/Alerts.java:198)
	at sun.security.ssl.SSLSocketImpl.fatal(java.base@9-ea/SSLSocketImpl.java:1962)
	at sun.security.ssl.Handshaker.fatalSE(java.base@9-ea/Handshaker.java:309)
	at sun.security.ssl.Handshaker.fatalSE(java.base@9-ea/Handshaker.java:303)
	at sun.security.ssl.ClientHandshaker.checkServerCerts(java.base@9-ea/ClientHandshaker.java:1843)
	at sun.security.ssl.ClientHandshaker.serverCertificate(java.base@9-ea/ClientHandshaker.java:1652)
	at sun.security.ssl.ClientHandshaker.processMessage(java.base@9-ea/ClientHandshaker.java:260)
	at sun.security.ssl.Handshaker.processLoop(java.base@9-ea/Handshaker.java:1061)
	at sun.security.ssl.Handshaker.processRecord(java.base@9-ea/Handshaker.java:995)
	at sun.security.ssl.SSLSocketImpl.processInputRecord(java.base@9-ea/SSLSocketImpl.java:1132)
	at sun.security.ssl.SSLSocketImpl.readRecord(java.base@9-ea/SSLSocketImpl.java:1069)
	at sun.security.ssl.SSLSocketImpl.readRecord(java.base@9-ea/SSLSocketImpl.java:968)
	at sun.security.ssl.SSLSocketImpl.performInitialHandshake(java.base@9-ea/SSLSocketImpl.java:1395)
	at sun.security.ssl.SSLSocketImpl.startHandshake(java.base@9-ea/SSLSocketImpl.java:1422)
	at sun.security.ssl.SSLSocketImpl.startHandshake(java.base@9-ea/SSLSocketImpl.java:1406)
	at org.apache.http.conn.ssl.SSLSocketFactory.connectSocket(SSLSocketFactory.java:543)
	at org.apache.http.conn.ssl.SSLSocketFactory.connectSocket(SSLSocketFactory.java:409)
	at org.apache.http.impl.conn.DefaultClientConnectionOperator.openConnection(DefaultClientConnectionOperator.java:177)
	at org.apache.http.impl.conn.ManagedClientConnectionImpl.open(ManagedClientConnectionImpl.java:304)
	at org.apache.http.impl.client.DefaultRequestDirector.tryConnect(DefaultRequestDirector.java:611)
	at org.apache.http.impl.client.DefaultRequestDirector.execute(DefaultRequestDirector.java:446)
	at org.apache.http.impl.client.AbstractHttpClient.doExecute(AbstractHttpClient.java:882)
	at org.apache.http.impl.client.CloseableHttpClient.execute(CloseableHttpClient.java:82)
	at org.apache.http.impl.client.CloseableHttpClient.execute(CloseableHttpClient.java:107)
	at org.apache.http.impl.client.CloseableHttpClient.execute(CloseableHttpClient.java:55)
	at org.apache.solr.client.solrj.impl.HttpSolrClient.executeMethod(HttpSolrClient.java:497)
	... 43 more
Caused by: sun.security.validator.ValidatorException: PKIX path building failed: sun.security.provider.certpath.SunCertPathBuilderException: unable to find valid certification path to requested target
	at sun.security.validator.PKIXValidator.doBuild(java.base@9-ea/PKIXValidator.java:386)
	at sun.security.validator.PKIXValidator.engineValidate(java.base@9-ea/PKIXValidator.java:291)
	at sun.security.validator.Validator.validate(java.base@9-ea/Validator.java:264)
	at sun.security.ssl.X509TrustManagerImpl.validate(java.base@9-ea/X509TrustManagerImpl.java:343)
	at sun.security.ssl.X509TrustManagerImpl.checkTrusted(java.base@9-ea/X509TrustManagerImpl.java:237)
	at sun.security.ssl.X509TrustManagerImpl.checkServerTrusted(java.base@9-ea/X509TrustManagerImpl.java:124)
	at sun.security.ssl.ClientHandshaker.checkServerCerts(java.base@9-ea/ClientHandshaker.java:1822)
	... 64 more
Caused by: sun.security.provider.certpath.SunCertPathBuilderException: unable to find valid certification path to requested target
	at sun.security.provider.certpath.SunCertPathBuilder.build(java.base@9-ea/SunCertPathBuilder.java:141)
	at sun.security.provider.certpath.SunCertPathBuilder.engineBuild(java.base@9-ea/SunCertPathBuilder.java:126)
	at java.security.cert.CertPathBuilder.build(java.base@9-ea/CertPathBuilder.java:288)
	at sun.security.validator.PKIXValidator.doBuild(java.base@9-ea/PKIXValidator.java:381)
	... 70 more




Build Log:
[...truncated 10934 lines...]
   [junit4] Suite: org.apache.solr.security.BasicAuthIntegrationTest
   [junit4]   2> Creating dataDir: /home/jenkins/workspace/Lucene-Solr-6.x-Linux/solr/build/solr-core/test/J2/temp/solr.security.BasicAuthIntegrationTest_F9D989217B3EB010-001/init-core-data-001
   [junit4]   2> 255448 INFO  (SUITE-BasicAuthIntegrationTest-seed#[F9D989217B3EB010]-worker) [    ] o.a.s.SolrTestCaseJ4 Randomized ssl (true) and clientAuth (true) via: @org.apache.solr.util.RandomizeSSL(reason="", ssl=0.0/0.0, value=0.0/0.0, clientAuth=0.0/0.0)
   [junit4]   2> 255449 INFO  (SUITE-BasicAuthIntegrationTest-seed#[F9D989217B3EB010]-worker) [    ] o.a.s.c.ZkTestServer STARTING ZK TEST SERVER
   [junit4]   2> 255450 INFO  (Thread-334) [    ] o.a.s.c.ZkTestServer client port:0.0.0.0/0.0.0.0:0
   [junit4]   2> 255450 INFO  (Thread-334) [    ] o.a.s.c.ZkTestServer Starting server
   [junit4]   2> 255550 INFO  (SUITE-BasicAuthIntegrationTest-seed#[F9D989217B3EB010]-worker) [    ] o.a.s.c.ZkTestServer start zk server on port:46334
   [junit4]   2> 255550 INFO  (SUITE-BasicAuthIntegrationTest-seed#[F9D989217B3EB010]-worker) [    ] o.a.s.c.c.SolrZkClient Using default ZkCredentialsProvider
   [junit4]   2> 255550 INFO  (SUITE-BasicAuthIntegrationTest-seed#[F9D989217B3EB010]-worker) [    ] o.a.s.c.c.ConnectionManager Waiting for client to connect to ZooKeeper
   [junit4]   2> 255552 INFO  (zkCallback-302-thread-1) [    ] o.a.s.c.c.ConnectionManager Watcher org.apache.solr.common.cloud.ConnectionManager@19f6ba1e name:ZooKeeperConnection Watcher:127.0.0.1:46334 got event WatchedEvent state:SyncConnected type:None path:null path:null type:None
   [junit4]   2> 255552 INFO  (SUITE-BasicAuthIntegrationTest-seed#[F9D989217B3EB010]-worker) [    ] o.a.s.c.c.ConnectionManager Client is connected to ZooKeeper
   [junit4]   2> 255552 INFO  (SUITE-BasicAuthIntegrationTest-seed#[F9D989217B3EB010]-worker) [    ] o.a.s.c.c.SolrZkClient Using default ZkACLProvider
   [junit4]   2> 255552 INFO  (SUITE-BasicAuthIntegrationTest-seed#[F9D989217B3EB010]-worker) [    ] o.a.s.c.c.SolrZkClient makePath: /solr/solr.xml
   [junit4]   2> 255553 INFO  (SUITE-BasicAuthIntegrationTest-seed#[F9D989217B3EB010]-worker) [    ] o.a.s.c.c.SolrZkClient makePath: /solr/clusterprops.json
   [junit4]   2> 255555 INFO  (jetty-launcher-301-thread-1) [    ] o.e.j.s.Server jetty-9.3.8.v20160314
   [junit4]   2> 255557 INFO  (jetty-launcher-301-thread-2) [    ] o.e.j.s.Server jetty-9.3.8.v20160314
   [junit4]   2> 255558 INFO  (jetty-launcher-301-thread-2) [    ] o.e.j.s.h.ContextHandler Started o.e.j.s.ServletContextHandler@301b71d8{/solr,null,AVAILABLE}
   [junit4]   2> 255558 INFO  (jetty-launcher-301-thread-1) [    ] o.e.j.s.h.ContextHandler Started o.e.j.s.ServletContextHandler@64f760d6{/solr,null,AVAILABLE}
   [junit4]   2> 255559 INFO  (jetty-launcher-301-thread-3) [    ] o.e.j.s.Server jetty-9.3.8.v20160314
   [junit4]   2> 255560 INFO  (jetty-launcher-301-thread-3) [    ] o.e.j.s.h.ContextHandler Started o.e.j.s.ServletContextHandler@59f85ed6{/solr,null,AVAILABLE}
   [junit4]   2> 255560 INFO  (jetty-launcher-301-thread-2) [    ] o.e.j.s.ServerConnector Started ServerConnector@5ee008d9{SSL,[ssl, http/1.1]}{127.0.0.1:36768}
   [junit4]   2> 255560 INFO  (jetty-launcher-301-thread-1) [    ] o.e.j.s.ServerConnector Started ServerConnector@3380b7ac{SSL,[ssl, http/1.1]}{127.0.0.1:39176}
   [junit4]   2> 255560 INFO  (jetty-launcher-301-thread-2) [    ] o.e.j.s.Server Started @257350ms
   [junit4]   2> 255560 INFO  (jetty-launcher-301-thread-1) [    ] o.e.j.s.Server Started @257350ms
   [junit4]   2> 255560 INFO  (jetty-launcher-301-thread-2) [    ] o.a.s.c.s.e.JettySolrRunner Jetty properties: {hostContext=/solr, hostPort=36768}
   [junit4]   2> 255560 INFO  (jetty-launcher-301-thread-1) [    ] o.a.s.c.s.e.JettySolrRunner Jetty properties: {hostContext=/solr, hostPort=39176}
   [junit4]   2> 255560 INFO  (jetty-launcher-301-thread-2) [    ] o.a.s.s.SolrDispatchFilter SolrDispatchFilter.init(): jdk.internal.loader.ClassLoaders$AppClassLoader@17d99928
   [junit4]   2> 255560 INFO  (jetty-launcher-301-thread-3) [    ] o.e.j.s.ServerConnector Started ServerConnector@22c89996{SSL,[ssl, http/1.1]}{127.0.0.1:33521}
   [junit4]   2> 255560 INFO  (jetty-launcher-301-thread-2) [    ] o.a.s.c.SolrResourceLoader new SolrResourceLoader for directory: '/home/jenkins/workspace/Lucene-Solr-6.x-Linux/solr/build/solr-core/test/J2/temp/solr.security.BasicAuthIntegrationTest_F9D989217B3EB010-001/tempDir-001/node2'
   [junit4]   2> 255560 INFO  (jetty-launcher-301-thread-3) [    ] o.e.j.s.Server Started @257350ms
   [junit4]   2> 255560 INFO  (jetty-launcher-301-thread-1) [    ] o.a.s.s.SolrDispatchFilter SolrDispatchFilter.init(): jdk.internal.loader.ClassLoaders$AppClassLoader@17d99928
   [junit4]   2> 255561 INFO  (jetty-launcher-301-thread-3) [    ] o.a.s.c.s.e.JettySolrRunner Jetty properties: {hostContext=/solr, hostPort=33521}
   [junit4]   2> 255561 INFO  (jetty-launcher-301-thread-1) [    ] o.a.s.c.SolrResourceLoader new SolrResourceLoader for directory: '/home/jenkins/workspace/Lucene-Solr-6.x-Linux/solr/build/solr-core/test/J2/temp/solr.security.BasicAuthIntegrationTest_F9D989217B3EB010-001/tempDir-001/node1'
   [junit4]   2> 255561 INFO  (jetty-launcher-301-thread-2) [    ] o.a.s.c.SolrResourceLoader JNDI not configured for solr (NoInitialContextEx)
   [junit4]   2> 255561 INFO  (jetty-launcher-301-thread-2) [    ] o.a.s.c.SolrResourceLoader solr home defaulted to 'solr/' (could not find system property or JNDI)
   [junit4]   2> 255561 INFO  (jetty-launcher-301-thread-1) [    ] o.a.s.c.SolrResourceLoader JNDI not configured for solr (NoInitialContextEx)
   [junit4]   2> 255561 INFO  (jetty-launcher-301-thread-1) [    ] o.a.s.c.SolrResourceLoader solr home defaulted to 'solr/' (could not find system property or JNDI)
   [junit4]   2> 255561 INFO  (jetty-launcher-301-thread-3) [    ] o.a.s.s.SolrDispatchFilter SolrDispatchFilter.init(): jdk.internal.loader.ClassLoaders$AppClassLoader@17d99928
   [junit4]   2> 255561 INFO  (jetty-launcher-301-thread-2) [    ] o.a.s.c.c.SolrZkClient Using default ZkCredentialsProvider
   [junit4]   2> 255561 INFO  (jetty-launcher-301-thread-3) [    ] o.a.s.c.SolrResourceLoader new SolrResourceLoader for directory: '/home/jenkins/workspace/Lucene-Solr-6.x-Linux/solr/build/solr-core/test/J2/temp/solr.security.BasicAuthIntegrationTest_F9D989217B3EB010-001/tempDir-001/node3'
   [junit4]   2> 255562 INFO  (jetty-launcher-301-thread-1) [    ] o.a.s.c.c.SolrZkClient Using default ZkCredentialsProvider
   [junit4]   2> 255562 INFO  (jetty-launcher-301-thread-3) [    ] o.a.s.c.SolrResourceLoader JNDI not configured for solr (NoInitialContextEx)
   [junit4]   2> 255562 INFO  (jetty-launcher-301-thread-3) [    ] o.a.s.c.SolrResourceLoader solr home defaulted to 'solr/' (could not find system property or JNDI)
   [junit4]   2> 255562 INFO  (jetty-launcher-301-thread-2) [    ] o.a.s.c.c.ConnectionManager Waiting for client to connect to ZooKeeper
   [junit4]   2> 255562 INFO  (jetty-launcher-301-thread-3) [    ] o.a.s.c.c.SolrZkClient Using default ZkCredentialsProvider
   [junit4]   2> 255562 INFO  (jetty-launcher-301-thread-1) [    ] o.a.s.c.c.ConnectionManager Waiting for client to connect to ZooKeeper
   [junit4]   2> 255562 INFO  (jetty-launcher-301-thread-3) [    ] o.a.s.c.c.ConnectionManager Waiting for client to connect to ZooKeeper
   [junit4]   2> 255563 INFO  (zkCallback-303-thread-1) [    ] o.a.s.c.c.ConnectionManager Watcher org.apache.solr.common.cloud.ConnectionManager@762eb239 name:ZooKeeperConnection Watcher:127.0.0.1:46334/solr got event WatchedEvent state:SyncConnected type:None path:null path:null type:None
   [junit4]   2> 255563 INFO  (jetty-launcher-301-thread-2) [    ] o.a.s.c.c.ConnectionManager Client is connected to ZooKeeper
   [junit4]   2> 255563 INFO  (zkCallback-304-thread-1) [    ] o.a.s.c.c.ConnectionManager Watcher org.apache.solr.common.cloud.ConnectionManager@397f626a name:ZooKeeperConnection Watcher:127.0.0.1:46334/solr got event WatchedEvent state:SyncConnected type:None path:null path:null type:None
   [junit4]   2> 255563 INFO  (jetty-launcher-301-thread-1) [    ] o.a.s.c.c.ConnectionManager Client is connected to ZooKeeper
   [junit4]   2> 255563 INFO  (jetty-launcher-301-thread-2) [    ] o.a.s.c.c.SolrZkClient Using default ZkACLProvider
   [junit4]   2> 255563 INFO  (zkCallback-305-thread-1) [    ] o.a.s.c.c.ConnectionManager Watcher org.apache.solr.common.cloud.ConnectionManager@34e73460 name:ZooKeeperConnection Watcher:127.0.0.1:46334/solr got event WatchedEvent state:SyncConnected type:None path:null path:null type:None
   [junit4]   2> 255563 INFO  (jetty-launcher-301-thread-1) [    ] o.a.s.c.c.SolrZkClient Using default ZkACLProvider
   [junit4]   2> 255563 INFO  (jetty-launcher-301-thread-3) [    ] o.a.s.c.c.ConnectionManager Client is connected to ZooKeeper
   [junit4]   2> 255563 INFO  (jetty-launcher-301-thread-2) [    ] o.a.s.s.SolrDispatchFilter solr.xml found in ZooKeeper. Loading...
   [junit4]   2> 255563 INFO  (jetty-launcher-301-thread-1) [    ] o.a.s.s.SolrDispatchFilter solr.xml found in ZooKeeper. Loading...
   [junit4]   2> 255563 INFO  (jetty-launcher-301-thread-3) [    ] o.a.s.c.c.SolrZkClient Using default ZkACLProvider
   [junit4]   2> 255563 INFO  (jetty-launcher-301-thread-3) [    ] o.a.s.s.SolrDispatchFilter solr.xml found in ZooKeeper. Loading...
   [junit4]   2> 255567 INFO  (jetty-launcher-301-thread-3) [    ] o.a.s.c.CorePropertiesLocator Config-defined core root directory: /home/jenkins/workspace/Lucene-Solr-6.x-Linux/solr/build/solr-core/test/J2/temp/solr.security.BasicAuthIntegrationTest_F9D989217B3EB010-001/tempDir-001/node3/.
   [junit4]   2> 255567 INFO  (jetty-launcher-301-thread-1) [    ] o.a.s.c.CorePropertiesLocator Config-defined core root directory: /home/jenkins/workspace/Lucene-Solr-6.x-Linux/solr/build/solr-core/test/J2/temp/solr.security.BasicAuthIntegrationTest_F9D989217B3EB010-001/tempDir-001/node1/.
   [junit4]   2> 255567 WARN  (NIOServerCxn.Factory:0.0.0.0/0.0.0.0:0) [    ] o.a.z.s.NIOServerCnxn caught end of stream exception
   [junit4]   2> EndOfStreamException: Unable to read additional data from client sessionid 0x1571088d2a50001, likely client has closed socket
   [junit4]   2> 	at org.apache.zookeeper.server.NIOServerCnxn.doIO(NIOServerCnxn.java:228)
   [junit4]   2> 	at org.apache.zookeeper.server.NIOServerCnxnFactory.run(NIOServerCnxnFactory.java:208)
   [junit4]   2> 	at java.lang.Thread.run(java.base@9-ea/Thread.java:843)
   [junit4]   2> 255567 INFO  (jetty-launcher-301-thread-1) [    ] o.a.s.c.CoreContainer New CoreContainer 2025986617
   [junit4]   2> 255567 INFO  (jetty-launcher-301-thread-3) [    ] o.a.s.c.CoreContainer New CoreContainer 1827331817
   [junit4]   2> 255567 INFO  (jetty-launcher-301-thread-2) [    ] o.a.s.c.CorePropertiesLocator Config-defined core root directory: /home/jenkins/workspace/Lucene-Solr-6.x-Linux/solr/build/solr-core/test/J2/temp/solr.security.BasicAuthIntegrationTest_F9D989217B3EB010-001/tempDir-001/node2/.
   [junit4]   2> 255568 INFO  (jetty-launcher-301-thread-3) [    ] o.a.s.c.CoreContainer Loading cores into CoreContainer [instanceDir=/home/jenkins/workspace/Lucene-Solr-6.x-Linux/solr/build/solr-core/test/J2/temp/solr.security.BasicAuthIntegrationTest_F9D989217B3EB010-001/tempDir-001/node3]
   [junit4]   2> 255568 INFO  (jetty-launcher-301-thread-2) [    ] o.a.s.c.CoreContainer New CoreContainer 657119836
   [junit4]   2> 255568 WARN  (NIOServerCxn.Factory:0.0.0.0/0.0.0.0:0) [    ] o.a.z.s.NIOServerCnxn caught end of stream exception
   [junit4]   2> EndOfStreamException: Unable to read additional data from client sessionid 0x1571088d2a50002, likely client has closed socket
   [junit4]   2> 	at org.apache.zookeeper.server.NIOServerCnxn.doIO(NIOServerCnxn.java:228)
   [junit4]   2> 	at org.apache.zookeeper.server.NIOServerCnxnFactory.run(NIOServerCnxnFactory.java:208)
   [junit4]   2> 	at java.lang.Thread.run(java.base@9-ea/Thread.java:843)
   [junit4]   2> 255568 WARN  (jetty-launcher-301-thread-3) [    ] o.a.s.c.CoreContainer Couldn't add files from /home/jenkins/workspace/Lucene-Solr-6.x-Linux/solr/build/solr-core/test/J2/temp/solr.security.BasicAuthIntegrationTest_F9D989217B3EB010-001/tempDir-001/node3/lib to classpath: /home/jenkins/workspace/Lucene-Solr-6.x-Linux/solr/build/solr-core/test/J2/temp/solr.security.BasicAuthIntegrationTest_F9D989217B3EB010-001/tempDir-001/node3/lib
   [junit4]   2> 255568 INFO  (jetty-launcher-301-thread-1) [    ] o.a.s.c.CoreContainer Loading cores into CoreContainer [instanceDir=/home/jenkins/workspace/Lucene-Solr-6.x-Linux/solr/build/solr-core/test/J2/temp/solr.security.BasicAuthIntegrationTest_F9D989217B3EB010-001/tempDir-001/node1]
   [junit4]   2> 255568 INFO  (jetty-launcher-301-thread-2) [    ] o.a.s.c.CoreContainer Loading cores into CoreContainer [instanceDir=/home/jenkins/workspace/Lucene-Solr-6.x-Linux/solr/build/solr-core/test/J2/temp/solr.security.BasicAuthIntegrationTest_F9D989217B3EB010-001/tempDir-001/node2]
   [junit4]   2> 255568 INFO  (jetty-launcher-301-thread-3) [    ] o.a.s.h.c.HttpShardHandlerFactory created with socketTimeout : 90000,urlScheme : https,connTimeout : 15000,maxConnectionsPerHost : 20,maxConnections : 10000,corePoolSize : 0,maximumPoolSize : 2147483647,maxThreadIdleTime : 5,sizeOfQueue : -1,fairnessPolicy : false,useRetries : false,connectionsEvictorSleepDelay : 5000,maxConnectionIdleTime : 40000,
   [junit4]   2> 255568 WARN  (jetty-launcher-301-thread-1) [    ] o.a.s.c.CoreContainer Couldn't add files from /home/jenkins/workspace/Lucene-Solr-6.x-Linux/solr/build/solr-core/test/J2/temp/solr.security.BasicAuthIntegrationTest_F9D989217B3EB010-001/tempDir-001/node1/lib to classpath: /home/jenkins/workspace/Lucene-Solr-6.x-Linux/solr/build/solr-core/test/J2/temp/solr.security.BasicAuthIntegrationTest_F9D989217B3EB010-001/tempDir-001/node1/lib
   [junit4]   2> 255568 WARN  (jetty-launcher-301-thread-2) [    ] o.a.s.c.CoreContainer Couldn't add files from /home/jenkins/workspace/Lucene-Solr-6.x-Linux/solr/build/solr-core/test/J2/temp/solr.security.BasicAuthIntegrationTest_F9D989217B3EB010-001/tempDir-001/node2/lib to classpath: /home/jenkins/workspace/Lucene-Solr-6.x-Linux/solr/build/solr-core/test/J2/temp/solr.security.BasicAuthIntegrationTest_F9D989217B3EB010-001/tempDir-001/node2/lib
   [junit4]   2> 255568 INFO  (jetty-launcher-301-thread-1) [    ] o.a.s.h.c.HttpShardHandlerFactory created with socketTimeout : 90000,urlScheme : https,connTimeout : 15000,maxConnectionsPerHost : 20,maxConnections : 10000,corePoolSize : 0,maximumPoolSize : 2147483647,maxThreadIdleTime : 5,sizeOfQueue : -1,fairnessPolicy : false,useRetries : false,connectionsEvictorSleepDelay : 5000,maxConnectionIdleTime : 40000,
   [junit4]   2> 255568 INFO  (jetty-launcher-301-thread-2) [    ] o.a.s.h.c.HttpShardHandlerFactory created with socketTimeout : 90000,urlScheme : https,connTimeout : 15000,maxConnectionsPerHost : 20,maxConnections : 10000,corePoolSize : 0,maximumPoolSize : 2147483647,maxThreadIdleTime : 5,sizeOfQueue : -1,fairnessPolicy : false,useRetries : false,connectionsEvictorSleepDelay : 5000,maxConnectionIdleTime : 40000,
   [junit4]   2> 255569 INFO  (jetty-launcher-301-thread-1) [    ] o.a.s.u.UpdateShardHandler Creating UpdateShardHandler HTTP client with params: socketTimeout=340000&connTimeout=45000&retry=true
   [junit4]   2> 255569 INFO  (jetty-launcher-301-thread-2) [    ] o.a.s.u.UpdateShardHandler Creating UpdateShardHandler HTTP client with params: socketTimeout=340000&connTimeout=45000&retry=true
   [junit4]   2> 255569 INFO  (jetty-launcher-301-thread-3) [    ] o.a.s.u.UpdateShardHandler Creating UpdateShardHandler HTTP client with params: socketTimeout=340000&connTimeout=45000&retry=true
   [junit4]   2> 255569 INFO  (jetty-launcher-301-thread-1) [    ] o.a.s.l.LogWatcher SLF4J impl is org.slf4j.impl.Log4jLoggerFactory
   [junit4]   2> 255569 INFO  (jetty-launcher-301-thread-1) [    ] o.a.s.l.LogWatcher Registering Log Listener [Log4j (org.slf4j.impl.Log4jLoggerFactory)]
   [junit4]   2> 255569 INFO  (jetty-launcher-301-thread-1) [    ] o.a.s.c.ZkContainer Zookeeper client=127.0.0.1:46334/solr
   [junit4]   2> 255569 INFO  (jetty-launcher-301-thread-1) [    ] o.a.s.c.ZkController zkHost includes chroot
   [junit4]   2> 255569 INFO  (jetty-launcher-301-thread-1) [    ] o.a.s.c.c.SolrZkClient Using default ZkCredentialsProvider
   [junit4]   2> 255569 INFO  (jetty-launcher-301-thread-3) [    ] o.a.s.l.LogWatcher SLF4J impl is org.slf4j.impl.Log4jLoggerFactory
   [junit4]   2> 255569 INFO  (jetty-launcher-301-thread-2) [    ] o.a.s.l.LogWatcher SLF4J impl is org.slf4j.impl.Log4jLoggerFactory
   [junit4]   2> 255570 INFO  (jetty-launcher-301-thread-3) [    ] o.a.s.l.LogWatcher Registering Log Listener [Log4j (org.slf4j.impl.Log4jLoggerFactory)]
   [junit4]   2> 255570 INFO  (jetty-launcher-301-thread-2) [    ] o.a.s.l.LogWatcher Registering Log Listener [Log4j (org.slf4j.impl.Log4jLoggerFactory)]
   [junit4]   2> 255570 INFO  (jetty-launcher-301-thread-3) [    ] o.a.s.c.ZkContainer Zookeeper client=127.0.0.1:46334/solr
   [junit4]   2> 255570 INFO  (jetty-launcher-301-thread-2) [    ] o.a.s.c.ZkContainer Zookeeper client=127.0.0.1:46334/solr
   [junit4]   2> 255570 INFO  (jetty-launcher-301-thread-3) [    ] o.a.s.c.ZkController zkHost includes chroot
   [junit4]   2> 255570 INFO  (jetty-launcher-301-thread-2) [    ] o.a.s.c.ZkController zkHost includes chroot
   [junit4]   2> 255570 INFO  (jetty-launcher-301-thread-3) [    ] o.a.s.c.c.SolrZkClient Using default ZkCredentialsProvider
   [junit4]   2> 255570 INFO  (jetty-launcher-301-thread-2) [    ] o.a.s.c.c.SolrZkClient Using default ZkCredentialsProvider
   [junit4]   2> 255570 INFO  (jetty-launcher-301-thread-1) [    ] o.a.s.c.c.ConnectionManager Waiting for client to connect to ZooKeeper
   [junit4]   2> 255570 INFO  (jetty-launcher-301-thread-3) [    ] o.a.s.c.c.ConnectionManager Waiting for client to connect to ZooKeeper
   [junit4]   2> 255570 INFO  (jetty-launcher-301-thread-2) [    ] o.a.s.c.c.ConnectionManager Waiting for client to connect to ZooKeeper
   [junit4]   2> 255571 INFO  (zkCallback-312-thread-1) [    ] o.a.s.c.c.ConnectionManager Watcher org.apache.solr.common.cloud.ConnectionManager@7400e4ca name:ZooKeeperConnection Watcher:127.0.0.1:46334 got event WatchedEvent state:SyncConnected type:None path:null path:null type:None
   [junit4]   2> 255571 INFO  (jetty-launcher-301-thread-1) [    ] o.a.s.c.c.ConnectionManager Client is connected to ZooKeeper
   [junit4]   2> 255571 INFO  (zkCallback-313-thread-1) [    ] o.a.s.c.c.ConnectionManager Watcher org.apache.solr.common.cloud.ConnectionManager@5fec1579 name:ZooKeeperConnection Watcher:127.0.0.1:46334 got event WatchedEvent state:SyncConnected type:None path:null path:null type:None
   [junit4]   2> 255571 INFO  (jetty-launcher-301-thread-3) [    ] o.a.s.c.c.ConnectionManager Client is connected to ZooKeeper
   [junit4]   2> 255571 INFO  (zkCallback-314-thread-1) [    ] o.a.s.c.c.ConnectionManager Watcher org.apache.solr.common.cloud.ConnectionManager@51f26cc name:ZooKeeperConnection Watcher:127.0.0.1:46334 got event WatchedEvent state:SyncConnected type:None path:null path:null type:None
   [junit4]   2> 255571 INFO  (jetty-launcher-301-thread-1) [    ] o.a.s.c.c.SolrZkClient Using default ZkACLProvider
   [junit4]   2> 255571 INFO  (jetty-launcher-301-thread-2) [    ] o.a.s.c.c.ConnectionManager Client is connected to ZooKeeper
   [junit4]   2> 255571 INFO  (jetty-launcher-301-thread-3) [    ] o.a.s.c.c.SolrZkClient Using default ZkACLProvider
   [junit4]   2> 255571 INFO  (jetty-launcher-301-thread-2) [    ] o.a.s.c.c.SolrZkClient Using default ZkACLProvider
   [junit4]   2> 255571 INFO  (jetty-launcher-301-thread-1) [    ] o.a.s.c.ZkController Added new OnReconnect listener org.apache.solr.cloud.ZkController$$Lambda$181/1986710169@234fa8f0
   [junit4]   2> 255571 WARN  (NIOServerCxn.Factory:0.0.0.0/0.0.0.0:0) [    ] o.a.z.s.NIOServerCnxn caught end of stream exception
   [junit4]   2> EndOfStreamException: Unable to read additional data from client sessionid 0x1571088d2a50005, likely client has closed socket
   [junit4]   2> 	at org.apache.zookeeper.server.NIOServerCnxn.doIO(NIOServerCnxn.java:228)
   [junit4]   2> 	at org.apache.zookeeper.server.NIOServerCnxnFactory.run(NIOServerCnxnFactory.java:208)
   [junit4]   2> 	at java.lang.Thread.run(java.base@9-ea/Thread.java:843)
   [junit4]   2> 255571 INFO  (jetty-launcher-301-thread-3) [    ] o.a.s.c.ZkController Added new OnReconnect listener org.apache.solr.cloud.ZkController$$Lambda$181/1986710169@359d989d
   [junit4]   2> 255572 INFO  (jetty-launcher-301-thread-1) [    ] o.a.s.c.c.ConnectionManager Waiting for client to connect to ZooKeeper
   [junit4]   2> 255572 INFO  (jetty-launcher-301-thread-3) [    ] o.a.s.c.c.ConnectionManager Waiting for client to connect to ZooKeeper
   [junit4]   2> 255572 INFO  (jetty-launcher-301-thread-2) [    ] o.a.s.c.ZkController Added new OnReconnect listener org.apache.solr.cloud.ZkController$$Lambda$181/1986710169@69bd151d
   [junit4]   2> 255572 INFO  (jetty-launcher-301-thread-2) [    ] o.a.s.c.c.ConnectionManager Waiting for client to connect to ZooKeeper
   [junit4]   2> 255572 INFO  (zkCallback-315-thread-1) [    ] o.a.s.c.c.ConnectionManager Watcher org.apache.solr.common.cloud.ConnectionManager@6230676a name:ZooKeeperConnection Watcher:127.0.0.1:46334/solr got event WatchedEvent state:SyncConnected type:None path:null path:null type:None
   [junit4]   2> 255572 INFO  (jetty-launcher-301-thread-1) [    ] o.a.s.c.c.ConnectionManager Client is connected to ZooKeeper
   [junit4]   2> 255572 INFO  (zkCallback-316-thread-1) [    ] o.a.s.c.c.ConnectionManager Watcher org.apache.solr.common.cloud.ConnectionManager@129fde7f name:ZooKeeperConnection Watcher:127.0.0.1:46334/solr got event WatchedEvent state:SyncConnected type:None path:null path:null type:None
   [junit4]   2> 255572 INFO  (jetty-launcher-301-thread-3) [    ] o.a.s.c.c.ConnectionManager Client is connected to ZooKeeper
   [junit4]   2> 255573 INFO  (zkCallback-317-thread-1) [    ] o.a.s.c.c.ConnectionManager Watcher org.apache.solr.common.cloud.ConnectionManager@388b89e8 name:ZooKeeperConnection Watcher:127.0.0.1:46334/solr got event WatchedEvent state:SyncConnected type:None path:null path:null type:None
   [junit4]   2> 255573 INFO  (jetty-launcher-301-thread-2) [    ] o.a.s.c.c.ConnectionManager Client is connected to ZooKeeper
   [junit4]   2> 255573 INFO  (jetty-launcher-301-thread-1) [    ] o.a.s.c.c.SolrZkClient makePath: /overseer/queue
   [junit4]   2> 255573 INFO  (jetty-launcher-301-thread-3) [    ] o.a.s.c.c.SolrZkClient makePath: /overseer/queue
   [junit4]   2> 255574 INFO  (jetty-launcher-301-thread-2) [    ] o.a.s.c.c.SolrZkClient makePath: /overseer/queue
   [junit4]   2> 255575 INFO  (jetty-launcher-301-thread-3) [    ] o.a.s.c.c.SolrZkClient makePath: /overseer/collection-queue-work
   [junit4]   2> 255575 INFO  (jetty-launcher-301-thread-1) [    ] o.a.s.c.c.SolrZkClient makePath: /overseer/collection-queue-work
   [junit4]   2> 255575 INFO  (jetty-launcher-301-thread-2) [    ] o.a.s.c.c.SolrZkClient makePath: /overseer/collection-queue-work
   [junit4]   2> 255576 INFO  (jetty-launcher-301-thread-1) [    ] o.a.s.c.c.SolrZkClient makePath: /overseer/collection-map-running
   [junit4]   2> 255576 INFO  (jetty-launcher-301-thread-3) [    ] o.a.s.c.c.SolrZkClient makePath: /overseer/collection-map-running
   [junit4]   2> 255576 INFO  (jetty-launcher-301-thread-2) [    ] o.a.s.c.c.SolrZkClient makePath: /overseer/collection-map-running
   [junit4]   2> 255576 INFO  (jetty-launcher-301-thread-1) [    ] o.a.s.c.c.SolrZkClient makePath: /overseer/collection-map-completed
   [junit4]   2> 255576 INFO  (jetty-launcher-301-thread-3) [    ] o.a.s.c.c.SolrZkClient makePath: /overseer/collection-map-completed
   [junit4]   2> 255576 INFO  (jetty-launcher-301-thread-2) [    ] o.a.s.c.c.SolrZkClient makePath: /overseer/collection-map-completed
   [junit4]   2> 255577 INFO  (jetty-launcher-301-thread-3) [    ] o.a.s.c.c.SolrZkClient makePath: /overseer/collection-map-failure
   [junit4]   2> 255577 INFO  (jetty-launcher-301-thread-1) [    ] o.a.s.c.c.SolrZkClient makePath: /overseer/collection-map-failure
   [junit4]   2> 255577 INFO  (jetty-launcher-301-thread-2) [    ] o.a.s.c.c.SolrZkClient makePath: /overseer/collection-map-failure
   [junit4]   2> 255577 INFO  (jetty-launcher-301-thread-1) [    ] o.a.s.c.c.SolrZkClient makePath: /live_nodes
   [junit4]   2> 255577 INFO  (jetty-launcher-301-thread-3) [    ] o.a.s.c.c.SolrZkClient makePath: /live_nodes
   [junit4]   2> 255578 INFO  (jetty-launcher-301-thread-2) [    ] o.a.s.c.c.SolrZkClient makePath: /collections
   [junit4]   2> 255578 INFO  (jetty-launcher-301-thread-1) [    ] o.a.s.c.c.SolrZkClient makePath: /collections
   [junit4]   2> 255578 INFO  (jetty-launcher-301-thread-3) [    ] o.a.s.c.c.SolrZkClient makePath: /collections
   [junit4]   2> 255578 INFO  (jetty-launcher-301-thread-1) [    ] o.a.s.c.c.SolrZkClient makePath: /aliases.json
   [junit4]   2> 255578 INFO  (jetty-launcher-301-thread-3) [    ] o.a.s.c.c.SolrZkClient makePath: /aliases.json
   [junit4]   2> 255578 INFO  (jetty-launcher-301-thread-2) [    ] o.a.s.c.c.SolrZkClient makePath: /aliases.json
   [junit4]   2> 255578 INFO  (jetty-launcher-301-thread-1) [    ] o.a.s.c.c.SolrZkClient makePath: /clusterstate.json
   [junit4]   2> 255578 INFO  (jetty-launcher-301-thread-3) [    ] o.a.s.c.c.SolrZkClient makePath: /clusterstate.json
   [junit4]   2> 255578 INFO  (jetty-launcher-301-thread-2) [    ] o.a.s.c.c.SolrZkClient makePath: /clusterstate.json
   [junit4]   2> 255579 INFO  (jetty-launcher-301-thread-1) [    ] o.a.s.c.c.SolrZkClient makePath: /security.json
   [junit4]   2> 255579 INFO  (jetty-launcher-301-thread-3) [    ] o.a.s.c.c.SolrZkClient makePath: /security.json
   [junit4]   2> 255579 INFO  (jetty-launcher-301-thread-2) [    ] o.a.s.c.c.SolrZkClient makePath: /security.json
   [junit4]   2> 255579 INFO  (jetty-launcher-301-thread-3) [    ] o.a.s.c.c.ZkStateReader Updating cluster state from ZooKeeper... 
   [junit4]   2> 255579 INFO  (jetty-launcher-301-thread-1) [    ] o.a.s.c.c.ZkStateReader Updating cluster state from ZooKeeper... 
   [junit4]   2> 255579 INFO  (jetty-launcher-301-thread-2) [    ] o.a.s.c.c.ZkStateReader Updating cluster state from ZooKeeper... 
   [junit4]   2> 255579 INFO  (jetty-launcher-301-thread-1) [    ] o.a.s.c.c.ZkStateReader Loaded cluster properties: {urlScheme=https}
   [junit4]   2> 255579 INFO  (jetty-launcher-301-thread-2) [    ] o.a.s.c.c.ZkStateReader Loaded cluster properties: {urlScheme=https}
   [junit4]   2> 255579 INFO  (jetty-launcher-301-thread-3) [    ] o.a.s.c.c.ZkStateReader Loaded cluster properties: {urlScheme=https}
   [junit4]   2> 255579 INFO  (jetty-launcher-301-thread-1) [    ] o.a.s.c.c.ZkStateReader Updated live nodes from ZooKeeper... (0) -> (0)
   [junit4]   2> 255579 INFO  (jetty-launcher-301-thread-2) [    ] o.a.s.c.c.ZkStateReader Updated live nodes from ZooKeeper... (0) -> (0)
   [junit4]   2> 255579 INFO  (jetty-launcher-301-thread-3) [    ] o.a.s.c.c.ZkStateReader Updated live nodes from ZooKeeper... (0) -> (0)
   [junit4]   2> 255580 INFO  (jetty-launcher-301-thread-1) [    ] o.a.s.c.c.SolrZkClient makePath: /overseer_elect
   [junit4]   2> 255580 INFO  (jetty-launcher-301-thread-2) [    ] o.a.s.c.c.SolrZkClient makePath: /overseer_elect
   [junit4]   2> 255580 INFO  (jetty-launcher-301-thread-3) [    ] o.a.s.c.c.SolrZkClient makePath: /overseer_elect
   [junit4]   2> 255580 INFO  (jetty-launcher-301-thread-1) [    ] o.a.s.c.c.SolrZkClient makePath: /overseer_elect/election
   [junit4]   2> 255580 INFO  (jetty-launcher-301-thread-3) [    ] o.a.s.c.c.SolrZkClient makePath: /overseer_elect/election
   [junit4]   2> 255580 INFO  (jetty-launcher-301-thread-2) [    ] o.a.s.c.c.SolrZkClient makePath: /overseer_elect/election
   [junit4]   2> 255581 INFO  (jetty-launcher-301-thread-3) [    ] o.a.s.c.Overseer Overseer (id=null) closing
   [junit4]   2> 255581 INFO  (jetty-launcher-301-thread-1) [    ] o.a.s.c.Overseer Overseer (id=null) closing
   [junit4]   2> 255581 INFO  (jetty-launcher-301-thread-2) [    ] o.a.s.c.Overseer Overseer (id=null) closing
   [junit4]   2> 255581 INFO  (jetty-launcher-301-thread-3) [    ] o.a.s.c.LeaderElector Joined leadership election with path: /overseer_elect/election/96564096847380488-127.0.0.1:33521_solr-n_0000000000
   [junit4]   2> 255581 INFO  (jetty-launcher-301-thread-1) [    ] o.a.s.c.LeaderElector Joined leadership election with path: /overseer_elect/election/96564096847380487-127.0.0.1:39176_solr-n_0000000001
   [junit4]   2> 255581 INFO  (jetty-launcher-301-thread-2) [    ] o.a.s.c.LeaderElector Joined leadership election with path: /overseer_elect/election/96564096847380489-127.0.0.1:36768_solr-n_0000000002
   [junit4]   2> 255581 INFO  (jetty-launcher-301-thread-3) [    ] o.a.s.c.OverseerElectionContext I am going to be the leader 127.0.0.1:33521_solr
   [junit4]   2> 255581 INFO  (jetty-launcher-301-thread-3) [    ] o.a.s.c.c.SolrZkClient makePath: /overseer_elect/leader
   [junit4]   2> 255581 INFO  (jetty-launcher-301-thread-1) [    ] o.a.s.c.LeaderElector Watching path /overseer_elect/election/96564096847380488-127.0.0.1:33521_solr-n_0000000000 to know if I could be the leader
   [junit4]   2> 255581 INFO  (jetty-launcher-301-thread-2) [    ] o.a.s.c.LeaderElector Watching path /overseer_elect/election/96564096847380487-127.0.0.1:39176_solr-n_0000000001 to know if I could be the leader
   [junit4]   2> 255581 INFO  (jetty-launcher-301-thread-1) [    ] o.a.s.c.ZkController Register node as live in ZooKeeper:/live_nodes/127.0.0.1:39176_solr
   [junit4]   2> 255581 INFO  (jetty-launcher-301-thread-1) [    ] o.a.s.c.c.SolrZkClient makePath: /live_nodes/127.0.0.1:39176_solr
   [junit4]   2> 255581 INFO  (jetty-launcher-301-thread-2) [    ] o.a.s.c.ZkController Register node as live in ZooKeeper:/live_nodes/127.0.0.1:36768_solr
   [junit4]   2> 255581 INFO  (jetty-launcher-301-thread-2) [    ] o.a.s.c.c.SolrZkClient makePath: /live_nodes/127.0.0.1:36768_solr
   [junit4]   2> 255581 INFO  (jetty-launcher-301-thread-3) [    ] o.a.s.c.Overseer Overseer (id=96564096847380488-127.0.0.1:33521_solr-n_0000000000) starting
   [junit4]   2> 255581 INFO  (zkCallback-316-thread-1) [    ] o.a.s.c.c.ZkStateReader A live node change: [WatchedEvent state:SyncConnected type:NodeChildrenChanged path:/live_nodes], has occurred - updating... (live nodes size: [0])
   [junit4]   2> 255581 INFO  (zkCallback-315-thread-1) [    ] o.a.s.c.c.ZkStateReader A live node change: [WatchedEvent state:SyncConnected type:NodeChildrenChanged path:/live_nodes], has occurred - updating... (live nodes size: [0])
   [junit4]   2> 255581 INFO  (zkCallback-317-thread-1) [    ] o.a.s.c.c.ZkStateReader A live node change: [WatchedEvent state:SyncConnected type:NodeChildrenChanged path:/live_nodes], has occurred - updating... (live nodes size: [0])
   [junit4]   2> 255582 INFO  (zkCallback-315-thread-1) [    ] o.a.s.c.c.ZkStateReader Updated live nodes from ZooKeeper... (0) -> (2)
   [junit4]   2> 255582 INFO  (zkCallback-316-thread-1) [    ] o.a.s.c.c.ZkStateReader Updated live nodes from ZooKeeper... (0) -> (2)
   [junit4]   2> 255582 INFO  (zkCallback-317-thread-1) [    ] o.a.s.c.c.ZkStateReader Updated live nodes from ZooKeeper... (0) -> (2)
   [junit4]   2> 255582 INFO  (jetty-launcher-301-thread-3) [    ] o.a.s.c.c.SolrZkClient makePath: /overseer/queue-work
   [junit4]   2> 255584 INFO  (jetty-launcher-301-thread-3) [    ] o.a.s.c.OverseerAutoReplicaFailoverThread Starting OverseerAutoReplicaFailoverThread autoReplicaFailoverWorkLoopDelay=10000 autoReplicaFailoverWaitAfterExpiration=30000 autoReplicaFailoverBadNodeExpiration=60000
   [junit4]   2> 255584 INFO  (OverseerCollectionConfigSetProcessor-96564096847380488-127.0.0.1:33521_solr-n_0000000000) [    ] o.a.s.c.OverseerTaskProcessor Process current queue of overseer operations
   [junit4]   2> 255584 INFO  (OverseerStateUpdate-96564096847380488-127.0.0.1:33521_solr-n_0000000000) [    ] o.a.s.c.Overseer Starting to work on the main queue
   [junit4]   2> 255584 INFO  (jetty-launcher-301-thread-3) [    ] o.a.s.c.ZkController Publish node=127.0.0.1:33521_solr as DOWN
   [junit4]   2> 255585 INFO  (OverseerStateUpdate-96564096847380488-127.0.0.1:33521_solr-n_0000000000) [    ] o.a.s.c.c.ZkStateReader Updated live nodes from ZooKeeper... (2) -> (2)
   [junit4]   2> 255586 INFO  (jetty-launcher-301-thread-3) [    ] o.a.s.c.ZkController Register node as live in ZooKeeper:/live_nodes/127.0.0.1:33521_solr
   [junit4]   2> 255586 INFO  (jetty-launcher-301-thread-3) [    ] o.a.s.c.c.SolrZkClient makePath: /live_nodes/127.0.0.1:33521_solr
   [junit4]   2> 255586 INFO  (OverseerStateUpdate-96564096847380488-127.0.0.1:33521_solr-n_0000000000) [    ] o.a.s.c.Overseer processMessage: queueSize: 1, message = {
   [junit4]   2>   "operation":"downnode",
   [junit4]   2>   "node_name":"127.0.0.1:33521_solr"} current state version: 0
   [junit4]   2> 255586 INFO  (OverseerStateUpdate-96564096847380488-127.0.0.1:33521_solr-n_0000000000) [    ] o.a.s.c.o.NodeMutator DownNode state invoked for node: 127.0.0.1:33521_solr
   [junit4]   2> 255587 INFO  (zkCallback-315-thread-1) [    ] o.a.s.c.c.ZkStateReader A live node change: [WatchedEvent state:SyncConnected type:NodeChildrenChanged path:/live_nodes], has occurred - updating... (live nodes size: [2])
   [junit4]   2> 255586 INFO  (zkCallback-317-thread-1) [    ] o.a.s.c.c.ZkStateReader A live node change: [WatchedEvent state:SyncConnected type:NodeChildrenChanged path:/live_nodes], has occurred - updating... (live nodes size: [2])
   [junit4]   2> 255586 INFO  (zkCallback-316-thread-1) [    ] o.a.s.c.c.ZkStateReader A live node change: [WatchedEvent state:SyncConnected type:NodeChildrenChanged path:/live_nodes], has occurred - updating... (live nodes size: [2])
   [junit4]   2> 255587 INFO  (zkCallback-315-thread-1) [    ] o.a.s.c.c.ZkStateReader Updated live nodes from ZooKeeper... (2) -> (3)
   [junit4]   2> 255587 INFO  (zkCallback-317-thread-1) [    ] o.a.s.c.c.ZkStateReader Updated live nodes from ZooKeeper... (2) -> (3)
   [junit4]   2> 255587 INFO  (zkCallback-316-thread-1) [    ] o.a.s.c.c.ZkStateReader Updated live nodes from ZooKeeper... (2) -> (3)
   [junit4]   2> 255588 INFO  (jetty-launcher-301-thread-1) [    ] o.a.s.c.CoreContainer Security conf doesn't exist. Skipping setup for authorization module.
   [junit4]   2> 255588 INFO  (jetty-launcher-301-thread-1) [    ] o.a.s.c.CoreContainer No authentication plugin used.
   [junit4]   2> 255588 INFO  (jetty-launcher-301-thread-1) [    ] o.a.s.c.CorePropertiesLocator Looking for core definitions underneath /home/jenkins/workspace/Lucene-Solr-6.x-Linux/solr/build/solr-core/test/J2/temp/solr.security.BasicAuthIntegrationTest_F9D989217B3EB010-001/tempDir-001/node1/.
   [junit4]   2> 255588 INFO  (jetty-launcher-301-thread-2) [    ] o.a.s.c.CoreContainer Security conf doesn't exist. Skipping setup for authorization module.
   [junit4]   2> 255588 INFO  (jetty-launcher-301-thread-2) [    ] o.a.s.c.CoreContainer No authentication plugin used.
   [junit4]   2> 255588 INFO  (jetty-launcher-301-thread-1) [    ] o.a.s.c.CorePropertiesLocator Found 0 core definitions
   [junit4]   2> 255589 INFO  (jetty-launcher-301-thread-2) [    ] o.a.s.c.CorePropertiesLocator Looking for core definitions underneath /home/jenkins/workspace/Lucene-Solr-6.x-Linux/solr/build/solr-core/test/J2/temp/solr.security.BasicAuthIntegrationTest_F9D989217B3EB010-001/tempDir-001/node2/.
   [junit4]   2> 255589 INFO  (jetty-launcher-301-thread-2) [    ] o.a.s.c.CorePropertiesLocator Found 0 core definitions
   [junit4]   2> 255589 INFO  (jetty-launcher-301-thread-1) [    ] o.a.s.s.SolrDispatchFilter user.dir=/home/jenkins/workspace/Lucene-Solr-6.x-Linux/solr/build/solr-core/test/J2
   [junit4]   2> 255589 INFO  (jetty-launcher-301-thread-1) [    ] o.a.s.s.SolrDispatchFilter SolrDispatchFilter.init() done
   [junit4]   2> 255589 INFO  (jetty-launcher-301-thread-2) [    ] o.a.s.s.SolrDispatchFilter user.dir=/home/jenkins/workspace/Lucene-Solr-6.x-Linux/solr/build/solr-core/test/J2
   [junit4]   2> 255589 INFO  (jetty-launcher-301-thread-2) [    ] o.a.s.s.SolrDispatchFilter SolrDispatchFilter.init() done
   [junit4]   2> 255592 INFO  (jetty-launcher-301-thread-3) [    ] o.a.s.c.CoreContainer Security conf doesn't exist. Skipping setup for authorization module.
   [junit4]   2> 255592 INFO  (jetty-launcher-301-thread-3) [    ] o.a.s.c.CoreContainer No authentication plugin used.
   [junit4]   2> 255592 INFO  (jetty-launcher-301-thread-3) [    ] o.a.s.c.CorePropertiesLocator Looking for core definitions underneath /home/jenkins/workspace/Lucene-Solr-6.x-Linux/solr/build/solr-core/test/J2/temp/solr.security.BasicAuthIntegrationTest_F9D989217B3EB010-001/tempDir-001/node3/.
   [junit4]   2> 255593 INFO  (jetty-launcher-301-thread-3) [    ] o.a.s.c.CorePropertiesLocator Found 0 core definitions
   [junit4]   2> 255593 INFO  (jetty-launcher-301-thread-3) [    ] o.a.s.s.SolrDispatchFilter user.dir=/home/jenkins/workspace/Lucene-Solr-6.x-Linux/solr/build/solr-core/test/J2
   [junit4]   2> 255593 INFO  (jetty-launcher-301-thread-3) [    ] o.a.s.s.SolrDispatchFilter SolrDispatchFilter.init() done
   [junit4]   2> 255593 INFO  (SUITE-BasicAuthIntegrationTest-seed#[F9D989217B3EB010]-worker) [    ] o.a.s.c.c.SolrZkClient Using default ZkCredentialsProvider
   [junit4]   2> 255593 INFO  (SUITE-BasicAuthIntegrationTest-seed#[F9D989217B3EB010]-worker) [    ] o.a.s.c.c.ConnectionManager Waiting for client to connect to ZooKeeper
   [junit4]   2> 255594 INFO  (zkCallback-321-thread-1) [    ] o.a.s.c.c.ConnectionManager Watcher org.apache.solr.common.cloud.ConnectionManager@f409be6 name:ZooKeeperConnection Watcher:127.0.0.1:46334 got event WatchedEvent state:SyncConnected type:None path:null path:null type:None
   [junit4]   2> 255594 INFO  (SUITE-BasicAuthIntegrationTest-seed#[F9D989217B3EB010]-worker) [    ] o.a.s.c.c.ConnectionManager Client is connected to ZooKeeper
   [junit4]   2> 255594 INFO  (SUITE-BasicAuthIntegrationTest-seed#[F9D989217B3EB010]-worker) [    ] o.a.s.c.c.SolrZkClient Using default ZkACLProvider
   [junit4]   2> 255595 INFO  (SUITE-BasicAuthIntegrationTest-seed#[F9D989217B3EB010]-worker) [    ] o.a.s.c.c.SolrZkClient Using default ZkCredentialsProvider
   [junit4]   2> 255596 INFO  (SUITE-BasicAuthIntegrationTest-seed#[F9D989217B3EB010]-worker) [    ] o.a.s.c.c.ConnectionManager Waiting for client to connect to ZooKeeper
   [junit4]   2> 255596 INFO  (zkCallback-324-thread-1) [    ] o.a.s.c.c.ConnectionManager Watcher org.apache.solr.common.cloud.ConnectionManager@1e8618d6 name:ZooKeeperConnection Watcher:127.0.0.1:46334/solr got event WatchedEvent state:SyncConnected type:None path:null path:null type:None
   [junit4]   2> 255596 INFO  (SUITE-BasicAuthIntegrationTest-seed#[F9D989217B3EB010]-worker) [    ] o.a.s.c.c.ConnectionManager Client is connected to ZooKeeper
   [junit4]   2> 255596 INFO  (SUITE-BasicAuthIntegrationTest-seed#[F9D989217B3EB010]-worker) [    ] o.a.s.c.c.SolrZkClient Using default ZkACLProvider
   [junit4]   2> 255597 INFO  (SUITE-BasicAuthIntegrationTest-seed#[F9D989217B3EB010]-worker) [    ] o.a.s.c.c.ZkStateReader Updating cluster state from ZooKeeper... 
   [junit4]   2> 255597 INFO  (SUITE-BasicAuthIntegrationTest-seed#[F9D989217B3EB010]-worker) [    ] o.a.s.c.c.ZkStateReader Loaded cluster properties: {urlScheme=https}
   [junit4]   2> 255598 INFO  (SUITE-BasicAuthIntegrationTest-seed#[F9D989217B3EB010]-worker) [    ] o.a.s.c.c.ZkStateReader Updated live nodes from ZooKeeper... (0) -> (3)
   [junit4]   2> 255599 INFO  (SUITE-BasicAuthIntegrationTest-seed#[F9D989217B3EB010]-worker) [    ] o.a.s.c.c.SolrZkClient makePath: /configs/conf/solrconfig.xml
   [junit4]   2> 255600 INFO  (SUITE-BasicAuthIntegrationTest-seed#[F9D989217B3EB010]-worker) [    ] o.a.s.c.c.SolrZkClient makePath: /configs/conf/schema.xml
   [junit4]   2> 255657 INFO  (qtp221814662-2002) [    ] o.a.s.h.a.CollectionsHandler Invoked Collection Action :create with params replicationFactor=1&collection.configName=conf&name=authCollection&action=CREATE&numShards=3&wt=javabin&version=2 and sendToOCPQueue=true
   [junit4]   2> 255658 INFO  (OverseerCollectionConfigSetProcessor-96564096847380488-127.0.0.1:33521_solr-n_0000000000) [    ] o.a.s.c.OverseerTaskProcessor Overseer Collection Message Handler: Get the message id:/overseer/collection-queue-work/qn-0000000000 message:{
   [junit4]   2>   "name":"authCollection",
   [junit4]   2>   "fromApi":"true",
   [junit4]   2>   "replicationFactor":"1",
   [junit4]   2>   "collection.configName":"conf",
   [junit4]   2>   "numShards":"3",
   [junit4]   2>   "stateFormat":"2",
   [junit4]   2>   "operation":"create"}
   [junit4]   2> 255659 INFO  (OverseerThreadFactory-1021-thread-1) [    ] o.a.s.c.OverseerCollectionMessageHandler OverseerCollectionMessageHandler.processMessage : create , {
   [junit4]   2>   "name":"authCollection",
   [junit4]   2>   "fromApi":"true",
   [junit4]   2>   "replicationFactor":"1",
   [junit4]   2>   "collection.configName":"conf",
   [junit4]   2>   "numShards":"3",
   [junit4]   2>   "stateFormat":"2",
   [junit4]   2>   "operation":"create"}
   [junit4]   2> 255659 INFO  (OverseerThreadFactory-1021-thread-1) [    ] o.a.s.c.CreateCollectionCmd Create collection authCollection
   [junit4]   2> 255659 INFO  (OverseerThreadFactory-1021-thread-1) [    ] o.a.s.c.OverseerCollectionMessageHandler creating collections conf node /collections/authCollection 
   [junit4]   2> 255659 INFO  (OverseerThreadFactory-1021-thread-1) [    ] o.a.s.c.c.SolrZkClient makePath: /collections/authCollection
   [junit4]   2> 255659 INFO  (zkCallback-315-thread-1) [    ] o.a.s.c.c.ZkStateReader A collections change: [WatchedEvent state:SyncConnected type:NodeChildrenChanged path:/collections], has occurred - updating...
   [junit4]   2> 255659 INFO  (zkCallback-324-thread-1) [    ] o.a.s.c.c.ZkStateReader A collections change: [WatchedEvent state:SyncConnected type:NodeChildrenChanged path:/collections], has occurred - updating...
   [junit4]   2> 255659 INFO  (zkCallback-316-thread-2) [    ] o.a.s.c.c.ZkStateReader A collections change: [WatchedEvent state:SyncConnected type:NodeChildrenChanged path:/collections], has occurred - updating...
   [junit4]   2> 255659 INFO  (zkCallback-317-thread-1) [    ] o.a.s.c.c.ZkStateReader A collections change: [WatchedEvent state:SyncConnected type:NodeChildrenChanged path:/collections], has occurred - updating...
   [junit4]   2> 255660 INFO  (OverseerStateUpdate-96564096847380488-127.0.0.1:33521_solr-n_0000000000) [    ] o.a.s.c.Overseer processMessage: queueSize: 1, message = {
   [junit4]   2>   "name":"authCollection",
   [junit4]   2>   "fromApi":"true",
   [junit4]   2>   "replicationFactor":"1",
   [junit4]   2>   "collection.configName":"conf",
   [junit4]   2>   "numShards":"3",
   [junit4]   2>   "stateFormat":"2",
   [junit4]   2>   "operation":"create"} current state version: 0
   [junit4]   2> 255660 INFO  (OverseerStateUpdate-96564096847380488-127.0.0.1:33521_solr-n_0000000000) [    ] o.a.s.c.o.ClusterStateMutator building a new cName: authCollection
   [junit4]   2> 255661 INFO  (OverseerStateUpdate-96564096847380488-127.0.0.1:33521_solr-n_0000000000) [    ] o.a.s.c.o.ZkStateWriter going to create_collection /collections/authCollection/state.json
   [junit4]   2> 255761 INFO  (OverseerThreadFactory-1021-thread-1) [    ] o.a.s.c.CreateCollectionCmd Creating SolrCores for new collection authCollection, shardNames [shard1, shard2, shard3] , replicationFactor : 1
   [junit4]   2> 255761 INFO  (OverseerThreadFactory-1021-thread-1) [    ] o.a.s.c.CreateCollectionCmd Creating core authCollection_shard1_replica1 as part of shard shard1 of collection authCollection on 127.0.0.1:33521_solr
   [junit4]   2> 255761 INFO  (OverseerThreadFactory-1021-thread-1) [    ] o.a.s.c.CreateCollectionCmd Creating core authCollection_shard3_replica1 as part of shard shard3 of collection authCollection on 127.0.0.1:39176_solr
   [junit4]   2> 255761 INFO  (OverseerThreadFactory-1021-thread-1) [    ] o.a.s.c.CreateCollectionCmd Creating core authCollection_shard2_replica1 as part of shard shard2 of collection authCollection on 127.0.0.1:36768_solr
   [junit4]   2> 255770 INFO  (qtp221814662-2017) [    ] o.a.s.h.a.CoreAdminOperation core create command qt=/admin/cores&collection.configName=conf&name=authCollection_shard3_replica1&action=CREATE&numShards=3&collection=authCollection&shard=shard3&wt=javabin&version=2
   [junit4]   2> 255770 INFO  (qtp221814662-2017) [    ] o.a.s.c.CoreDescriptor Created CoreDescriptor: {schema=schema.xml, dataDir=data/, collection.configName=conf, collection=authCollection, loadOnStartup=true, transient=false, name=authCollection_shard3_replica1, numShards=3, shard=shard3, config=solrconfig.xml, configSetProperties=configsetprops.json}
   [junit4]   2> 255770 INFO  (qtp221814662-2017) [    ] o.a.s.c.ZkController publishing state=down
   [junit4]   2> 255771 INFO  (qtp221814662-2017) [    ] o.a.s.c.ZkController Registering watch for collection authCollection
   [junit4]   2> 255771 INFO  (qtp221814662-2017) [    ] o.a.s.c.c.ZkStateReader Add data for [authCollection] ver [0]
   [junit4]   2> 255771 INFO  (OverseerStateUpdate-96564096847380488-127.0.0.1:33521_solr-n_0000000000) [    ] o.a.s.c.Overseer processMessage: queueSize: 1, message = {
   [junit4]   2>   "core":"authCollection_shard3_replica1",
   [junit4]   2>   "roles":null,
   [junit4]   2>   "base_url":"https://127.0.0.1:39176/solr",
   [junit4]   2>   "node_name":"127.0.0.1:39176_solr",
   [junit4]   2>   "numShards":"3",
   [junit4]   2>   "state":"down",
   [junit4]   2>   "shard":"shard3",
   [junit4]   2>   "collection":"authCollection",
   [junit4]   2>   "operation":"state"} current state version: 0
   [junit4]   2> 255771 INFO  (OverseerStateUpdate-96564096847380488-127.0.0.1:33521_solr-n_0000000000) [    ] o.a.s.c.o.ReplicaMutator Update state numShards=3 message={
   [junit4]   2>   "core":"authCollection_shard3_replica1",
   [junit4]   2>   "roles":null,
   [junit4]   2>   "base_url":"https://127.0.0.1:39176/solr",
   [junit4]   2>   "node_name":"127.0.0.1:39176_solr",
   [junit4]   2>   "numShards":"3",
   [junit4]   2>   "state":"down",
   [junit4]   2>   "shard":"shard3",
   [junit4]   2>   "collection":"authCollection",
   [junit4]   2>   "operation":"state"}
   [junit4]   2> 255772 INFO  (qtp221814662-2017) [    ] o.a.s.c.ZkController look for our core node name
   [junit4]   2> 255817 INFO  (qtp1360734914-2023) [    ] o.a.s.h.a.CoreAdminOperation core create command qt=/admin/cores&collection.configName=conf&name=authCollection_shard1_replica1&action=CREATE&numShards=3&collection=authCollection&shard=shard1&wt=javabin&version=2
   [junit4]   2> 255817 INFO  (qtp1360734914-2023) [    ] o.a.s.c.CoreDescriptor Created CoreDescriptor: {schema=schema.xml, dataDir=data/, collection.configName=conf, collection=authCollection, loadOnStartup=true, transient=false, name=authCollection_shard1_replica1, numShards=3, shard=shard1, config=solrconfig.xml, configSetProperties=configsetprops.json}
   [junit4]   2> 255818 INFO  (qtp1360734914-2023) [    ] o.a.s.c.ZkController publishing state=down
   [junit4]   2> 255818 INFO  (qtp1360734914-2023) [    ] o.a.s.c.ZkController Registering watch for collection authCollection
   [junit4]   2> 255818 INFO  (OverseerStateUpdate-96564096847380488-127.0.0.1:33521_solr-n_0000000000) [    ] o.a.s.c.Overseer processMessage: queueSize: 1, message = {
   [junit4]   2>   "core":"authCollection_shard1_replica1",
   [junit4]   2>   "roles":null,
   [junit4]   2>   "base_url":"https://127.0.0.1:33521/solr",
   [junit4]   2>   "node_name":"127.0.0.1:33521_solr",
   [junit4]   2>   "numShards":"3",
   [junit4]   2>   "state":"down",
   [junit4]   2>   "shard":"shard1",
   [junit4]   2>   "collection":"authCollection",
   [junit4]   2>   "operation":"state"} current state version: 0
   [junit4]   2> 255818 INFO  (qtp1360734914-2023) [    ] o.a.s.c.c.ZkStateReader Add data for [authCollection] ver [0]
   [junit4]   2> 255818 INFO  (OverseerStateUpdate-96564096847380488-127.0.0.1:33521_solr-n_0000000000) [    ] o.a.s.c.o.ReplicaMutator Update state numShards=3 message={
   [junit4]   2>   "core":"authCollection_shard1_replica1",
   [junit4]   2>   "roles":null,
   [junit4]   2>   "base_url":"https://127.0.0.1:33521/solr",
   [junit4]   2>   "node_name":"127.0.0.1:33521_solr",
   [junit4]   2>   "numShards":"3",
   [junit4]   2>   "state":"down",
   [junit4]   2>   "shard":"shard1",
   [junit4]   2>   "collection":"authCollection",
   [junit4]   2>   "operation":"state"}
   [junit4]   2> 255818 INFO  (qtp1360734914-2023) [    ] o.a.s.c.ZkController look for our core node name
   [junit4]   2> 255824 INFO  (qtp776541465-2003) [    ] o.a.s.h.a.CoreAdminOperation core create command qt=/admin/cores&collection.configName=conf&name=authCollection_shard2_replica1&action=CREATE&numShards=3&collection=authCollection&shard=shard2&wt=javabin&version=2
   [junit4]   2> 255824 INFO  (qtp776541465-2003) [    ] o.a.s.c.CoreDescriptor Created CoreDescriptor: {schema=schema.xml, dataDir=data/, collection.configName=conf, collection=authCollection, loadOnStartup=true, transient=false, name=authCollection_shard2_replica1, numShards=3, shard=shard2, config=solrconfig.xml, configSetProperties=configsetprops.json}
   [junit4]   2> 255825 INFO  (qtp776541465-2003) [    ] o.a.s.c.ZkController publishing state=down
   [junit4]   2> 255825 INFO  (qtp776541465-2003) [    ] o.a.s.c.ZkController Registering watch for collection authCollection
   [junit4]   2> 255826 INFO  (OverseerStateUpdate-96564096847380488-127.0.0.1:33521_solr-n_0000000000) [    ] o.a.s.c.Overseer processMessage: queueSize: 1, message = {
   [junit4]   2>   "core":"authCollection_shard2_replica1",
   [junit4]   2>   "roles":null,
   [junit4]   2>   "base_url":"https://127.0.0.1:36768/solr",
   [junit4]   2>   "node_name":"127.0.0.1:36768_solr",
   [junit4]   2>   "numShards":"3",
   [junit4]   2>   "state":"down",
   [junit4]   2>   "shard":"shard2",
   [junit4]   2>   "collection":"authCollection",
   [junit4]   2>   "operation":"state"} current state version: 0
   [junit4]   2> 255826 INFO  (qtp776541465-2003) [    ] o.a.s.c.c.ZkStateReader Add data for [authCollection] ver [0]
   [junit4]   2> 255826 INFO  (OverseerStateUpdate-96564096847380488-127.0.0.1:33521_solr-n_0000000000) [    ] o.a.s.c.o.ReplicaMutator Update state numShards=3 message={
   [junit4]   2>   "core":"authCollection_shard2_replica1",
   [junit4]   2>   "roles":null,
   [junit4]   2>   "base_url":"https://127.0.0.1:36768/solr",
   [junit4]   2>   "node_name":"127.0.0.1:36768_solr",
   [junit4]   2>   "numShards":"3",
   [junit4]   2>   "state":"down",
   [junit4]   2>   "shard":"shard2",
   [junit4]   2>   "collection":"authCollection",
   [junit4]   2>   "operation":"state"}
   [junit4]   2> 255826 INFO  (qtp776541465-2003) [    ] o.a.s.c.ZkController look for our core node name
   [junit4]   2> 255927 INFO  (OverseerStateUpdate-96564096847380488-127.0.0.1:33521_solr-n_0000000000) [    ] o.a.s.c.o.ZkStateWriter going to update_collection /collections/authCollection/state.json version: 0
   [junit4]   2> 255927 INFO  (zkCallback-315-thread-1) [    ] o.a.s.c.c.ZkStateReader A cluster state change: [WatchedEvent state:SyncConnected type:NodeDataChanged path:/collections/authCollection/state.json] for collection [authCollection] has occurred - updating... (live nodes size: [3])
   [junit4]   2> 255927 INFO  (zkCallback-317-thread-1) [    ] o.a.s.c.c.ZkStateReader A cluster state change: [WatchedEvent state:SyncConnected type:NodeDataChanged path:/collections/authCollection/state.json] for collection [authCollection] has occurred - updating... (live nodes size: [3])
   [junit4]   2> 255927 INFO  (zkCallback-316-thread-1) [    ] o.a.s.c.c.ZkStateReader A cluster state change: [WatchedEvent state:SyncConnected type:NodeDataChanged path:/collections/authCollection/state.json] for collection [authCollection] has occurred - updating... (live nodes size: [3])
   [junit4]   2> 255928 INFO  (zkCallback-315-thread-1) [    ] o.a.s.c.c.ZkStateReader Updating data for [authCollection] from [0] to [1]
   [junit4]   2> 255928 INFO  (zkCallback-316-thread-1) [    ] o.a.s.c.c.ZkStateReader Updating data for [authCollection] from [0] to [1]
   [junit4]   2> 255928 INFO  (zkCallback-317-thread-1) [    ] o.a.s.c.c.ZkStateReader Updating data for [authCollection] from [0] to [1]
   [junit4]   2> 256772 INFO  (qtp221814662-2017) [    ] o.a.s.c.ZkController waiting to find shard id in clusterstate for authCollection_shard3_replica1
   [junit4]   2> 256772 INFO  (qtp221814662-2017) [    ] o.a.s.c.ZkController Check for collection zkNode:authCollection
   [junit4]   2> 256772 INFO  (qtp221814662-2017) [    ] o.a.s.c.ZkController Collection zkNode exists
   [junit4]   2> 256772 INFO  (qtp221814662-2017) [    ] o.a.s.c.c.ZkStateReader Load collection config from: [/collections/authCollection]
   [junit4]   2> 256772 INFO  (qtp221814662-2017) [    ] o.a.s.c.c.ZkStateReader path=[/collections/authCollection] [configName]=[conf] specified config exists in ZooKeeper
   [junit4]   2> 256772 INFO  (qtp221814662-2017) [    ] o.a.s.c.SolrResourceLoader new SolrResourceLoader for directory: '/home/jenkins/workspace/Lucene-Solr-6.x-Linux/solr/build/solr-core/test/J2/temp/solr.security.BasicAuthIntegrationTest_F9D989217B3EB010-001/tempDir-001/node1/authCollection_shard3_replica1'
   [junit4]   2> 256772 INFO  (qtp221814662-2017) [    ] o.a.s.c.SolrResourceLoader JNDI not configured for solr (NoInitialContextEx)
   [junit4]   2> 256773 INFO  (qtp221814662-2017) [    ] o.a.s.c.SolrResourceLoader solr home defaulted to 'solr/' (could not find system property or JNDI)
   [junit4]   2> 256773 INFO  (qtp221814662-2017) [    ] o.a.s.c.Config loaded config solrconfig.xml with version 0 
   [junit4]   2> 256775 INFO  (qtp221814662-2017) [    ] o.a.s.c.SolrConfig current version of requestparams : -1
   [junit4]   2> 256777 INFO  (qtp221814662-2017) [    ] o.a.s.c.SolrConfig Using Lucene MatchVersion: 6.3.0
   [junit4]   2> 256788 INFO  (qtp221814662-2017) [    ] o.a.s.c.SolrConfig Loaded SolrConfig: solrconfig.xml
   [junit4]   2> 256790 INFO  (qtp221814662-2017) [    ] o.a.s.s.IndexSchema [authCollection_shard3_replica1] Schema name=minimal
   [junit4]   2> 256791 INFO  (qtp221814662-2017) [    ] o.a.s.s.IndexSchema unique key field: id
   [junit4]   2> 256792 INFO  (qtp221814662-2017) [    ] o.a.s.c.ConfigSetProperties Did not find ConfigSet properties, assuming default properties: Can't find resource 'configsetprops.json' in classpath or '/configs/conf', cwd=/home/jenkins/workspace/Lucene-Solr-6.x-Linux/solr/build/solr-core/test/J2
   [junit4]   2> 256792 INFO  (qtp221814662-2017) [    ] o.a.s.c.CoreContainer Creating SolrCore 'authCollection_shard3_replica1' using configuration from collection authCollection
   [junit4]   2> 256792 INFO  (qtp221814662-2017) [    ] o.a.s.c.SolrCore org.apache.solr.core.MockDirectoryFactory
   [junit4]   2> 256793 INFO  (qtp221814662-2017) [    ] o.a.s.c.SolrCore [[authCollection_shard3_replica1] ] Opening new SolrCore at [/home/jenkins/workspace/Lucene-Solr-6.x-Linux/solr/build/solr-core/test/J2/temp/solr.security.BasicAuthIntegrationTest_F9D989217B3EB010-001/tempDir-001/node1/authCollection_shard3_replica1], dataDir=[/home/jenkins/workspace/Lucene-Solr-6.x-Linux/solr/build/solr-core/test/J2/temp/solr.security.BasicAuthIntegrationTest_F9D989217B3EB010-001/tempDir-001/node1/./authCollection_shard3_replica1/data/]
   [junit4]   2> 256793 INFO  (qtp221814662-2017) [    ] o.a.s.c.SolrCore JMX monitoring not detected for core: authCollection_shard3_replica1
   [junit4]   2> 256793 INFO  (qtp221814662-2017) [    ] o.a.s.c.CachingDirectoryFactory return new directory for /home/jenkins/workspace/Lucene-Solr-6.x-Linux/solr/build/solr-core/test/J2/temp/solr.security.BasicAuthIntegrationTest_F9D989217B3EB010-001/tempDir-001/node1/./authCollection_shard3_replica1/data/snapshot_metadata
   [junit4]   2> 256793 INFO  (qtp221814662-2017) [    ] o.a.s.c.s.SolrSnapshotMetaDataManager Loading from snapshot metadata file...
   [junit4]   2> 256793 INFO  (qtp221814662-2017) [    ] o.a.s.c.CachingDirectoryFactory return new directory for /home/jenkins/workspace/Lucene-Solr-6.x-Linux/solr/build/solr-core/test/J2/temp/solr.security.BasicAuthIntegrationTest_F9D989217B3EB010-001/tempDir-001/node1/./authCollection_shard3_replica1/data
   [junit4]   2> 256793 INFO  (qtp221814662-2017) [    ] o.a.s.c.SolrCore New index directory detected: old=null new=/home/jenkins/workspace/Lucene-Solr-6.x-Linux/solr/build/solr-core/test/J2/temp/solr.security.BasicAuthIntegrationTest_F9D989217B3EB010-001/tempDir-001/node1/./authCollection_shard3_replica1/data/index/
   [junit4]   2> 256794 WARN  (qtp221814662-2017) [    ] o.a.s.c.SolrCore [authCollection_shard3_replica1] Solr index directory '/home/jenkins/workspace/Lucene-Solr-6.x-Linux/solr/build/solr-core/test/J2/temp/solr.security.BasicAuthIntegrationTest_F9D989217B3EB010-001/tempDir-001/node1/./authCollection_shard3_replica1/data/index' doesn't exist. Creating new index...
   [junit4]   2> 256794 INFO  (qtp221814662-2017) [    ] o.a.s.c.CachingDirectoryFactory return new directory for /home/jenkins/workspace/Lucene-Solr-6.x-Linux/solr/build/solr-core/test/J2/temp/solr.security.BasicAuthIntegrationTest_F9D989217B3EB010-001/tempDir-001/node1/./authCollection_shard3_replica1/data/index
   [junit4]   2> 256795 INFO  (qtp221814662-2017) [    ] o.a.s.c.SolrDeletionPolicy SolrDeletionPolicy.onCommit: commits: num=1
   [junit4]   2> 	commit{dir=MockDirectoryWrapper(RAMDirectory@3c83a833 lockFactory=org.apache.lucene.store.SingleInstanceLockFactory@3566b359),segFN=segments_1,generation=1}
   [junit4]   2> 256795 INFO  (qtp221814662-2017) [    ] o.a.s.c.SolrDeletionPolicy newest commit generation = 1
   [junit4]   2> 256795 INFO  (OldIndexDirectoryCleanupThreadForCore-authCollection_shard3_replica1) [    ] o.a.s.c.SolrCore Looking for old index directories to cleanup for core authCollection_shard3_replica1 in /home/jenkins/workspace/Lucene-Solr-6.x-Linux/solr/build/solr-core/test/J2/temp/solr.security.BasicAuthIntegrationTest_F9D989217B3EB010-001/tempDir-001/node1/./authCollection_shard3_replica1/data/
   [junit4]   2> 256795 WARN  (OldIndexDirectoryCleanupThreadForCore-authCollection_shard3_replica1) [    ] o.a.s.c.DirectoryFactory /home/jenkins/workspace/Lucene-Solr-6.x-Linux/solr/build/solr-core/test/J2/temp/solr.security.BasicAuthIntegrationTest_F9D989217B3EB010-001/tempDir-001/node1/./authCollection_shard3_replica1/data/ does not point to a valid data directory; skipping clean-up of old index directories.
   [junit4]   2> 256796 INFO  (qtp221814662-2017) [    ] o.a.s.c.SolrCore no updateRequestProcessorChain defined as default, creating implicit default
   [junit4]   2> 256797 INFO  (qtp221814662-2017) [    ] o.a.s.h.l.XMLLoader xsltCacheLifetimeSeconds=60
   [junit4]   2> 256797 INFO  (qtp221814662-2017) [    ] o.a.s.h.l.XMLLoader xsltCacheLifetimeSeconds=60
   [junit4]   2> 256798 INFO  (qtp221814662-2017) [    ] o.a.s.h.l.XMLLoader xsltCacheLifetimeSeconds=60
   [junit4]   2> 256798 INFO  (qtp221814662-2017) [    ] o.a.s.h.l.XMLLoader xsltCacheLifetimeSeconds=60
   [junit4]   2> 256799 INFO  (qtp221814662-2017) [    ] o.a.s.c.RequestHandlers Registered paths: /admin/mbeans,/update/json/docs,/admin/luke,/export,/get,/admin/properties,/update/json,/admin/threads,/update/csv,/sql,/graph,/select,/admin/segments,/admin/system,/replication,/config,/stream,/schema,/admin/plugins,/admin/logging,/admin/ping,/update,/admin/file,/terms
   [junit4]   2> 256799 INFO  (qtp221814662-2017) [    ] o.a.s.c.SolrCore Using default statsCache cache: org.apache.solr.search.stats.LocalStatsCache
   [junit4]   2> 256799 INFO  (qtp221814662-2017) [    ] o.a.s.u.UpdateHandler Using UpdateLog implementation: org.apache.solr.update.UpdateLog
   [junit4]   2> 256799 INFO  (qtp221814662-2017) [    ] o.a.s.u.UpdateLog Initializing UpdateLog: dataDir=null defaultSyncLevel=FLUSH numRecordsToKeep=100 maxNumLogsToKeep=10 numVersionBuckets=65536
   [junit4]   2> 256805 INFO  (qtp221814662-2017) [    ] o.a.s.u.CommitTracker Hard AutoCommit: disabled
   [junit4]   2> 256805 INFO  (qtp221814662-2017) [    ] o.a.s.u.CommitTracker Soft AutoCommit: disabled
   [junit4]   2> 256805 INFO  (qtp221814662-2017) [    ] o.a.s.c.SolrDeletionPolicy SolrDeletionPolicy.onInit: commits: num=1
   [junit4]   2> 	commit{dir=MockDirectoryWrapper(RAMDirectory@3c83a833 lockFactory=org.apache.lucene.store.SingleInstanceLockFactory@3566b359),segFN=segments_1,generation=1}
   [junit4]   2> 256805 INFO  (qtp221814662-2017) [    ] o.a.s.c.SolrDeletionPolicy newest commit generation = 1
   [junit4]   2> 256805 INFO  (qtp221814662-2017) [    ] o.a.s.s.SolrIndexSearcher Opening [Searcher@2f81190f[authCollection_shard3_replica1] main]
   [junit4]   2> 256805 INFO  (qtp221814662-2017) [    ] o.a.s.c.c.ZkStateReader Load collection config from: [/collections/authCollection]
   [junit4]   2> 256806 INFO  (qtp221814662-2017) [    ] o.a.s.c.c.ZkStateReader path=[/collections/authCollection] [configName]=[conf] specified config exists in ZooKeeper
   [junit4]   2> 256806 INFO  (qtp221814662-2017) [    ] o.a.s.r.ManagedResourceStorage Setting up ZooKeeper-based storage for the RestManager with znodeBase: /configs/conf
   [junit4]   2> 256806 INFO  (qtp221814662-2017) [    ] o.a.s.r.ManagedResourceStorage Configured ZooKeeperStorageIO with znodeBase: /configs/conf
   [junit4]   2> 256806 INFO  (qtp221814662-2017) [    ] o.a.s.r.RestManager Initializing RestManager with initArgs: {}
   [junit4]   2> 256806 INFO  (qtp221814662-2017) [    ] o.a.s.r.ManagedResourceStorage Reading _rest_managed.json using ZooKeeperStorageIO:path=/configs/conf
   [junit4]   2> 256806 INFO  (qtp221814662-2017) [    ] o.a.s.r.ManagedResourceStorage No data found for znode /configs/conf/_rest_managed.json
   [junit4]   2> 256806 INFO  (qtp221814662-2017) [    ] o.a.s.r.ManagedResourceStorage Loaded null at path _rest_managed.json using ZooKeeperStorageIO:path=/configs/conf
   [junit4]   2> 256806 INFO  (qtp221814662-2017) [    ] o.a.s.r.RestManager Initializing 0 registered ManagedResources
   [junit4]   2> 256806 INFO  (qtp221814662-2017) [    ] o.a.s.h.ReplicationHandler Commits will be reserved for  10000
   [junit4]   2> 256806 INFO  (searcherExecutor-1028-thread-1) [    ] o.a.s.c.SolrCore [authCollection_shard3_replica1] Registered new searcher Searcher@2f81190f[authCollection_shard3_replica1] main{ExitableDirectoryReader(UninvertingDirectoryReader())}
   [junit4]   2> 256806 INFO  (qtp221814662-2017) [    ] o.a.s.u.UpdateLog Looking up max value of version field to seed version buckets
   [junit4]   2> 256806 INFO  (qtp221814662-2017) [    ] o.a.s.u.VersionInfo Refreshing highest value of _version_ for 65536 version buckets from index
   [junit4]   2> 256806 INFO  (qtp221814662-2017) [    ] o.a.s.u.VersionInfo No terms found for _version_, cannot seed version bucket highest value from index
   [junit4]   2> 256806 INFO  (qtp221814662-2017) [    ] o.a.s.u.UpdateLog Could not find max version in index or recent updates, using new clock 1545025550979956736
   [junit4]   2> 256808 INFO  (qtp221814662-2017) [    ] o.a.s.u.UpdateLog Took 1.0ms to seed version buckets with highest version 1545025550979956736
   [junit4]   2> 256808 INFO  (qtp221814662-2017) [    ] o.a.s.c.ZkController watch zkdir /configs/conf
   [junit4]   2> 256809 INFO  (qtp221814662-2017) [    ] o.a.s.c.CoreContainer registering core: authCollection_shard3_replica1
   [junit4]   2> 256809 INFO  (qtp221814662-2017) [    ] o.a.s.c.ZkController Register replica - core:authCollection_shard3_replica1 address:https://127.0.0.1:39176/solr collection:authCollection shard:shard3
   [junit4]   2> 256809 INFO  (qtp221814662-2017) [    ] o.a.s.c.c.SolrZkClient makePath: /collections/authCollection/leader_elect/shard3/election
   [junit4]   2> 256810 INFO  (qtp221814662-2017) [    ] o.a.s.c.LeaderElector Joined leadership election with path: /collections/authCollection/leader_elect/shard3/election/96564096847380487-core_node1-n_0000000000
   [junit4]   2> 256811 INFO  (qtp221814662-2017) [    ] o.a.s.c.ShardLeaderElectionContext Running the leader process for shard=shard3 and weAreReplacement=false and leaderVoteWait=10000
   [junit4]   2> 256811 INFO  (qtp221814662-2017) [    ] o.a.s.c.ShardLeaderElectionContext Enough replicas found to continue.
   [junit4]   2> 256811 INFO  (qtp221814662-2017) [    ] o.a.s.c.ShardLeaderElectionContext I may be the new leader - try and sync
   [junit4]   2> 256811 INFO  (qtp221814662-2017) [    ] o.a.s.c.SyncStrategy Sync replicas to https://127.0.0.1:39176/solr/authCollection_shard3_replica1/
   [junit4]   2> 256811 INFO  (qtp221814662-2017) [    ] o.a.s.c.SyncStrategy Sync Success - now sync replicas to me
   [junit4]   2> 256811 INFO  (qtp221814662-2017) [    ] o.a.s.c.SyncStrategy https://127.0.0.1:39176/solr/authCollection_shard3_replica1/ has no replicas
   [junit4]   2> 256811 INFO  (OverseerStateUpdate-96564096847380488-127.0.0.1:33521_solr-n_0000000000) [    ] o.a.s.c.Overseer processMessage: queueSize: 1, message = {
   [junit4]   2>   "operation":"leader",
   [junit4]   2>   "shard":"shard3",
   [junit4]   2>   "collection":"authCollection"} current state version: 0
   [junit4]   2> 256812 INFO  (qtp221814662-2017) [    ] o.a.s.c.c.SolrZkClient makePath: /collections/authCollection/leaders/shard3
   [junit4]   2> 256812 INFO  (qtp221814662-2017) [    ] o.a.s.c.ShardLeaderElectionContextBase Creating leader registration node /collections/authCollection/leaders/shard3/leader after winning as /collections/authCollection/leader_elect/shard3/election/96564096847380487-core_node1-n_0000000000
   [junit4]   2> 256814 INFO  (qtp221814662-2017) [    ] o.a.s.c.ShardLeaderElectionContext I am the new leader: https://127.0.0.1:39176/solr/authCollection_shard3_replica1/ shard3
   [junit4]   2> 256814 INFO  (OverseerStateUpdate-96564096847380488-127.0.0.1:33521_solr-n_0000000000) [    ] o.a.s.c.Overseer processMessage: queueSize: 1, message = {
   [junit4]   2>   "operation":"leader",
   [junit4]   2>   "shard":"shard3",
   [junit4]   2>   "collection":"authCollection",
   [junit4]   2>   "base_url":"https://127.0.0.1:39176/solr",
   [junit4]   2>   "core":"authCollection_shard3_replica1",
   [junit4]   2>   "state":"active"} current state version: 0
   [junit4]   2> 256819 INFO  (qtp1360734914-2023) [    ] o.a.s.c.ZkController waiting to find shard id in clusterstate for authCollection_shard1_replica1
   [junit4]   2> 256819 INFO  (qtp1360734914-2023) [    ] o.a.s.c.ZkController Check for collection zkNode:authCollection
   [junit4]   2> 256819 INFO  (qtp1360734914-2023) [    ] o.a.s.c.ZkController Collection zkNode exists
   [junit4]   2> 256819 INFO  (qtp1360734914-2023) [    ] o.a.s.c.c.ZkStateReader Load collection config from: [/collections/authCollection]
   [junit4]   2> 256819 INFO  (qtp1360734914-2023) [    ] o.a.s.c.c.ZkStateReader path=[/collections/authCollection] [configName]=[conf] specified config exists in ZooKeeper
   [junit4]   2> 256819 INFO  (qtp1360734914-2023) [    ] o.a.s.c.SolrResourceLoader new SolrResourceLoader for directory: '/home/jenkins/workspace/Lucene-Solr-6.x-Linux/solr/build/solr-core/test/J2/temp/solr.security.BasicAuthIntegrationTest_F9D989217B3EB010-001/tempDir-001/node3/authCollection_shard1_replica1'
   [junit4]   2> 256819 INFO  (qtp1360734914-2023) [    ] o.a.s.c.SolrResourceLoader JNDI not configured for solr (NoInitialContextEx)
   [junit4]   2> 256819 INFO  (qtp1360734914-2023) [    ] o.a.s.c.SolrResourceLoader solr home defaulted to 'solr/' (could not find system property or JNDI)
   [junit4]   2> 256820 INFO  (qtp1360734914-2023) [    ] o.a.s.c.Config loaded config solrconfig.xml with version 0 
   [junit4]   2> 256893 INFO  (qtp776541465-2003) [    ] o.a.s.c.ZkController waiting to find shard id in clusterstate for authCollection_shard2_replica1
   [junit4]   2> 256894 INFO  (qtp776541465-2003) [    ] o.a.s.c.ZkController Check for collection zkNode:authCollection
   [junit4]   2> 256894 INFO  (qtp776541465-2003) [    ] o.a.s.c.ZkController Collection zkNode exists
   [junit4]   2> 256894 INFO  (qtp776541465-2003) [    ] o.a.s.c.c.ZkStateReader Load collection config from: [/collections/authCollection]
   [junit4]   2> 256894 INFO  (qtp776541465-2003) [    ] o.a.s.c.c.ZkStateReader path=[/collections/authCollection] [configName]=[conf] specified config exists in ZooKeeper
   [junit4]   2> 256894 INFO  (qtp776541465-2003) [    ] o.a.s.c.SolrResourceLoader new SolrResourceLoader for directory: '/home/jenkins/workspace/Lucene-Solr-6.x-Linux/solr/build/solr-core/test/J2/temp/solr.security.BasicAuthIntegrationTest_F9D989217B3EB010-001/tempDir-001/node2/authCollection_shard2_replica1'
   [junit4]   2> 256895 INFO  (qtp776541465-2003) [    ] o.a.s.c.SolrResourceLoader JNDI not configured for solr (NoInitialContextEx)
   [junit4]   2> 256895 INFO  (qtp776541465-2003) [    ] o.a.s.c.SolrResourceLoader solr home defaulted to 'solr/' (could not find system property or JNDI)
   [junit4]   2> 256895 INFO  (qtp1360734914-2023) [    ] o.a.s.c.SolrConfig current version of requestparams : -1
   [junit4]   2> 256896 INFO  (qtp776541465-2003) [    ] o.a.s.c.Config loaded config solrconfig.xml with version 0 
   [junit4]   2> 256898 INFO  (qtp1360734914-2023) [    ] o.a.s.c.SolrConfig Using Lucene MatchVersion: 6.3.0
   [junit4]   2> 256901 INFO  (qtp776541465-2003) [    ] o.a.s.c.SolrConfig current version of requestparams : -1
   [junit4]   2> 256902 INFO  (qtp1360734914-2023) [    ] o.a.s.c.SolrConfig Loaded SolrConfig: solrconfig.xml
   [junit4]   2> 256903 INFO  (qtp776541465-2003) [    ] o.a.s.c.SolrConfig Using Lucene MatchVersion: 6.3.0
   [junit4]   2> 256905 INFO  (qtp1360734914-2023) [    ] o.a.s.s.IndexSchema [authCollection_shard1_replica1] Schema name=minimal
   [junit4]   2> 256908 INFO  (qtp1360734914-2023) [    ] o.a.s.s.IndexSchema unique key field: id
   [junit4]   2> 256910 INFO  (qtp1360734914-2023) [    ] o.a.s.c.ConfigSetProperties Did not find ConfigSet properties, assuming default properties: Can't find resource 'configsetprops.json' in classpath or '/configs/conf', cwd=/home/jenkins/workspace/Lucene-Solr-6.x-Linux/solr/build/solr-core/test/J2
   [junit4]   2> 256910 INFO  (qtp1360734914-2023) [    ] o.a.s.c.CoreContainer Creating SolrCore 'authCollection_shard1_replica1' using configuration from collection authCollection
   [junit4]   2> 256910 INFO  (qtp1360734914-2023) [    ] o.a.s.c.SolrCore org.apache.solr.core.MockDirectoryFactory
   [junit4]   2> 256910 INFO  (qtp1360734914-2023) [    ] o.a.s.c.SolrCore [[authCollection_shard1_replica1] ] Opening new SolrCore at [/home/jenkins/workspace/Lucene-Solr-6.x-Linux/solr/build/solr-core/test/J2/temp/solr.security.BasicAuthIntegrationTest_F9D989217B3EB010-001/tempDir-001/node3/authCollection_shard1_replica1], dataDir=[/home/jenkins/workspace/Lucene-Solr-6.x-Linux/solr/build/solr-core/test/J2/temp/solr.security.BasicAuthIntegrationTest_F9D989217B3EB010-001/tempDir-001/node3/./authCollection_shard1_replica1/data/]
   [junit4]   2> 256910 INFO  (qtp1360734914-2023) [    ] o.a.s.c.SolrCore JMX monitoring not detected for core: authCollection_shard1_replica1
   [junit4]   2> 256910 INFO  (qtp776541465-2003) [    ] o.a.s.c.SolrConfig Loaded SolrConfig: solrconfig.xml
   [junit4]   2> 256911 INFO  (qtp1360734914-2023) [    ] o.a.s.c.CachingDirectoryFactory return new directory for /home/jenkins/workspace/Lucene-Solr-6.x-Linux/solr/build/solr-core/test/J2/temp/solr.security.BasicAuthIntegrationTest_F9D989217B3EB010-001/tempDir-001/node3/./authCollection_shard1_replica1/data/snapshot_metadata
   [junit4]   2> 256911 INFO  (qtp1360734914-2023) [    ] o.a.s.c.s.SolrSnapshotMetaDataManager Loading from snapshot metadata file...
   [junit4]   2> 256911 INFO  (qtp1360734914-2023) [    ] o.a.s.c.CachingDirectoryFactory return new directory for /home/jenkins/workspace/Lucene-Solr-6.x-Linux/solr/build/solr-core/test/J2/temp/solr.security.BasicAuthIntegrationTest_F9D989217B3EB010-001/tempDir-001/node3/./authCollection_shard1_replica1/data
   [junit4]   2> 256911 INFO  (qtp1360734914-2023) [    ] o.a.s.c.SolrCore New index directory detected: old=null new=/home/jenkins/workspace/Lucene-Solr-6.x-Linux/solr/build/solr-core/test/J2/temp/solr.security.BasicAuthIntegrationTest_F9D989217B3EB010-001/tempDir-001/node3/./authCollection_shard1_replica1/data/index/
   [junit4]   2> 256911 WARN  (qtp1360734914-2023) [    ] o.a.s.c.SolrCore [authCollection_shard1_replica1] Solr index directory '/home/jenkins/workspace/Lucene-Solr-6.x-Linux/solr/build/solr-core/test/J2/temp/solr.security.BasicAuthIntegrationTest_F9D989217B3EB010-001/tempDir-001/node3/./authCollection_shard1_replica1/data/index' doesn't exist. Creating new index...
   [junit4]   2> 256911 INFO  (qtp1360734914-2023) [    ] o.a.s.c.CachingDirectoryFactory return new directory for /home/jenkins/workspace/Lucene-Solr-6.x-Linux/solr/build/solr-core/test/J2/temp/solr.security.BasicAuthIntegrationTest_F9D989217B3EB010-001/tempDir-001/node3/./authCollection_shard1_replica1/data/index
   [junit4]   2> 256912 INFO  (qtp1360734914-2023) [    ] o.a.s.c.SolrDeletionPolicy SolrDeletionPolicy.onCommit: commits: num=1
   [junit4]   2> 	commit{dir=MockDirectoryWrapper(RAMDirectory@7d80d52b lockFactory=org.apache.lucene.store.SingleInstanceLockFactory@5ba2929),segFN=segments_1,generation=1}
   [junit4]   2> 256912 INFO  (qtp1360734914-2023) [    ] o.a.s.c.SolrDeletionPolicy newest commit generation = 1
   [junit4]   2> 256912 INFO  (OldIndexDirectoryCleanupThreadForCore-authCollection_shard1_replica1) [    ] o.a.s.c.SolrCore Looking for old index directories to cleanup for core authCollection_shard1_replica1 in /home/jenkins/workspace/Lucene-Solr-6.x-Linux/solr/build/solr-core/test/J2/temp/solr.security.BasicAuthIntegrationTest_F9D989217B3EB010-001/tempDir-001/node3/./authCollection_shard1_replica1/data/
   [junit4]   2> 256912 WARN  (OldIndexDirectoryCleanupThreadForCore-authCollection_shard1_replica1) [    ] o.a.s.c.DirectoryFactory /home/jenkins/workspace/Lucene-Solr-6.x-Linux/solr/build/solr-core/test/J2/temp/solr.security.BasicAuthIntegrationTest_F9D989217B3EB010-001/tempDir-001/node3/./authCollection_shard1_replica1/data/ does not point to a valid data directory; skipping clean-up of old index directories.
   [junit4]   2> 256913 INFO  (qtp776541465-2003) [    ] o.a.s.s.IndexSchema [authCollection_shard2_replica1] Schema name=minimal
   [junit4]   2> 256913 INFO  (qtp1360734914-2023) [    ] o.a.s.c.SolrCore no updateRequestProcessorChain defined as default, creating implicit default
   [junit4]   2> 256914 INFO  (qtp1360734914-2023) [    ] o.a.s.h.l.XMLLoader xsltCacheLifetimeSeconds=60
   [junit4]   2> 256915 INFO  (qtp1360734914-2023) [    ] o.a.s.h.l.XMLLoader xsltCacheLifetimeSeconds=60
   [junit4]   2> 256915 INFO  (OverseerStateUpdate-96564096847380488-127.0.0.1:33521_solr-n_0000000000) [    ] o.a.s.c.o.ZkStateWriter going to update_collection /collections/authCollection/state.json version: 1
   [junit4]   2> 256915 INFO  (qtp1360734914-2023) [    ] o.a.s.h.l.XMLLoader xsltCacheLifetimeSeconds=60
   [junit4]   2> 256915 INFO  (qtp776541465-2003) [    ] o.a.s.s.IndexSchema unique key field: id
   [junit4]   2> 256915 INFO  (zkCallback-315-thread-1) [    ] o.a.s.c.c.ZkStateReader A cluster state change: [WatchedEvent state:SyncConnected type:NodeDataChanged path:/collections/authCollection/state.json] for collection [authCollection] has occurred - updating... (live nodes size: [3])
   [junit4]   2> 256915 INFO  (zkCallback-317-thread-1) [    ] o.a.s.c.c.ZkStateReader A cluster state change: [WatchedEvent state:SyncConnected type:NodeDataChanged path:/collections/authCollection/state.json] for collection [authCollection] has occurred - updating... (live nodes size: [3])
   [junit4]   2> 256915 INFO  (zkCallback-316-thread-2) [    ] o.a.s.c.c.ZkStateReader A cluster state change: [WatchedEvent state:SyncConnected type:NodeDataChanged path:/collections/authCollection/state.json] for collection [authCollection] has occurred - updating... (live nodes size: [3])
   [junit4]   2> 256916 INFO  (zkCallback-315-thread-1) [    ] o.a.s.c.c.ZkStateReader Updating data for [authCollection] from [1] to [2]
   [junit4]   2> 256916 INFO  (zkCallback-317-thread-1) [    ] o.a.s.c.c.ZkStateReader Updating data for [authCollection] from [1] to [2]
   [junit4]   2> 256916 INFO  (zkCallback-316-thread-2) [    ] o.a.s.c.c.ZkStateReader Updating data for [authCollection] from [1] to [2]
   [junit4]   2> 256916 INFO  (qtp1360734914-2023) [    ] o.a.s.h.l.XMLLoader xsltCacheLifetimeSeconds=60
   [junit4]   2> 256916 INFO  (qtp776541465-2003) [    ] o.a.s.c.ConfigSetProperties Did not find ConfigSet properties, assuming default properties: Can't find resource 'configsetprops.json' in classpath or '/configs/conf', cwd=/home/jenkins/workspace/Lucene-Solr-6.x-Linux/solr/build/solr-core/test/J2
   [junit4]   2> 256916 INFO  (qtp776541465-2003) [    ] o.a.s.c.CoreContainer Creating SolrCore 'authCollection_shard2_replica1' using configuration from collection authCollection
   [junit4]   2> 256916 INFO  (qtp776541465-2003) [    ] o.a.s.c.SolrCore org.apache.solr.core.MockDirectoryFactory
   [junit4]   2> 256916 INFO  (qtp776541465-2003) [    ] o.a.s.c.SolrCore [[authCollection_shard2_replica1] ] Opening new SolrCore at [/home/jenkins/workspace/Lucene-Solr-6.x-Linux/solr/build/solr-core/test/J2/temp/solr.security.BasicAuthIntegrationTest_F9D989217B3EB010-001/tempDir-001/node2/authCollection_shard2_replica1], dataDir=[/home/jenkins/workspace/Lucene-Solr-6.x-Linux/solr/build/solr-core/test/J2/temp/solr.security.BasicAuthIntegrationTest_F9D989217B3EB010-001/tempDir-001/node2/./authCollection_shard2_replica1/data/]
   [junit4]   2> 256916 INFO  (qtp776541465-2003) [    ] o.a.s.c.SolrCore JMX monitoring not detected for core: authCollection_shard2_replica1
   [junit4]   2> 256916 INFO  (qtp1360734914-2023) [    ] o.a.s.c.RequestHandlers Registered paths: /admin/mbeans,/update/json/docs,/admin/luke,/export,/get,/admin/properties,/update/json,/admin/threads,/update/csv,/sql,/graph,/select,/admin/segments,/admin/system,/replication,/config,/stream,/schema,/admin/plugins,/admin/logging,/admin/ping,/update,/admin/file,/terms
   [junit4]   2> 256916 INFO  (qtp1360734914-2023) [    ] o.a.s.c.SolrCore Using default statsCache cache: org.apache.solr.search.stats.LocalStatsCache
   [junit4]   2> 256917 INFO  (qtp1360734914-2023) [    ] o.a.s.u.UpdateHandler Using UpdateLog implementation: org.apache.solr.update.UpdateLog
   [junit4]   2> 256917 INFO  (qtp1360734914-2023) [    ] o.a.s.u.UpdateLog Initializing UpdateLog: dataDir=null defaultSyncLevel=FLUSH numRecordsToKeep=100 maxNumLogsToKeep=10 numVersionBuckets=65536
   [junit4]   2> 256917 INFO  (qtp776541465-2003) [    ] o.a.s.c.CachingDirectoryFactory return new directory for /home/jenkins/workspace/Lucene-Solr-6.x-Linux/solr/build/solr-core/test/J2/temp/solr.security.BasicAuthIntegrationTest_F9D989217B3EB010-001/tempDir-001/node2/./authCollection_shard2_replica1/data/snapshot_metadata
   [junit4]   2> 256917 INFO  (qtp776541465-2003) [    ] o.a.s.c.s.SolrSnapshotMetaDataManager Loading from snapshot metadata file...
   [junit4]   2> 256918 INFO  (qtp776541465-2003) [    ] o.a.s.c.CachingDirectoryFactory return new directory for /home/jenkins/workspace/Lucene-Solr-6.x-Linux/solr/build/solr-core/test/J2/temp/solr.security.BasicAuthIntegrationTest_F9D989217B3EB010-001/tempDir-001/node2/./authCollection_shard2_replica1/data
   [junit4]   2> 256918 INFO  (qtp776541465-2003) [    ] o.a.s.c.SolrCore New index directory detected: old=null new=/home/jenkins/workspace/Lucene-Solr-6.x-Linux/solr/build/solr-core/test/J2/temp/solr.security.BasicAuthIntegrationTest_F9D989217B3EB010-001/tempDir-001/node2/./authCollection_shard2_replica1/data/index/
   [junit4]   2> 256918 WARN  (qtp776541465-2003) [    ] o.a.s.c.SolrCore [authCollection_shard2_replica1] Solr index directory '/home/jenkins/workspace/Lucene-Solr-6.x-Linux/solr/build/solr-core/test/J2/temp/solr.security.BasicAuthIntegrationTest_F9D989217B3EB010-001/tempDir-001/node2/./authCollection_shard2_replica1/data/index' doesn't exist. Creating new index...
   [junit4]   2> 256918 INFO  (qtp1360734914-2023) [    ] o.a.s.u.CommitTracker Hard AutoCommit: disabled
   [junit4]   2> 256918 INFO  (qtp776541465-2003) [    ] o.a.s.c.CachingDirectoryFactory return ne

[...truncated too long message...]

ory: /home/jenkins/workspace/Lucene-Solr-6.x-Linux/solr/build/solr-core/test/J2/temp/solr.security.BasicAuthIntegrationTest_F9D989217B3EB010-001/tempDir-001/node2/./authCollection_shard2_replica1/data/snapshot_metadata
   [junit4]   2> 259873 INFO  (coreCloseExecutor-1058-thread-1) [    ] o.a.s.c.CachingDirectoryFactory Closing directory, CoreContainer#isShutdown=true
   [junit4]   2> 259874 INFO  (zkCallback-316-thread-1) [    ] o.a.s.c.c.ZkStateReader A live node change: [WatchedEvent state:SyncConnected type:NodeChildrenChanged path:/live_nodes], has occurred - updating... (live nodes size: [3])
   [junit4]   2> 259874 INFO  (zkCallback-317-thread-3) [    ] o.a.s.c.c.ZkStateReader A live node change: [WatchedEvent state:SyncConnected type:NodeChildrenChanged path:/live_nodes], has occurred - updating... (live nodes size: [3])
   [junit4]   2> 259874 INFO  (coreCloseExecutor-1058-thread-1) [    ] o.a.s.c.CachingDirectoryFactory Closing directory: /home/jenkins/workspace/Lucene-Solr-6.x-Linux/solr/build/solr-core/test/J2/temp/solr.security.BasicAuthIntegrationTest_F9D989217B3EB010-001/tempDir-001/node3/./authCollection_shard1_replica1/data/snapshot_metadata
   [junit4]   2> 259874 INFO  (zkCallback-329-thread-1) [    ] o.a.s.c.c.ZkStateReader A live node change: [WatchedEvent state:SyncConnected type:NodeChildrenChanged path:/live_nodes], has occurred - updating... (live nodes size: [3])
   [junit4]   2> 259874 INFO  (OverseerStateUpdate-96564096847380488-127.0.0.1:33521_solr-n_0000000000) [    ] o.a.s.c.Overseer processMessage: queueSize: 1, message = {
   [junit4]   2>   "operation":"downnode",
   [junit4]   2>   "node_name":"127.0.0.1:33521_solr"} current state version: 0
   [junit4]   2> 259874 WARN  (zkCallback-329-thread-1) [    ] o.a.s.c.c.ZkStateReader ZooKeeper watch triggered, but Solr cannot talk to ZK: [KeeperErrorCode = Session expired for /live_nodes]
   [junit4]   2> 259874 INFO  (OverseerStateUpdate-96564096847380488-127.0.0.1:33521_solr-n_0000000000) [    ] o.a.s.c.o.NodeMutator DownNode state invoked for node: 127.0.0.1:33521_solr
   [junit4]   2> 259874 INFO  (coreCloseExecutor-1057-thread-1) [    ] o.a.s.c.CachingDirectoryFactory looking to close /home/jenkins/workspace/Lucene-Solr-6.x-Linux/solr/build/solr-core/test/J2/temp/solr.security.BasicAuthIntegrationTest_F9D989217B3EB010-001/tempDir-001/node2/./authCollection_shard2_replica1/data [CachedDir<<refCount=0;path=/home/jenkins/workspace/Lucene-Solr-6.x-Linux/solr/build/solr-core/test/J2/temp/solr.security.BasicAuthIntegrationTest_F9D989217B3EB010-001/tempDir-001/node2/./authCollection_shard2_replica1/data;done=false>>]
   [junit4]   2> 259875 INFO  (OverseerStateUpdate-96564096847380488-127.0.0.1:33521_solr-n_0000000000) [    ] o.a.s.c.o.NodeMutator Update replica state for core_node2:{"core":"authCollection_shard1_replica1","base_url":"https://127.0.0.1:33521/solr","node_name":"127.0.0.1:33521_solr","state":"active","leader":"true"} to down
   [junit4]   2> 259875 INFO  (coreCloseExecutor-1057-thread-1) [    ] o.a.s.c.CachingDirectoryFactory Closing directory, CoreContainer#isShutdown=true
   [junit4]   2> 259875 INFO  (coreCloseExecutor-1057-thread-1) [    ] o.a.s.c.CachingDirectoryFactory Closing directory: /home/jenkins/workspace/Lucene-Solr-6.x-Linux/solr/build/solr-core/test/J2/temp/solr.security.BasicAuthIntegrationTest_F9D989217B3EB010-001/tempDir-001/node2/./authCollection_shard2_replica1/data
   [junit4]   2> 259875 INFO  (zkCallback-316-thread-1) [    ] o.a.s.c.c.ZkStateReader Updated live nodes from ZooKeeper... (3) -> (2)
   [junit4]   2> 259875 INFO  (jetty-launcher-301-thread-3) [    ] o.e.j.s.h.ContextHandler Stopped o.e.j.s.ServletContextHandler@685fa776{/solr,null,UNAVAILABLE}
   [junit4]   2> 259874 INFO  (zkCallback-317-thread-3) [    ] o.a.s.c.c.ZkStateReader Updated live nodes from ZooKeeper... (3) -> (2)
   [junit4]   2> 259876 INFO  (zkCallback-316-thread-1) [    ] o.a.s.c.c.ZkStateReader A live node change: [WatchedEvent state:SyncConnected type:NodeChildrenChanged path:/live_nodes], has occurred - updating... (live nodes size: [2])
   [junit4]   2> 259877 INFO  (jetty-launcher-301-thread-1) [    ] o.a.s.c.Overseer Overseer (id=96564096847380488-127.0.0.1:33521_solr-n_0000000000) closing
   [junit4]   2> 259878 ERROR (jetty-launcher-301-thread-2-EventThread) [    ] o.a.z.ClientCnxn Error while calling watcher 
   [junit4]   2> java.util.concurrent.RejectedExecutionException: Task org.apache.solr.common.util.ExecutorUtil$MDCAwareThreadPoolExecutor$$Lambda$169/919165986@25cc3aec rejected from org.apache.solr.common.util.ExecutorUtil$MDCAwareThreadPoolExecutor@79394c6f[Shutting down, pool size = 2, active threads = 0, queued tasks = 0, completed tasks = 19]
   [junit4]   2> 	at java.util.concurrent.ThreadPoolExecutor$AbortPolicy.rejectedExecution(java.base@9-ea/ThreadPoolExecutor.java:2073)
   [junit4]   2> 	at java.util.concurrent.ThreadPoolExecutor.reject(java.base@9-ea/ThreadPoolExecutor.java:839)
   [junit4]   2> 	at java.util.concurrent.ThreadPoolExecutor.execute(java.base@9-ea/ThreadPoolExecutor.java:1385)
   [junit4]   2> 	at org.apache.solr.common.util.ExecutorUtil$MDCAwareThreadPoolExecutor.execute(ExecutorUtil.java:214)
   [junit4]   2> 	at java.util.concurrent.AbstractExecutorService.submit(java.base@9-ea/AbstractExecutorService.java:118)
   [junit4]   2> 	at org.apache.solr.common.cloud.SolrZkClient$3.process(SolrZkClient.java:266)
   [junit4]   2> 	at org.apache.zookeeper.ClientCnxn$EventThread.processEvent(ClientCnxn.java:522)
   [junit4]   2> 	at org.apache.zookeeper.ClientCnxn$EventThread.run(ClientCnxn.java:498)
   [junit4]   2> 259878 INFO  (zkCallback-316-thread-3) [    ] o.a.s.c.c.ZkStateReader A live node change: [WatchedEvent state:SyncConnected type:NodeChildrenChanged path:/live_nodes], has occurred - updating... (live nodes size: [1])
   [junit4]   2> 259878 INFO  (jetty-launcher-301-thread-2) [    ] o.e.j.s.h.ContextHandler Stopped o.e.j.s.ServletContextHandler@301b71d8{/solr,null,UNAVAILABLE}
   [junit4]   2> 259878 WARN  (zkCallback-316-thread-3) [    ] o.a.s.c.c.ZkStateReader ZooKeeper watch triggered, but Solr cannot talk to ZK: [KeeperErrorCode = Session expired for /live_nodes]
   [junit4]   2> 259878 INFO  (OverseerStateUpdate-96564096847380488-127.0.0.1:33521_solr-n_0000000000) [    ] o.a.s.c.Overseer Overseer Loop exiting : 127.0.0.1:33521_solr
   [junit4]   2> 259878 INFO  (zkCallback-316-thread-1) [    ] o.a.s.c.c.ZkStateReader Updated live nodes from ZooKeeper... (2) -> (1)
   [junit4]   2> 259878 INFO  (jetty-launcher-301-thread-1) [    ] o.e.j.s.h.ContextHandler Stopped o.e.j.s.ServletContextHandler@59f85ed6{/solr,null,UNAVAILABLE}
   [junit4]   2> 259879 INFO  (SUITE-BasicAuthIntegrationTest-seed#[F9D989217B3EB010]-worker) [    ] o.a.s.c.ZkTestServer connecting to 127.0.0.1:46334 46334
   [junit4]   2> 259997 INFO  (Thread-334) [    ] o.a.s.c.ZkTestServer connecting to 127.0.0.1:46334 46334
   [junit4]   2> 259998 WARN  (Thread-334) [    ] o.a.s.c.ZkTestServer Watch limit violations: 
   [junit4]   2> Maximum concurrent create/delete watches above limit:
   [junit4]   2> 
   [junit4]   2> 	5	/solr/aliases.json
   [junit4]   2> 	4	/solr/security.json
   [junit4]   2> 	4	/solr/configs/conf
   [junit4]   2> 
   [junit4]   2> Maximum concurrent data watches above limit:
   [junit4]   2> 
   [junit4]   2> 	5	/solr/clusterstate.json
   [junit4]   2> 	5	/solr/clusterprops.json
   [junit4]   2> 	4	/solr/collections/authCollection/state.json
   [junit4]   2> 	2	/solr/overseer_elect/election/96564096847380488-127.0.0.1:33521_solr-n_0000000000
   [junit4]   2> 
   [junit4]   2> Maximum concurrent children watches above limit:
   [junit4]   2> 
   [junit4]   2> 	9	/solr/overseer/queue
   [junit4]   2> 	5	/solr/collections
   [junit4]   2> 	5	/solr/overseer/collection-queue-work
   [junit4]   2> 	4	/solr/live_nodes
   [junit4]   2> 	2	/solr/overseer/queue-work
   [junit4]   2> 
   [junit4]   2> 259998 INFO  (SUITE-BasicAuthIntegrationTest-seed#[F9D989217B3EB010]-worker) [    ] o.a.s.SolrTestCaseJ4 ###deleteCore
   [junit4]   2> NOTE: leaving temporary files on disk at: /home/jenkins/workspace/Lucene-Solr-6.x-Linux/solr/build/solr-core/test/J2/temp/solr.security.BasicAuthIntegrationTest_F9D989217B3EB010-001
   [junit4]   2> Sep 09, 2016 7:59:49 PM com.carrotsearch.randomizedtesting.ThreadLeakControl checkThreadLeaks
   [junit4]   2> WARNING: Will linger awaiting termination of 1 leaked thread(s).
   [junit4]   2> NOTE: test params are: codec=FastDecompressionCompressingStoredFields(storedFieldsFormat=CompressingStoredFieldsFormat(compressionMode=FAST_DECOMPRESSION, chunkSize=2415, maxDocsPerChunk=3, blockSize=10), termVectorsFormat=CompressingTermVectorsFormat(compressionMode=FAST_DECOMPRESSION, chunkSize=2415, blockSize=10)), sim=RandomSimilarity(queryNorm=false,coord=no): {}, locale=dua-CM, timezone=America/Tijuana
   [junit4]   2> NOTE: Linux 4.4.0-36-generic amd64/Oracle Corporation 9-ea (64-bit)/cpus=12,threads=1,free=307682912,total=473956352
   [junit4]   2> NOTE: All tests run in this JVM: [TestJmxMonitoredMap, LeaderInitiatedRecoveryOnCommitTest, ResponseHeaderTest, TestCloudPivotFacet, CoreAdminRequestStatusTest, TestZkChroot, SuggesterTSTTest, SolrCLIZkUtilsTest, TestXmlQParser, TestDocTermOrds, AutoCommitTest, ResponseLogComponentTest, TestWriterPerf, TestScoreJoinQPScore, BadComponentTest, SimpleMLTQParserTest, BufferStoreTest, TestConfigReload, TestTolerantSearch, ExitableDirectoryReaderTest, TestStressReorder, TestHighFrequencyDictionaryFactory, TestSmileRequest, BadCopyFieldTest, BadIndexSchemaTest, HardAutoCommitTest, CurrencyFieldXmlFileTest, SuggesterWFSTTest, PreAnalyzedFieldTest, TestImplicitCoreProperties, BJQParserTest, TestSolrDeletionPolicy1, TestLFUCache, TestNonDefinedSimilarityFactory, MultiThreadedOCPTest, JSONWriterTest, BasicAuthIntegrationTest]
   [junit4] Completed [91/630 (1!)] on J2 in 5.31s, 1 test, 1 error <<< FAILURES!

[...truncated 51535 lines...]


Mime
View raw message