lucene-dev mailing list archives

Site index · List index
Message view « Date » · « Thread »
Top « Date » · « Thread »
From Policeman Jenkins Server <jenk...@thetaphi.de>
Subject [JENKINS] Lucene-Solr-5.5-Linux (64bit/jdk1.7.0_80) - Build # 429 - Unstable!
Date Mon, 12 Sep 2016 17:53:44 GMT
Build: http://jenkins.thetaphi.de/job/Lucene-Solr-5.5-Linux/429/
Java: 64bit/jdk1.7.0_80 -XX:+UseCompressedOops -XX:+UseConcMarkSweepGC

1 tests failed.
FAILED:  org.apache.solr.schema.TestManagedSchemaAPI.test

Error Message:
Error from server at http://127.0.0.1:40603/solr/testschemaapi_shard1_replica2: ERROR: [doc=2] unknown field 'myNewField1'

Stack Trace:
org.apache.solr.client.solrj.impl.CloudSolrClient$RouteException: Error from server at http://127.0.0.1:40603/solr/testschemaapi_shard1_replica2: ERROR: [doc=2] unknown field 'myNewField1'
	at __randomizedtesting.SeedInfo.seed([E7427EDE8206C7A8:6F1641042CFAAA50]:0)
	at org.apache.solr.client.solrj.impl.CloudSolrClient.directUpdate(CloudSolrClient.java:653)
	at org.apache.solr.client.solrj.impl.CloudSolrClient.sendRequest(CloudSolrClient.java:1002)
	at org.apache.solr.client.solrj.impl.CloudSolrClient.requestWithRetryOnStaleState(CloudSolrClient.java:891)
	at org.apache.solr.client.solrj.impl.CloudSolrClient.request(CloudSolrClient.java:827)
	at org.apache.solr.schema.TestManagedSchemaAPI.testAddFieldAndDocument(TestManagedSchemaAPI.java:101)
	at org.apache.solr.schema.TestManagedSchemaAPI.test(TestManagedSchemaAPI.java:69)
	at sun.reflect.NativeMethodAccessorImpl.invoke0(Native Method)
	at sun.reflect.NativeMethodAccessorImpl.invoke(NativeMethodAccessorImpl.java:57)
	at sun.reflect.DelegatingMethodAccessorImpl.invoke(DelegatingMethodAccessorImpl.java:43)
	at java.lang.reflect.Method.invoke(Method.java:606)
	at com.carrotsearch.randomizedtesting.RandomizedRunner.invoke(RandomizedRunner.java:1764)
	at com.carrotsearch.randomizedtesting.RandomizedRunner$8.evaluate(RandomizedRunner.java:871)
	at com.carrotsearch.randomizedtesting.RandomizedRunner$9.evaluate(RandomizedRunner.java:907)
	at com.carrotsearch.randomizedtesting.RandomizedRunner$10.evaluate(RandomizedRunner.java:921)
	at com.carrotsearch.randomizedtesting.rules.SystemPropertiesRestoreRule$1.evaluate(SystemPropertiesRestoreRule.java:57)
	at org.apache.lucene.util.TestRuleSetupTeardownChained$1.evaluate(TestRuleSetupTeardownChained.java:49)
	at org.apache.lucene.util.AbstractBeforeAfterRule$1.evaluate(AbstractBeforeAfterRule.java:45)
	at org.apache.lucene.util.TestRuleThreadAndTestName$1.evaluate(TestRuleThreadAndTestName.java:48)
	at org.apache.lucene.util.TestRuleIgnoreAfterMaxFailures$1.evaluate(TestRuleIgnoreAfterMaxFailures.java:64)
	at org.apache.lucene.util.TestRuleMarkFailure$1.evaluate(TestRuleMarkFailure.java:47)
	at com.carrotsearch.randomizedtesting.rules.StatementAdapter.evaluate(StatementAdapter.java:36)
	at com.carrotsearch.randomizedtesting.ThreadLeakControl$StatementRunner.run(ThreadLeakControl.java:367)
	at com.carrotsearch.randomizedtesting.ThreadLeakControl.forkTimeoutingTask(ThreadLeakControl.java:809)
	at com.carrotsearch.randomizedtesting.ThreadLeakControl$3.evaluate(ThreadLeakControl.java:460)
	at com.carrotsearch.randomizedtesting.RandomizedRunner.runSingleTest(RandomizedRunner.java:880)
	at com.carrotsearch.randomizedtesting.RandomizedRunner$5.evaluate(RandomizedRunner.java:781)
	at com.carrotsearch.randomizedtesting.RandomizedRunner$6.evaluate(RandomizedRunner.java:816)
	at com.carrotsearch.randomizedtesting.RandomizedRunner$7.evaluate(RandomizedRunner.java:827)
	at com.carrotsearch.randomizedtesting.rules.StatementAdapter.evaluate(StatementAdapter.java:36)
	at com.carrotsearch.randomizedtesting.rules.SystemPropertiesRestoreRule$1.evaluate(SystemPropertiesRestoreRule.java:57)
	at org.apache.lucene.util.AbstractBeforeAfterRule$1.evaluate(AbstractBeforeAfterRule.java:45)
	at com.carrotsearch.randomizedtesting.rules.StatementAdapter.evaluate(StatementAdapter.java:36)
	at org.apache.lucene.util.TestRuleStoreClassName$1.evaluate(TestRuleStoreClassName.java:41)
	at com.carrotsearch.randomizedtesting.rules.NoShadowingOrOverridesOnMethodsRule$1.evaluate(NoShadowingOrOverridesOnMethodsRule.java:40)
	at com.carrotsearch.randomizedtesting.rules.NoShadowingOrOverridesOnMethodsRule$1.evaluate(NoShadowingOrOverridesOnMethodsRule.java:40)
	at com.carrotsearch.randomizedtesting.rules.StatementAdapter.evaluate(StatementAdapter.java:36)
	at com.carrotsearch.randomizedtesting.rules.StatementAdapter.evaluate(StatementAdapter.java:36)
	at com.carrotsearch.randomizedtesting.rules.StatementAdapter.evaluate(StatementAdapter.java:36)
	at org.apache.lucene.util.TestRuleAssertionsRequired$1.evaluate(TestRuleAssertionsRequired.java:53)
	at org.apache.lucene.util.TestRuleMarkFailure$1.evaluate(TestRuleMarkFailure.java:47)
	at org.apache.lucene.util.TestRuleIgnoreAfterMaxFailures$1.evaluate(TestRuleIgnoreAfterMaxFailures.java:64)
	at org.apache.lucene.util.TestRuleIgnoreTestSuites$1.evaluate(TestRuleIgnoreTestSuites.java:54)
	at com.carrotsearch.randomizedtesting.rules.StatementAdapter.evaluate(StatementAdapter.java:36)
	at com.carrotsearch.randomizedtesting.ThreadLeakControl$StatementRunner.run(ThreadLeakControl.java:367)
	at java.lang.Thread.run(Thread.java:745)
Caused by: org.apache.solr.client.solrj.impl.HttpSolrClient$RemoteSolrException: Error from server at http://127.0.0.1:40603/solr/testschemaapi_shard1_replica2: ERROR: [doc=2] unknown field 'myNewField1'
	at org.apache.solr.client.solrj.impl.HttpSolrClient.executeMethod(HttpSolrClient.java:577)
	at org.apache.solr.client.solrj.impl.HttpSolrClient.request(HttpSolrClient.java:241)
	at org.apache.solr.client.solrj.impl.HttpSolrClient.request(HttpSolrClient.java:230)
	at org.apache.solr.client.solrj.impl.LBHttpSolrClient.doRequest(LBHttpSolrClient.java:372)
	at org.apache.solr.client.solrj.impl.LBHttpSolrClient.request(LBHttpSolrClient.java:325)
	at org.apache.solr.client.solrj.impl.CloudSolrClient$2.call(CloudSolrClient.java:628)
	at org.apache.solr.client.solrj.impl.CloudSolrClient$2.call(CloudSolrClient.java:625)
	at java.util.concurrent.FutureTask.run(FutureTask.java:262)
	at org.apache.solr.common.util.ExecutorUtil$MDCAwareThreadPoolExecutor$1.run(ExecutorUtil.java:231)
	at java.util.concurrent.ThreadPoolExecutor.runWorker(ThreadPoolExecutor.java:1145)
	at java.util.concurrent.ThreadPoolExecutor$Worker.run(ThreadPoolExecutor.java:615)
	... 1 more




Build Log:
[...truncated 10924 lines...]
   [junit4] Suite: org.apache.solr.schema.TestManagedSchemaAPI
   [junit4]   2> Creating dataDir: /home/jenkins/workspace/Lucene-Solr-5.5-Linux/solr/build/solr-core/test/J2/temp/solr.schema.TestManagedSchemaAPI_E7427EDE8206C7A8-001/init-core-data-001
   [junit4]   2> 391505 INFO  (SUITE-TestManagedSchemaAPI-seed#[E7427EDE8206C7A8]-worker) [    ] o.a.s.SolrTestCaseJ4 Randomized ssl (false) and clientAuth (false)
   [junit4]   2> 391508 INFO  (TEST-TestManagedSchemaAPI.test-seed#[E7427EDE8206C7A8]) [    ] o.a.s.SolrTestCaseJ4 ###Starting test
   [junit4]   2> 391509 INFO  (TEST-TestManagedSchemaAPI.test-seed#[E7427EDE8206C7A8]) [    ] o.a.s.c.ZkTestServer STARTING ZK TEST SERVER
   [junit4]   2> 391509 INFO  (Thread-1058) [    ] o.a.s.c.ZkTestServer client port:0.0.0.0/0.0.0.0:0
   [junit4]   2> 391509 INFO  (Thread-1058) [    ] o.a.s.c.ZkTestServer Starting server
   [junit4]   2> 391609 INFO  (TEST-TestManagedSchemaAPI.test-seed#[E7427EDE8206C7A8]) [    ] o.a.s.c.ZkTestServer start zk server on port:46155
   [junit4]   2> 391609 INFO  (TEST-TestManagedSchemaAPI.test-seed#[E7427EDE8206C7A8]) [    ] o.a.s.c.c.SolrZkClient Using default ZkCredentialsProvider
   [junit4]   2> 391609 INFO  (TEST-TestManagedSchemaAPI.test-seed#[E7427EDE8206C7A8]) [    ] o.a.s.c.c.ConnectionManager Waiting for client to connect to ZooKeeper
   [junit4]   2> 391612 INFO  (zkCallback-390-thread-1) [    ] o.a.s.c.c.ConnectionManager Watcher org.apache.solr.common.cloud.ConnectionManager@69b0750 name:ZooKeeperConnection Watcher:127.0.0.1:46155 got event WatchedEvent state:SyncConnected type:None path:null path:null type:None
   [junit4]   2> 391612 INFO  (TEST-TestManagedSchemaAPI.test-seed#[E7427EDE8206C7A8]) [    ] o.a.s.c.c.ConnectionManager Client is connected to ZooKeeper
   [junit4]   2> 391612 INFO  (TEST-TestManagedSchemaAPI.test-seed#[E7427EDE8206C7A8]) [    ] o.a.s.c.c.SolrZkClient Using default ZkACLProvider
   [junit4]   2> 391612 INFO  (TEST-TestManagedSchemaAPI.test-seed#[E7427EDE8206C7A8]) [    ] o.a.s.c.c.SolrZkClient makePath: /solr/solr.xml
   [junit4]   2> 391615 INFO  (jetty-launcher-389-thread-1) [    ] o.e.j.s.Server jetty-9.2.13.v20150730
   [junit4]   2> 391615 INFO  (jetty-launcher-389-thread-2) [    ] o.e.j.s.Server jetty-9.2.13.v20150730
   [junit4]   2> 391616 INFO  (jetty-launcher-389-thread-2) [    ] o.e.j.s.h.ContextHandler Started o.e.j.s.ServletContextHandler@4c041bbc{/solr,null,AVAILABLE}
   [junit4]   2> 391616 INFO  (jetty-launcher-389-thread-1) [    ] o.e.j.s.h.ContextHandler Started o.e.j.s.ServletContextHandler@21b8faa1{/solr,null,AVAILABLE}
   [junit4]   2> 391617 INFO  (jetty-launcher-389-thread-1) [    ] o.e.j.s.ServerConnector Started ServerConnector@71652ec1{HTTP/1.1}{127.0.0.1:46254}
   [junit4]   2> 391617 INFO  (jetty-launcher-389-thread-2) [    ] o.e.j.s.ServerConnector Started ServerConnector@c2be72{HTTP/1.1}{127.0.0.1:40603}
   [junit4]   2> 391617 INFO  (jetty-launcher-389-thread-1) [    ] o.e.j.s.Server Started @393365ms
   [junit4]   2> 391617 INFO  (jetty-launcher-389-thread-2) [    ] o.e.j.s.Server Started @393365ms
   [junit4]   2> 391617 INFO  (jetty-launcher-389-thread-1) [    ] o.a.s.c.s.e.JettySolrRunner Jetty properties: {hostPort=46254, hostContext=/solr}
   [junit4]   2> 391617 INFO  (jetty-launcher-389-thread-2) [    ] o.a.s.c.s.e.JettySolrRunner Jetty properties: {hostPort=40603, hostContext=/solr}
   [junit4]   2> 391618 INFO  (jetty-launcher-389-thread-1) [    ] o.a.s.s.SolrDispatchFilter SolrDispatchFilter.init(): sun.misc.Launcher$AppClassLoader@2876b359
   [junit4]   2> 391618 INFO  (jetty-launcher-389-thread-2) [    ] o.a.s.s.SolrDispatchFilter SolrDispatchFilter.init(): sun.misc.Launcher$AppClassLoader@2876b359
   [junit4]   2> 391618 INFO  (jetty-launcher-389-thread-1) [    ] o.a.s.c.SolrResourceLoader new SolrResourceLoader for directory: '/home/jenkins/workspace/Lucene-Solr-5.5-Linux/solr/build/solr-core/test/J2/temp/solr.schema.TestManagedSchemaAPI_E7427EDE8206C7A8-001/tempDir-001/node1'
   [junit4]   2> 391618 INFO  (jetty-launcher-389-thread-2) [    ] o.a.s.c.SolrResourceLoader new SolrResourceLoader for directory: '/home/jenkins/workspace/Lucene-Solr-5.5-Linux/solr/build/solr-core/test/J2/temp/solr.schema.TestManagedSchemaAPI_E7427EDE8206C7A8-001/tempDir-001/node2'
   [junit4]   2> 391618 INFO  (jetty-launcher-389-thread-1) [    ] o.a.s.c.SolrResourceLoader JNDI not configured for solr (NoInitialContextEx)
   [junit4]   2> 391618 INFO  (jetty-launcher-389-thread-2) [    ] o.a.s.c.SolrResourceLoader JNDI not configured for solr (NoInitialContextEx)
   [junit4]   2> 391618 INFO  (jetty-launcher-389-thread-1) [    ] o.a.s.c.SolrResourceLoader solr home defaulted to 'solr/' (could not find system property or JNDI)
   [junit4]   2> 391618 INFO  (jetty-launcher-389-thread-2) [    ] o.a.s.c.SolrResourceLoader solr home defaulted to 'solr/' (could not find system property or JNDI)
   [junit4]   2> 391618 INFO  (jetty-launcher-389-thread-1) [    ] o.a.s.c.c.SolrZkClient Using default ZkCredentialsProvider
   [junit4]   2> 391618 INFO  (jetty-launcher-389-thread-2) [    ] o.a.s.c.c.SolrZkClient Using default ZkCredentialsProvider
   [junit4]   2> 391618 INFO  (jetty-launcher-389-thread-1) [    ] o.a.s.c.c.ConnectionManager Waiting for client to connect to ZooKeeper
   [junit4]   2> 391618 INFO  (jetty-launcher-389-thread-2) [    ] o.a.s.c.c.ConnectionManager Waiting for client to connect to ZooKeeper
   [junit4]   2> 391619 INFO  (zkCallback-391-thread-1) [    ] o.a.s.c.c.ConnectionManager Watcher org.apache.solr.common.cloud.ConnectionManager@666b08e4 name:ZooKeeperConnection Watcher:127.0.0.1:46155/solr got event WatchedEvent state:SyncConnected type:None path:null path:null type:None
   [junit4]   2> 391619 INFO  (jetty-launcher-389-thread-1) [    ] o.a.s.c.c.ConnectionManager Client is connected to ZooKeeper
   [junit4]   2> 391619 INFO  (zkCallback-392-thread-1) [    ] o.a.s.c.c.ConnectionManager Watcher org.apache.solr.common.cloud.ConnectionManager@7fea244f name:ZooKeeperConnection Watcher:127.0.0.1:46155/solr got event WatchedEvent state:SyncConnected type:None path:null path:null type:None
   [junit4]   2> 391619 INFO  (jetty-launcher-389-thread-1) [    ] o.a.s.c.c.SolrZkClient Using default ZkACLProvider
   [junit4]   2> 391619 INFO  (jetty-launcher-389-thread-2) [    ] o.a.s.c.c.ConnectionManager Client is connected to ZooKeeper
   [junit4]   2> 391620 INFO  (jetty-launcher-389-thread-2) [    ] o.a.s.c.c.SolrZkClient Using default ZkACLProvider
   [junit4]   2> 391620 INFO  (jetty-launcher-389-thread-1) [    ] o.a.s.s.SolrDispatchFilter solr.xml found in ZooKeeper. Loading...
   [junit4]   2> 391620 INFO  (jetty-launcher-389-thread-2) [    ] o.a.s.s.SolrDispatchFilter solr.xml found in ZooKeeper. Loading...
   [junit4]   2> 391630 INFO  (jetty-launcher-389-thread-2) [    ] o.a.s.c.CorePropertiesLocator Config-defined core root directory: /home/jenkins/workspace/Lucene-Solr-5.5-Linux/solr/build/solr-core/test/J2/temp/solr.schema.TestManagedSchemaAPI_E7427EDE8206C7A8-001/tempDir-001/node2/.
   [junit4]   2> 391630 INFO  (jetty-launcher-389-thread-1) [    ] o.a.s.c.CorePropertiesLocator Config-defined core root directory: /home/jenkins/workspace/Lucene-Solr-5.5-Linux/solr/build/solr-core/test/J2/temp/solr.schema.TestManagedSchemaAPI_E7427EDE8206C7A8-001/tempDir-001/node1/.
   [junit4]   2> 391630 INFO  (jetty-launcher-389-thread-2) [    ] o.a.s.c.CoreContainer New CoreContainer 674339997
   [junit4]   2> 391630 INFO  (jetty-launcher-389-thread-1) [    ] o.a.s.c.CoreContainer New CoreContainer 1361124360
   [junit4]   2> 391630 INFO  (jetty-launcher-389-thread-2) [    ] o.a.s.c.CoreContainer Loading cores into CoreContainer [instanceDir=/home/jenkins/workspace/Lucene-Solr-5.5-Linux/solr/build/solr-core/test/J2/temp/solr.schema.TestManagedSchemaAPI_E7427EDE8206C7A8-001/tempDir-001/node2]
   [junit4]   2> 391631 INFO  (jetty-launcher-389-thread-1) [    ] o.a.s.c.CoreContainer Loading cores into CoreContainer [instanceDir=/home/jenkins/workspace/Lucene-Solr-5.5-Linux/solr/build/solr-core/test/J2/temp/solr.schema.TestManagedSchemaAPI_E7427EDE8206C7A8-001/tempDir-001/node1]
   [junit4]   2> 391630 WARN  (NIOServerCxn.Factory:0.0.0.0/0.0.0.0:0) [    ] o.a.z.s.NIOServerCnxn caught end of stream exception
   [junit4]   2> EndOfStreamException: Unable to read additional data from client sessionid 0x1571f6142140001, likely client has closed socket
   [junit4]   2> 	at org.apache.zookeeper.server.NIOServerCnxn.doIO(NIOServerCnxn.java:228)
   [junit4]   2> 	at org.apache.zookeeper.server.NIOServerCnxnFactory.run(NIOServerCnxnFactory.java:208)
   [junit4]   2> 	at java.lang.Thread.run(Thread.java:745)
   [junit4]   2> 391631 WARN  (jetty-launcher-389-thread-1) [    ] o.a.s.c.CoreContainer Couldn't add files from /home/jenkins/workspace/Lucene-Solr-5.5-Linux/solr/build/solr-core/test/J2/temp/solr.schema.TestManagedSchemaAPI_E7427EDE8206C7A8-001/tempDir-001/node1/lib to classpath: /home/jenkins/workspace/Lucene-Solr-5.5-Linux/solr/build/solr-core/test/J2/temp/solr.schema.TestManagedSchemaAPI_E7427EDE8206C7A8-001/tempDir-001/node1/lib
   [junit4]   2> 391631 WARN  (jetty-launcher-389-thread-2) [    ] o.a.s.c.CoreContainer Couldn't add files from /home/jenkins/workspace/Lucene-Solr-5.5-Linux/solr/build/solr-core/test/J2/temp/solr.schema.TestManagedSchemaAPI_E7427EDE8206C7A8-001/tempDir-001/node2/lib to classpath: /home/jenkins/workspace/Lucene-Solr-5.5-Linux/solr/build/solr-core/test/J2/temp/solr.schema.TestManagedSchemaAPI_E7427EDE8206C7A8-001/tempDir-001/node2/lib
   [junit4]   2> 391631 INFO  (jetty-launcher-389-thread-1) [    ] o.a.s.h.c.HttpShardHandlerFactory created with socketTimeout : 90000,urlScheme : ,connTimeout : 15000,maxConnectionsPerHost : 20,maxConnections : 10000,corePoolSize : 0,maximumPoolSize : 2147483647,maxThreadIdleTime : 5,sizeOfQueue : -1,fairnessPolicy : false,useRetries : false,connectionsEvictorSleepDelay : 5000,maxConnectionIdleTime : 40000,
   [junit4]   2> 391631 INFO  (jetty-launcher-389-thread-2) [    ] o.a.s.h.c.HttpShardHandlerFactory created with socketTimeout : 90000,urlScheme : ,connTimeout : 15000,maxConnectionsPerHost : 20,maxConnections : 10000,corePoolSize : 0,maximumPoolSize : 2147483647,maxThreadIdleTime : 5,sizeOfQueue : -1,fairnessPolicy : false,useRetries : false,connectionsEvictorSleepDelay : 5000,maxConnectionIdleTime : 40000,
   [junit4]   2> 391632 INFO  (jetty-launcher-389-thread-2) [    ] o.a.s.u.UpdateShardHandler Creating UpdateShardHandler HTTP client with params: socketTimeout=340000&connTimeout=45000&retry=true
   [junit4]   2> 391632 INFO  (jetty-launcher-389-thread-1) [    ] o.a.s.u.UpdateShardHandler Creating UpdateShardHandler HTTP client with params: socketTimeout=340000&connTimeout=45000&retry=true
   [junit4]   2> 391632 INFO  (jetty-launcher-389-thread-2) [    ] o.a.s.l.LogWatcher SLF4J impl is org.slf4j.impl.Log4jLoggerFactory
   [junit4]   2> 391632 INFO  (jetty-launcher-389-thread-2) [    ] o.a.s.l.LogWatcher Registering Log Listener [Log4j (org.slf4j.impl.Log4jLoggerFactory)]
   [junit4]   2> 391632 INFO  (jetty-launcher-389-thread-1) [    ] o.a.s.l.LogWatcher SLF4J impl is org.slf4j.impl.Log4jLoggerFactory
   [junit4]   2> 391632 INFO  (jetty-launcher-389-thread-1) [    ] o.a.s.l.LogWatcher Registering Log Listener [Log4j (org.slf4j.impl.Log4jLoggerFactory)]
   [junit4]   2> 391632 INFO  (jetty-launcher-389-thread-2) [    ] o.a.s.c.ZkContainer Zookeeper client=127.0.0.1:46155/solr
   [junit4]   2> 391632 INFO  (jetty-launcher-389-thread-2) [    ] o.a.s.c.ZkController zkHost includes chroot
   [junit4]   2> 391632 INFO  (jetty-launcher-389-thread-1) [    ] o.a.s.c.ZkContainer Zookeeper client=127.0.0.1:46155/solr
   [junit4]   2> 391632 INFO  (jetty-launcher-389-thread-2) [    ] o.a.s.c.c.SolrZkClient Using default ZkCredentialsProvider
   [junit4]   2> 391633 INFO  (jetty-launcher-389-thread-1) [    ] o.a.s.c.ZkController zkHost includes chroot
   [junit4]   2> 391633 INFO  (jetty-launcher-389-thread-1) [    ] o.a.s.c.c.SolrZkClient Using default ZkCredentialsProvider
   [junit4]   2> 391633 INFO  (jetty-launcher-389-thread-2) [    ] o.a.s.c.c.ConnectionManager Waiting for client to connect to ZooKeeper
   [junit4]   2> 391633 INFO  (jetty-launcher-389-thread-1) [    ] o.a.s.c.c.ConnectionManager Waiting for client to connect to ZooKeeper
   [junit4]   2> 391634 INFO  (zkCallback-398-thread-1) [    ] o.a.s.c.c.ConnectionManager Watcher org.apache.solr.common.cloud.ConnectionManager@7c55dff8 name:ZooKeeperConnection Watcher:127.0.0.1:46155 got event WatchedEvent state:SyncConnected type:None path:null path:null type:None
   [junit4]   2> 391635 INFO  (jetty-launcher-389-thread-1) [    ] o.a.s.c.c.ConnectionManager Client is connected to ZooKeeper
   [junit4]   2> 391635 INFO  (jetty-launcher-389-thread-1) [    ] o.a.s.c.c.SolrZkClient Using default ZkACLProvider
   [junit4]   2> 391635 INFO  (zkCallback-397-thread-1) [    ] o.a.s.c.c.ConnectionManager Watcher org.apache.solr.common.cloud.ConnectionManager@76bee0d name:ZooKeeperConnection Watcher:127.0.0.1:46155 got event WatchedEvent state:SyncConnected type:None path:null path:null type:None
   [junit4]   2> 391635 INFO  (jetty-launcher-389-thread-2) [    ] o.a.s.c.c.ConnectionManager Client is connected to ZooKeeper
   [junit4]   2> 391636 INFO  (jetty-launcher-389-thread-2) [    ] o.a.s.c.c.SolrZkClient Using default ZkACLProvider
   [junit4]   2> 391636 INFO  (jetty-launcher-389-thread-1) [n:127.0.0.1:46254_solr    ] o.a.s.c.ZkController Added new OnReconnect listener org.apache.solr.cloud.ZkController$6@746b6605
   [junit4]   2> 391637 INFO  (jetty-launcher-389-thread-1) [n:127.0.0.1:46254_solr    ] o.a.s.c.c.ConnectionManager Waiting for client to connect to ZooKeeper
   [junit4]   2> 391637 INFO  (jetty-launcher-389-thread-2) [n:127.0.0.1:40603_solr    ] o.a.s.c.ZkController Added new OnReconnect listener org.apache.solr.cloud.ZkController$6@7263b03e
   [junit4]   2> 391637 INFO  (jetty-launcher-389-thread-2) [n:127.0.0.1:40603_solr    ] o.a.s.c.c.ConnectionManager Waiting for client to connect to ZooKeeper
   [junit4]   2> 391638 INFO  (zkCallback-399-thread-1-processing-n:127.0.0.1:46254_solr) [n:127.0.0.1:46254_solr    ] o.a.s.c.c.ConnectionManager Watcher org.apache.solr.common.cloud.ConnectionManager@7d72124 name:ZooKeeperConnection Watcher:127.0.0.1:46155/solr got event WatchedEvent state:SyncConnected type:None path:null path:null type:None
   [junit4]   2> 391638 INFO  (jetty-launcher-389-thread-1) [n:127.0.0.1:46254_solr    ] o.a.s.c.c.ConnectionManager Client is connected to ZooKeeper
   [junit4]   2> 391638 INFO  (zkCallback-400-thread-1-processing-n:127.0.0.1:40603_solr) [n:127.0.0.1:40603_solr    ] o.a.s.c.c.ConnectionManager Watcher org.apache.solr.common.cloud.ConnectionManager@ada06dc name:ZooKeeperConnection Watcher:127.0.0.1:46155/solr got event WatchedEvent state:SyncConnected type:None path:null path:null type:None
   [junit4]   2> 391638 INFO  (jetty-launcher-389-thread-2) [n:127.0.0.1:40603_solr    ] o.a.s.c.c.ConnectionManager Client is connected to ZooKeeper
   [junit4]   2> 391638 INFO  (jetty-launcher-389-thread-1) [n:127.0.0.1:46254_solr    ] o.a.s.c.c.SolrZkClient makePath: /overseer/queue
   [junit4]   2> 391639 INFO  (jetty-launcher-389-thread-2) [n:127.0.0.1:40603_solr    ] o.a.s.c.c.SolrZkClient makePath: /overseer/queue
   [junit4]   2> 391639 INFO  (jetty-launcher-389-thread-1) [n:127.0.0.1:46254_solr    ] o.a.s.c.c.SolrZkClient makePath: /overseer/collection-queue-work
   [junit4]   2> 391639 INFO  (jetty-launcher-389-thread-2) [n:127.0.0.1:40603_solr    ] o.a.s.c.c.SolrZkClient makePath: /overseer/collection-queue-work
   [junit4]   2> 391640 INFO  (jetty-launcher-389-thread-1) [n:127.0.0.1:46254_solr    ] o.a.s.c.c.SolrZkClient makePath: /overseer/collection-map-running
   [junit4]   2> 391640 INFO  (jetty-launcher-389-thread-2) [n:127.0.0.1:40603_solr    ] o.a.s.c.c.SolrZkClient makePath: /overseer/collection-map-running
   [junit4]   2> 391641 INFO  (jetty-launcher-389-thread-1) [n:127.0.0.1:46254_solr    ] o.a.s.c.c.SolrZkClient makePath: /overseer/collection-map-completed
   [junit4]   2> 391641 INFO  (jetty-launcher-389-thread-2) [n:127.0.0.1:40603_solr    ] o.a.s.c.c.SolrZkClient makePath: /overseer/collection-map-completed
   [junit4]   2> 391642 INFO  (jetty-launcher-389-thread-2) [n:127.0.0.1:40603_solr    ] o.a.s.c.c.SolrZkClient makePath: /overseer/collection-map-failure
   [junit4]   2> 391642 INFO  (jetty-launcher-389-thread-1) [n:127.0.0.1:46254_solr    ] o.a.s.c.c.SolrZkClient makePath: /overseer/collection-map-failure
   [junit4]   2> 391643 INFO  (jetty-launcher-389-thread-1) [n:127.0.0.1:46254_solr    ] o.a.s.c.c.SolrZkClient makePath: /live_nodes
   [junit4]   2> 391643 INFO  (jetty-launcher-389-thread-2) [n:127.0.0.1:40603_solr    ] o.a.s.c.c.SolrZkClient makePath: /live_nodes
   [junit4]   2> 391643 INFO  (jetty-launcher-389-thread-1) [n:127.0.0.1:46254_solr    ] o.a.s.c.c.SolrZkClient makePath: /collections
   [junit4]   2> 391644 INFO  (jetty-launcher-389-thread-2) [n:127.0.0.1:40603_solr    ] o.a.s.c.c.SolrZkClient makePath: /collections
   [junit4]   2> 391644 INFO  (jetty-launcher-389-thread-2) [n:127.0.0.1:40603_solr    ] o.a.s.c.c.SolrZkClient makePath: /aliases.json
   [junit4]   2> 391644 INFO  (jetty-launcher-389-thread-1) [n:127.0.0.1:46254_solr    ] o.a.s.c.c.SolrZkClient makePath: /aliases.json
   [junit4]   2> 391644 INFO  (jetty-launcher-389-thread-1) [n:127.0.0.1:46254_solr    ] o.a.s.c.c.SolrZkClient makePath: /clusterstate.json
   [junit4]   2> 391644 INFO  (jetty-launcher-389-thread-2) [n:127.0.0.1:40603_solr    ] o.a.s.c.c.SolrZkClient makePath: /clusterstate.json
   [junit4]   2> 391645 INFO  (jetty-launcher-389-thread-2) [n:127.0.0.1:40603_solr    ] o.a.s.c.c.SolrZkClient makePath: /security.json
   [junit4]   2> 391645 INFO  (jetty-launcher-389-thread-1) [n:127.0.0.1:46254_solr    ] o.a.s.c.c.SolrZkClient makePath: /security.json
   [junit4]   2> 391645 INFO  (jetty-launcher-389-thread-1) [n:127.0.0.1:46254_solr    ] o.a.s.c.ZkController Register node as live in ZooKeeper:/live_nodes/127.0.0.1:46254_solr
   [junit4]   2> 391645 INFO  (jetty-launcher-389-thread-2) [n:127.0.0.1:40603_solr    ] o.a.s.c.ZkController Register node as live in ZooKeeper:/live_nodes/127.0.0.1:40603_solr
   [junit4]   2> 391645 INFO  (jetty-launcher-389-thread-1) [n:127.0.0.1:46254_solr    ] o.a.s.c.c.SolrZkClient makePath: /live_nodes/127.0.0.1:46254_solr
   [junit4]   2> 391646 INFO  (jetty-launcher-389-thread-2) [n:127.0.0.1:40603_solr    ] o.a.s.c.c.SolrZkClient makePath: /live_nodes/127.0.0.1:40603_solr
   [junit4]   2> 391648 INFO  (jetty-launcher-389-thread-1) [n:127.0.0.1:46254_solr    ] o.a.s.c.c.SolrZkClient makePath: /overseer_elect
   [junit4]   2> 391648 INFO  (jetty-launcher-389-thread-2) [n:127.0.0.1:40603_solr    ] o.a.s.c.c.SolrZkClient makePath: /overseer_elect
   [junit4]   2> 391648 INFO  (jetty-launcher-389-thread-1) [n:127.0.0.1:46254_solr    ] o.a.s.c.c.SolrZkClient makePath: /overseer_elect/election
   [junit4]   2> 391648 INFO  (jetty-launcher-389-thread-2) [n:127.0.0.1:40603_solr    ] o.a.s.c.c.SolrZkClient makePath: /overseer_elect/election
   [junit4]   2> 391649 INFO  (jetty-launcher-389-thread-2) [n:127.0.0.1:40603_solr    ] o.a.s.c.Overseer Overseer (id=null) closing
   [junit4]   2> 391649 INFO  (jetty-launcher-389-thread-1) [n:127.0.0.1:46254_solr    ] o.a.s.c.Overseer Overseer (id=null) closing
   [junit4]   2> 391649 INFO  (jetty-launcher-389-thread-2) [n:127.0.0.1:40603_solr    ] o.a.s.c.LeaderElector Joined leadership election with path: /overseer_elect/election/96580419592650758-127.0.0.1:40603_solr-n_0000000000
   [junit4]   2> 391649 INFO  (jetty-launcher-389-thread-1) [n:127.0.0.1:46254_solr    ] o.a.s.c.LeaderElector Joined leadership election with path: /overseer_elect/election/96580419592650757-127.0.0.1:46254_solr-n_0000000001
   [junit4]   2> 391649 INFO  (jetty-launcher-389-thread-2) [n:127.0.0.1:40603_solr    ] o.a.s.c.OverseerElectionContext I am going to be the leader 127.0.0.1:40603_solr
   [junit4]   2> 391649 INFO  (jetty-launcher-389-thread-2) [n:127.0.0.1:40603_solr    ] o.a.s.c.c.SolrZkClient makePath: /overseer_elect/leader
   [junit4]   2> 391649 INFO  (jetty-launcher-389-thread-1) [n:127.0.0.1:46254_solr    ] o.a.s.c.LeaderElector Watching path /overseer_elect/election/96580419592650758-127.0.0.1:40603_solr-n_0000000000 to know if I could be the leader
   [junit4]   2> 391649 INFO  (jetty-launcher-389-thread-1) [n:127.0.0.1:46254_solr    ] o.a.s.c.c.ZkStateReader Updating cluster state from ZooKeeper... 
   [junit4]   2> 391650 INFO  (jetty-launcher-389-thread-2) [n:127.0.0.1:40603_solr    ] o.a.s.c.Overseer Overseer (id=96580419592650758-127.0.0.1:40603_solr-n_0000000000) starting
   [junit4]   2> 391651 INFO  (jetty-launcher-389-thread-2) [n:127.0.0.1:40603_solr    ] o.a.s.c.c.SolrZkClient makePath: /overseer/queue-work
   [junit4]   2> 391653 INFO  (jetty-launcher-389-thread-2) [n:127.0.0.1:40603_solr    ] o.a.s.c.OverseerAutoReplicaFailoverThread Starting OverseerAutoReplicaFailoverThread autoReplicaFailoverWorkLoopDelay=10000 autoReplicaFailoverWaitAfterExpiration=30000 autoReplicaFailoverBadNodeExpiration=60000
   [junit4]   2> 391654 INFO  (jetty-launcher-389-thread-2) [n:127.0.0.1:40603_solr    ] o.a.s.c.c.ZkStateReader Updating cluster state from ZooKeeper... 
   [junit4]   2> 391654 INFO  (OverseerCollectionConfigSetProcessor-96580419592650758-127.0.0.1:40603_solr-n_0000000000) [n:127.0.0.1:40603_solr    ] o.a.s.c.OverseerTaskProcessor Process current queue of overseer operations
   [junit4]   2> 391654 INFO  (OverseerStateUpdate-96580419592650758-127.0.0.1:40603_solr-n_0000000000) [n:127.0.0.1:40603_solr    ] o.a.s.c.Overseer Starting to work on the main queue
   [junit4]   2> 391659 INFO  (jetty-launcher-389-thread-1) [n:127.0.0.1:46254_solr    ] o.a.s.c.CoreContainer Security conf doesn't exist. Skipping setup for authorization module.
   [junit4]   2> 391659 INFO  (jetty-launcher-389-thread-1) [n:127.0.0.1:46254_solr    ] o.a.s.c.CoreContainer No authentication plugin used.
   [junit4]   2> 391660 INFO  (jetty-launcher-389-thread-1) [n:127.0.0.1:46254_solr    ] o.a.s.c.CorePropertiesLocator Looking for core definitions underneath /home/jenkins/workspace/Lucene-Solr-5.5-Linux/solr/build/solr-core/test/J2/temp/solr.schema.TestManagedSchemaAPI_E7427EDE8206C7A8-001/tempDir-001/node1/.
   [junit4]   2> 391660 INFO  (jetty-launcher-389-thread-1) [n:127.0.0.1:46254_solr    ] o.a.s.c.CorePropertiesLocator Found 0 core definitions
   [junit4]   2> 391661 INFO  (jetty-launcher-389-thread-1) [n:127.0.0.1:46254_solr    ] o.a.s.s.SolrDispatchFilter user.dir=/home/jenkins/workspace/Lucene-Solr-5.5-Linux/solr/build/solr-core/test/J2
   [junit4]   2> 391661 INFO  (jetty-launcher-389-thread-1) [n:127.0.0.1:46254_solr    ] o.a.s.s.SolrDispatchFilter SolrDispatchFilter.init() done
   [junit4]   2> 391664 INFO  (jetty-launcher-389-thread-2) [n:127.0.0.1:40603_solr    ] o.a.s.c.CoreContainer Security conf doesn't exist. Skipping setup for authorization module.
   [junit4]   2> 391665 INFO  (jetty-launcher-389-thread-2) [n:127.0.0.1:40603_solr    ] o.a.s.c.CoreContainer No authentication plugin used.
   [junit4]   2> 391665 INFO  (jetty-launcher-389-thread-2) [n:127.0.0.1:40603_solr    ] o.a.s.c.CorePropertiesLocator Looking for core definitions underneath /home/jenkins/workspace/Lucene-Solr-5.5-Linux/solr/build/solr-core/test/J2/temp/solr.schema.TestManagedSchemaAPI_E7427EDE8206C7A8-001/tempDir-001/node2/.
   [junit4]   2> 391665 INFO  (jetty-launcher-389-thread-2) [n:127.0.0.1:40603_solr    ] o.a.s.c.CorePropertiesLocator Found 0 core definitions
   [junit4]   2> 391665 INFO  (jetty-launcher-389-thread-2) [n:127.0.0.1:40603_solr    ] o.a.s.s.SolrDispatchFilter user.dir=/home/jenkins/workspace/Lucene-Solr-5.5-Linux/solr/build/solr-core/test/J2
   [junit4]   2> 391665 INFO  (jetty-launcher-389-thread-2) [n:127.0.0.1:40603_solr    ] o.a.s.s.SolrDispatchFilter SolrDispatchFilter.init() done
   [junit4]   2> 391666 INFO  (TEST-TestManagedSchemaAPI.test-seed#[E7427EDE8206C7A8]) [    ] o.a.s.c.c.SolrZkClient Using default ZkCredentialsProvider
   [junit4]   2> 391667 INFO  (TEST-TestManagedSchemaAPI.test-seed#[E7427EDE8206C7A8]) [    ] o.a.s.c.c.ConnectionManager Waiting for client to connect to ZooKeeper
   [junit4]   2> 391675 INFO  (zkCallback-401-thread-1) [    ] o.a.s.c.c.ConnectionManager Watcher org.apache.solr.common.cloud.ConnectionManager@b34f79 name:ZooKeeperConnection Watcher:127.0.0.1:46155 got event WatchedEvent state:SyncConnected type:None path:null path:null type:None
   [junit4]   2> 391675 INFO  (TEST-TestManagedSchemaAPI.test-seed#[E7427EDE8206C7A8]) [    ] o.a.s.c.c.ConnectionManager Client is connected to ZooKeeper
   [junit4]   2> 391675 INFO  (TEST-TestManagedSchemaAPI.test-seed#[E7427EDE8206C7A8]) [    ] o.a.s.c.c.SolrZkClient Using default ZkACLProvider
   [junit4]   2> 391676 INFO  (TEST-TestManagedSchemaAPI.test-seed#[E7427EDE8206C7A8]) [    ] o.a.s.c.c.SolrZkClient Using default ZkCredentialsProvider
   [junit4]   2> 391677 INFO  (TEST-TestManagedSchemaAPI.test-seed#[E7427EDE8206C7A8]) [    ] o.a.s.c.c.ConnectionManager Waiting for client to connect to ZooKeeper
   [junit4]   2> 391678 INFO  (zkCallback-403-thread-1) [    ] o.a.s.c.c.ConnectionManager Watcher org.apache.solr.common.cloud.ConnectionManager@6e5adecc name:ZooKeeperConnection Watcher:127.0.0.1:46155/solr got event WatchedEvent state:SyncConnected type:None path:null path:null type:None
   [junit4]   2> 391678 INFO  (TEST-TestManagedSchemaAPI.test-seed#[E7427EDE8206C7A8]) [    ] o.a.s.c.c.ConnectionManager Client is connected to ZooKeeper
   [junit4]   2> 391678 INFO  (TEST-TestManagedSchemaAPI.test-seed#[E7427EDE8206C7A8]) [    ] o.a.s.c.c.SolrZkClient Using default ZkACLProvider
   [junit4]   2> 391679 INFO  (TEST-TestManagedSchemaAPI.test-seed#[E7427EDE8206C7A8]) [    ] o.a.s.c.c.SolrZkClient makePath: /configs/conf1/solrconfig.xml
   [junit4]   2> 391680 INFO  (TEST-TestManagedSchemaAPI.test-seed#[E7427EDE8206C7A8]) [    ] o.a.s.c.c.SolrZkClient makePath: /configs/conf1/managed-schema
   [junit4]   2> 391682 INFO  (TEST-TestManagedSchemaAPI.test-seed#[E7427EDE8206C7A8]) [    ] o.a.s.c.c.SolrZkClient Using default ZkCredentialsProvider
   [junit4]   2> 391684 INFO  (TEST-TestManagedSchemaAPI.test-seed#[E7427EDE8206C7A8]) [    ] o.a.s.c.c.ConnectionManager Waiting for client to connect to ZooKeeper
   [junit4]   2> 391684 INFO  (zkCallback-404-thread-1) [    ] o.a.s.c.c.ConnectionManager Watcher org.apache.solr.common.cloud.ConnectionManager@5ab1e54c name:ZooKeeperConnection Watcher:127.0.0.1:46155/solr got event WatchedEvent state:SyncConnected type:None path:null path:null type:None
   [junit4]   2> 391684 INFO  (TEST-TestManagedSchemaAPI.test-seed#[E7427EDE8206C7A8]) [    ] o.a.s.c.c.ConnectionManager Client is connected to ZooKeeper
   [junit4]   2> 391685 INFO  (TEST-TestManagedSchemaAPI.test-seed#[E7427EDE8206C7A8]) [    ] o.a.s.c.c.SolrZkClient Using default ZkACLProvider
   [junit4]   2> 391685 INFO  (TEST-TestManagedSchemaAPI.test-seed#[E7427EDE8206C7A8]) [    ] o.a.s.c.c.ZkStateReader Updating cluster state from ZooKeeper... 
   [junit4]   2> 391688 INFO  (qtp895387297-2900) [n:127.0.0.1:40603_solr    ] o.a.s.h.a.CollectionsHandler Invoked Collection Action :create with params action=CREATE&replicationFactor=2&numShards=1&name=testschemaapi&version=2&wt=javabin&collection.configName=conf1 and sendToOCPQueue=true
   [junit4]   2> 391690 INFO  (OverseerCollectionConfigSetProcessor-96580419592650758-127.0.0.1:40603_solr-n_0000000000) [n:127.0.0.1:40603_solr    ] o.a.s.c.OverseerTaskProcessor Overseer Collection Message Handler: Get the message id:/overseer/collection-queue-work/qn-0000000000 message:{
   [junit4]   2>   "name":"testschemaapi",
   [junit4]   2>   "fromApi":"true",
   [junit4]   2>   "replicationFactor":"2",
   [junit4]   2>   "collection.configName":"conf1",
   [junit4]   2>   "numShards":"1",
   [junit4]   2>   "stateFormat":"2",
   [junit4]   2>   "operation":"create"}
   [junit4]   2> 391690 INFO  (OverseerThreadFactory-1562-thread-1-processing-n:127.0.0.1:40603_solr) [n:127.0.0.1:40603_solr    ] o.a.s.c.OverseerCollectionMessageHandler OverseerCollectionMessageHandler.processMessage : create , {
   [junit4]   2>   "name":"testschemaapi",
   [junit4]   2>   "fromApi":"true",
   [junit4]   2>   "replicationFactor":"2",
   [junit4]   2>   "collection.configName":"conf1",
   [junit4]   2>   "numShards":"1",
   [junit4]   2>   "stateFormat":"2",
   [junit4]   2>   "operation":"create"}
   [junit4]   2> 391691 INFO  (OverseerThreadFactory-1562-thread-1-processing-n:127.0.0.1:40603_solr) [n:127.0.0.1:40603_solr    ] o.a.s.c.OverseerCollectionMessageHandler Create collection testschemaapi
   [junit4]   2> 391691 INFO  (OverseerThreadFactory-1562-thread-1-processing-n:127.0.0.1:40603_solr) [n:127.0.0.1:40603_solr    ] o.a.s.c.OverseerCollectionMessageHandler creating collections conf node /collections/testschemaapi 
   [junit4]   2> 391692 INFO  (OverseerThreadFactory-1562-thread-1-processing-n:127.0.0.1:40603_solr) [n:127.0.0.1:40603_solr    ] o.a.s.c.c.SolrZkClient makePath: /collections/testschemaapi
   [junit4]   2> 391692 INFO  (zkCallback-400-thread-1-processing-n:127.0.0.1:40603_solr) [n:127.0.0.1:40603_solr    ] o.a.s.c.c.ZkStateReader A collections change: [WatchedEvent state:SyncConnected type:NodeChildrenChanged path:/collections], has occurred - updating...
   [junit4]   2> 391692 INFO  (zkCallback-404-thread-1) [    ] o.a.s.c.c.ZkStateReader A collections change: [WatchedEvent state:SyncConnected type:NodeChildrenChanged path:/collections], has occurred - updating...
   [junit4]   2> 391692 INFO  (zkCallback-399-thread-1-processing-n:127.0.0.1:46254_solr) [n:127.0.0.1:46254_solr    ] o.a.s.c.c.ZkStateReader A collections change: [WatchedEvent state:SyncConnected type:NodeChildrenChanged path:/collections], has occurred - updating...
   [junit4]   2> 391695 INFO  (OverseerStateUpdate-96580419592650758-127.0.0.1:40603_solr-n_0000000000) [n:127.0.0.1:40603_solr    ] o.a.s.c.Overseer processMessage: queueSize: 1, message = {
   [junit4]   2>   "name":"testschemaapi",
   [junit4]   2>   "fromApi":"true",
   [junit4]   2>   "replicationFactor":"2",
   [junit4]   2>   "collection.configName":"conf1",
   [junit4]   2>   "numShards":"1",
   [junit4]   2>   "stateFormat":"2",
   [junit4]   2>   "operation":"create"} current state version: 0
   [junit4]   2> 391695 INFO  (OverseerStateUpdate-96580419592650758-127.0.0.1:40603_solr-n_0000000000) [n:127.0.0.1:40603_solr    ] o.a.s.c.o.ClusterStateMutator building a new cName: testschemaapi
   [junit4]   2> 391696 INFO  (OverseerStateUpdate-96580419592650758-127.0.0.1:40603_solr-n_0000000000) [n:127.0.0.1:40603_solr    ] o.a.s.c.o.ZkStateWriter going to create_collection /collections/testschemaapi/state.json
   [junit4]   2> 391794 INFO  (OverseerThreadFactory-1562-thread-1-processing-n:127.0.0.1:40603_solr) [n:127.0.0.1:40603_solr    ] o.a.s.c.OverseerCollectionMessageHandler Creating SolrCores for new collection testschemaapi, shardNames [shard1] , replicationFactor : 2
   [junit4]   2> 391794 INFO  (OverseerThreadFactory-1562-thread-1-processing-n:127.0.0.1:40603_solr) [n:127.0.0.1:40603_solr    ] o.a.s.c.OverseerCollectionMessageHandler Creating core testschemaapi_shard1_replica1 as part of shard shard1 of collection testschemaapi on 127.0.0.1:46254_solr
   [junit4]   2> 391795 INFO  (OverseerThreadFactory-1562-thread-1-processing-n:127.0.0.1:40603_solr) [n:127.0.0.1:40603_solr    ] o.a.s.c.OverseerCollectionMessageHandler Creating core testschemaapi_shard1_replica2 as part of shard shard1 of collection testschemaapi on 127.0.0.1:40603_solr
   [junit4]   2> 391797 INFO  (qtp1808554705-2899) [n:127.0.0.1:46254_solr    ] o.a.s.h.a.CoreAdminOperation core create command action=CREATE&numShards=1&name=testschemaapi_shard1_replica1&qt=/admin/cores&version=2&wt=javabin&collection=testschemaapi&shard=shard1&collection.configName=conf1
   [junit4]   2> 391797 INFO  (qtp895387297-2902) [n:127.0.0.1:40603_solr    ] o.a.s.h.a.CoreAdminOperation core create command action=CREATE&numShards=1&name=testschemaapi_shard1_replica2&qt=/admin/cores&version=2&wt=javabin&collection=testschemaapi&shard=shard1&collection.configName=conf1
   [junit4]   2> 391797 INFO  (qtp1808554705-2899) [n:127.0.0.1:46254_solr    ] o.a.s.c.CoreDescriptor Created CoreDescriptor: {shard=shard1, name=testschemaapi_shard1_replica1, collection=testschemaapi, configSetProperties=configsetprops.json, config=solrconfig.xml, collection.configName=conf1, numShards=1, schema=schema.xml, transient=false, loadOnStartup=true, dataDir=data/}
   [junit4]   2> 391797 INFO  (qtp895387297-2902) [n:127.0.0.1:40603_solr    ] o.a.s.c.CoreDescriptor Created CoreDescriptor: {transient=false, numShards=1, name=testschemaapi_shard1_replica2, collection=testschemaapi, loadOnStartup=true, dataDir=data/, collection.configName=conf1, configSetProperties=configsetprops.json, shard=shard1, config=solrconfig.xml, schema=schema.xml}
   [junit4]   2> 391798 INFO  (qtp1808554705-2899) [n:127.0.0.1:46254_solr c:testschemaapi s:shard1  x:testschemaapi_shard1_replica1] o.a.s.c.ZkController publishing state=down
   [junit4]   2> 391798 INFO  (qtp895387297-2902) [n:127.0.0.1:40603_solr c:testschemaapi s:shard1  x:testschemaapi_shard1_replica2] o.a.s.c.ZkController publishing state=down
   [junit4]   2> 391799 INFO  (qtp895387297-2902) [n:127.0.0.1:40603_solr c:testschemaapi s:shard1  x:testschemaapi_shard1_replica2] o.a.s.c.ZkController Registering watch for collection testschemaapi
   [junit4]   2> 391799 INFO  (qtp895387297-2902) [n:127.0.0.1:40603_solr c:testschemaapi s:shard1  x:testschemaapi_shard1_replica2] o.a.s.c.c.ZkStateReader addZkWatch [testschemaapi]
   [junit4]   2> 391799 INFO  (qtp1808554705-2899) [n:127.0.0.1:46254_solr c:testschemaapi s:shard1  x:testschemaapi_shard1_replica1] o.a.s.c.ZkController Registering watch for collection testschemaapi
   [junit4]   2> 391799 INFO  (qtp1808554705-2899) [n:127.0.0.1:46254_solr c:testschemaapi s:shard1  x:testschemaapi_shard1_replica1] o.a.s.c.c.ZkStateReader addZkWatch [testschemaapi]
   [junit4]   2> 391799 INFO  (OverseerStateUpdate-96580419592650758-127.0.0.1:40603_solr-n_0000000000) [n:127.0.0.1:40603_solr    ] o.a.s.c.Overseer processMessage: queueSize: 2, message = {
   [junit4]   2>   "numShards":"1",
   [junit4]   2>   "base_url":"http://127.0.0.1:40603/solr",
   [junit4]   2>   "state":"down",
   [junit4]   2>   "collection":"testschemaapi",
   [junit4]   2>   "node_name":"127.0.0.1:40603_solr",
   [junit4]   2>   "operation":"state",
   [junit4]   2>   "roles":null,
   [junit4]   2>   "shard":"shard1",
   [junit4]   2>   "core":"testschemaapi_shard1_replica2"} current state version: 0
   [junit4]   2> 391799 INFO  (qtp895387297-2902) [n:127.0.0.1:40603_solr c:testschemaapi s:shard1  x:testschemaapi_shard1_replica2] o.a.s.c.c.ZkStateReader Add data for [testschemaapi] ver [0]
   [junit4]   2> 391799 INFO  (qtp1808554705-2899) [n:127.0.0.1:46254_solr c:testschemaapi s:shard1  x:testschemaapi_shard1_replica1] o.a.s.c.c.ZkStateReader Add data for [testschemaapi] ver [0]
   [junit4]   2> 391799 INFO  (qtp895387297-2902) [n:127.0.0.1:40603_solr c:testschemaapi s:shard1  x:testschemaapi_shard1_replica2] o.a.s.c.ZkController look for our core node name
   [junit4]   2> 391799 INFO  (qtp1808554705-2899) [n:127.0.0.1:46254_solr c:testschemaapi s:shard1  x:testschemaapi_shard1_replica1] o.a.s.c.ZkController look for our core node name
   [junit4]   2> 391799 INFO  (OverseerStateUpdate-96580419592650758-127.0.0.1:40603_solr-n_0000000000) [n:127.0.0.1:40603_solr    ] o.a.s.c.o.ReplicaMutator Update state numShards=1 message={
   [junit4]   2>   "numShards":"1",
   [junit4]   2>   "base_url":"http://127.0.0.1:40603/solr",
   [junit4]   2>   "state":"down",
   [junit4]   2>   "collection":"testschemaapi",
   [junit4]   2>   "node_name":"127.0.0.1:40603_solr",
   [junit4]   2>   "operation":"state",
   [junit4]   2>   "roles":null,
   [junit4]   2>   "shard":"shard1",
   [junit4]   2>   "core":"testschemaapi_shard1_replica2"}
   [junit4]   2> 391800 INFO  (OverseerStateUpdate-96580419592650758-127.0.0.1:40603_solr-n_0000000000) [n:127.0.0.1:40603_solr    ] o.a.s.c.Overseer processMessage: queueSize: 1, message = {
   [junit4]   2>   "numShards":"1",
   [junit4]   2>   "base_url":"http://127.0.0.1:46254/solr",
   [junit4]   2>   "state":"down",
   [junit4]   2>   "collection":"testschemaapi",
   [junit4]   2>   "node_name":"127.0.0.1:46254_solr",
   [junit4]   2>   "operation":"state",
   [junit4]   2>   "roles":null,
   [junit4]   2>   "shard":"shard1",
   [junit4]   2>   "core":"testschemaapi_shard1_replica1"} current state version: 0
   [junit4]   2> 391801 INFO  (OverseerStateUpdate-96580419592650758-127.0.0.1:40603_solr-n_0000000000) [n:127.0.0.1:40603_solr    ] o.a.s.c.o.ReplicaMutator Update state numShards=1 message={
   [junit4]   2>   "numShards":"1",
   [junit4]   2>   "base_url":"http://127.0.0.1:46254/solr",
   [junit4]   2>   "state":"down",
   [junit4]   2>   "collection":"testschemaapi",
   [junit4]   2>   "node_name":"127.0.0.1:46254_solr",
   [junit4]   2>   "operation":"state",
   [junit4]   2>   "roles":null,
   [junit4]   2>   "shard":"shard1",
   [junit4]   2>   "core":"testschemaapi_shard1_replica1"}
   [junit4]   2> 391903 INFO  (OverseerStateUpdate-96580419592650758-127.0.0.1:40603_solr-n_0000000000) [n:127.0.0.1:40603_solr    ] o.a.s.c.o.ZkStateWriter going to update_collection /collections/testschemaapi/state.json version: 0
   [junit4]   2> 391903 INFO  (zkCallback-400-thread-1-processing-n:127.0.0.1:40603_solr) [n:127.0.0.1:40603_solr    ] o.a.s.c.c.ZkStateReader A cluster state change: [WatchedEvent state:SyncConnected type:NodeDataChanged path:/collections/testschemaapi/state.json] for collection [testschemaapi] has occurred - updating... (live nodes size: [2])
   [junit4]   2> 391903 INFO  (zkCallback-399-thread-1-processing-n:127.0.0.1:46254_solr) [n:127.0.0.1:46254_solr    ] o.a.s.c.c.ZkStateReader A cluster state change: [WatchedEvent state:SyncConnected type:NodeDataChanged path:/collections/testschemaapi/state.json] for collection [testschemaapi] has occurred - updating... (live nodes size: [2])
   [junit4]   2> 391904 INFO  (zkCallback-400-thread-1-processing-n:127.0.0.1:40603_solr) [n:127.0.0.1:40603_solr    ] o.a.s.c.c.ZkStateReader Updating data for [testschemaapi] from [0] to [1]
   [junit4]   2> 391904 INFO  (zkCallback-399-thread-1-processing-n:127.0.0.1:46254_solr) [n:127.0.0.1:46254_solr    ] o.a.s.c.c.ZkStateReader Updating data for [testschemaapi] from [0] to [1]
   [junit4]   2> 392800 INFO  (qtp895387297-2902) [n:127.0.0.1:40603_solr c:testschemaapi s:shard1  x:testschemaapi_shard1_replica2] o.a.s.c.ZkController waiting to find shard id in clusterstate for testschemaapi_shard1_replica2
   [junit4]   2> 392800 INFO  (qtp1808554705-2899) [n:127.0.0.1:46254_solr c:testschemaapi s:shard1  x:testschemaapi_shard1_replica1] o.a.s.c.ZkController waiting to find shard id in clusterstate for testschemaapi_shard1_replica1
   [junit4]   2> 392800 INFO  (qtp895387297-2902) [n:127.0.0.1:40603_solr c:testschemaapi s:shard1  x:testschemaapi_shard1_replica2] o.a.s.c.ZkController Check for collection zkNode:testschemaapi
   [junit4]   2> 392800 INFO  (qtp1808554705-2899) [n:127.0.0.1:46254_solr c:testschemaapi s:shard1  x:testschemaapi_shard1_replica1] o.a.s.c.ZkController Check for collection zkNode:testschemaapi
   [junit4]   2> 392800 INFO  (qtp895387297-2902) [n:127.0.0.1:40603_solr c:testschemaapi s:shard1  x:testschemaapi_shard1_replica2] o.a.s.c.ZkController Collection zkNode exists
   [junit4]   2> 392800 INFO  (qtp895387297-2902) [n:127.0.0.1:40603_solr c:testschemaapi s:shard1  x:testschemaapi_shard1_replica2] o.a.s.c.c.ZkStateReader Load collection config from: [/collections/testschemaapi]
   [junit4]   2> 392800 INFO  (qtp1808554705-2899) [n:127.0.0.1:46254_solr c:testschemaapi s:shard1  x:testschemaapi_shard1_replica1] o.a.s.c.ZkController Collection zkNode exists
   [junit4]   2> 392800 INFO  (qtp1808554705-2899) [n:127.0.0.1:46254_solr c:testschemaapi s:shard1  x:testschemaapi_shard1_replica1] o.a.s.c.c.ZkStateReader Load collection config from: [/collections/testschemaapi]
   [junit4]   2> 392800 INFO  (qtp895387297-2902) [n:127.0.0.1:40603_solr c:testschemaapi s:shard1  x:testschemaapi_shard1_replica2] o.a.s.c.c.ZkStateReader path=[/collections/testschemaapi] [configName]=[conf1] specified config exists in ZooKeeper
   [junit4]   2> 392800 INFO  (qtp895387297-2902) [n:127.0.0.1:40603_solr c:testschemaapi s:shard1  x:testschemaapi_shard1_replica2] o.a.s.c.SolrResourceLoader new SolrResourceLoader for directory: '/home/jenkins/workspace/Lucene-Solr-5.5-Linux/solr/build/solr-core/test/J2/temp/solr.schema.TestManagedSchemaAPI_E7427EDE8206C7A8-001/tempDir-001/node2/testschemaapi_shard1_replica2'
   [junit4]   2> 392800 INFO  (qtp1808554705-2899) [n:127.0.0.1:46254_solr c:testschemaapi s:shard1  x:testschemaapi_shard1_replica1] o.a.s.c.c.ZkStateReader path=[/collections/testschemaapi] [configName]=[conf1] specified config exists in ZooKeeper
   [junit4]   2> 392801 INFO  (qtp1808554705-2899) [n:127.0.0.1:46254_solr c:testschemaapi s:shard1  x:testschemaapi_shard1_replica1] o.a.s.c.SolrResourceLoader new SolrResourceLoader for directory: '/home/jenkins/workspace/Lucene-Solr-5.5-Linux/solr/build/solr-core/test/J2/temp/solr.schema.TestManagedSchemaAPI_E7427EDE8206C7A8-001/tempDir-001/node1/testschemaapi_shard1_replica1'
   [junit4]   2> 392801 INFO  (qtp895387297-2902) [n:127.0.0.1:40603_solr c:testschemaapi s:shard1  x:testschemaapi_shard1_replica2] o.a.s.c.SolrResourceLoader JNDI not configured for solr (NoInitialContextEx)
   [junit4]   2> 392801 INFO  (qtp895387297-2902) [n:127.0.0.1:40603_solr c:testschemaapi s:shard1  x:testschemaapi_shard1_replica2] o.a.s.c.SolrResourceLoader solr home defaulted to 'solr/' (could not find system property or JNDI)
   [junit4]   2> 392801 INFO  (qtp1808554705-2899) [n:127.0.0.1:46254_solr c:testschemaapi s:shard1  x:testschemaapi_shard1_replica1] o.a.s.c.SolrResourceLoader JNDI not configured for solr (NoInitialContextEx)
   [junit4]   2> 392801 INFO  (qtp1808554705-2899) [n:127.0.0.1:46254_solr c:testschemaapi s:shard1  x:testschemaapi_shard1_replica1] o.a.s.c.SolrResourceLoader solr home defaulted to 'solr/' (could not find system property or JNDI)
   [junit4]   2> 392802 INFO  (qtp895387297-2902) [n:127.0.0.1:40603_solr c:testschemaapi s:shard1  x:testschemaapi_shard1_replica2] o.a.s.c.Config loaded config solrconfig.xml with version 0 
   [junit4]   2> 392802 INFO  (qtp1808554705-2899) [n:127.0.0.1:46254_solr c:testschemaapi s:shard1  x:testschemaapi_shard1_replica1] o.a.s.c.Config loaded config solrconfig.xml with version 0 
   [junit4]   2> 392805 INFO  (qtp895387297-2902) [n:127.0.0.1:40603_solr c:testschemaapi s:shard1  x:testschemaapi_shard1_replica2] o.a.s.c.SolrConfig current version of requestparams : -1
   [junit4]   2> 392805 INFO  (qtp1808554705-2899) [n:127.0.0.1:46254_solr c:testschemaapi s:shard1  x:testschemaapi_shard1_replica1] o.a.s.c.SolrConfig current version of requestparams : -1
   [junit4]   2> 392812 INFO  (qtp1808554705-2899) [n:127.0.0.1:46254_solr c:testschemaapi s:shard1  x:testschemaapi_shard1_replica1] o.a.s.c.SolrConfig Using Lucene MatchVersion: 5.5.4
   [junit4]   2> 392813 INFO  (qtp895387297-2902) [n:127.0.0.1:40603_solr c:testschemaapi s:shard1  x:testschemaapi_shard1_replica2] o.a.s.c.SolrConfig Using Lucene MatchVersion: 5.5.4
   [junit4]   2> 392828 INFO  (qtp1808554705-2899) [n:127.0.0.1:46254_solr c:testschemaapi s:shard1  x:testschemaapi_shard1_replica1] o.a.s.c.SolrConfig Loaded SolrConfig: solrconfig.xml
   [junit4]   2> 392828 INFO  (qtp895387297-2902) [n:127.0.0.1:40603_solr c:testschemaapi s:shard1  x:testschemaapi_shard1_replica2] o.a.s.c.SolrConfig Loaded SolrConfig: solrconfig.xml
   [junit4]   2> 392831 INFO  (qtp895387297-2902) [n:127.0.0.1:40603_solr c:testschemaapi s:shard1  x:testschemaapi_shard1_replica2] o.a.s.s.IndexSchema [testschemaapi_shard1_replica2] Schema name=minimal
   [junit4]   2> 392831 INFO  (qtp1808554705-2899) [n:127.0.0.1:46254_solr c:testschemaapi s:shard1  x:testschemaapi_shard1_replica1] o.a.s.s.IndexSchema [testschemaapi_shard1_replica1] Schema name=minimal
   [junit4]   2> 392844 INFO  (qtp895387297-2902) [n:127.0.0.1:40603_solr c:testschemaapi s:shard1  x:testschemaapi_shard1_replica2] o.a.s.s.IndexSchema unique key field: id
   [junit4]   2> 392845 INFO  (qtp895387297-2902) [n:127.0.0.1:40603_solr c:testschemaapi s:shard1  x:testschemaapi_shard1_replica2] o.a.s.c.ConfigSetProperties Did not find ConfigSet properties, assuming default properties: Can't find resource 'configsetprops.json' in classpath or '/configs/conf1', cwd=/home/jenkins/workspace/Lucene-Solr-5.5-Linux/solr/build/solr-core/test/J2
   [junit4]   2> 392845 INFO  (qtp895387297-2902) [n:127.0.0.1:40603_solr c:testschemaapi s:shard1  x:testschemaapi_shard1_replica2] o.a.s.c.CoreContainer Creating SolrCore 'testschemaapi_shard1_replica2' using configuration from collection testschemaapi
   [junit4]   2> 392846 INFO  (qtp895387297-2902) [n:127.0.0.1:40603_solr c:testschemaapi s:shard1 r:core_node1 x:testschemaapi_shard1_replica2] o.a.s.c.SolrCore org.apache.solr.core.MockDirectoryFactory
   [junit4]   2> 392846 INFO  (qtp895387297-2902) [n:127.0.0.1:40603_solr c:testschemaapi s:shard1 r:core_node1 x:testschemaapi_shard1_replica2] o.a.s.c.SolrCore [[testschemaapi_shard1_replica2] ] Opening new SolrCore at [/home/jenkins/workspace/Lucene-Solr-5.5-Linux/solr/build/solr-core/test/J2/temp/solr.schema.TestManagedSchemaAPI_E7427EDE8206C7A8-001/tempDir-001/node2/testschemaapi_shard1_replica2], dataDir=[/home/jenkins/workspace/Lucene-Solr-5.5-Linux/solr/build/solr-core/test/J2/temp/solr.schema.TestManagedSchemaAPI_E7427EDE8206C7A8-001/tempDir-001/node2/./testschemaapi_shard1_replica2/data/]
   [junit4]   2> 392846 INFO  (qtp895387297-2902) [n:127.0.0.1:40603_solr c:testschemaapi s:shard1 r:core_node1 x:testschemaapi_shard1_replica2] o.a.s.c.SolrCore JMX monitoring not detected for core: testschemaapi_shard1_replica2
   [junit4]   2> 392847 INFO  (qtp1808554705-2899) [n:127.0.0.1:46254_solr c:testschemaapi s:shard1  x:testschemaapi_shard1_replica1] o.a.s.s.IndexSchema unique key field: id
   [junit4]   2> 392847 INFO  (qtp895387297-2902) [n:127.0.0.1:40603_solr c:testschemaapi s:shard1 r:core_node1 x:testschemaapi_shard1_replica2] o.a.s.c.CachingDirectoryFactory return new directory for /home/jenkins/workspace/Lucene-Solr-5.5-Linux/solr/build/solr-core/test/J2/temp/solr.schema.TestManagedSchemaAPI_E7427EDE8206C7A8-001/tempDir-001/node2/./testschemaapi_shard1_replica2/data
   [junit4]   2> 392847 INFO  (qtp895387297-2902) [n:127.0.0.1:40603_solr c:testschemaapi s:shard1 r:core_node1 x:testschemaapi_shard1_replica2] o.a.s.c.SolrCore New index directory detected: old=null new=/home/jenkins/workspace/Lucene-Solr-5.5-Linux/solr/build/solr-core/test/J2/temp/solr.schema.TestManagedSchemaAPI_E7427EDE8206C7A8-001/tempDir-001/node2/./testschemaapi_shard1_replica2/data/index/
   [junit4]   2> 392848 WARN  (qtp895387297-2902) [n:127.0.0.1:40603_solr c:testschemaapi s:shard1 r:core_node1 x:testschemaapi_shard1_replica2] o.a.s.c.SolrCore [testschemaapi_shard1_replica2] Solr index directory '/home/jenkins/workspace/Lucene-Solr-5.5-Linux/solr/build/solr-core/test/J2/temp/solr.schema.TestManagedSchemaAPI_E7427EDE8206C7A8-001/tempDir-001/node2/./testschemaapi_shard1_replica2/data/index' doesn't exist. Creating new index...
   [junit4]   2> 392848 INFO  (qtp895387297-2902) [n:127.0.0.1:40603_solr c:testschemaapi s:shard1 r:core_node1 x:testschemaapi_shard1_replica2] o.a.s.c.CachingDirectoryFactory return new directory for /home/jenkins/workspace/Lucene-Solr-5.5-Linux/solr/build/solr-core/test/J2/temp/solr.schema.TestManagedSchemaAPI_E7427EDE8206C7A8-001/tempDir-001/node2/./testschemaapi_shard1_replica2/data/index
   [junit4]   2> 392848 INFO  (qtp1808554705-2899) [n:127.0.0.1:46254_solr c:testschemaapi s:shard1  x:testschemaapi_shard1_replica1] o.a.s.c.ConfigSetProperties Did not find ConfigSet properties, assuming default properties: Can't find resource 'configsetprops.json' in classpath or '/configs/conf1', cwd=/home/jenkins/workspace/Lucene-Solr-5.5-Linux/solr/build/solr-core/test/J2
   [junit4]   2> 392848 INFO  (qtp1808554705-2899) [n:127.0.0.1:46254_solr c:testschemaapi s:shard1  x:testschemaapi_shard1_replica1] o.a.s.c.CoreContainer Creating SolrCore 'testschemaapi_shard1_replica1' using configuration from collection testschemaapi
   [junit4]   2> 392848 INFO  (qtp1808554705-2899) [n:127.0.0.1:46254_solr c:testschemaapi s:shard1 r:core_node2 x:testschemaapi_shard1_replica1] o.a.s.c.SolrCore org.apache.solr.core.MockDirectoryFactory
   [junit4]   2> 392848 INFO  (qtp1808554705-2899) [n:127.0.0.1:46254_solr c:testschemaapi s:shard1 r:core_node2 x:testschemaapi_shard1_replica1] o.a.s.c.SolrCore [[testschemaapi_shard1_replica1] ] Opening new SolrCore at [/home/jenkins/workspace/Lucene-Solr-5.5-Linux/solr/build/solr-core/test/J2/temp/solr.schema.TestManagedSchemaAPI_E7427EDE8206C7A8-001/tempDir-001/node1/testschemaapi_shard1_replica1], dataDir=[/home/jenkins/workspace/Lucene-Solr-5.5-Linux/solr/build/solr-core/test/J2/temp/solr.schema.TestManagedSchemaAPI_E7427EDE8206C7A8-001/tempDir-001/node1/./testschemaapi_shard1_replica1/data/]
   [junit4]   2> 392848 INFO  (qtp895387297-2902) [n:127.0.0.1:40603_solr c:testschemaapi s:shard1 r:core_node1 x:testschemaapi_shard1_replica2] o.a.s.c.SolrDeletionPolicy SolrDeletionPolicy.onCommit: commits: num=1
   [junit4]   2> 	commit{dir=MockDirectoryWrapper(RAMDirectory@7cfff3ac lockFactory=org.apache.lucene.store.SingleInstanceLockFactory@7d6e151),segFN=segments_1,generation=1}
   [junit4]   2> 392848 INFO  (qtp1808554705-2899) [n:127.0.0.1:46254_solr c:testschemaapi s:shard1 r:core_node2 x:testschemaapi_shard1_replica1] o.a.s.c.SolrCore JMX monitoring not detected for core: testschemaapi_shard1_replica1
   [junit4]   2> 392848 INFO  (qtp895387297-2902) [n:127.0.0.1:40603_solr c:testschemaapi s:shard1 r:core_node1 x:testschemaapi_shard1_replica2] o.a.s.c.SolrDeletionPolicy newest commit generation = 1
   [junit4]   2> 392849 INFO  (OldIndexDirectoryCleanupThreadForCore-testschemaapi_shard1_replica2) [n:127.0.0.1:40603_solr c:testschemaapi s:shard1 r:core_node1 x:testschemaapi_shard1_replica2] o.a.s.c.SolrCore Looking for old index directories to cleanup for core testschemaapi_shard1_replica2 in /home/jenkins/workspace/Lucene-Solr-5.5-Linux/solr/build/solr-core/test/J2/temp/solr.schema.TestManagedSchemaAPI_E7427EDE8206C7A8-001/tempDir-001/node2/./testschemaapi_shard1_replica2/data/
   [junit4]   2> 392849 WARN  (OldIndexDirectoryCleanupThreadForCore-testschemaapi_shard1_replica2) [n:127.0.0.1:40603_solr c:testschemaapi s:shard1 r:core_node1 x:testschemaapi_shard1_replica2] o.a.s.c.DirectoryFactory /home/jenkins/workspace/Lucene-Solr-5.5-Linux/solr/build/solr-core/test/J2/temp/solr.schema.TestManagedSchemaAPI_E7427EDE8206C7A8-001/tempDir-001/node2/./testschemaapi_shard1_replica2/data/ does not point to a valid data directory; skipping clean-up of old index directories.
   [junit4]   2> 392849 INFO  (qtp1808554705-2899) [n:127.0.0.1:46254_solr c:testschemaapi s:shard1 r:core_node2 x:testschemaapi_shard1_replica1] o.a.s.c.CachingDirectoryFactory return new directory for /home/jenkins/workspace/Lucene-Solr-5.5-Linux/solr/build/solr-core/test/J2/temp/solr.schema.TestManagedSchemaAPI_E7427EDE8206C7A8-001/tempDir-001/node1/./testschemaapi_shard1_replica1/data
   [junit4]   2> 392850 INFO  (qtp1808554705-2899) [n:127.0.0.1:46254_solr c:testschemaapi s:shard1 r:core_node2 x:testschemaapi_shard1_replica1] o.a.s.c.SolrCore New index directory detected: old=null new=/home/jenkins/workspace/Lucene-Solr-5.5-Linux/solr/build/solr-core/test/J2/temp/solr.schema.TestManagedSchemaAPI_E7427EDE8206C7A8-001/tempDir-001/node1/./testschemaapi_shard1_replica1/data/index/
   [junit4]   2> 392850 WARN  (qtp1808554705-2899) [n:127.0.0.1:46254_solr c:testschemaapi s:shard1 r:core_node2 x:testschemaapi_shard1_replica1] o.a.s.c.SolrCore [testschemaapi_shard1_replica1] Solr index directory '/home/jenkins/workspace/Lucene-Solr-5.5-Linux/solr/build/solr-core/test/J2/temp/solr.schema.TestManagedSchemaAPI_E7427EDE8206C7A8-001/tempDir-001/node1/./testschemaapi_shard1_replica1/data/index' doesn't exist. Creating new index...
   [junit4]   2> 392850 INFO  (qtp1808554705-2899) [n:127.0.0.1:46254_solr c:testschemaapi s:shard1 r:core_node2 x:testschemaapi_shard1_replica1] o.a.s.c.CachingDirectoryFactory return new directory for /home/jenkins/workspace/Lucene-Solr-5.5-Linux/solr/build/solr-core/test/J2/temp/solr.schema.TestManagedSchemaAPI_E7427EDE8206C7A8-001/tempDir-001/node1/./testschemaapi_shard1_replica1/data/index
   [junit4]   2> 392850 INFO  (qtp895387297-2902) [n:127.0.0.1:40603_solr c:testschemaapi s:shard1 r:core_node1 x:testschemaapi_shard1_replica2] o.a.s.c.SolrCore no updateRequestProcessorChain defined as default, creating implicit default
   [junit4]   2> 392851 INFO  (qtp1808554705-2899) [n:127.0.0.1:46254_solr c:testschemaapi s:shard1 r:core_node2 x:testschemaapi_shard1_replica1] o.a.s.c.SolrDeletionPolicy SolrDeletionPolicy.onCommit: commits: num=1
   [junit4]   2> 	commit{dir=MockDirectoryWrapper(RAMDirectory@7c04efee lockFactory=org.apache.lucene.store.SingleInstanceLockFactory@282431de),segFN=segments_1,generation=1}
   [junit4]   2> 392851 INFO  (qtp1808554705-2899) [n:127.0.0.1:46254_solr c:testschemaapi s:shard1 r:core_node2 x:testschemaapi_shard1_replica1] o.a.s.c.SolrDeletionPolicy newest commit generation = 1
   [junit4]   2> 392851 INFO  (OldIndexDirectoryCleanupThreadForCore-testschemaapi_shard1_replica1) [n:127.0.0.1:46254_solr c:testschemaapi s:shard1 r:core_node2 x:testschemaapi_shard1_replica1] o.a.s.c.SolrCore Looking for old index directories to cleanup for core testschemaapi_shard1_replica1 in /home/jenkins/workspace/Lucene-Solr-5.5-Linux/solr/build/solr-core/test/J2/temp/solr.schema.TestManagedSchemaAPI_E7427EDE8206C7A8-001/tempDir-001/node1/./testschemaapi_shard1_replica1/data/
   [junit4]   2> 392851 WARN  (OldIndexDirectoryCleanupThreadForCore-testschemaapi_shard1_replica1) [n:127.0.0.1:46254_solr c:testschemaapi s:shard1 r:core_node2 x:testschemaapi_shard1_replica1] o.a.s.c.DirectoryFactory /home/jenkins/workspace/Lucene-Solr-5.5-Linux/solr/build/solr-core/test/J2/temp/solr.schema.TestManagedSchemaAPI_E7427EDE8206C7A8-001/tempDir-001/node1/./testschemaapi_shard1_replica1/data/ does not point to a valid data directory; skipping clean-up of old index directories.
   [junit4]   2> 392852 INFO  (qtp1808554705-2899) [n:127.0.0.1:46254_solr c:testschemaapi s:shard1 r:core_node2 x:testschemaapi_shard1_replica1] o.a.s.c.SolrCore no updateRequestProcessorChain defined as default, creating implicit default
   [junit4]   2> 392852 INFO  (qtp895387297-2902) [n:127.0.0.1:40603_solr c:testschemaapi s:shard1 r:core_node1 x:testschemaapi_shard1_replica2] o.a.s.h.l.XMLLoader xsltCacheLifetimeSeconds=60
   [junit4]   2> 392853 INFO  (qtp895387297-2902) [n:127.0.0.1:40603_solr c:testschemaapi s:shard1 r:core_node1 x:testschemaapi_shard1_replica2] o.a.s.h.l.XMLLoader xsltCacheLifetimeSeconds=60
   [junit4]   2> 392853 INFO  (qtp1808554705-2899) [n:127.0.0.1:46254_solr c:testschemaapi s:shard1 r:core_node2 x:testschemaapi_shard1_replica1] o.a.s.h.l.XMLLoader xsltCacheLifetimeSeconds=60
   [junit4]   2> 392853 INFO  (qtp895387297-2902) [n:127.0.0.1:40603_solr c:testschemaapi s:shard1 r:core_node1 x:testschemaapi_shard1_replica2] o.a.s.h.l.XMLLoader xsltCacheLifetimeSeconds=60
   [junit4]   2> 392854 INFO  (qtp1808554705-2899) [n:127.0.0.1:46254_solr c:testschemaapi s:shard1 r:core_node2 x:testschemaapi_shard1_replica1] o.a.s.h.l.XMLLoader xsltCacheLifetimeSeconds=60
   [junit4]   2> 392854 INFO  (qtp895387297-2902) [n:127.0.0.1:40603_solr c:testschemaapi s:shard1 r:core_node1 x:testschemaapi_shard1_replica2] o.a.s.h.l.XMLLoader xsltCacheLifetimeSeconds=60
   [junit4]   2> 392855 INFO  (qtp1808554705-2899) [n:127.0.0.1:46254_solr c:testschemaapi s:shard1 r:core_node2 x:testschemaapi_shard1_replica1] o.a.s.h.l.XMLLoader xsltCacheLifetimeSeconds=60
   [junit4]   2> 392855 INFO  (qtp895387297-2902) [n:127.0.0.1:40603_solr c:testschemaapi s:shard1 r:core_node1 x:testschemaapi_shard1_replica2] o.a.s.c.RequestHandlers Registered paths: /replication,/get,/admin/mbeans,/admin/luke,/select,/admin/plugins,/admin/ping,/admin/file,/admin/segments,/admin/threads,/admin/properties,/config,/update,/admin/system,/update/json/docs,/update/csv,/admin/logging,/update/json,/schema
   [junit4]   2> 392856 INFO  (qtp1808554705-2899) [n:127.0.0.1:46254_solr c:testschemaapi s:shard1 r:core_node2 x:testschemaapi_shard1_replica1] o.a.s.h.l.XMLLoader xsltCacheLifetimeSeconds=60
   [junit4]   2> 392856 INFO  (qtp895387297-2902) [n:127.0.0.1:40603_solr c:testschemaapi s:shard1 r:core_node1 x:testschemaapi_shard1_replica2] o.a.s.c.SolrCore Using default statsCache cache: org.apache.solr.search.stats.LocalStatsCache
   [junit4]   2> 392856 INFO  (qtp895387297-2902) [n:127.0.0.1:40603_solr c:testschemaapi s:shard1 r:core_node1 x:testschemaapi_shard1_replica2] o.a.s.u.UpdateHandler Using UpdateLog implementation: org.apache.solr.update.UpdateLog
   [junit4]   2> 392856 INFO  (qtp895387297-2902) [n:127.0.0.1:40603_solr c:testschemaapi s:shard1 r:core_node1 x:testschemaapi_shard1_replica2] o.a.s.u.UpdateLog Initializing UpdateLog: dataDir=null defaultSyncLevel=FLUSH numRecordsToKeep=100 maxNumLogsToKeep=10 numVersionBuckets=65536
   [junit4]   2> 392857 INFO  (qtp1808554705-2899) [n:127.0.0.1:46254_solr c:testschemaapi s:shard1 r:core_node2 x:testschemaapi_shard1_replica1] o.a.s.c.RequestHandlers Registered paths: /replication,/get,/admin/mbeans,/admin/luke,/select,/admin/plugins,/admin/ping,/admin/file,/admin/segments,/admin/threads,/admin/properties,/config,/update,/admin/system,/update/json/docs,/update/csv,/admin/logging,/update/json,/schema
   [junit4]   2> 392857 INFO  (qtp895387297-2902) [n:127.0.0.1:40603_solr c:testschemaapi s:shard1 r:core_node1 x:testschemaapi_shard1_replica2] o.a.s.u.CommitTracker Hard AutoCommit: disabled
   [junit4]   2> 392857 INFO  (qtp895387297-2902) [n:127.0.0.1:40603_solr c:testschemaapi s:shard1 r:core_node1 x:testschemaapi_shard1_replica2] o.a.s.u.CommitTracker Soft AutoCommit: disabled
   [junit4]   2> 392857 INFO  (qtp895387297-2902) [n:127.0.0.1:40603_solr c:testschemaapi s:shard1 r:core_node1 x:testschemaapi_shard1_replica2] o.a.s.c.SolrDeletionPolicy SolrDeletionPolicy.onInit: commits: num=1
   [junit4]   2> 	commit{dir=MockDirectoryWrapper(RAMDirectory@7cfff3ac lockFactory=org.apache.lucene.store.SingleInstanceLockFactory@7d6e151),segFN=segments_1,generation=1}
   [junit4]   2> 392857 INFO  (qtp895387297-2902) [n:127.0.0.1:40603_solr c:testschemaapi s:shard1 r:core_node1 x:testschemaapi_shard1_replica2] o.a.s.c.SolrDeletionPolicy newest commit generation = 1
   [junit4]   2> 392857 INFO  (qtp1808554705-2899) [n:127.0.0.1:46254_solr c:testschemaapi s:shard1 r:core_node2 x:testschemaapi_shard1_replica1] o.a.s.c.SolrCore Using default statsCache cache: org.apache.solr.search.stats.LocalStatsCache
   [junit4]   2> 392857 INFO  (qtp895387297-2902) [n:127.0.0.1:40603_solr c:testschemaapi s:shard1 r:core_node1 x:testschemaapi_shard1_replica2] o.a.s.s.SolrIndexSearcher Opening Searcher@6f4f0776[testschemaapi_shard1_replica2] main
   [junit4]   2> 392858 INFO  (qtp895387297-2902) [n:127.0.0.1:40603_solr c:testschemaapi s:shard1 r:core_node1 x:testschemaapi_shard1_replica2] o.a.s.c.c.ZkStateReader Load collection config from: [/collections/testschemaapi]
   [junit4]   2> 392858 INFO  (qtp1808554705-2899) [n:127.0.0.1:46254_solr c:testschemaapi s:shard1 r:core_node2 x:testschemaapi_shard1_replica1] o.a.s.u.UpdateHandler Using UpdateLog implementation: org.apache.solr.update.UpdateLog
   [junit4]   2> 392859 INFO  (qtp1808554705-2899) [n:127.0.0.1:46254_solr c:testschemaapi s:shard1 r:core_node2 x:testschemaapi_shard1_replica1] o.a.s.u.UpdateLog Initializing UpdateLog: dataDir=null defaultSyncLevel=FLUSH numRecordsToKeep=100 maxNumLogsToKeep=10 numVersionBuckets=65536
   [junit4]   2> 392859 INFO  (qtp895387297-2902) [n:127.0.0.1:40603_solr c:testschemaapi s:shard1 r:core_node1 x:testschemaapi_shard1_replica2] o.a.s.c.c.ZkStateReader path=[/collections/testschemaapi] [configName]=[conf1] specified config exists in ZooKeeper
   [junit4]   2> 392859 INFO  (qtp895387297-2902) [n:127.0.0.1:40603_solr c:testschemaapi s:shard1 r:core_node1 x:testschemaapi_shard1_replica2] o.a.s.r.ManagedResourceStorage Setting up ZooKeeper-based storage for the RestManager with znodeBase: /configs/conf1
   [junit4]   2> 392860 INFO  (qtp895387297-2902) [n:127.0.0.1:40603_solr c:testschemaapi s:shard1 r:core_node1 x:testschemaapi_shard1_replica2] o.a.s.r.ManagedResourceStorage Configured ZooKeeperStorageIO with znodeBase: /configs/conf1
   [junit4]   2> 392860 INFO  (qtp895387297-2902) [n:127.0.0.1:40603_solr c:testschemaapi s:shard1 r:core_node1 x:testschemaapi_shard1_replica2] o.a.s.r.RestManager Initializing RestManager with initArgs: {}
   [junit4]   2> 392860 INFO  (qtp895387297-2902) [n:127.0.0.1:40603_solr c:testschemaapi s:shard1 r:core_node1 x:testschemaapi_shard1_replica2] o.a.s.r.ManagedResourceStorage Reading _rest_managed.json using ZooKeeperStorageIO:path=/configs/conf1
   [junit4]   2> 392860 INFO  (qtp895387297-2902) [n:127.0.0.1:40603_solr c:testschemaapi s:shard1 r:core_node1 x:testschemaapi_shard1_replica2] o.a.s.r.ManagedResourceStorage No data found for znode /configs/conf1/_rest_managed.json
   [junit4]   2> 392860 INFO  (qtp895387297-2902) [n:127.0.0.1:40603_solr c:testschemaapi s:shard1 r:core_node1 x:testschemaapi_shard1_replica2] o.a.s.r.ManagedResourceStorage Loaded null at path _rest_managed.json using ZooKeeperStorageIO:path=/configs/conf1
   [junit4]   2> 392860 INFO  (qtp895387297-2902) [n:127.0.0.1:40603_solr c:testschemaapi s:shard1 r:core_node1 x:testschemaapi_shard1_replica2] o.a.s.r.RestManager Initializing 0 registered ManagedResources
   [junit4]   2> 392860 INFO  (qtp1808554705-2899) [n:127.0.0.1:46254_solr c:testschemaapi s:shard1 r:core_node2 x:testschemaapi_shard1_replica1] o.a.s.u.CommitTracker Hard AutoCommit: disabled
   [junit4]   2> 392860 INFO  (qtp895387297-2902) [n:127.0.0.1:40603_solr c:testschemaapi s:shard1 r:core_node1 x:testschemaapi_shard1_replica2] o.a.s.s.ZkIndexSchemaReader Creating ZooKeeper watch for the managed schema at /configs/conf1/managed-schema
   [junit4]   2> 392860 INFO  (qtp1808554705-2899) [n:127.0.0.1:46254_solr c:testschemaapi s:shard1 r:core_node2 x:testschemaapi_shard1_replica1] o.a.s.u.CommitTracker Soft AutoCommit: disabled
   [junit4]   2> 392860 INFO  (qtp895387297-2902) [n:127.0.0.1:40603_solr c:testschemaapi s:shard1 r:core_node1 x:testschemaapi_shard1_replica2] o.a.s.c.ZkController Added new OnReconnect listener ZkIndexSchemaReader: /configs/conf1/managed-schema, uniqueCoreId: testschemaapi_shard1_replica2:619421503542211
   [junit4]   2> 392860 INFO  (qtp895387297-2902) [n:127.0.0.1:40603_solr c:testschemaapi s:shard1 r:core_node1 x:testschemaapi_shard1_replica2] o.a.s.h.ReplicationHandler Commits will be reserved for  10000
   [junit4]   2> 392861 INFO  (qtp1808554705-2899) [n:127.0.0.1:46254_solr c:testschemaapi s:shard1 r:core_node2 x:testschemaapi_shard1_replica1] o.a.s.c.SolrDeletionPolicy SolrDeletionPolicy.onInit: commits: num=1
   [junit4]   2> 	commit{dir=MockDirectoryWrapper(RAMDirectory@7c04efee lockFactory=org.apache.lucene.store.SingleInstanceLockFactory@282431de),segFN=segments_1,generation=1}
   [junit4]   2> 392861 INFO  (qtp895387297-2902) [n:127.0.0.1:40603_solr c:testschemaapi s:shard1 r:core_node1 x:testschemaapi_shard1_replica2] o.a.s.u.UpdateLog Looking up max value of version field to seed version buckets
   [junit4]   2> 392861 INFO  (qtp1808554705-2899) [n:127.0.0.1:46254_solr c:testschemaapi s:shard1 r:core_node2 x:testschemaapi_shard1_replica1] o.a.s.c.SolrDeletionPolicy newest commit generation = 1
   [junit4]   2> 392861 INFO  (qtp895387297-2902) [n:127.0.0.1:40603_solr c:testschemaapi s:shard1 r:core_node1 x:testschemaapi_shard1_replica2] o.a.s.u.VersionInfo Refreshing highest value of _version_ for 65536 version buckets from index
   [junit4]   2> 392861 INFO  (searcherExecutor-1567-thread-1-processing-r:core_node1 c:testschemaapi n:127.0.0.1:40603_solr x:testschemaapi_shard1_replica2 s:shard1) [n:127.0.0.1:40603_solr c:testschemaapi s:shard1 r:core_node1 x:testschemaapi_shard1_replica2] o.a.s.c.SolrCore [testschemaapi_shard1_replica2] Registered new searcher Searcher@6f4f0776[testschemaapi_shard1_replica2] main{ExitableDirectoryReader(UninvertingDirectoryReader())}
   [junit4]   2> 392861 INFO  (qtp895387297-2902) [n:127.0.0.1:40603_solr c:testschemaapi s:shard1 r:core_node1 x:testschemaapi_shard1_replica2] o.a.s.u.VersionInfo No terms found for _version_, cannot seed version bucket highest value from index
   [junit4]   2> 392861 INFO  (qtp1808554705-2899) [n:127.0.0.1:46254_solr c:testschemaapi s:shard1 r:core_node2 x:testschemaapi_shard1_replica1] o.a.s.s.SolrIndexSearcher Opening Searcher@2f5c4937[testschemaapi_shard1_replica1] main
   [junit4]   2> 392861 INFO  (qtp895387297-2902) [n:127.0.0.1:40603_solr c:testschemaapi s:shard1 r:core_node1 x:testschemaapi_shard1_replica2] o.a.s.u.UpdateLog Could not find max version in index or recent updates, using new clock 1545286714899038208
   [junit4]   2> 392861 INFO  (qtp1808554705-2899) [n:127.0.0.1:46254_solr c:testschemaapi s:shard1 r:core_node2 x:testschemaapi_shard1_replica1] o.a.s.c.c.ZkStateReader Load collection config from: [/collections/testschemaapi]
   [junit4]   2> 392861 INFO  (qtp1808554705-2899) [n:127.0.0.1:46254_solr c:testschemaapi s:shard1 r:core_node2 x:testschemaapi_shard1_replica1] o.a.s.c.c.ZkStateReader path=[/collections/testschemaapi] [configName]=[conf1] specified config exists in ZooKeeper
   [junit4]   2> 392861 INFO  (qtp1808554705-2899) [n:127.0.0.1:46254_solr c:testschemaapi s:shard1 r:core_node2 x:testschemaapi_shard1_replica1] o.a.s.r.ManagedResourceStorage Setting up ZooKeeper-based storage for the RestManager with znodeBase: /configs/conf1
   [junit4]   2> 392861 INFO  (qtp1808554705-2899) [n:127.0.0.1:46254_solr c:testschemaapi s:shard1 r:core_node2 x:testschemaapi_shard1_replica1] o.a.s.r.ManagedResourceStorage Configured ZooKeeperStorageIO with znodeBase: /configs/conf1
   [junit4]   2> 392862 INFO  (qtp1808554705-2899) [n:127.0.0.1:46254_solr c:testschemaapi s:shard1 r:core_node2 x:testschemaapi_shard1_replica1] o.a.s.r.RestManager Initializing RestManager with initArgs: {}
   [junit4]   2> 392862 INFO  (qtp1808554705-2899) [n:127.0.0.1:46254_solr c:testschemaapi s:shard1 r:core_node2 x:testschemaapi_shard1_replica1] o.a.s.r.ManagedResourceStorage Reading _rest_managed.json using ZooKeeperStorageIO:path=/configs/conf1
   [junit4]   2> 392862 INFO  (qtp1808554705-2899) [n:127.0.0.1:46254_solr c:testschemaapi s:shard1 r:core_node2 x:testschemaapi_shard1_replica1] o.a.s.r.ManagedResourceStorage No data found for znode /configs/conf1/_rest_managed.json
   [junit4]   2> 392862 INFO  (qtp1808554705-2899) [n:127.0.0.1:46254_solr c:testschemaapi s:shard1 r:core_node2 x:testschemaapi_shard1_replica1] o.a.s.r.ManagedResourceStorage Loaded null at path _rest_managed.json using ZooKeeperStorageIO:path=/configs/conf1
   [junit4]   2> 392862 INFO  (qtp1808554705-2899) [n:127.0.0.1:46254_solr c:testschemaapi s:shard1 r:core_node2 x:testschemaapi_shard1_replica1] o.a.s.r.RestManager Initializing 0 registered ManagedResources
   [junit4]   2> 392862 INFO  (qtp1808554705-2899) [n:127.0.0.1:46254_solr c:testschemaapi s:shard1 r:core_node2 x:testschemaapi_shard1_replica1] o.a.s.s.ZkIndexSchemaReader Creating ZooKeeper watch for the managed schema at /configs/conf1/managed-schema
   [junit4]   2> 392862 INFO  (qtp1808554705-2899) [n:127.0.0.1:46254_solr c:testschemaapi s:shard1 r:core_node2 x:testschemaapi_shard1_replica1] o.a.s.c.ZkController Added new OnReconnect listener ZkIndexSchemaReader: /configs/conf1/managed-schema, uniqueCoreId: testschemaapi_shard1_replica1:619421506148509
   [junit4]   2> 392862 INFO  (qtp1808554705-2899) [n:127.0.0.1:46254_solr c:testschemaapi s:shard1 r:core_node2 x:testschemaapi_shard1_replica1] o.a.s.h.ReplicationHandler Commits will be reserved for  10000
   [junit4]   2> 392862 INFO  (qtp1808554705-2899) [n:127.0.0.1:46254_solr c:testschemaapi s:shard1 r:core_node2 x:testschemaapi_shard1_replica1] o.a.s.u.UpdateLog Looking up max value of version field to seed version buckets
   [junit4]   2> 392862 INFO  (searcherExecutor-1568-thread-1-processing-r:core_node2 n:127.0.0.1:46254_solr c:testschemaapi s:shard1 x:testschemaapi_shard1_replica1) [n:127.0.0.1:46254_solr c:testschemaapi s:shard1 r:core_node2 x:testschemaapi_shard1_replica1] o.a.s.c.SolrCore [testschemaapi_shard1_replica1] Registered new searcher Searcher@2f5c4937[testschemaapi_shard1_replica1] main{ExitableDirectoryReader(UninvertingDirectoryReader())}
   [junit4]   2> 392862 INFO  (qtp1808554705-2899) [n:127.0.0.1:46254_solr c:testschemaapi s:shard1 r:core_node2 x:testschemaapi_shard1_replica1] o.a.s.u.VersionInfo Refreshing highest value of _version_ for 65536 version buckets from index
   [junit4]   2> 392863 INFO  (qtp895387297-2902) [n:127.0.0.1:40603_solr c:testschemaapi s:shard1 r:core_node1 x:testschemaapi_shard1_replica2] o.a.s.u.UpdateLog Took 1.0ms to seed version buckets with highest version 1545286714899038208
   [junit4]   2> 392863 INFO  (qtp1808554705-2899) [n:127.0.0.1:46254_solr c:testschemaapi s:shard1 r:core_node2 x:testschemaapi_shard1_replica1] o.a.s.u.VersionInfo No terms found for _version_, cannot seed version bucket highest value from index
   [junit4]   2> 392863 INFO  (qtp1808554705-2899) [n:127.0.0.1:46254_solr c:testschemaapi s:shard1 r:core_node2 x:testschemaapi_shard1_replica1] o.a.s.u.UpdateLog Could not find max version in index or recent updates, using new clock 1545286714901135360
   [junit4]   2> 392863 INFO  (qtp895387297-2902) [n:127.0.0.1:40603_solr c:testschemaapi s:shard1 r:core_node1 x:testschemaapi_shard1_replica2] o.a.s.c.ZkController watch zkdir /configs/conf1
   [junit4]   2> 392863 INFO  (qtp895387297-2902) [n:127.0.0.1:40603_solr c:testschemaapi s:shard1 r:core_node1 x:testschemaapi_shard1_replica2] o.a.s.c.CoreContainer registering core: testschemaapi_shard1_replica2
   [junit4]   2> 392863 INFO  (qtp895387297-2902) [n:127.0.0.1:40603_solr c:testschemaapi s:shard1 r:core_node1 x:testschemaapi_shard1_replica2] o.a.s.c.ZkController Register replica - core:testschemaapi_shard1_replica2 address:http://127.0.0.1:40603/solr collection:testschemaapi shard:shard1
   [junit4]   2> 392863 INFO  (qtp895387297-2902) [n:127.0.0.1:40603_solr c:testschemaapi s:shard1 r:core_node1 x:testschemaapi_shard1_replica2] o.a.s.c.c.SolrZkClient makePath: /collections/testschemaapi/leader_elect/shard1/election
   [junit4]   2> 392864 INFO  (qtp1808554705-2899) [n:127.0.0.1:46254_solr c:testschemaapi s:shard1 r:core_node2 x:testschemaapi_shard1_replica1] o.a.s.u.UpdateLog Took 1.0ms to seed version buckets with highest version 1545286714901135360
   [junit4]   2> 392864 INFO  (qtp1808554705-2899) [n:127.0.0.1:46254_solr c:testschemaapi s:shard1 r:core_node2 x:testschemaapi_shard1_replica1] o.a.s.c.ZkController watch zkdir /configs/conf1
   [junit4]   2> 392865 INFO  (qtp1808554705-2899) [n:127.0.0.1:46254_solr c:testschemaapi s:shard1 r:core_node2 x:testschemaapi_shard1_replica1] o.a.s.c.CoreContainer registering core: testschemaapi_shard1_replica1
   [junit4]   2> 392865 INFO  (qtp1808554705-2899) [n:127.0.0.1:46254_solr c:testschemaapi s:shard1 r:core_node2 x:testschemaapi_shard1_replica1] o.a.s.c.ZkController Register replica - core:testschemaapi_shard1_replica1 address:http://127.0.0.1:46254/solr collection:testschemaapi shard:shard1
   [junit4]   2> 392865 INFO  (qtp895387297-2902) [n:127.0.0.1:40603_solr c:testschemaapi s:shard1 r:core_node1 x:testschemaapi_shard1_replica2] o.a.s.c.LeaderElector Joined leadership election with path: /collections/testschemaapi/leader_elect/shard1/election/96580419592650758-core_node1-n_0000000000
   [junit4]   2> 392866 INFO  (qtp1808554705-2899) [n:127.0.0.1:46254_solr c:testschemaapi s:shard1 r:core_node2 x:testschemaapi_shard1_replica1] o.a.s.c.LeaderElector Joined leadership election with path: /collections/testschemaapi/leader_elect/shard1/election/96580419592650757-core_node2-n_0000000001
   [junit4]   2> 392866 INFO  (qtp895387297-2902) [n:127.0.0.1:40603_solr c:testschemaapi s:shard1 r:core_node1 x:testschemaapi_shard1_replica2] o.a.s.c.ShardLeaderElectionContext Running the leader process for shard=shard1 and weAreReplacement=false and leaderVoteWait=10000
   [junit4]   2> 392866 INFO  (qtp1808554705-2899) [n:127.0.0.1:46254_solr c:testschemaapi s:shard1 r:core_node2 x:testschemaapi_shard1_replica1] o.a.s.c.LeaderElector Watching path /collections/testschemaapi/leader_elect/shard1/election/96580419592650758-core_node1-n_0000000000 to know if I could be the leader
   [junit4]   2> 392867 INFO  (qtp895387297-2902) [n:127.0.0.1:40603_solr c:testschemaapi s:shard1 r:core_node1 x:testschemaapi_shard1_replica2] o.a.s.c.ShardLeaderElectionContext Enough replicas found to continue.
   [junit4]   2> 392867 INFO  (qtp895387297-2902) [n:127.0.0.1:40603_solr c:testschemaapi s:shard1 r:core_node1 x:testschemaapi_shard1_replica2] o.a.s.c.ShardLeaderElectionContext I may be the new leader - try and sync
   [junit4]   2> 392867 INFO  (qtp895387297-2902) [n:127.0.0.1:40603_solr c:testschemaapi s:shard1 r:core_node1 x:testschemaapi_shard1_replica2] o.a.s.c.SyncStrategy Sync replicas to http://127.0.0.1:40603/solr/testschemaapi_shard1_replica2/
   [junit4]   2> 392867 INFO  (qtp895387297-2902) [n:127.0.0.1:40603_solr c:testschemaapi s:shard1 r:core_node1 x:testschemaapi_shard1_replica2] o.a.s.u.PeerSync PeerSync: core=testschemaapi_shard1_replica2 url=http://127.0.0.1:40603/solr START replicas=[http://127.0.0.1:46254/solr/testschemaapi_shard1_replica1/] nUpdates=100
   [junit4]   2> 392867 INFO  (OverseerStateUpdate-96580419592650758-127.0.0.1:40603_solr-n_0000000000) [n:127.0.0.1:40603_solr    ] o.a.s.c.Overseer processMessage: queueSize: 1, message = {
   [junit4]   2>   "operation":"leader",
   [junit4]   2>   "shard":"shard1",
   [junit4]   2>   "collection":"testschemaapi"} current state version: 0
   [junit4]   2> 392867 INFO  (qtp895387297-2902) [n:127.0.0.1:40603_solr c:testschemaapi s:shard1 r:core_node1 x:testschemaapi_shard1_replica2] o.a.s.u.PeerSync PeerSync: core=testschemaapi_shard1_replica2 url=http://127.0.0.1:40603/solr DONE.  We have no versions.  sync failed.
   [junit4]   2> 392867 INFO  (qtp895387297-2902) [n:127.0.0.1:40603_solr c:testschemaapi s:shard1 r:core_node1 x:testschemaapi_shard1_replica2] o.a.s.c.SyncStrategy Leader's attempt to sync with shard failed, moving to the next candidate
   [junit4]   2> 392867 INFO  (qtp895387297-2902) [n:127.0.0.1:40603_solr c:testschemaapi s:shard1 r:core_node1 x:testschemaapi_shard1_replica2] o.a.s.c.ShardLeaderElectionContext We failed sync, but we have no versions - we can't sync in that case - we were active before, so become leader anyway
   [junit4]   2> 392868 INFO  (qtp895387297-2902) [n:127.0.0.1:40603_solr c:testschemaapi s:shard1 r:core_node1 x:testschemaapi_shard1_replica2] o.a.s.c.c.SolrZkClient makePath: /collections/testschemaapi/leaders/shard1
   [junit4]   2> 392869 INFO  (qtp1808554705-2901) [n:127.0.0.1:46254_solr c:testschemaapi s:shard1 r:core_node2 x:testschemaapi_shard1_replica1] o.a.s.c.S.Request [testschemaapi_shard1_replica1]  webapp=/solr path=/get params={qt=/get&version=2&wt=javabin&distrib=false&fingerprint=false&getVersions=100} status=0 QTime=0
   [junit4]   2> 392869 INFO  (qtp895387297-2902) [n:127.0.0.1:40603_solr c:testschemaapi s:shard1 r:core_node1 x:testschemaapi_shard1_replica2] o.a.s.c.ShardLeaderElectionContextBase Creating leader registration node /collections/testschemaapi/leaders/shard1/leader after winning as /collections/testschemaapi/leader_elect/shard1/election/96580419592650758-core_node1-n_0000000000
   [junit4]   2> 392872 INFO  (qtp895387297-2902) [n:127.0.0.1:40603_solr c:testschemaapi s:shard1 r:core_node1 x:testschemaapi_shard1_replica2] o.a.s.c.ShardLeaderElectionContext I am the new leader: http://127.0.0.1:40603/solr/testschemaapi_shard1_replica2/ shard1
   [junit4]   2> 392872 INFO  (OverseerStateUpdate-96580419592650758-127.0.0.1:40603_solr-n_0000000000) [n:127.0.0.1:40603_solr    ] o.a.s.c.Overseer processMessage: queueSize: 1, message = {
   [junit4]   2>   "operation":"leader",
   [junit4]   2>   "shard":"shard1",
   [junit4]   2>   "collection":"testschemaapi",
   [junit4]   2>   "base_url":"http://127.0.0.1:40603/solr",
   [junit4]   2>   "core":"testschemaapi_shard1_replica2",
   [junit4]   2>   "state":"active"} current state version: 0
   [junit4]   2> 392973 INFO  (OverseerStateUpdate-96580419592650758-127.0.0.1:40603_solr-n_0000000000) [n:127.0.0.1:40603_solr    ] o.a.s.c.o.ZkStateWriter going to update_collection /collections/testschemaapi/state.json version: 1
   [junit4]   2> 392974 INFO  (zkCallback-399-thread-1-processing-n:127.0.0.1:46254_solr) [n:127.0.0.1:46254_solr    ] o.a.s.c.c.ZkStateReader A cluster state change: [WatchedEvent state:SyncConnected type:NodeDataChanged path:/collections/testschemaapi/state.json] for collection [testschemaapi] has occurred - updating... (live nodes size: [2])
   [junit4]   2> 392974 INFO  (zkCallback-400-thread-2-processing-n:127.0.0.1:40603_solr) [n:127.0.0.1:40603_solr    ] o.a.s.c.c.ZkStateReader A cluster state change: [WatchedEvent state:SyncConnected type:NodeDataChanged path:/collections/testschemaapi/state.json] for collection [testschemaapi] has occurred - updating... (live nodes size: [2])
   [junit4]   2> 392974 INFO  (zkCallback-399-thread-1-processing-n:127.0.0.1:46254_solr) [n:127.0.0.1:46254_solr    ] o.a.s.c.c.ZkStateReader Updating data for [testschemaapi] from [1] to [2]
   [junit4]   2> 392974 INFO  (zkCallback-400-thread-2-processing-n:127.0.0.1:40603_solr) [n:127.0.0.1:40603_solr    ] o.a.s.c.c.ZkStateReader Updating data for [testschemaapi] from [1] to [2]
   [junit4]   2> 393022 INFO  (qtp895387297-2902) [n:127.0.0.1:40603_solr c:testschemaapi s:shard1 r:core_node1 x:testschemaapi_shard1_replica2] o.a.s.c.ZkController We are http://127.0.0.1:40603/solr/testschemaapi_shard1_replica2/ and leader is http://127.0.0.1:40603/solr/testschemaapi_shard1_replica2/
   [junit4]   2> 393022 INFO  (qtp895387297-2902) [n:127.0.0.1:40603_solr c:testschemaapi s:shard1 r:core_node1 x:testschemaapi_shard1_replica2] o.a.s.c.ZkController No LogReplay needed for core=testschemaapi_shard1_replica2 baseURL=http://127.0.0.1:40603/solr
   [junit4]   2> 393022 INFO  (qtp895387297-2902) [n:127.0.0.1:40603_solr c:testschemaapi s:shard1 r:core_node1 x:testschemaapi_shard1_replica2] o.a.s.c.ZkController I am the leader, no recovery necessary
   [junit4]   2> 393022 INFO  (qtp895387297-2902) [n:127.0.0.1:40603_solr c:testschemaapi s:shard1 r:core_node1 x:testschemaapi_shard1_replica2] o.a.s.c.ZkController publishing state=active
   [junit4]   2> 393024 INFO  (OverseerStateUpdate-96580419592650758-127.0.0.1:40603_solr-n_0000000000) [n:127.0.0.1:40603_solr    ] o.a.s.c.Overseer processMessage: queueSize: 1, message = {
   [junit4]   2>   "core_node_name":"core_node1",
   [junit4]   2>   "numShards":"1",
   [junit4]   2>   "base_url":"http://127.0.0.1:40603/solr",
   [junit4]   2>   "state":"active",
   [junit4]   2>   "collection":"testschemaapi",
   [junit4]   2>   "node_name":"127.0.0.1:40603_solr",
   [junit4]   2>   "operation":"state",
   [junit4]   2>   "roles":null,
   [junit4]   2>   "shard":"shard1",
   [junit4]   2>   "core":"testschemaapi_shard1_replica2"} current state version: 0
   [junit4]   2> 393024 INFO  (OverseerStateUpdate-96580419592650758-127.0.0.1:40603_solr-n_0000000000) [n:127.0.0.1:40603_solr    ] o.a.s.c.o.ReplicaMutator Update state numShards=1 message={
   [junit4]   2>   "core_node_name":"core_node1",
   [junit4]   2>   "numShards":"1",
   [junit4]   2>   "base_url":"http://127.0.0.1:40603/solr",
   [junit4]   2>   "state":"active",
   [junit4]   2>   "collection":"testschemaapi",
   [junit4]   2>   "node_name":"127.0.0.1:40603_solr",
   [junit4]   2>   "operation":"state",
   [junit4]   2>   "roles":null,
   [junit4]   2>   "shard":"shard1",
   [junit4]   2>   "core":"testschemaapi_shard1_replica2"}
   [junit4]   2> 393024 INFO  (qtp895387297-2902) [n:127.0.0.1:40603_solr c:testschemaapi s:shard1 r:core_node1 x:testschemaapi_shard1_replica2] o.a.s.s.HttpSolrCall [admin] webapp=null path=/admin/cores params={action=CREATE&numShards=1&name=testschemaapi_shard1_replica2&qt=/admin/cores&version=2&wt=javabin&collection=testschemaapi&shard=shard1&collection.configName=conf1} status=0 QTime=1227
   [junit4]   2> 393125 INFO  (OverseerStateUpdate-96580419592650758-127.0.0.1:40603_solr-n_0000000000) [n:127.0.0.1:40603_solr    ] o.a.s.c.o.ZkStateWriter going to update_collection /collections/testschemaapi/state.json version: 2
   [junit4]   2> 393126 INFO  (zkCallback-400-thread-1-processing-n:127.0.0.1:40603_solr) [n:127.0.0.1:40603_solr    ] o.a.s.c.c.ZkStateReader A cluster state change: [WatchedEvent state:SyncConnected type:NodeDataChanged path:/collections/testschemaapi/state.json] for collection [testschemaapi] has occurred - updating... (live nodes size: [2])
   [junit4]   2> 393126 INFO  (zkCallback-399-thread-1-processing-n:127.0.0.1:46254_solr) [n:127.0.0.1:46254_solr    ] o.a.s.c.c.ZkStateReader A cluster state change: [WatchedEvent state:SyncConnected type:NodeDataChanged path:/collections/testschemaapi/state.json] for collection [testschemaapi] has occurred - updating... (live nodes size: [2])
   [junit4]   2> 393126 INFO  (zkCallback-400-thread-1-processing-n:127.0.0.1:40603_solr) [n:127.0.0.1:40603_solr    ] o.a.s.c.c.ZkStateReader Updating data for [testschemaapi] from [2] to [3]
   [junit4]   2> 393126 INFO  (zkCallback-399-thread-1-processing-n:127.0.0.1:46254_solr) [n:127.0.0.1:46254_solr    ] o.a.s.c.c.ZkStateReader Updating data for [testschemaapi] from [2] to [3]
   [junit4]   2> 393867 INFO  (qtp1808554705-2899) [n:127.0.0.1:46254_solr c:testschemaapi s:shard1 r:core_node2 x:testschemaapi_shard1_replica1] o.a.s.c.ZkController We are http://127.0.0.1:46254/solr/testschemaapi_shard1_replica1/ and leader is http://127.0.0.1:40603/solr/testschemaapi_shard1_replica2/
   [junit4]   2> 393867 INFO  (qtp1808554705-2899) [n:127.0.0.1:46254_solr c:testschemaapi s:shard1 r:core_node2 x:testschemaapi_shard1_replica1] o.a.s.c.ZkController No LogReplay needed for core=testschemaapi_shard1_replica1 baseURL=http://127.0.0.1:46254/solr
   [junit4]   2> 393867 INFO  (qtp1808554705-2899) [n:127.0.0.1:46254_solr c:testschemaapi s:shard1 r:core_node2 x:testschemaapi_shard1_replica1] o.a.s.c.ZkController Core needs to recover:testschemaapi_shard1_replica1
   [junit4]   2> 393868 INFO  (updateExecutor-395-thread-1-processing-r:core_node2 n:127.0.0.1:46254_solr c:testschemaapi s:shard1 x:testschemaapi_shard1_replica1) [n:127.0.0.1:46254_solr c:testschemaapi s:shard1 r:core_node2 x:testschemaapi_shard1_replica1] o.a.s.u.DefaultSolrCoreState Running recovery
   [junit4]   2> 393868 INFO  (recoveryExecutor

[...truncated too long message...]

e.solr.common.cloud.SolrZkClient$7.execute(SolrZkClient.java:342)
   [junit4]   2> 	at org.apache.solr.common.cloud.ZkCmdExecutor.retryOperation(ZkCmdExecutor.java:60)
   [junit4]   2> 	at org.apache.solr.common.cloud.SolrZkClient.getData(SolrZkClient.java:342)
   [junit4]   2> 	at org.apache.solr.schema.ManagedIndexSchemaFactory.create(ManagedIndexSchemaFactory.java:128)
   [junit4]   2> 	... 7 more
   [junit4]   2> 402104 WARN  (Thread-1095) [n:127.0.0.1:40603_solr    ] o.a.s.c.ZkController listener throws error
   [junit4]   2> org.apache.solr.common.SolrException: Unable to reload core [testschemaapi_shard1_replica2]
   [junit4]   2> 	at org.apache.solr.core.CoreContainer.reload(CoreContainer.java:927)
   [junit4]   2> 	at org.apache.solr.core.SolrCore$11.run(SolrCore.java:2623)
   [junit4]   2> 	at org.apache.solr.cloud.ZkController$5.run(ZkController.java:2480)
   [junit4]   2> Caused by: org.apache.solr.common.SolrException: Could not load conf for core testschemaapi_shard1_replica2: Error attempting to access /configs/conf1/managed-schema
   [junit4]   2> 	at org.apache.solr.core.ConfigSetService.getConfig(ConfigSetService.java:84)
   [junit4]   2> 	at org.apache.solr.core.CoreContainer.reload(CoreContainer.java:920)
   [junit4]   2> 	... 2 more
   [junit4]   2> Caused by: org.apache.solr.common.SolrException: Error attempting to access /configs/conf1/managed-schema
   [junit4]   2> 	at org.apache.solr.schema.ManagedIndexSchemaFactory.create(ManagedIndexSchemaFactory.java:143)
   [junit4]   2> 	at org.apache.solr.schema.ManagedIndexSchemaFactory.create(ManagedIndexSchemaFactory.java:47)
   [junit4]   2> 	at org.apache.solr.schema.IndexSchemaFactory.buildIndexSchema(IndexSchemaFactory.java:70)
   [junit4]   2> 	at org.apache.solr.core.ConfigSetService.createIndexSchema(ConfigSetService.java:108)
   [junit4]   2> 	at org.apache.solr.core.ConfigSetService.getConfig(ConfigSetService.java:79)
   [junit4]   2> 	... 3 more
   [junit4]   2> Caused by: org.apache.zookeeper.KeeperException$SessionExpiredException: KeeperErrorCode = Session expired for /configs/conf1/managed-schema
   [junit4]   2> 	at org.apache.zookeeper.KeeperException.create(KeeperException.java:127)
   [junit4]   2> 	at org.apache.zookeeper.KeeperException.create(KeeperException.java:51)
   [junit4]   2> 	at org.apache.zookeeper.ZooKeeper.getData(ZooKeeper.java:1155)
   [junit4]   2> 	at org.apache.solr.common.cloud.SolrZkClient$7.execute(SolrZkClient.java:345)
   [junit4]   2> 	at org.apache.solr.common.cloud.SolrZkClient$7.execute(SolrZkClient.java:342)
   [junit4]   2> 	at org.apache.solr.common.cloud.ZkCmdExecutor.retryOperation(ZkCmdExecutor.java:60)
   [junit4]   2> 	at org.apache.solr.common.cloud.SolrZkClient.getData(SolrZkClient.java:342)
   [junit4]   2> 	at org.apache.solr.schema.ManagedIndexSchemaFactory.create(ManagedIndexSchemaFactory.java:128)
   [junit4]   2> 	... 7 more
   [junit4]   2> 403590 WARN  (zkCallback-399-thread-2-processing-n:127.0.0.1:46254_solr) [n:127.0.0.1:46254_solr    ] o.a.s.c.c.ZkStateReader ZooKeeper watch triggered, but Solr cannot talk to ZK: [KeeperErrorCode = Session expired for /live_nodes]
   [junit4]   2> 403590 WARN  (zkCallback-400-thread-8-processing-n:127.0.0.1:40603_solr) [n:127.0.0.1:40603_solr    ] o.a.s.c.c.ZkStateReader ZooKeeper watch triggered, but Solr cannot talk to ZK: [KeeperErrorCode = Session expired for /live_nodes]
   [junit4]   2> 403591 INFO  (jetty-launcher-389-thread-2) [    ] o.e.j.s.h.ContextHandler Stopped o.e.j.s.ServletContextHandler@21b8faa1{/solr,null,UNAVAILABLE}
   [junit4]   2> 403591 INFO  (jetty-launcher-389-thread-1) [    ] o.e.j.s.h.ContextHandler Stopped o.e.j.s.ServletContextHandler@4c041bbc{/solr,null,UNAVAILABLE}
   [junit4]   2> 403592 INFO  (TEST-TestManagedSchemaAPI.test-seed#[E7427EDE8206C7A8]) [    ] o.a.s.c.ZkTestServer connecting to 127.0.0.1:46155 46155
   [junit4]   2> 403613 INFO  (Thread-1058) [    ] o.a.s.c.ZkTestServer connecting to 127.0.0.1:46155 46155
   [junit4]   2> 403613 WARN  (Thread-1058) [    ] o.a.s.c.ZkTestServer Watch limit violations: 
   [junit4]   2> Maximum concurrent create/delete watches above limit:
   [junit4]   2> 
   [junit4]   2> 	6	/solr/configs/conf1
   [junit4]   2> 	6	/solr/configs/conf1/managed-schema
   [junit4]   2> 	3	/solr/aliases.json
   [junit4]   2> 	2	/solr/security.json
   [junit4]   2> 
   [junit4]   2> Maximum concurrent data watches above limit:
   [junit4]   2> 
   [junit4]   2> 	3	/solr/clusterstate.json
   [junit4]   2> 	2	/solr/collections/testschemaapi/state.json
   [junit4]   2> 
   [junit4]   2> Maximum concurrent children watches above limit:
   [junit4]   2> 
   [junit4]   2> 	9	/solr/overseer/collection-queue-work
   [junit4]   2> 	8	/solr/overseer/queue
   [junit4]   2> 	3	/solr/overseer/queue-work
   [junit4]   2> 	3	/solr/collections
   [junit4]   2> 	3	/solr/live_nodes
   [junit4]   2> 
   [junit4]   2> 403613 INFO  (TEST-TestManagedSchemaAPI.test-seed#[E7427EDE8206C7A8]) [    ] o.a.s.SolrTestCaseJ4 ###Ending test
   [junit4]   2> NOTE: reproduce with: ant test  -Dtestcase=TestManagedSchemaAPI -Dtests.method=test -Dtests.seed=E7427EDE8206C7A8 -Dtests.multiplier=3 -Dtests.slow=true -Dtests.locale=nl -Dtests.timezone=Asia/Jakarta -Dtests.asserts=true -Dtests.file.encoding=UTF-8
   [junit4] ERROR   12.1s J2 | TestManagedSchemaAPI.test <<<
   [junit4]    > Throwable #1: org.apache.solr.client.solrj.impl.CloudSolrClient$RouteException: Error from server at http://127.0.0.1:40603/solr/testschemaapi_shard1_replica2: ERROR: [doc=2] unknown field 'myNewField1'
   [junit4]    > 	at __randomizedtesting.SeedInfo.seed([E7427EDE8206C7A8:6F1641042CFAAA50]:0)
   [junit4]    > 	at org.apache.solr.client.solrj.impl.CloudSolrClient.directUpdate(CloudSolrClient.java:653)
   [junit4]    > 	at org.apache.solr.client.solrj.impl.CloudSolrClient.sendRequest(CloudSolrClient.java:1002)
   [junit4]    > 	at org.apache.solr.client.solrj.impl.CloudSolrClient.requestWithRetryOnStaleState(CloudSolrClient.java:891)
   [junit4]    > 	at org.apache.solr.client.solrj.impl.CloudSolrClient.request(CloudSolrClient.java:827)
   [junit4]    > 	at org.apache.solr.schema.TestManagedSchemaAPI.testAddFieldAndDocument(TestManagedSchemaAPI.java:101)
   [junit4]    > 	at org.apache.solr.schema.TestManagedSchemaAPI.test(TestManagedSchemaAPI.java:69)
   [junit4]    > 	at java.lang.Thread.run(Thread.java:745)
   [junit4]    > Caused by: org.apache.solr.client.solrj.impl.HttpSolrClient$RemoteSolrException: Error from server at http://127.0.0.1:40603/solr/testschemaapi_shard1_replica2: ERROR: [doc=2] unknown field 'myNewField1'
   [junit4]    > 	at org.apache.solr.client.solrj.impl.HttpSolrClient.executeMethod(HttpSolrClient.java:577)
   [junit4]    > 	at org.apache.solr.client.solrj.impl.HttpSolrClient.request(HttpSolrClient.java:241)
   [junit4]    > 	at org.apache.solr.client.solrj.impl.HttpSolrClient.request(HttpSolrClient.java:230)
   [junit4]    > 	at org.apache.solr.client.solrj.impl.LBHttpSolrClient.doRequest(LBHttpSolrClient.java:372)
   [junit4]    > 	at org.apache.solr.client.solrj.impl.LBHttpSolrClient.request(LBHttpSolrClient.java:325)
   [junit4]    > 	at org.apache.solr.client.solrj.impl.CloudSolrClient$2.call(CloudSolrClient.java:628)
   [junit4]    > 	at org.apache.solr.client.solrj.impl.CloudSolrClient$2.call(CloudSolrClient.java:625)
   [junit4]    > 	at java.util.concurrent.FutureTask.run(FutureTask.java:262)
   [junit4]    > 	at org.apache.solr.common.util.ExecutorUtil$MDCAwareThreadPoolExecutor$1.run(ExecutorUtil.java:231)
   [junit4]    > 	at java.util.concurrent.ThreadPoolExecutor.runWorker(ThreadPoolExecutor.java:1145)
   [junit4]    > 	at java.util.concurrent.ThreadPoolExecutor$Worker.run(ThreadPoolExecutor.java:615)
   [junit4]    > 	... 1 more
   [junit4]   2> 403616 INFO  (SUITE-TestManagedSchemaAPI-seed#[E7427EDE8206C7A8]-worker) [    ] o.a.s.SolrTestCaseJ4 ###deleteCore
   [junit4]   2> NOTE: leaving temporary files on disk at: /home/jenkins/workspace/Lucene-Solr-5.5-Linux/solr/build/solr-core/test/J2/temp/solr.schema.TestManagedSchemaAPI_E7427EDE8206C7A8-001
   [junit4]   2> Sep 12, 2016 5:11:02 PM com.carrotsearch.randomizedtesting.ThreadLeakControl checkThreadLeaks
   [junit4]   2> WARNING: Will linger awaiting termination of 1 leaked thread(s).
   [junit4]   2> NOTE: test params are: codec=Asserting(Lucene54): {_version_=BlockTreeOrds(blocksize=128), id=PostingsFormat(name=Direct), myNewField=PostingsFormat(name=Memory doPackFST= true)}, docValues:{}, sim=DefaultSimilarity, locale=nl, timezone=Asia/Jakarta
   [junit4]   2> NOTE: Linux 4.4.0-36-generic amd64/Oracle Corporation 1.7.0_80 (64-bit)/cpus=12,threads=1,free=207390144,total=507641856
   [junit4]   2> NOTE: All tests run in this JVM: [SolrCoreCheckLockOnStartupTest, TestInitParams, BadComponentTest, TestCollationField, TestJsonRequest, DistributedDebugComponentTest, CheckHdfsIndexTest, BadIndexSchemaTest, TestRandomRequestDistribution, DirectUpdateHandlerTest, HdfsRestartWhileUpdatingTest, LeaderInitiatedRecoveryOnShardRestartTest, TestReRankQParserPlugin, TestOverriddenPrefixQueryForCustomFieldType, SuggesterWFSTTest, TestPostingsSolrHighlighter, DistributedSuggestComponentTest, TestObjectReleaseTracker, HdfsChaosMonkeyNothingIsSafeTest, TestManagedResource, TestConfigSetsAPIZkFailure, TestTrieFacet, PluginInfoTest, DistributedQueueTest, TestCloudSchemaless, CoreSorterTest, DebugComponentTest, InfoHandlerTest, DateMathParserTest, TestManagedSchemaFieldTypeResource, TestAuthorizationFramework, TestRecovery, FullSolrCloudDistribCmdsTest, IgnoreCommitOptimizeUpdateProcessorFactoryTest, TestJmxIntegration, BlockJoinFacetSimpleTest, TestAnalyzeInfixSuggestions, TestCoreDiscovery, TestCSVResponseWriter, StatsComponentTest, TestFieldSortValues, DistributedFacetPivotWhiteBoxTest, PeerSyncReplicationTest, TestHdfsUpdateLog, TestManagedSchemaAPI]
   [junit4] Completed [109/575 (1!)] on J2 in 13.13s, 1 test, 1 error <<< FAILURES!

[...truncated 58121 lines...]


Mime
View raw message