lucene-dev mailing list archives

Site index · List index
Message view « Date » · « Thread »
Top « Date » · « Thread »
From Policeman Jenkins Server <jenk...@thetaphi.de>
Subject [JENKINS] Lucene-Solr-5.5-Linux (32bit/jdk1.8.0_102) - Build # 430 - Still Unstable!
Date Mon, 12 Sep 2016 21:56:49 GMT
Build: http://jenkins.thetaphi.de/job/Lucene-Solr-5.5-Linux/430/
Java: 32bit/jdk1.8.0_102 -server -XX:+UseConcMarkSweepGC

1 tests failed.
FAILED:  junit.framework.TestSuite.org.apache.solr.handler.TestSolrConfigHandlerCloud

Error Message:
1 thread leaked from SUITE scope at org.apache.solr.handler.TestSolrConfigHandlerCloud:     1) Thread[id=4420, name=Thread-1996, state=TIMED_WAITING, group=TGRP-TestSolrConfigHandlerCloud]         at java.lang.Thread.sleep(Native Method)         at org.apache.solr.cloud.ZkSolrResourceLoader.openResource(ZkSolrResourceLoader.java:101)         at org.apache.solr.core.SolrResourceLoader.openSchema(SolrResourceLoader.java:355)         at org.apache.solr.schema.IndexSchemaFactory.create(IndexSchemaFactory.java:48)         at org.apache.solr.schema.IndexSchemaFactory.buildIndexSchema(IndexSchemaFactory.java:70)         at org.apache.solr.core.ConfigSetService.createIndexSchema(ConfigSetService.java:108)         at org.apache.solr.core.ConfigSetService.getConfig(ConfigSetService.java:79)         at org.apache.solr.core.CoreContainer.reload(CoreContainer.java:920)         at org.apache.solr.core.SolrCore$11.run(SolrCore.java:2623)         at org.apache.solr.cloud.ZkController$5.run(ZkController.java:2480)

Stack Trace:
com.carrotsearch.randomizedtesting.ThreadLeakError: 1 thread leaked from SUITE scope at org.apache.solr.handler.TestSolrConfigHandlerCloud: 
   1) Thread[id=4420, name=Thread-1996, state=TIMED_WAITING, group=TGRP-TestSolrConfigHandlerCloud]
        at java.lang.Thread.sleep(Native Method)
        at org.apache.solr.cloud.ZkSolrResourceLoader.openResource(ZkSolrResourceLoader.java:101)
        at org.apache.solr.core.SolrResourceLoader.openSchema(SolrResourceLoader.java:355)
        at org.apache.solr.schema.IndexSchemaFactory.create(IndexSchemaFactory.java:48)
        at org.apache.solr.schema.IndexSchemaFactory.buildIndexSchema(IndexSchemaFactory.java:70)
        at org.apache.solr.core.ConfigSetService.createIndexSchema(ConfigSetService.java:108)
        at org.apache.solr.core.ConfigSetService.getConfig(ConfigSetService.java:79)
        at org.apache.solr.core.CoreContainer.reload(CoreContainer.java:920)
        at org.apache.solr.core.SolrCore$11.run(SolrCore.java:2623)
        at org.apache.solr.cloud.ZkController$5.run(ZkController.java:2480)
	at __randomizedtesting.SeedInfo.seed([64370980C7089CB8]:0)




Build Log:
[...truncated 11173 lines...]
   [junit4] Suite: org.apache.solr.handler.TestSolrConfigHandlerCloud
   [junit4]   2> Creating dataDir: /home/jenkins/workspace/Lucene-Solr-5.5-Linux/solr/build/solr-core/test/J0/temp/solr.handler.TestSolrConfigHandlerCloud_64370980C7089CB8-001/init-core-data-001
   [junit4]   2> 435741 INFO  (SUITE-TestSolrConfigHandlerCloud-seed#[64370980C7089CB8]-worker) [    ] o.a.s.SolrTestCaseJ4 Randomized ssl (false) and clientAuth (false)
   [junit4]   2> 435741 INFO  (SUITE-TestSolrConfigHandlerCloud-seed#[64370980C7089CB8]-worker) [    ] o.a.s.BaseDistributedSearchTestCase Setting hostContext system property: /
   [junit4]   2> 435743 INFO  (TEST-TestSolrConfigHandlerCloud.test-seed#[64370980C7089CB8]) [    ] o.a.s.c.ZkTestServer STARTING ZK TEST SERVER
   [junit4]   2> 435744 INFO  (Thread-1916) [    ] o.a.s.c.ZkTestServer client port:0.0.0.0/0.0.0.0:0
   [junit4]   2> 435744 INFO  (Thread-1916) [    ] o.a.s.c.ZkTestServer Starting server
   [junit4]   2> 435844 INFO  (TEST-TestSolrConfigHandlerCloud.test-seed#[64370980C7089CB8]) [    ] o.a.s.c.ZkTestServer start zk server on port:35061
   [junit4]   2> 435845 INFO  (TEST-TestSolrConfigHandlerCloud.test-seed#[64370980C7089CB8]) [    ] o.a.s.c.c.SolrZkClient Using default ZkCredentialsProvider
   [junit4]   2> 435845 INFO  (TEST-TestSolrConfigHandlerCloud.test-seed#[64370980C7089CB8]) [    ] o.a.s.c.c.ConnectionManager Waiting for client to connect to ZooKeeper
   [junit4]   2> 435847 INFO  (zkCallback-462-thread-1) [    ] o.a.s.c.c.ConnectionManager Watcher org.apache.solr.common.cloud.ConnectionManager@a76fbf name:ZooKeeperConnection Watcher:127.0.0.1:35061 got event WatchedEvent state:SyncConnected type:None path:null path:null type:None
   [junit4]   2> 435847 INFO  (TEST-TestSolrConfigHandlerCloud.test-seed#[64370980C7089CB8]) [    ] o.a.s.c.c.ConnectionManager Client is connected to ZooKeeper
   [junit4]   2> 435847 INFO  (TEST-TestSolrConfigHandlerCloud.test-seed#[64370980C7089CB8]) [    ] o.a.s.c.c.SolrZkClient Using default ZkACLProvider
   [junit4]   2> 435847 INFO  (TEST-TestSolrConfigHandlerCloud.test-seed#[64370980C7089CB8]) [    ] o.a.s.c.c.SolrZkClient makePath: /solr
   [junit4]   2> 435848 INFO  (TEST-TestSolrConfigHandlerCloud.test-seed#[64370980C7089CB8]) [    ] o.a.s.c.c.SolrZkClient Using default ZkCredentialsProvider
   [junit4]   2> 435848 INFO  (TEST-TestSolrConfigHandlerCloud.test-seed#[64370980C7089CB8]) [    ] o.a.s.c.c.ConnectionManager Waiting for client to connect to ZooKeeper
   [junit4]   2> 435849 INFO  (zkCallback-463-thread-1) [    ] o.a.s.c.c.ConnectionManager Watcher org.apache.solr.common.cloud.ConnectionManager@552496 name:ZooKeeperConnection Watcher:127.0.0.1:35061/solr got event WatchedEvent state:SyncConnected type:None path:null path:null type:None
   [junit4]   2> 435849 INFO  (TEST-TestSolrConfigHandlerCloud.test-seed#[64370980C7089CB8]) [    ] o.a.s.c.c.ConnectionManager Client is connected to ZooKeeper
   [junit4]   2> 435849 INFO  (TEST-TestSolrConfigHandlerCloud.test-seed#[64370980C7089CB8]) [    ] o.a.s.c.c.SolrZkClient Using default ZkACLProvider
   [junit4]   2> 435849 INFO  (TEST-TestSolrConfigHandlerCloud.test-seed#[64370980C7089CB8]) [    ] o.a.s.c.c.SolrZkClient makePath: /collections/collection1
   [junit4]   2> 435850 INFO  (TEST-TestSolrConfigHandlerCloud.test-seed#[64370980C7089CB8]) [    ] o.a.s.c.c.SolrZkClient makePath: /collections/collection1/shards
   [junit4]   2> 435851 INFO  (TEST-TestSolrConfigHandlerCloud.test-seed#[64370980C7089CB8]) [    ] o.a.s.c.c.SolrZkClient makePath: /collections/control_collection
   [junit4]   2> 435851 INFO  (TEST-TestSolrConfigHandlerCloud.test-seed#[64370980C7089CB8]) [    ] o.a.s.c.c.SolrZkClient makePath: /collections/control_collection/shards
   [junit4]   2> 435852 INFO  (TEST-TestSolrConfigHandlerCloud.test-seed#[64370980C7089CB8]) [    ] o.a.s.c.AbstractZkTestCase put /home/jenkins/workspace/Lucene-Solr-5.5-Linux/solr/core/src/test-files/solr/collection1/conf/solrconfig-tlog.xml to /configs/conf1/solrconfig.xml
   [junit4]   2> 435852 INFO  (TEST-TestSolrConfigHandlerCloud.test-seed#[64370980C7089CB8]) [    ] o.a.s.c.c.SolrZkClient makePath: /configs/conf1/solrconfig.xml
   [junit4]   2> 435853 INFO  (TEST-TestSolrConfigHandlerCloud.test-seed#[64370980C7089CB8]) [    ] o.a.s.c.AbstractZkTestCase put /home/jenkins/workspace/Lucene-Solr-5.5-Linux/solr/core/src/test-files/solr/collection1/conf/schema.xml to /configs/conf1/schema.xml
   [junit4]   2> 435853 INFO  (TEST-TestSolrConfigHandlerCloud.test-seed#[64370980C7089CB8]) [    ] o.a.s.c.c.SolrZkClient makePath: /configs/conf1/schema.xml
   [junit4]   2> 435854 INFO  (TEST-TestSolrConfigHandlerCloud.test-seed#[64370980C7089CB8]) [    ] o.a.s.c.AbstractZkTestCase put /home/jenkins/workspace/Lucene-Solr-5.5-Linux/solr/core/src/test-files/solr/collection1/conf/solrconfig.snippet.randomindexconfig.xml to /configs/conf1/solrconfig.snippet.randomindexconfig.xml
   [junit4]   2> 435854 INFO  (TEST-TestSolrConfigHandlerCloud.test-seed#[64370980C7089CB8]) [    ] o.a.s.c.c.SolrZkClient makePath: /configs/conf1/solrconfig.snippet.randomindexconfig.xml
   [junit4]   2> 435854 INFO  (TEST-TestSolrConfigHandlerCloud.test-seed#[64370980C7089CB8]) [    ] o.a.s.c.AbstractZkTestCase put /home/jenkins/workspace/Lucene-Solr-5.5-Linux/solr/core/src/test-files/solr/collection1/conf/stopwords.txt to /configs/conf1/stopwords.txt
   [junit4]   2> 435855 INFO  (TEST-TestSolrConfigHandlerCloud.test-seed#[64370980C7089CB8]) [    ] o.a.s.c.c.SolrZkClient makePath: /configs/conf1/stopwords.txt
   [junit4]   2> 435855 INFO  (TEST-TestSolrConfigHandlerCloud.test-seed#[64370980C7089CB8]) [    ] o.a.s.c.AbstractZkTestCase put /home/jenkins/workspace/Lucene-Solr-5.5-Linux/solr/core/src/test-files/solr/collection1/conf/protwords.txt to /configs/conf1/protwords.txt
   [junit4]   2> 435855 INFO  (TEST-TestSolrConfigHandlerCloud.test-seed#[64370980C7089CB8]) [    ] o.a.s.c.c.SolrZkClient makePath: /configs/conf1/protwords.txt
   [junit4]   2> 435857 INFO  (TEST-TestSolrConfigHandlerCloud.test-seed#[64370980C7089CB8]) [    ] o.a.s.c.AbstractZkTestCase put /home/jenkins/workspace/Lucene-Solr-5.5-Linux/solr/core/src/test-files/solr/collection1/conf/currency.xml to /configs/conf1/currency.xml
   [junit4]   2> 435857 INFO  (TEST-TestSolrConfigHandlerCloud.test-seed#[64370980C7089CB8]) [    ] o.a.s.c.c.SolrZkClient makePath: /configs/conf1/currency.xml
   [junit4]   2> 435858 INFO  (TEST-TestSolrConfigHandlerCloud.test-seed#[64370980C7089CB8]) [    ] o.a.s.c.AbstractZkTestCase put /home/jenkins/workspace/Lucene-Solr-5.5-Linux/solr/core/src/test-files/solr/collection1/conf/enumsConfig.xml to /configs/conf1/enumsConfig.xml
   [junit4]   2> 435858 INFO  (TEST-TestSolrConfigHandlerCloud.test-seed#[64370980C7089CB8]) [    ] o.a.s.c.c.SolrZkClient makePath: /configs/conf1/enumsConfig.xml
   [junit4]   2> 435859 INFO  (TEST-TestSolrConfigHandlerCloud.test-seed#[64370980C7089CB8]) [    ] o.a.s.c.AbstractZkTestCase put /home/jenkins/workspace/Lucene-Solr-5.5-Linux/solr/core/src/test-files/solr/collection1/conf/open-exchange-rates.json to /configs/conf1/open-exchange-rates.json
   [junit4]   2> 435859 INFO  (TEST-TestSolrConfigHandlerCloud.test-seed#[64370980C7089CB8]) [    ] o.a.s.c.c.SolrZkClient makePath: /configs/conf1/open-exchange-rates.json
   [junit4]   2> 435859 INFO  (TEST-TestSolrConfigHandlerCloud.test-seed#[64370980C7089CB8]) [    ] o.a.s.c.AbstractZkTestCase put /home/jenkins/workspace/Lucene-Solr-5.5-Linux/solr/core/src/test-files/solr/collection1/conf/mapping-ISOLatin1Accent.txt to /configs/conf1/mapping-ISOLatin1Accent.txt
   [junit4]   2> 435859 INFO  (TEST-TestSolrConfigHandlerCloud.test-seed#[64370980C7089CB8]) [    ] o.a.s.c.c.SolrZkClient makePath: /configs/conf1/mapping-ISOLatin1Accent.txt
   [junit4]   2> 435860 INFO  (TEST-TestSolrConfigHandlerCloud.test-seed#[64370980C7089CB8]) [    ] o.a.s.c.AbstractZkTestCase put /home/jenkins/workspace/Lucene-Solr-5.5-Linux/solr/core/src/test-files/solr/collection1/conf/old_synonyms.txt to /configs/conf1/old_synonyms.txt
   [junit4]   2> 435860 INFO  (TEST-TestSolrConfigHandlerCloud.test-seed#[64370980C7089CB8]) [    ] o.a.s.c.c.SolrZkClient makePath: /configs/conf1/old_synonyms.txt
   [junit4]   2> 435861 INFO  (TEST-TestSolrConfigHandlerCloud.test-seed#[64370980C7089CB8]) [    ] o.a.s.c.AbstractZkTestCase put /home/jenkins/workspace/Lucene-Solr-5.5-Linux/solr/core/src/test-files/solr/collection1/conf/synonyms.txt to /configs/conf1/synonyms.txt
   [junit4]   2> 435861 INFO  (TEST-TestSolrConfigHandlerCloud.test-seed#[64370980C7089CB8]) [    ] o.a.s.c.c.SolrZkClient makePath: /configs/conf1/synonyms.txt
   [junit4]   2> 435933 INFO  (TEST-TestSolrConfigHandlerCloud.test-seed#[64370980C7089CB8]) [    ] o.a.s.SolrTestCaseJ4 Writing core.properties file to /home/jenkins/workspace/Lucene-Solr-5.5-Linux/solr/build/solr-core/test/J0/temp/solr.handler.TestSolrConfigHandlerCloud_64370980C7089CB8-001/control-001/cores/collection1
   [junit4]   2> 435934 INFO  (TEST-TestSolrConfigHandlerCloud.test-seed#[64370980C7089CB8]) [    ] o.e.j.s.Server jetty-9.2.13.v20150730
   [junit4]   2> 435935 INFO  (TEST-TestSolrConfigHandlerCloud.test-seed#[64370980C7089CB8]) [    ] o.e.j.s.h.ContextHandler Started o.e.j.s.ServletContextHandler@1dcaa12{/,null,AVAILABLE}
   [junit4]   2> 435935 INFO  (TEST-TestSolrConfigHandlerCloud.test-seed#[64370980C7089CB8]) [    ] o.e.j.s.ServerConnector Started ServerConnector@8ecdf5{HTTP/1.1}{127.0.0.1:46039}
   [junit4]   2> 435935 INFO  (TEST-TestSolrConfigHandlerCloud.test-seed#[64370980C7089CB8]) [    ] o.e.j.s.Server Started @437679ms
   [junit4]   2> 435935 INFO  (TEST-TestSolrConfigHandlerCloud.test-seed#[64370980C7089CB8]) [    ] o.a.s.c.s.e.JettySolrRunner Jetty properties: {solr.data.dir=/home/jenkins/workspace/Lucene-Solr-5.5-Linux/solr/build/solr-core/test/J0/temp/solr.handler.TestSolrConfigHandlerCloud_64370980C7089CB8-001/tempDir-001/control/data, hostContext=/, hostPort=46039, coreRootDirectory=/home/jenkins/workspace/Lucene-Solr-5.5-Linux/solr/build/solr-core/test/J0/../../../../../../../../../home/jenkins/workspace/Lucene-Solr-5.5-Linux/solr/build/solr-core/test/J0/temp/solr.handler.TestSolrConfigHandlerCloud_64370980C7089CB8-001/control-001/cores}
   [junit4]   2> 435935 INFO  (TEST-TestSolrConfigHandlerCloud.test-seed#[64370980C7089CB8]) [    ] o.a.s.s.SolrDispatchFilter SolrDispatchFilter.init(): sun.misc.Launcher$AppClassLoader@1d16e93
   [junit4]   2> 435936 INFO  (TEST-TestSolrConfigHandlerCloud.test-seed#[64370980C7089CB8]) [    ] o.a.s.c.SolrResourceLoader new SolrResourceLoader for directory: '/home/jenkins/workspace/Lucene-Solr-5.5-Linux/solr/build/solr-core/test/J0/temp/solr.handler.TestSolrConfigHandlerCloud_64370980C7089CB8-001/control-001'
   [junit4]   2> 435936 INFO  (TEST-TestSolrConfigHandlerCloud.test-seed#[64370980C7089CB8]) [    ] o.a.s.c.SolrResourceLoader JNDI not configured for solr (NoInitialContextEx)
   [junit4]   2> 435936 INFO  (TEST-TestSolrConfigHandlerCloud.test-seed#[64370980C7089CB8]) [    ] o.a.s.c.SolrResourceLoader solr home defaulted to 'solr/' (could not find system property or JNDI)
   [junit4]   2> 435936 INFO  (TEST-TestSolrConfigHandlerCloud.test-seed#[64370980C7089CB8]) [    ] o.a.s.c.c.SolrZkClient Using default ZkCredentialsProvider
   [junit4]   2> 435936 INFO  (TEST-TestSolrConfigHandlerCloud.test-seed#[64370980C7089CB8]) [    ] o.a.s.c.c.ConnectionManager Waiting for client to connect to ZooKeeper
   [junit4]   2> 435937 INFO  (zkCallback-464-thread-1) [    ] o.a.s.c.c.ConnectionManager Watcher org.apache.solr.common.cloud.ConnectionManager@6b8e67 name:ZooKeeperConnection Watcher:127.0.0.1:35061/solr got event WatchedEvent state:SyncConnected type:None path:null path:null type:None
   [junit4]   2> 435937 INFO  (TEST-TestSolrConfigHandlerCloud.test-seed#[64370980C7089CB8]) [    ] o.a.s.c.c.ConnectionManager Client is connected to ZooKeeper
   [junit4]   2> 435938 INFO  (TEST-TestSolrConfigHandlerCloud.test-seed#[64370980C7089CB8]) [    ] o.a.s.c.c.SolrZkClient Using default ZkACLProvider
   [junit4]   2> 435938 INFO  (TEST-TestSolrConfigHandlerCloud.test-seed#[64370980C7089CB8]) [    ] o.a.s.s.SolrDispatchFilter Loading solr.xml from SolrHome (not found in ZooKeeper)
   [junit4]   2> 435938 INFO  (TEST-TestSolrConfigHandlerCloud.test-seed#[64370980C7089CB8]) [    ] o.a.s.c.SolrXmlConfig Loading container configuration from /home/jenkins/workspace/Lucene-Solr-5.5-Linux/solr/build/solr-core/test/J0/temp/solr.handler.TestSolrConfigHandlerCloud_64370980C7089CB8-001/control-001/solr.xml
   [junit4]   2> 435942 INFO  (TEST-TestSolrConfigHandlerCloud.test-seed#[64370980C7089CB8]) [    ] o.a.s.c.CorePropertiesLocator Config-defined core root directory: /home/jenkins/workspace/Lucene-Solr-5.5-Linux/solr/build/solr-core/test/J0/../../../../../../../../../home/jenkins/workspace/Lucene-Solr-5.5-Linux/solr/build/solr-core/test/J0/temp/solr.handler.TestSolrConfigHandlerCloud_64370980C7089CB8-001/control-001/cores
   [junit4]   2> 435942 INFO  (TEST-TestSolrConfigHandlerCloud.test-seed#[64370980C7089CB8]) [    ] o.a.s.c.CoreContainer New CoreContainer 25629677
   [junit4]   2> 435942 INFO  (TEST-TestSolrConfigHandlerCloud.test-seed#[64370980C7089CB8]) [    ] o.a.s.c.CoreContainer Loading cores into CoreContainer [instanceDir=/home/jenkins/workspace/Lucene-Solr-5.5-Linux/solr/build/solr-core/test/J0/temp/solr.handler.TestSolrConfigHandlerCloud_64370980C7089CB8-001/control-001]
   [junit4]   2> 435943 WARN  (TEST-TestSolrConfigHandlerCloud.test-seed#[64370980C7089CB8]) [    ] o.a.s.c.CoreContainer Couldn't add files from /home/jenkins/workspace/Lucene-Solr-5.5-Linux/solr/build/solr-core/test/J0/temp/solr.handler.TestSolrConfigHandlerCloud_64370980C7089CB8-001/control-001/lib to classpath: /home/jenkins/workspace/Lucene-Solr-5.5-Linux/solr/build/solr-core/test/J0/temp/solr.handler.TestSolrConfigHandlerCloud_64370980C7089CB8-001/control-001/lib
   [junit4]   2> 435943 INFO  (TEST-TestSolrConfigHandlerCloud.test-seed#[64370980C7089CB8]) [    ] o.a.s.h.c.HttpShardHandlerFactory created with socketTimeout : 90000,urlScheme : ,connTimeout : 15000,maxConnectionsPerHost : 20,maxConnections : 10000,corePoolSize : 0,maximumPoolSize : 2147483647,maxThreadIdleTime : 5,sizeOfQueue : -1,fairnessPolicy : false,useRetries : false,connectionsEvictorSleepDelay : 5000,maxConnectionIdleTime : 40000,
   [junit4]   2> 435944 INFO  (TEST-TestSolrConfigHandlerCloud.test-seed#[64370980C7089CB8]) [    ] o.a.s.u.UpdateShardHandler Creating UpdateShardHandler HTTP client with params: socketTimeout=340000&connTimeout=45000&retry=true
   [junit4]   2> 435944 INFO  (TEST-TestSolrConfigHandlerCloud.test-seed#[64370980C7089CB8]) [    ] o.a.s.l.LogWatcher SLF4J impl is org.slf4j.impl.Log4jLoggerFactory
   [junit4]   2> 435944 INFO  (TEST-TestSolrConfigHandlerCloud.test-seed#[64370980C7089CB8]) [    ] o.a.s.l.LogWatcher Registering Log Listener [Log4j (org.slf4j.impl.Log4jLoggerFactory)]
   [junit4]   2> 435944 INFO  (TEST-TestSolrConfigHandlerCloud.test-seed#[64370980C7089CB8]) [    ] o.a.s.c.ZkContainer Zookeeper client=127.0.0.1:35061/solr
   [junit4]   2> 435944 INFO  (TEST-TestSolrConfigHandlerCloud.test-seed#[64370980C7089CB8]) [    ] o.a.s.c.ZkController zkHost includes chroot
   [junit4]   2> 435944 INFO  (TEST-TestSolrConfigHandlerCloud.test-seed#[64370980C7089CB8]) [    ] o.a.s.c.c.SolrZkClient Using default ZkCredentialsProvider
   [junit4]   2> 435944 INFO  (TEST-TestSolrConfigHandlerCloud.test-seed#[64370980C7089CB8]) [    ] o.a.s.c.c.ConnectionManager Waiting for client to connect to ZooKeeper
   [junit4]   2> 435946 INFO  (zkCallback-467-thread-1) [    ] o.a.s.c.c.ConnectionManager Watcher org.apache.solr.common.cloud.ConnectionManager@10c4caf name:ZooKeeperConnection Watcher:127.0.0.1:35061 got event WatchedEvent state:SyncConnected type:None path:null path:null type:None
   [junit4]   2> 435946 INFO  (TEST-TestSolrConfigHandlerCloud.test-seed#[64370980C7089CB8]) [    ] o.a.s.c.c.ConnectionManager Client is connected to ZooKeeper
   [junit4]   2> 435946 INFO  (TEST-TestSolrConfigHandlerCloud.test-seed#[64370980C7089CB8]) [    ] o.a.s.c.c.SolrZkClient Using default ZkACLProvider
   [junit4]   2> 435947 INFO  (TEST-TestSolrConfigHandlerCloud.test-seed#[64370980C7089CB8]) [n:127.0.0.1:46039_    ] o.a.s.c.ZkController Added new OnReconnect listener org.apache.solr.cloud.ZkController$6@a23a08
   [junit4]   2> 435947 INFO  (TEST-TestSolrConfigHandlerCloud.test-seed#[64370980C7089CB8]) [n:127.0.0.1:46039_    ] o.a.s.c.c.ConnectionManager Waiting for client to connect to ZooKeeper
   [junit4]   2> 435948 INFO  (zkCallback-468-thread-1-processing-n:127.0.0.1:46039_) [n:127.0.0.1:46039_    ] o.a.s.c.c.ConnectionManager Watcher org.apache.solr.common.cloud.ConnectionManager@18a9204 name:ZooKeeperConnection Watcher:127.0.0.1:35061/solr got event WatchedEvent state:SyncConnected type:None path:null path:null type:None
   [junit4]   2> 435948 INFO  (TEST-TestSolrConfigHandlerCloud.test-seed#[64370980C7089CB8]) [n:127.0.0.1:46039_    ] o.a.s.c.c.ConnectionManager Client is connected to ZooKeeper
   [junit4]   2> 435950 INFO  (TEST-TestSolrConfigHandlerCloud.test-seed#[64370980C7089CB8]) [n:127.0.0.1:46039_    ] o.a.s.c.c.SolrZkClient makePath: /overseer/queue
   [junit4]   2> 435951 INFO  (TEST-TestSolrConfigHandlerCloud.test-seed#[64370980C7089CB8]) [n:127.0.0.1:46039_    ] o.a.s.c.c.SolrZkClient makePath: /overseer/collection-queue-work
   [junit4]   2> 435954 INFO  (TEST-TestSolrConfigHandlerCloud.test-seed#[64370980C7089CB8]) [n:127.0.0.1:46039_    ] o.a.s.c.c.SolrZkClient makePath: /overseer/collection-map-running
   [junit4]   2> 435954 INFO  (TEST-TestSolrConfigHandlerCloud.test-seed#[64370980C7089CB8]) [n:127.0.0.1:46039_    ] o.a.s.c.c.SolrZkClient makePath: /overseer/collection-map-completed
   [junit4]   2> 435955 INFO  (TEST-TestSolrConfigHandlerCloud.test-seed#[64370980C7089CB8]) [n:127.0.0.1:46039_    ] o.a.s.c.c.SolrZkClient makePath: /overseer/collection-map-failure
   [junit4]   2> 435955 INFO  (TEST-TestSolrConfigHandlerCloud.test-seed#[64370980C7089CB8]) [n:127.0.0.1:46039_    ] o.a.s.c.c.SolrZkClient makePath: /live_nodes
   [junit4]   2> 435956 INFO  (TEST-TestSolrConfigHandlerCloud.test-seed#[64370980C7089CB8]) [n:127.0.0.1:46039_    ] o.a.s.c.c.SolrZkClient makePath: /aliases.json
   [junit4]   2> 435956 INFO  (TEST-TestSolrConfigHandlerCloud.test-seed#[64370980C7089CB8]) [n:127.0.0.1:46039_    ] o.a.s.c.c.SolrZkClient makePath: /clusterstate.json
   [junit4]   2> 435957 INFO  (TEST-TestSolrConfigHandlerCloud.test-seed#[64370980C7089CB8]) [n:127.0.0.1:46039_    ] o.a.s.c.c.SolrZkClient makePath: /security.json
   [junit4]   2> 435957 INFO  (TEST-TestSolrConfigHandlerCloud.test-seed#[64370980C7089CB8]) [n:127.0.0.1:46039_    ] o.a.s.c.ZkController Register node as live in ZooKeeper:/live_nodes/127.0.0.1:46039_
   [junit4]   2> 435957 INFO  (TEST-TestSolrConfigHandlerCloud.test-seed#[64370980C7089CB8]) [n:127.0.0.1:46039_    ] o.a.s.c.c.SolrZkClient makePath: /live_nodes/127.0.0.1:46039_
   [junit4]   2> 435958 INFO  (TEST-TestSolrConfigHandlerCloud.test-seed#[64370980C7089CB8]) [n:127.0.0.1:46039_    ] o.a.s.c.c.SolrZkClient makePath: /overseer_elect
   [junit4]   2> 435958 INFO  (TEST-TestSolrConfigHandlerCloud.test-seed#[64370980C7089CB8]) [n:127.0.0.1:46039_    ] o.a.s.c.c.SolrZkClient makePath: /overseer_elect/election
   [junit4]   2> 435959 INFO  (TEST-TestSolrConfigHandlerCloud.test-seed#[64370980C7089CB8]) [n:127.0.0.1:46039_    ] o.a.s.c.Overseer Overseer (id=null) closing
   [junit4]   2> 435959 INFO  (TEST-TestSolrConfigHandlerCloud.test-seed#[64370980C7089CB8]) [n:127.0.0.1:46039_    ] o.a.s.c.LeaderElector Joined leadership election with path: /overseer_elect/election/96581376424083460-127.0.0.1:46039_-n_0000000000
   [junit4]   2> 435959 INFO  (TEST-TestSolrConfigHandlerCloud.test-seed#[64370980C7089CB8]) [n:127.0.0.1:46039_    ] o.a.s.c.OverseerElectionContext I am going to be the leader 127.0.0.1:46039_
   [junit4]   2> 435959 INFO  (TEST-TestSolrConfigHandlerCloud.test-seed#[64370980C7089CB8]) [n:127.0.0.1:46039_    ] o.a.s.c.c.SolrZkClient makePath: /overseer_elect/leader
   [junit4]   2> 435960 INFO  (TEST-TestSolrConfigHandlerCloud.test-seed#[64370980C7089CB8]) [n:127.0.0.1:46039_    ] o.a.s.c.Overseer Overseer (id=96581376424083460-127.0.0.1:46039_-n_0000000000) starting
   [junit4]   2> 435960 INFO  (TEST-TestSolrConfigHandlerCloud.test-seed#[64370980C7089CB8]) [n:127.0.0.1:46039_    ] o.a.s.c.c.SolrZkClient makePath: /overseer/queue-work
   [junit4]   2> 435962 INFO  (TEST-TestSolrConfigHandlerCloud.test-seed#[64370980C7089CB8]) [n:127.0.0.1:46039_    ] o.a.s.c.OverseerAutoReplicaFailoverThread Starting OverseerAutoReplicaFailoverThread autoReplicaFailoverWorkLoopDelay=10000 autoReplicaFailoverWaitAfterExpiration=30000 autoReplicaFailoverBadNodeExpiration=60000
   [junit4]   2> 435962 INFO  (OverseerCollectionConfigSetProcessor-96581376424083460-127.0.0.1:46039_-n_0000000000) [n:127.0.0.1:46039_    ] o.a.s.c.OverseerTaskProcessor Process current queue of overseer operations
   [junit4]   2> 435962 INFO  (TEST-TestSolrConfigHandlerCloud.test-seed#[64370980C7089CB8]) [n:127.0.0.1:46039_    ] o.a.s.c.c.ZkStateReader Updating cluster state from ZooKeeper... 
   [junit4]   2> 435962 INFO  (OverseerStateUpdate-96581376424083460-127.0.0.1:46039_-n_0000000000) [n:127.0.0.1:46039_    ] o.a.s.c.Overseer Starting to work on the main queue
   [junit4]   2> 435987 INFO  (TEST-TestSolrConfigHandlerCloud.test-seed#[64370980C7089CB8]) [n:127.0.0.1:46039_    ] o.a.s.c.CoreContainer Security conf doesn't exist. Skipping setup for authorization module.
   [junit4]   2> 435987 INFO  (TEST-TestSolrConfigHandlerCloud.test-seed#[64370980C7089CB8]) [n:127.0.0.1:46039_    ] o.a.s.c.CoreContainer No authentication plugin used.
   [junit4]   2> 435988 INFO  (TEST-TestSolrConfigHandlerCloud.test-seed#[64370980C7089CB8]) [n:127.0.0.1:46039_    ] o.a.s.c.CorePropertiesLocator Looking for core definitions underneath /home/jenkins/workspace/Lucene-Solr-5.5-Linux/solr/build/solr-core/test/J0/../../../../../../../../../home/jenkins/workspace/Lucene-Solr-5.5-Linux/solr/build/solr-core/test/J0/temp/solr.handler.TestSolrConfigHandlerCloud_64370980C7089CB8-001/control-001/cores
   [junit4]   2> 435989 INFO  (TEST-TestSolrConfigHandlerCloud.test-seed#[64370980C7089CB8]) [n:127.0.0.1:46039_    ] o.a.s.c.CoreDescriptor Created CoreDescriptor: {name=collection1, config=solrconfig.xml, transient=false, schema=schema.xml, loadOnStartup=true, configSetProperties=configsetprops.json, collection=control_collection, coreNodeName=, dataDir=data/, shard=}
   [junit4]   2> 435989 INFO  (TEST-TestSolrConfigHandlerCloud.test-seed#[64370980C7089CB8]) [n:127.0.0.1:46039_    ] o.a.s.c.CorePropertiesLocator Found core collection1 in /home/jenkins/workspace/Lucene-Solr-5.5-Linux/solr/build/solr-core/test/J0/../../../../../../../../../home/jenkins/workspace/Lucene-Solr-5.5-Linux/solr/build/solr-core/test/J0/temp/solr.handler.TestSolrConfigHandlerCloud_64370980C7089CB8-001/control-001/cores/collection1
   [junit4]   2> 435989 INFO  (TEST-TestSolrConfigHandlerCloud.test-seed#[64370980C7089CB8]) [n:127.0.0.1:46039_    ] o.a.s.c.CorePropertiesLocator Found 1 core definitions
   [junit4]   2> 435990 INFO  (TEST-TestSolrConfigHandlerCloud.test-seed#[64370980C7089CB8]) [n:127.0.0.1:46039_    ] o.a.s.s.SolrDispatchFilter user.dir=/home/jenkins/workspace/Lucene-Solr-5.5-Linux/solr/build/solr-core/test/J0
   [junit4]   2> 435990 INFO  (TEST-TestSolrConfigHandlerCloud.test-seed#[64370980C7089CB8]) [n:127.0.0.1:46039_    ] o.a.s.s.SolrDispatchFilter SolrDispatchFilter.init() done
   [junit4]   2> 435990 INFO  (coreLoadExecutor-2478-thread-1-processing-n:127.0.0.1:46039_) [n:127.0.0.1:46039_ c:control_collection   x:collection1] o.a.s.c.ZkController publishing state=down
   [junit4]   2> 435990 INFO  (coreLoadExecutor-2478-thread-1-processing-n:127.0.0.1:46039_) [n:127.0.0.1:46039_ c:control_collection   x:collection1] o.a.s.c.ZkController numShards not found on descriptor - reading it from system property
   [junit4]   2> 435991 INFO  (OverseerStateUpdate-96581376424083460-127.0.0.1:46039_-n_0000000000) [n:127.0.0.1:46039_    ] o.a.s.c.Overseer processMessage: queueSize: 1, message = {
   [junit4]   2>   "core":"collection1",
   [junit4]   2>   "roles":null,
   [junit4]   2>   "base_url":"http://127.0.0.1:46039",
   [junit4]   2>   "node_name":"127.0.0.1:46039_",
   [junit4]   2>   "numShards":"1",
   [junit4]   2>   "state":"down",
   [junit4]   2>   "shard":null,
   [junit4]   2>   "collection":"control_collection",
   [junit4]   2>   "operation":"state"} current state version: 0
   [junit4]   2> 435991 INFO  (coreLoadExecutor-2478-thread-1-processing-n:127.0.0.1:46039_) [n:127.0.0.1:46039_ c:control_collection   x:collection1] o.a.s.c.ZkController Collection control_collection not visible yet, but flagging it so a watch is registered when it becomes visible
   [junit4]   2> 435991 INFO  (coreLoadExecutor-2478-thread-1-processing-n:127.0.0.1:46039_) [n:127.0.0.1:46039_ c:control_collection   x:collection1] o.a.s.c.c.ZkStateReader addZkWatch [control_collection]
   [junit4]   2> 435991 INFO  (OverseerStateUpdate-96581376424083460-127.0.0.1:46039_-n_0000000000) [n:127.0.0.1:46039_    ] o.a.s.c.o.ReplicaMutator Update state numShards=1 message={
   [junit4]   2>   "core":"collection1",
   [junit4]   2>   "roles":null,
   [junit4]   2>   "base_url":"http://127.0.0.1:46039",
   [junit4]   2>   "node_name":"127.0.0.1:46039_",
   [junit4]   2>   "numShards":"1",
   [junit4]   2>   "state":"down",
   [junit4]   2>   "shard":null,
   [junit4]   2>   "collection":"control_collection",
   [junit4]   2>   "operation":"state"}
   [junit4]   2> 435991 INFO  (coreLoadExecutor-2478-thread-1-processing-n:127.0.0.1:46039_) [n:127.0.0.1:46039_ c:control_collection   x:collection1] o.a.s.c.c.ZkStateReader Deleting data for [control_collection]
   [junit4]   2> 435991 INFO  (OverseerStateUpdate-96581376424083460-127.0.0.1:46039_-n_0000000000) [n:127.0.0.1:46039_    ] o.a.s.c.o.ClusterStateMutator building a new cName: control_collection
   [junit4]   2> 435992 INFO  (OverseerStateUpdate-96581376424083460-127.0.0.1:46039_-n_0000000000) [n:127.0.0.1:46039_    ] o.a.s.c.o.ReplicaMutator Assigning new node to shard shard=shard1
   [junit4]   2> 435992 INFO  (coreLoadExecutor-2478-thread-1-processing-n:127.0.0.1:46039_) [n:127.0.0.1:46039_ c:control_collection   x:collection1] o.a.s.c.ZkController look for our core node name
   [junit4]   2> 435992 INFO  (zkCallback-468-thread-1-processing-n:127.0.0.1:46039_) [n:127.0.0.1:46039_    ] o.a.s.c.c.ZkStateReader A cluster state change: [WatchedEvent state:SyncConnected type:NodeDataChanged path:/clusterstate.json], has occurred - updating... (live nodes size: [1])
   [junit4]   2> 436992 INFO  (coreLoadExecutor-2478-thread-1-processing-n:127.0.0.1:46039_) [n:127.0.0.1:46039_ c:control_collection   x:collection1] o.a.s.c.ZkController waiting to find shard id in clusterstate for collection1
   [junit4]   2> 436992 INFO  (coreLoadExecutor-2478-thread-1-processing-n:127.0.0.1:46039_) [n:127.0.0.1:46039_ c:control_collection   x:collection1] o.a.s.c.ZkController Check for collection zkNode:control_collection
   [junit4]   2> 436993 INFO  (coreLoadExecutor-2478-thread-1-processing-n:127.0.0.1:46039_) [n:127.0.0.1:46039_ c:control_collection   x:collection1] o.a.s.c.ZkController Collection zkNode exists
   [junit4]   2> 436993 INFO  (coreLoadExecutor-2478-thread-1-processing-n:127.0.0.1:46039_) [n:127.0.0.1:46039_ c:control_collection   x:collection1] o.a.s.c.c.ZkStateReader Load collection config from: [/collections/control_collection]
   [junit4]   2> 436993 INFO  (coreLoadExecutor-2478-thread-1-processing-n:127.0.0.1:46039_) [n:127.0.0.1:46039_ c:control_collection   x:collection1] o.a.s.c.c.ZkStateReader path=[/collections/control_collection] [configName]=[conf1] specified config exists in ZooKeeper
   [junit4]   2> 436993 INFO  (coreLoadExecutor-2478-thread-1-processing-n:127.0.0.1:46039_) [n:127.0.0.1:46039_ c:control_collection   x:collection1] o.a.s.c.SolrResourceLoader new SolrResourceLoader for directory: '/home/jenkins/workspace/Lucene-Solr-5.5-Linux/solr/build/solr-core/test/J0/temp/solr.handler.TestSolrConfigHandlerCloud_64370980C7089CB8-001/control-001/cores/collection1'
   [junit4]   2> 436993 INFO  (coreLoadExecutor-2478-thread-1-processing-n:127.0.0.1:46039_) [n:127.0.0.1:46039_ c:control_collection   x:collection1] o.a.s.c.SolrResourceLoader JNDI not configured for solr (NoInitialContextEx)
   [junit4]   2> 436993 INFO  (coreLoadExecutor-2478-thread-1-processing-n:127.0.0.1:46039_) [n:127.0.0.1:46039_ c:control_collection   x:collection1] o.a.s.c.SolrResourceLoader solr home defaulted to 'solr/' (could not find system property or JNDI)
   [junit4]   2> 436994 INFO  (coreLoadExecutor-2478-thread-1-processing-n:127.0.0.1:46039_) [n:127.0.0.1:46039_ c:control_collection   x:collection1] o.a.s.c.Config loaded config solrconfig.xml with version 0 
   [junit4]   2> 436998 INFO  (coreLoadExecutor-2478-thread-1-processing-n:127.0.0.1:46039_) [n:127.0.0.1:46039_ c:control_collection   x:collection1] o.a.s.c.SolrConfig current version of requestparams : -1
   [junit4]   2> 437001 WARN  (coreLoadExecutor-2478-thread-1-processing-n:127.0.0.1:46039_) [n:127.0.0.1:46039_ c:control_collection   x:collection1] o.a.s.c.Config Beginning with Solr 5.5, <mergePolicy> is deprecated, use <mergePolicyFactory> instead.
   [junit4]   2> 437002 INFO  (coreLoadExecutor-2478-thread-1-processing-n:127.0.0.1:46039_) [n:127.0.0.1:46039_ c:control_collection   x:collection1] o.a.s.c.SolrConfig Using Lucene MatchVersion: 5.5.4
   [junit4]   2> 437013 INFO  (coreLoadExecutor-2478-thread-1-processing-n:127.0.0.1:46039_) [n:127.0.0.1:46039_ c:control_collection   x:collection1] o.a.s.c.SolrConfig Loaded SolrConfig: solrconfig.xml
   [junit4]   2> 437017 INFO  (coreLoadExecutor-2478-thread-1-processing-n:127.0.0.1:46039_) [n:127.0.0.1:46039_ c:control_collection   x:collection1] o.a.s.s.IndexSchema [collection1] Schema name=test
   [junit4]   2> 437134 INFO  (coreLoadExecutor-2478-thread-1-processing-n:127.0.0.1:46039_) [n:127.0.0.1:46039_ c:control_collection   x:collection1] o.a.s.s.OpenExchangeRatesOrgProvider Initialized with rates=open-exchange-rates.json, refreshInterval=1440.
   [junit4]   2> 437138 INFO  (coreLoadExecutor-2478-thread-1-processing-n:127.0.0.1:46039_) [n:127.0.0.1:46039_ c:control_collection   x:collection1] o.a.s.s.IndexSchema default search field in schema is text
   [junit4]   2> 437139 INFO  (coreLoadExecutor-2478-thread-1-processing-n:127.0.0.1:46039_) [n:127.0.0.1:46039_ c:control_collection   x:collection1] o.a.s.s.IndexSchema unique key field: id
   [junit4]   2> 437144 INFO  (coreLoadExecutor-2478-thread-1-processing-n:127.0.0.1:46039_) [n:127.0.0.1:46039_ c:control_collection   x:collection1] o.a.s.s.FileExchangeRateProvider Reloading exchange rates from file currency.xml
   [junit4]   2> 437145 INFO  (coreLoadExecutor-2478-thread-1-processing-n:127.0.0.1:46039_) [n:127.0.0.1:46039_ c:control_collection   x:collection1] o.a.s.s.FileExchangeRateProvider Reloading exchange rates from file currency.xml
   [junit4]   2> 437146 INFO  (coreLoadExecutor-2478-thread-1-processing-n:127.0.0.1:46039_) [n:127.0.0.1:46039_ c:control_collection   x:collection1] o.a.s.s.OpenExchangeRatesOrgProvider Reloading exchange rates from open-exchange-rates.json
   [junit4]   2> 437147 INFO  (coreLoadExecutor-2478-thread-1-processing-n:127.0.0.1:46039_) [n:127.0.0.1:46039_ c:control_collection   x:collection1] o.a.s.s.OpenExchangeRatesOrgProvider Reloading exchange rates from open-exchange-rates.json
   [junit4]   2> 437148 INFO  (coreLoadExecutor-2478-thread-1-processing-n:127.0.0.1:46039_) [n:127.0.0.1:46039_ c:control_collection   x:collection1] o.a.s.c.ConfigSetProperties Did not find ConfigSet properties, assuming default properties: Can't find resource 'configsetprops.json' in classpath or '/configs/conf1', cwd=/home/jenkins/workspace/Lucene-Solr-5.5-Linux/solr/build/solr-core/test/J0
   [junit4]   2> 437148 INFO  (coreLoadExecutor-2478-thread-1-processing-n:127.0.0.1:46039_) [n:127.0.0.1:46039_ c:control_collection   x:collection1] o.a.s.c.CoreContainer Creating SolrCore 'collection1' using configuration from collection control_collection
   [junit4]   2> 437148 INFO  (coreLoadExecutor-2478-thread-1-processing-n:127.0.0.1:46039_) [n:127.0.0.1:46039_ c:control_collection s:shard1 r:core_node1 x:collection1] o.a.s.c.SolrCore org.apache.solr.core.MockDirectoryFactory
   [junit4]   2> 437148 INFO  (coreLoadExecutor-2478-thread-1-processing-n:127.0.0.1:46039_) [n:127.0.0.1:46039_ c:control_collection s:shard1 r:core_node1 x:collection1] o.a.s.c.SolrCore [[collection1] ] Opening new SolrCore at [/home/jenkins/workspace/Lucene-Solr-5.5-Linux/solr/build/solr-core/test/J0/temp/solr.handler.TestSolrConfigHandlerCloud_64370980C7089CB8-001/control-001/cores/collection1], dataDir=[/home/jenkins/workspace/Lucene-Solr-5.5-Linux/solr/build/solr-core/test/J0/../../../../../../../../../home/jenkins/workspace/Lucene-Solr-5.5-Linux/solr/build/solr-core/test/J0/temp/solr.handler.TestSolrConfigHandlerCloud_64370980C7089CB8-001/control-001/cores/collection1/data/]
   [junit4]   2> 437148 INFO  (coreLoadExecutor-2478-thread-1-processing-n:127.0.0.1:46039_) [n:127.0.0.1:46039_ c:control_collection s:shard1 r:core_node1 x:collection1] o.a.s.c.JmxMonitoredMap JMX monitoring is enabled. Adding Solr mbeans to JMX Server: com.sun.jmx.mbeanserver.JmxMBeanServer@16e7d1f
   [junit4]   2> 437149 INFO  (coreLoadExecutor-2478-thread-1-processing-n:127.0.0.1:46039_) [n:127.0.0.1:46039_ c:control_collection s:shard1 r:core_node1 x:collection1] o.a.s.c.CachingDirectoryFactory return new directory for /home/jenkins/workspace/Lucene-Solr-5.5-Linux/solr/build/solr-core/test/J0/../../../../../../../../../home/jenkins/workspace/Lucene-Solr-5.5-Linux/solr/build/solr-core/test/J0/temp/solr.handler.TestSolrConfigHandlerCloud_64370980C7089CB8-001/control-001/cores/collection1/data
   [junit4]   2> 437149 INFO  (coreLoadExecutor-2478-thread-1-processing-n:127.0.0.1:46039_) [n:127.0.0.1:46039_ c:control_collection s:shard1 r:core_node1 x:collection1] o.a.s.c.SolrCore New index directory detected: old=null new=/home/jenkins/workspace/Lucene-Solr-5.5-Linux/solr/build/solr-core/test/J0/../../../../../../../../../home/jenkins/workspace/Lucene-Solr-5.5-Linux/solr/build/solr-core/test/J0/temp/solr.handler.TestSolrConfigHandlerCloud_64370980C7089CB8-001/control-001/cores/collection1/data/index/
   [junit4]   2> 437149 WARN  (coreLoadExecutor-2478-thread-1-processing-n:127.0.0.1:46039_) [n:127.0.0.1:46039_ c:control_collection s:shard1 r:core_node1 x:collection1] o.a.s.c.SolrCore [collection1] Solr index directory '/home/jenkins/workspace/Lucene-Solr-5.5-Linux/solr/build/solr-core/test/J0/../../../../../../../../../home/jenkins/workspace/Lucene-Solr-5.5-Linux/solr/build/solr-core/test/J0/temp/solr.handler.TestSolrConfigHandlerCloud_64370980C7089CB8-001/control-001/cores/collection1/data/index' doesn't exist. Creating new index...
   [junit4]   2> 437149 INFO  (coreLoadExecutor-2478-thread-1-processing-n:127.0.0.1:46039_) [n:127.0.0.1:46039_ c:control_collection s:shard1 r:core_node1 x:collection1] o.a.s.c.CachingDirectoryFactory return new directory for /home/jenkins/workspace/Lucene-Solr-5.5-Linux/solr/build/solr-core/test/J0/../../../../../../../../../home/jenkins/workspace/Lucene-Solr-5.5-Linux/solr/build/solr-core/test/J0/temp/solr.handler.TestSolrConfigHandlerCloud_64370980C7089CB8-001/control-001/cores/collection1/data/index
   [junit4]   2> 437149 INFO  (coreLoadExecutor-2478-thread-1-processing-n:127.0.0.1:46039_) [n:127.0.0.1:46039_ c:control_collection s:shard1 r:core_node1 x:collection1] o.a.s.u.RandomMergePolicy RandomMergePolicy wrapping class org.apache.lucene.index.LogByteSizeMergePolicy: [LogByteSizeMergePolicy: minMergeSize=1677721, mergeFactor=29, maxMergeSize=2147483648, maxMergeSizeForForcedMerge=9223372036854775807, calibrateSizeByDeletes=false, maxMergeDocs=2147483647, maxCFSSegmentSizeMB=8.796093022207999E12, noCFSRatio=1.0]
   [junit4]   2> 437149 INFO  (coreLoadExecutor-2478-thread-1-processing-n:127.0.0.1:46039_) [n:127.0.0.1:46039_ c:control_collection s:shard1 r:core_node1 x:collection1] o.a.s.c.SolrDeletionPolicy SolrDeletionPolicy.onCommit: commits: num=1
   [junit4]   2> 	commit{dir=MockDirectoryWrapper(RAMDirectory@66020 lockFactory=org.apache.lucene.store.SingleInstanceLockFactory@106bf45),segFN=segments_1,generation=1}
   [junit4]   2> 437149 INFO  (coreLoadExecutor-2478-thread-1-processing-n:127.0.0.1:46039_) [n:127.0.0.1:46039_ c:control_collection s:shard1 r:core_node1 x:collection1] o.a.s.c.SolrDeletionPolicy newest commit generation = 1
   [junit4]   2> 437150 INFO  (OldIndexDirectoryCleanupThreadForCore-collection1) [n:127.0.0.1:46039_ c:control_collection s:shard1 r:core_node1 x:collection1] o.a.s.c.SolrCore Looking for old index directories to cleanup for core collection1 in /home/jenkins/workspace/Lucene-Solr-5.5-Linux/solr/build/solr-core/test/J0/../../../../../../../../../home/jenkins/workspace/Lucene-Solr-5.5-Linux/solr/build/solr-core/test/J0/temp/solr.handler.TestSolrConfigHandlerCloud_64370980C7089CB8-001/control-001/cores/collection1/data/
   [junit4]   2> 437150 WARN  (OldIndexDirectoryCleanupThreadForCore-collection1) [n:127.0.0.1:46039_ c:control_collection s:shard1 r:core_node1 x:collection1] o.a.s.c.DirectoryFactory /home/jenkins/workspace/Lucene-Solr-5.5-Linux/solr/build/solr-core/test/J0/../../../../../../../../../home/jenkins/workspace/Lucene-Solr-5.5-Linux/solr/build/solr-core/test/J0/temp/solr.handler.TestSolrConfigHandlerCloud_64370980C7089CB8-001/control-001/cores/collection1/data/ does not point to a valid data directory; skipping clean-up of old index directories.
   [junit4]   2> 437151 INFO  (coreLoadExecutor-2478-thread-1-processing-n:127.0.0.1:46039_) [n:127.0.0.1:46039_ c:control_collection s:shard1 r:core_node1 x:collection1] o.a.s.u.p.UpdateRequestProcessorChain creating updateRequestProcessorChain "nodistrib"
   [junit4]   2> 437151 INFO  (coreLoadExecutor-2478-thread-1-processing-n:127.0.0.1:46039_) [n:127.0.0.1:46039_ c:control_collection s:shard1 r:core_node1 x:collection1] o.a.s.u.p.UpdateRequestProcessorChain creating updateRequestProcessorChain "dedupe"
   [junit4]   2> 437152 INFO  (coreLoadExecutor-2478-thread-1-processing-n:127.0.0.1:46039_) [n:127.0.0.1:46039_ c:control_collection s:shard1 r:core_node1 x:collection1] o.a.s.u.p.UpdateRequestProcessorChain inserting DistributedUpdateProcessorFactory into updateRequestProcessorChain "dedupe"
   [junit4]   2> 437152 INFO  (coreLoadExecutor-2478-thread-1-processing-n:127.0.0.1:46039_) [n:127.0.0.1:46039_ c:control_collection s:shard1 r:core_node1 x:collection1] o.a.s.u.p.UpdateRequestProcessorChain creating updateRequestProcessorChain "stored_sig"
   [junit4]   2> 437152 INFO  (coreLoadExecutor-2478-thread-1-processing-n:127.0.0.1:46039_) [n:127.0.0.1:46039_ c:control_collection s:shard1 r:core_node1 x:collection1] o.a.s.u.p.UpdateRequestProcessorChain inserting DistributedUpdateProcessorFactory into updateRequestProcessorChain "stored_sig"
   [junit4]   2> 437152 INFO  (coreLoadExecutor-2478-thread-1-processing-n:127.0.0.1:46039_) [n:127.0.0.1:46039_ c:control_collection s:shard1 r:core_node1 x:collection1] o.a.s.u.p.UpdateRequestProcessorChain creating updateRequestProcessorChain "distrib-dup-test-chain-explicit"
   [junit4]   2> 437152 INFO  (coreLoadExecutor-2478-thread-1-processing-n:127.0.0.1:46039_) [n:127.0.0.1:46039_ c:control_collection s:shard1 r:core_node1 x:collection1] o.a.s.u.p.UpdateRequestProcessorChain creating updateRequestProcessorChain "distrib-dup-test-chain-implicit"
   [junit4]   2> 437152 INFO  (coreLoadExecutor-2478-thread-1-processing-n:127.0.0.1:46039_) [n:127.0.0.1:46039_ c:control_collection s:shard1 r:core_node1 x:collection1] o.a.s.u.p.UpdateRequestProcessorChain inserting DistributedUpdateProcessorFactory into updateRequestProcessorChain "distrib-dup-test-chain-implicit"
   [junit4]   2> 437153 INFO  (coreLoadExecutor-2478-thread-1-processing-n:127.0.0.1:46039_) [n:127.0.0.1:46039_ c:control_collection s:shard1 r:core_node1 x:collection1] o.a.s.c.SolrCore no updateRequestProcessorChain defined as default, creating implicit default
   [junit4]   2> 437153 WARN  (coreLoadExecutor-2478-thread-1-processing-n:127.0.0.1:46039_) [n:127.0.0.1:46039_ c:control_collection s:shard1 r:core_node1 x:collection1] o.a.s.c.RequestHandlers INVALID paramSet a in requestHandler {type = requestHandler,name = /dump,class = DumpRequestHandler,args = {defaults={a=A,b=B}}}
   [junit4]   2> 437154 INFO  (coreLoadExecutor-2478-thread-1-processing-n:127.0.0.1:46039_) [n:127.0.0.1:46039_ c:control_collection s:shard1 r:core_node1 x:collection1] o.a.s.h.l.XMLLoader xsltCacheLifetimeSeconds=60
   [junit4]   2> 437155 INFO  (coreLoadExecutor-2478-thread-1-processing-n:127.0.0.1:46039_) [n:127.0.0.1:46039_ c:control_collection s:shard1 r:core_node1 x:collection1] o.a.s.h.l.XMLLoader xsltCacheLifetimeSeconds=60
   [junit4]   2> 437155 INFO  (coreLoadExecutor-2478-thread-1-processing-n:127.0.0.1:46039_) [n:127.0.0.1:46039_ c:control_collection s:shard1 r:core_node1 x:collection1] o.a.s.h.l.XMLLoader xsltCacheLifetimeSeconds=60
   [junit4]   2> 437156 INFO  (coreLoadExecutor-2478-thread-1-processing-n:127.0.0.1:46039_) [n:127.0.0.1:46039_ c:control_collection s:shard1 r:core_node1 x:collection1] o.a.s.h.l.XMLLoader xsltCacheLifetimeSeconds=60
   [junit4]   2> 437157 INFO  (coreLoadExecutor-2478-thread-1-processing-n:127.0.0.1:46039_) [n:127.0.0.1:46039_ c:control_collection s:shard1 r:core_node1 x:collection1] o.a.s.c.RequestHandlers Registered paths: /admin/mbeans,standard,/dump,/update/csv,/update/json/docs,/admin/luke,/admin/segments,/get,/admin/system,/replication,/admin/properties,/config,/schema,/admin/plugins,/admin/logging,/update/json,/admin/threads,/admin/ping,/update,/admin/file
   [junit4]   2> 437158 INFO  (coreLoadExecutor-2478-thread-1-processing-n:127.0.0.1:46039_) [n:127.0.0.1:46039_ c:control_collection s:shard1 r:core_node1 x:collection1] o.a.s.c.SolrCore Using default statsCache cache: org.apache.solr.search.stats.LocalStatsCache
   [junit4]   2> 437158 INFO  (coreLoadExecutor-2478-thread-1-processing-n:127.0.0.1:46039_) [n:127.0.0.1:46039_ c:control_collection s:shard1 r:core_node1 x:collection1] o.a.s.u.UpdateHandler Using UpdateLog implementation: org.apache.solr.update.UpdateLog
   [junit4]   2> 437158 INFO  (coreLoadExecutor-2478-thread-1-processing-n:127.0.0.1:46039_) [n:127.0.0.1:46039_ c:control_collection s:shard1 r:core_node1 x:collection1] o.a.s.u.UpdateLog Initializing UpdateLog: dataDir= defaultSyncLevel=FLUSH numRecordsToKeep=100 maxNumLogsToKeep=10 numVersionBuckets=65536
   [junit4]   2> 437159 INFO  (coreLoadExecutor-2478-thread-1-processing-n:127.0.0.1:46039_) [n:127.0.0.1:46039_ c:control_collection s:shard1 r:core_node1 x:collection1] o.a.s.u.CommitTracker Hard AutoCommit: disabled
   [junit4]   2> 437159 INFO  (coreLoadExecutor-2478-thread-1-processing-n:127.0.0.1:46039_) [n:127.0.0.1:46039_ c:control_collection s:shard1 r:core_node1 x:collection1] o.a.s.u.CommitTracker Soft AutoCommit: disabled
   [junit4]   2> 437159 INFO  (coreLoadExecutor-2478-thread-1-processing-n:127.0.0.1:46039_) [n:127.0.0.1:46039_ c:control_collection s:shard1 r:core_node1 x:collection1] o.a.s.u.RandomMergePolicy RandomMergePolicy wrapping class org.apache.lucene.index.TieredMergePolicy: [TieredMergePolicy: maxMergeAtOnce=44, maxMergeAtOnceExplicit=45, maxMergedSegmentMB=6.8779296875, floorSegmentMB=1.359375, forceMergeDeletesPctAllowed=21.340720529596794, segmentsPerTier=36.0, maxCFSSegmentSizeMB=8.796093022207999E12, noCFSRatio=1.0
   [junit4]   2> 437159 INFO  (coreLoadExecutor-2478-thread-1-processing-n:127.0.0.1:46039_) [n:127.0.0.1:46039_ c:control_collection s:shard1 r:core_node1 x:collection1] o.a.s.c.SolrDeletionPolicy SolrDeletionPolicy.onInit: commits: num=1
   [junit4]   2> 	commit{dir=MockDirectoryWrapper(RAMDirectory@66020 lockFactory=org.apache.lucene.store.SingleInstanceLockFactory@106bf45),segFN=segments_1,generation=1}
   [junit4]   2> 437159 INFO  (coreLoadExecutor-2478-thread-1-processing-n:127.0.0.1:46039_) [n:127.0.0.1:46039_ c:control_collection s:shard1 r:core_node1 x:collection1] o.a.s.c.SolrDeletionPolicy newest commit generation = 1
   [junit4]   2> 437159 INFO  (coreLoadExecutor-2478-thread-1-processing-n:127.0.0.1:46039_) [n:127.0.0.1:46039_ c:control_collection s:shard1 r:core_node1 x:collection1] o.a.s.s.SolrIndexSearcher Opening Searcher@b3e282[collection1] main
   [junit4]   2> 437159 INFO  (coreLoadExecutor-2478-thread-1-processing-n:127.0.0.1:46039_) [n:127.0.0.1:46039_ c:control_collection s:shard1 r:core_node1 x:collection1] o.a.s.c.c.ZkStateReader Load collection config from: [/collections/control_collection]
   [junit4]   2> 437160 INFO  (coreLoadExecutor-2478-thread-1-processing-n:127.0.0.1:46039_) [n:127.0.0.1:46039_ c:control_collection s:shard1 r:core_node1 x:collection1] o.a.s.c.c.ZkStateReader path=[/collections/control_collection] [configName]=[conf1] specified config exists in ZooKeeper
   [junit4]   2> 437160 INFO  (coreLoadExecutor-2478-thread-1-processing-n:127.0.0.1:46039_) [n:127.0.0.1:46039_ c:control_collection s:shard1 r:core_node1 x:collection1] o.a.s.r.ManagedResourceStorage Setting up ZooKeeper-based storage for the RestManager with znodeBase: /configs/conf1
   [junit4]   2> 437160 INFO  (coreLoadExecutor-2478-thread-1-processing-n:127.0.0.1:46039_) [n:127.0.0.1:46039_ c:control_collection s:shard1 r:core_node1 x:collection1] o.a.s.r.ManagedResourceStorage Configured ZooKeeperStorageIO with znodeBase: /configs/conf1
   [junit4]   2> 437160 INFO  (coreLoadExecutor-2478-thread-1-processing-n:127.0.0.1:46039_) [n:127.0.0.1:46039_ c:control_collection s:shard1 r:core_node1 x:collection1] o.a.s.r.RestManager Initializing RestManager with initArgs: {}
   [junit4]   2> 437160 INFO  (coreLoadExecutor-2478-thread-1-processing-n:127.0.0.1:46039_) [n:127.0.0.1:46039_ c:control_collection s:shard1 r:core_node1 x:collection1] o.a.s.r.ManagedResourceStorage Reading _rest_managed.json using ZooKeeperStorageIO:path=/configs/conf1
   [junit4]   2> 437161 INFO  (coreLoadExecutor-2478-thread-1-processing-n:127.0.0.1:46039_) [n:127.0.0.1:46039_ c:control_collection s:shard1 r:core_node1 x:collection1] o.a.s.r.ManagedResourceStorage No data found for znode /configs/conf1/_rest_managed.json
   [junit4]   2> 437161 INFO  (coreLoadExecutor-2478-thread-1-processing-n:127.0.0.1:46039_) [n:127.0.0.1:46039_ c:control_collection s:shard1 r:core_node1 x:collection1] o.a.s.r.ManagedResourceStorage Loaded null at path _rest_managed.json using ZooKeeperStorageIO:path=/configs/conf1
   [junit4]   2> 437161 INFO  (coreLoadExecutor-2478-thread-1-processing-n:127.0.0.1:46039_) [n:127.0.0.1:46039_ c:control_collection s:shard1 r:core_node1 x:collection1] o.a.s.r.RestManager Initializing 0 registered ManagedResources
   [junit4]   2> 437161 INFO  (coreLoadExecutor-2478-thread-1-processing-n:127.0.0.1:46039_) [n:127.0.0.1:46039_ c:control_collection s:shard1 r:core_node1 x:collection1] o.a.s.h.ReplicationHandler Commits will be reserved for  10000
   [junit4]   2> 437161 INFO  (searcherExecutor-2479-thread-1-processing-n:127.0.0.1:46039_ x:collection1 s:shard1 c:control_collection r:core_node1) [n:127.0.0.1:46039_ c:control_collection s:shard1 r:core_node1 x:collection1] o.a.s.c.SolrCore [collection1] Registered new searcher Searcher@b3e282[collection1] main{ExitableDirectoryReader(UninvertingDirectoryReader())}
   [junit4]   2> 437161 INFO  (coreLoadExecutor-2478-thread-1-processing-n:127.0.0.1:46039_) [n:127.0.0.1:46039_ c:control_collection s:shard1 r:core_node1 x:collection1] o.a.s.u.UpdateLog Looking up max value of version field to seed version buckets
   [junit4]   2> 437161 INFO  (coreLoadExecutor-2478-thread-1-processing-n:127.0.0.1:46039_) [n:127.0.0.1:46039_ c:control_collection s:shard1 r:core_node1 x:collection1] o.a.s.u.VersionInfo Refreshing highest value of _version_ for 65536 version buckets from index
   [junit4]   2> 437161 INFO  (coreLoadExecutor-2478-thread-1-processing-n:127.0.0.1:46039_) [n:127.0.0.1:46039_ c:control_collection s:shard1 r:core_node1 x:collection1] o.a.s.u.VersionInfo No terms found for _version_, cannot seed version bucket highest value from index
   [junit4]   2> 437162 INFO  (coreLoadExecutor-2478-thread-1-processing-n:127.0.0.1:46039_) [n:127.0.0.1:46039_ c:control_collection s:shard1 r:core_node1 x:collection1] o.a.s.u.UpdateLog Could not find max version in index or recent updates, using new clock 1545302024271167488
   [junit4]   2> 437163 INFO  (coreLoadExecutor-2478-thread-1-processing-n:127.0.0.1:46039_) [n:127.0.0.1:46039_ c:control_collection s:shard1 r:core_node1 x:collection1] o.a.s.u.UpdateLog Took 1.0ms to seed version buckets with highest version 1545302024271167488
   [junit4]   2> 437163 INFO  (coreLoadExecutor-2478-thread-1-processing-n:127.0.0.1:46039_) [n:127.0.0.1:46039_ c:control_collection s:shard1 r:core_node1 x:collection1] o.a.s.c.ZkController watch zkdir /configs/conf1
   [junit4]   2> 437164 INFO  (coreLoadExecutor-2478-thread-1-processing-n:127.0.0.1:46039_) [n:127.0.0.1:46039_ c:control_collection s:shard1 r:core_node1 x:collection1] o.a.s.c.CoreContainer registering core: collection1
   [junit4]   2> 437164 INFO  (coreZkRegister-2472-thread-1-processing-n:127.0.0.1:46039_ x:collection1 s:shard1 c:control_collection r:core_node1) [n:127.0.0.1:46039_ c:control_collection s:shard1 r:core_node1 x:collection1] o.a.s.c.ZkController Register replica - core:collection1 address:http://127.0.0.1:46039 collection:control_collection shard:shard1
   [junit4]   2> 437165 INFO  (coreZkRegister-2472-thread-1-processing-n:127.0.0.1:46039_ x:collection1 s:shard1 c:control_collection r:core_node1) [n:127.0.0.1:46039_ c:control_collection s:shard1 r:core_node1 x:collection1] o.a.s.c.c.SolrZkClient makePath: /collections/control_collection/leader_elect/shard1/election
   [junit4]   2> 437167 INFO  (coreZkRegister-2472-thread-1-processing-n:127.0.0.1:46039_ x:collection1 s:shard1 c:control_collection r:core_node1) [n:127.0.0.1:46039_ c:control_collection s:shard1 r:core_node1 x:collection1] o.a.s.c.LeaderElector Joined leadership election with path: /collections/control_collection/leader_elect/shard1/election/96581376424083460-core_node1-n_0000000000
   [junit4]   2> 437168 INFO  (coreZkRegister-2472-thread-1-processing-n:127.0.0.1:46039_ x:collection1 s:shard1 c:control_collection r:core_node1) [n:127.0.0.1:46039_ c:control_collection s:shard1 r:core_node1 x:collection1] o.a.s.c.ShardLeaderElectionContext Running the leader process for shard=shard1 and weAreReplacement=false and leaderVoteWait=10000
   [junit4]   2> 437168 INFO  (coreZkRegister-2472-thread-1-processing-n:127.0.0.1:46039_ x:collection1 s:shard1 c:control_collection r:core_node1) [n:127.0.0.1:46039_ c:control_collection s:shard1 r:core_node1 x:collection1] o.a.s.c.ShardLeaderElectionContext Enough replicas found to continue.
   [junit4]   2> 437168 INFO  (coreZkRegister-2472-thread-1-processing-n:127.0.0.1:46039_ x:collection1 s:shard1 c:control_collection r:core_node1) [n:127.0.0.1:46039_ c:control_collection s:shard1 r:core_node1 x:collection1] o.a.s.c.ShardLeaderElectionContext I may be the new leader - try and sync
   [junit4]   2> 437169 INFO  (coreZkRegister-2472-thread-1-processing-n:127.0.0.1:46039_ x:collection1 s:shard1 c:control_collection r:core_node1) [n:127.0.0.1:46039_ c:control_collection s:shard1 r:core_node1 x:collection1] o.a.s.c.SyncStrategy Sync replicas to http://127.0.0.1:46039/collection1/
   [junit4]   2> 437169 INFO  (coreZkRegister-2472-thread-1-processing-n:127.0.0.1:46039_ x:collection1 s:shard1 c:control_collection r:core_node1) [n:127.0.0.1:46039_ c:control_collection s:shard1 r:core_node1 x:collection1] o.a.s.c.SyncStrategy Sync Success - now sync replicas to me
   [junit4]   2> 437169 INFO  (coreZkRegister-2472-thread-1-processing-n:127.0.0.1:46039_ x:collection1 s:shard1 c:control_collection r:core_node1) [n:127.0.0.1:46039_ c:control_collection s:shard1 r:core_node1 x:collection1] o.a.s.c.SyncStrategy http://127.0.0.1:46039/collection1/ has no replicas
   [junit4]   2> 437169 INFO  (OverseerStateUpdate-96581376424083460-127.0.0.1:46039_-n_0000000000) [n:127.0.0.1:46039_    ] o.a.s.c.Overseer processMessage: queueSize: 1, message = {
   [junit4]   2>   "operation":"leader",
   [junit4]   2>   "shard":"shard1",
   [junit4]   2>   "collection":"control_collection"} current state version: 1
   [junit4]   2> 437169 INFO  (coreZkRegister-2472-thread-1-processing-n:127.0.0.1:46039_ x:collection1 s:shard1 c:control_collection r:core_node1) [n:127.0.0.1:46039_ c:control_collection s:shard1 r:core_node1 x:collection1] o.a.s.c.c.SolrZkClient makePath: /collections/control_collection/leaders/shard1
   [junit4]   2> 437170 INFO  (coreZkRegister-2472-thread-1-processing-n:127.0.0.1:46039_ x:collection1 s:shard1 c:control_collection r:core_node1) [n:127.0.0.1:46039_ c:control_collection s:shard1 r:core_node1 x:collection1] o.a.s.c.ShardLeaderElectionContextBase Creating leader registration node /collections/control_collection/leaders/shard1/leader after winning as /collections/control_collection/leader_elect/shard1/election/96581376424083460-core_node1-n_0000000000
   [junit4]   2> 437171 INFO  (coreZkRegister-2472-thread-1-processing-n:127.0.0.1:46039_ x:collection1 s:shard1 c:control_collection r:core_node1) [n:127.0.0.1:46039_ c:control_collection s:shard1 r:core_node1 x:collection1] o.a.s.c.ShardLeaderElectionContext I am the new leader: http://127.0.0.1:46039/collection1/ shard1
   [junit4]   2> 437171 INFO  (OverseerStateUpdate-96581376424083460-127.0.0.1:46039_-n_0000000000) [n:127.0.0.1:46039_    ] o.a.s.c.Overseer processMessage: queueSize: 1, message = {
   [junit4]   2>   "operation":"leader",
   [junit4]   2>   "shard":"shard1",
   [junit4]   2>   "collection":"control_collection",
   [junit4]   2>   "base_url":"http://127.0.0.1:46039",
   [junit4]   2>   "core":"collection1",
   [junit4]   2>   "state":"active"} current state version: 1
   [junit4]   2> 437274 INFO  (zkCallback-468-thread-1-processing-n:127.0.0.1:46039_) [n:127.0.0.1:46039_    ] o.a.s.c.c.ZkStateReader A cluster state change: [WatchedEvent state:SyncConnected type:NodeDataChanged path:/clusterstate.json], has occurred - updating... (live nodes size: [1])
   [junit4]   2> 437322 INFO  (coreZkRegister-2472-thread-1-processing-n:127.0.0.1:46039_ x:collection1 s:shard1 c:control_collection r:core_node1) [n:127.0.0.1:46039_ c:control_collection s:shard1 r:core_node1 x:collection1] o.a.s.c.ZkController We are http://127.0.0.1:46039/collection1/ and leader is http://127.0.0.1:46039/collection1/
   [junit4]   2> 437322 INFO  (coreZkRegister-2472-thread-1-processing-n:127.0.0.1:46039_ x:collection1 s:shard1 c:control_collection r:core_node1) [n:127.0.0.1:46039_ c:control_collection s:shard1 r:core_node1 x:collection1] o.a.s.c.ZkController No LogReplay needed for core=collection1 baseURL=http://127.0.0.1:46039
   [junit4]   2> 437322 INFO  (coreZkRegister-2472-thread-1-processing-n:127.0.0.1:46039_ x:collection1 s:shard1 c:control_collection r:core_node1) [n:127.0.0.1:46039_ c:control_collection s:shard1 r:core_node1 x:collection1] o.a.s.c.ZkController I am the leader, no recovery necessary
   [junit4]   2> 437322 INFO  (coreZkRegister-2472-thread-1-processing-n:127.0.0.1:46039_ x:collection1 s:shard1 c:control_collection r:core_node1) [n:127.0.0.1:46039_ c:control_collection s:shard1 r:core_node1 x:collection1] o.a.s.c.ZkController publishing state=active
   [junit4]   2> 437322 INFO  (coreZkRegister-2472-thread-1-processing-n:127.0.0.1:46039_ x:collection1 s:shard1 c:control_collection r:core_node1) [n:127.0.0.1:46039_ c:control_collection s:shard1 r:core_node1 x:collection1] o.a.s.c.ZkController numShards not found on descriptor - reading it from system property
   [junit4]   2> 437323 INFO  (OverseerStateUpdate-96581376424083460-127.0.0.1:46039_-n_0000000000) [n:127.0.0.1:46039_    ] o.a.s.c.Overseer processMessage: queueSize: 1, message = {
   [junit4]   2>   "core":"collection1",
   [junit4]   2>   "core_node_name":"core_node1",
   [junit4]   2>   "roles":null,
   [junit4]   2>   "base_url":"http://127.0.0.1:46039",
   [junit4]   2>   "node_name":"127.0.0.1:46039_",
   [junit4]   2>   "numShards":"1",
   [junit4]   2>   "state":"active",
   [junit4]   2>   "shard":"shard1",
   [junit4]   2>   "collection":"control_collection",
   [junit4]   2>   "operation":"state"} current state version: 2
   [junit4]   2> 437323 INFO  (OverseerStateUpdate-96581376424083460-127.0.0.1:46039_-n_0000000000) [n:127.0.0.1:46039_    ] o.a.s.c.o.ReplicaMutator Update state numShards=1 message={
   [junit4]   2>   "core":"collection1",
   [junit4]   2>   "core_node_name":"core_node1",
   [junit4]   2>   "roles":null,
   [junit4]   2>   "base_url":"http://127.0.0.1:46039",
   [junit4]   2>   "node_name":"127.0.0.1:46039_",
   [junit4]   2>   "numShards":"1",
   [junit4]   2>   "state":"active",
   [junit4]   2>   "shard":"shard1",
   [junit4]   2>   "collection":"control_collection",
   [junit4]   2>   "operation":"state"}
   [junit4]   2> 437424 INFO  (zkCallback-468-thread-3-processing-n:127.0.0.1:46039_) [n:127.0.0.1:46039_    ] o.a.s.c.c.ZkStateReader A cluster state change: [WatchedEvent state:SyncConnected type:NodeDataChanged path:/clusterstate.json], has occurred - updating... (live nodes size: [1])
   [junit4]   2> 437491 INFO  (TEST-TestSolrConfigHandlerCloud.test-seed#[64370980C7089CB8]) [    ] o.a.s.c.c.SolrZkClient Using default ZkCredentialsProvider
   [junit4]   2> 437492 INFO  (TEST-TestSolrConfigHandlerCloud.test-seed#[64370980C7089CB8]) [    ] o.a.s.c.c.ConnectionManager Waiting for client to connect to ZooKeeper
   [junit4]   2> 437493 INFO  (zkCallback-470-thread-1) [    ] o.a.s.c.c.ConnectionManager Watcher org.apache.solr.common.cloud.ConnectionManager@36b8af name:ZooKeeperConnection Watcher:127.0.0.1:35061/solr got event WatchedEvent state:SyncConnected type:None path:null path:null type:None
   [junit4]   2> 437493 INFO  (TEST-TestSolrConfigHandlerCloud.test-seed#[64370980C7089CB8]) [    ] o.a.s.c.c.ConnectionManager Client is connected to ZooKeeper
   [junit4]   2> 437493 INFO  (TEST-TestSolrConfigHandlerCloud.test-seed#[64370980C7089CB8]) [    ] o.a.s.c.c.SolrZkClient Using default ZkACLProvider
   [junit4]   2> 437493 INFO  (TEST-TestSolrConfigHandlerCloud.test-seed#[64370980C7089CB8]) [    ] o.a.s.c.c.ZkStateReader Updating cluster state from ZooKeeper... 
   [junit4]   2> 437494 INFO  (TEST-TestSolrConfigHandlerCloud.test-seed#[64370980C7089CB8]) [    ] o.a.s.c.ChaosMonkey monkey: init - expire sessions:false cause connection loss:false
   [junit4]   2> 437560 INFO  (TEST-TestSolrConfigHandlerCloud.test-seed#[64370980C7089CB8]) [    ] o.a.s.SolrTestCaseJ4 Writing core.properties file to /home/jenkins/workspace/Lucene-Solr-5.5-Linux/solr/build/solr-core/test/J0/temp/solr.handler.TestSolrConfigHandlerCloud_64370980C7089CB8-001/shard-1-001/cores/collection1
   [junit4]   2> 437560 INFO  (TEST-TestSolrConfigHandlerCloud.test-seed#[64370980C7089CB8]) [    ] o.a.s.c.AbstractFullDistribZkTestBase create jetty 1 in directory /home/jenkins/workspace/Lucene-Solr-5.5-Linux/solr/build/solr-core/test/J0/temp/solr.handler.TestSolrConfigHandlerCloud_64370980C7089CB8-001/shard-1-001
   [junit4]   2> 437561 INFO  (TEST-TestSolrConfigHandlerCloud.test-seed#[64370980C7089CB8]) [    ] o.e.j.s.Server jetty-9.2.13.v20150730
   [junit4]   2> 437562 INFO  (TEST-TestSolrConfigHandlerCloud.test-seed#[64370980C7089CB8]) [    ] o.e.j.s.h.ContextHandler Started o.e.j.s.ServletContextHandler@1886c23{/,null,AVAILABLE}
   [junit4]   2> 437562 INFO  (TEST-TestSolrConfigHandlerCloud.test-seed#[64370980C7089CB8]) [    ] o.e.j.s.ServerConnector Started ServerConnector@1a681bc{HTTP/1.1}{127.0.0.1:43827}
   [junit4]   2> 437562 INFO  (TEST-TestSolrConfigHandlerCloud.test-seed#[64370980C7089CB8]) [    ] o.e.j.s.Server Started @439306ms
   [junit4]   2> 437562 INFO  (TEST-TestSolrConfigHandlerCloud.test-seed#[64370980C7089CB8]) [    ] o.a.s.c.s.e.JettySolrRunner Jetty properties: {solr.data.dir=/home/jenkins/workspace/Lucene-Solr-5.5-Linux/solr/build/solr-core/test/J0/temp/solr.handler.TestSolrConfigHandlerCloud_64370980C7089CB8-001/tempDir-001/jetty1, solrconfig=solrconfig.xml, hostContext=/, hostPort=43827, coreRootDirectory=/home/jenkins/workspace/Lucene-Solr-5.5-Linux/solr/build/solr-core/test/J0/temp/solr.handler.TestSolrConfigHandlerCloud_64370980C7089CB8-001/shard-1-001/cores}
   [junit4]   2> 437562 INFO  (TEST-TestSolrConfigHandlerCloud.test-seed#[64370980C7089CB8]) [    ] o.a.s.s.SolrDispatchFilter SolrDispatchFilter.init(): sun.misc.Launcher$AppClassLoader@1d16e93
   [junit4]   2> 437562 INFO  (TEST-TestSolrConfigHandlerCloud.test-seed#[64370980C7089CB8]) [    ] o.a.s.c.SolrResourceLoader new SolrResourceLoader for directory: '/home/jenkins/workspace/Lucene-Solr-5.5-Linux/solr/build/solr-core/test/J0/temp/solr.handler.TestSolrConfigHandlerCloud_64370980C7089CB8-001/shard-1-001'
   [junit4]   2> 437562 INFO  (TEST-TestSolrConfigHandlerCloud.test-seed#[64370980C7089CB8]) [    ] o.a.s.c.SolrResourceLoader JNDI not configured for solr (NoInitialContextEx)
   [junit4]   2> 437562 INFO  (TEST-TestSolrConfigHandlerCloud.test-seed#[64370980C7089CB8]) [    ] o.a.s.c.SolrResourceLoader solr home defaulted to 'solr/' (could not find system property or JNDI)
   [junit4]   2> 437563 INFO  (TEST-TestSolrConfigHandlerCloud.test-seed#[64370980C7089CB8]) [    ] o.a.s.c.c.SolrZkClient Using default ZkCredentialsProvider
   [junit4]   2> 437567 INFO  (TEST-TestSolrConfigHandlerCloud.test-seed#[64370980C7089CB8]) [    ] o.a.s.c.c.ConnectionManager Waiting for client to connect to ZooKeeper
   [junit4]   2> 437568 INFO  (zkCallback-471-thread-1) [    ] o.a.s.c.c.ConnectionManager Watcher org.apache.solr.common.cloud.ConnectionManager@1c00c4f name:ZooKeeperConnection Watcher:127.0.0.1:35061/solr got event WatchedEvent state:SyncConnected type:None path:null path:null type:None
   [junit4]   2> 437568 INFO  (TEST-TestSolrConfigHandlerCloud.test-seed#[64370980C7089CB8]) [    ] o.a.s.c.c.ConnectionManager Client is connected to ZooKeeper
   [junit4]   2> 437569 INFO  (TEST-TestSolrConfigHandlerCloud.test-seed#[64370980C7089CB8]) [    ] o.a.s.c.c.SolrZkClient Using default ZkACLProvider
   [junit4]   2> 437569 INFO  (TEST-TestSolrConfigHandlerCloud.test-seed#[64370980C7089CB8]) [    ] o.a.s.s.SolrDispatchFilter Loading solr.xml from SolrHome (not found in ZooKeeper)
   [junit4]   2> 437569 INFO  (TEST-TestSolrConfigHandlerCloud.test-seed#[64370980C7089CB8]) [    ] o.a.s.c.SolrXmlConfig Loading container configuration from /home/jenkins/workspace/Lucene-Solr-5.5-Linux/solr/build/solr-core/test/J0/temp/solr.handler.TestSolrConfigHandlerCloud_64370980C7089CB8-001/shard-1-001/solr.xml
   [junit4]   2> 437573 INFO  (TEST-TestSolrConfigHandlerCloud.test-seed#[64370980C7089CB8]) [    ] o.a.s.c.CorePropertiesLocator Config-defined core root directory: /home/jenkins/workspace/Lucene-Solr-5.5-Linux/solr/build/solr-core/test/J0/temp/solr.handler.TestSolrConfigHandlerCloud_64370980C7089CB8-001/shard-1-001/cores
   [junit4]   2> 437574 INFO  (TEST-TestSolrConfigHandlerCloud.test-seed#[64370980C7089CB8]) [    ] o.a.s.c.CoreContainer New CoreContainer 24494762
   [junit4]   2> 437574 INFO  (TEST-TestSolrConfigHandlerCloud.test-seed#[64370980C7089CB8]) [    ] o.a.s.c.CoreContainer Loading cores into CoreContainer [instanceDir=/home/jenkins/workspace/Lucene-Solr-5.5-Linux/solr/build/solr-core/test/J0/temp/solr.handler.TestSolrConfigHandlerCloud_64370980C7089CB8-001/shard-1-001]
   [junit4]   2> 437574 WARN  (TEST-TestSolrConfigHandlerCloud.test-seed#[64370980C7089CB8]) [    ] o.a.s.c.CoreContainer Couldn't add files from /home/jenkins/workspace/Lucene-Solr-5.5-Linux/solr/build/solr-core/test/J0/temp/solr.handler.TestSolrConfigHandlerCloud_64370980C7089CB8-001/shard-1-001/lib to classpath: /home/jenkins/workspace/Lucene-Solr-5.5-Linux/solr/build/solr-core/test/J0/temp/solr.handler.TestSolrConfigHandlerCloud_64370980C7089CB8-001/shard-1-001/lib
   [junit4]   2> 437574 INFO  (TEST-TestSolrConfigHandlerCloud.test-seed#[64370980C7089CB8]) [    ] o.a.s.h.c.HttpShardHandlerFactory created with socketTimeout : 90000,urlScheme : ,connTimeout : 15000,maxConnectionsPerHost : 20,maxConnections : 10000,corePoolSize : 0,maximumPoolSize : 2147483647,maxThreadIdleTime : 5,sizeOfQueue : -1,fairnessPolicy : false,useRetries : false,connectionsEvictorSleepDelay : 5000,maxConnectionIdleTime : 40000,
   [junit4]   2> 437575 INFO  (TEST-TestSolrConfigHandlerCloud.test-seed#[64370980C7089CB8]) [    ] o.a.s.u.UpdateShardHandler Creating UpdateShardHandler HTTP client with params: socketTimeout=340000&connTimeout=45000&retry=true
   [junit4]   2> 437575 INFO  (TEST-TestSolrConfigHandlerCloud.test-seed#[64370980C7089CB8]) [    ] o.a.s.l.LogWatcher SLF4J impl is org.slf4j.impl.Log4jLoggerFactory
   [junit4]   2> 437575 INFO  (TEST-TestSolrConfigHandlerCloud.test-seed#[64370980C7089CB8]) [    ] o.a.s.l.LogWatcher Registering Log Listener [Log4j (org.slf4j.impl.Log4jLoggerFactory)]
   [junit4]   2> 437575 INFO  (TEST-TestSolrConfigHandlerCloud.test-seed#[64370980C7089CB8]) [    ] o.a.s.c.ZkContainer Zookeeper client=127.0.0.1:35061/solr
   [junit4]   2> 437575 INFO  (TEST-TestSolrConfigHandlerCloud.test-seed#[64370980C7089CB8]) [    ] o.a.s.c.ZkController zkHost includes chroot
   [junit4]   2> 437575 INFO  (TEST-TestSolrConfigHandlerCloud.test-seed#[64370980C7089CB8]) [    ] o.a.s.c.c.SolrZkClient Using default ZkCredentialsProvider
   [junit4]   2> 437575 INFO  (TEST-TestSolrConfigHandlerCloud.test-seed#[64370980C7089CB8]) [    ] o.a.s.c.c.ConnectionManager Waiting for client to connect to ZooKeeper
   [junit4]   2> 437577 INFO  (zkCallback-474-thread-1) [    ] o.a.s.c.c.ConnectionManager Watcher org.apache.solr.common.cloud.ConnectionManager@16a981f name:ZooKeeperConnection Watcher:127.0.0.1:35061 got event WatchedEvent state:SyncConnected type:None path:null path:null type:None
   [junit4]   2> 437577 INFO  (TEST-TestSolrConfigHandlerCloud.test-seed#[64370980C7089CB8]) [    ] o.a.s.c.c.ConnectionManager Client is connected to ZooKeeper
   [junit4]   2> 437577 INFO  (TEST-TestSolrConfigHandlerCloud.test-seed#[64370980C7089CB8]) [    ] o.a.s.c.c.SolrZkClient Using default ZkACLProvider
   [junit4]   2> 437578 INFO  (TEST-TestSolrConfigHandlerCloud.test-seed#[64370980C7089CB8]) [n:127.0.0.1:43827_    ] o.a.s.c.ZkController Added new OnReconnect listener org.apache.solr.cloud.ZkController$6@12d4611
   [junit4]   2> 437578 INFO  (TEST-TestSolrConfigHandlerCloud.test-seed#[64370980C7089CB8]) [n:127.0.0.1:43827_    ] o.a.s.c.c.ConnectionManager Waiting for client to connect to ZooKeeper
   [junit4]   2> 437579 INFO  (zkCallback-475-thread-1-processing-n:127.0.0.1:43827_) [n:127.0.0.1:43827_    ] o.a.s.c.c.ConnectionManager Watcher org.apache.solr.common.cloud.ConnectionManager@e38f5d name:ZooKeeperConnection Watcher:127.0.0.1:35061/solr got event WatchedEvent state:SyncConnected type:None path:null path:null type:None
   [junit4]   2> 437579 INFO  (TEST-TestSolrConfigHandlerCloud.test-seed#[64370980C7089CB8]) [n:127.0.0.1:43827_    ] o.a.s.c.c.ConnectionManager Client is connected to ZooKeeper
   [junit4]   2> 437581 INFO  (TEST-TestSolrConfigHandlerCloud.test-seed#[64370980C7089CB8]) [n:127.0.0.1:43827_    ] o.a.s.c.c.ZkStateReader Updating cluster state from ZooKeeper... 
   [junit4]   2> 438583 INFO  (TEST-TestSolrConfigHandlerCloud.test-seed#[64370980C7089CB8]) [n:127.0.0.1:43827_    ] o.a.s.c.ZkController Register node as live in ZooKeeper:/live_nodes/127.0.0.1:43827_
   [junit4]   2> 438584 INFO  (TEST-TestSolrConfigHandlerCloud.test-seed#[64370980C7089CB8]) [n:127.0.0.1:43827_    ] o.a.s.c.c.SolrZkClient makePath: /live_nodes/127.0.0.1:43827_
   [junit4]   2> 438584 INFO  (zkCallback-475-thread-1-processing-n:127.0.0.1:43827_) [n:127.0.0.1:43827_    ] o.a.s.c.c.ZkStateReader A live node change: [WatchedEvent state:SyncConnected type:NodeChildrenChanged path:/live_nodes], has occurred - updating... (live nodes size: [1])
   [junit4]   2> 438584 INFO  (zkCallback-470-thread-1) [    ] o.a.s.c.c.ZkStateReader A live node change: [WatchedEvent state:SyncConnected type:NodeChildrenChanged path:/live_nodes], has occurred - updating... (live nodes size: [1])
   [junit4]   2> 438584 INFO  (zkCallback-468-thread-3-processing-n:127.0.0.1:46039_) [n:127.0.0.1:46039_    ] o.a.s.c.c.ZkStateReader A live node change: [WatchedEvent state:SyncConnected type:NodeChildrenChanged path:/live_nodes], has occurred - updating... (live nodes size: [1])
   [junit4]   2> 438585 INFO  (TEST-TestSolrConfigHandlerCloud.test-seed#[64370980C7089CB8]) [n:127.0.0.1:43827_    ] o.a.s.c.Overseer Overseer (id=null) closing
   [junit4]   2> 438585 INFO  (TEST-TestSolrConfigHandlerCloud.test-seed#[64370980C7089CB8]) [n:127.0.0.1:43827_    ] o.a.s.c.LeaderElector Joined leadership election with path: /overseer_elect/election/96581376424083464-127.0.0.1:43827_-n_0000000001
   [junit4]   2> 438585 INFO  (TEST-TestSolrConfigHandlerCloud.test-seed#[64370980C7089CB8]) [n:127.0.0.1:43827_    ] o.a.s.c.LeaderElector Watching path /overseer_elect/election/96581376424083460-127.0.0.1:46039_-n_0000000000 to know if I could be the leader
   [junit4]   2> 438618 INFO  (TEST-TestSolrConfigHandlerCloud.test-seed#[64370980C7089CB8]) [n:127.0.0.1:43827_    ] o.a.s.c.CoreContainer Security conf doesn't exist. Skipping setup for authorization module.
   [junit4]   2> 438618 INFO  (TEST-TestSolrConfigHandlerCloud.test-seed#[64370980C7089CB8]) [n:127.0.0.1:43827_    ] o.a.s.c.CoreContainer No authentication plugin used.
   [junit4]   2> 438618 INFO  (TEST-TestSolrConfigHandlerCloud.test-seed#[64370980C7089CB8]) [n:127.0.0.1:43827_    ] o.a.s.c.CorePropertiesLocator Looking for core definitions underneath /home/jenkins/workspace/Lucene-Solr-5.5-Linux/solr/build/solr-core/test/J0/temp/solr.handler.TestSolrConfigHandlerCloud_64370980C7089CB8-001/shard-1-001/cores
   [junit4]   2> 438619 INFO  (TEST-TestSolrConfigHandlerCloud.test-seed#[64370980C7089CB8]) [n:127.0.0.1:43827_    ] o.a.s.c.CoreDescriptor Created CoreDescriptor: {name=collection1, config=solrconfig.xml, transient=false, schema=schema.xml, loadOnStartup=true, configSetProperties=configsetprops.json, collection=collection1, coreNodeName=, dataDir=data/, shard=}
   [junit4]   2> 438619 INFO  (TEST-TestSolrConfigHandlerCloud.test-seed#[64370980C7089CB8]) [n:127.0.0.1:43827_    ] o.a.s.c.CorePropertiesLocator Found core collection1 in /home/jenkins/workspace/Lucene-Solr-5.5-Linux/solr/build/solr-core/test/J0/temp/solr.handler.TestSolrConfigHandlerCloud_64370980C7089CB8-001/shard-1-001/cores/collection1
   [junit4]   2> 438619 INFO  (TEST-TestSolrConfigHandlerCloud.test-seed#[64370980C7089CB8]) [n:127.0.0.1:43827_    ] o.a.s.c.CorePropertiesLocator Found 1 core definitions
   [junit4]   2> 438619 INFO  (TEST-TestSolrConfigHandlerCloud.test-seed#[64370980C7089CB8]) [n:127.0.0.1:43827_    ] o.a.s.s.SolrDispatchFilter user.dir=/home/jenkins/workspace/Lucene-Solr-5.5-Linux/solr/build/solr-core/test/J0
   [junit4]   2> 438619 INFO  (TEST-TestSolrConfigHandlerCloud.test-seed#[64370980C7089CB8]) [n:127.0.0.1:43827_    ] o.a.s.s.SolrDispatchFilter SolrDispatchFilter.init() done
   [junit4]   2> 438619 INFO  (coreLoadExecutor-2489-thread-1-processing-n:127.0.0.1:43827_) [n:127.0.0.1:43827_ c:collection1   x:collection1] o.a.s.c.ZkController publishing state=down
   [junit4]   2> 438619 INFO  (coreLoadExecutor-2489-thread-1-processing-n:127.0.0.1:43827_) [n:127.0.0.1:43827_ c:collection1   x:collection1] o.a.s.c.ZkController numShards not found on descriptor - reading it from system property
   [junit4]   2> 438620 INFO  (coreLoadExecutor-2489-thread-1-processing-n:127.0.0.1:43827_) [n:127.0.0.1:43827_ c:collection1   x:collection1] o.a.s.c.ZkController Collection collection1 not visible yet, but flagging it so a watch is registered when it becomes visible
   [junit4]   2> 438620 INFO  (coreLoadExecutor-2489-thread-1-processing-n:127.0.0.1:43827_) [n:127.0.0.1:43827_ c:collection1   x:collection1] o.a.s.c.c.ZkStateReader addZkWatch [collection1]
   [junit4]   2> 438620 INFO  (OverseerStateUpdate-96581376424083460-127.0.0.1:46039_-n_0000000000) [n:127.0.0.1:46039_    ] o.a.s.c.Overseer processMessage: queueSize: 1, message = {
   [junit4]   2>   "core":"collection1",
   [junit4]   2>   "roles":null,
   [junit4]   2>   "base_url":"http://127.0.0.1:43827",
   [junit4]   2>   "node_name":"127.0.0.1:43827_",
   [junit4]   2>   "numShards":"2",
   [junit4]   2>   "state":"down",
   [junit4]   2>   "shard":null,
   [junit4]   2>   "collection":"collection1",
   [junit4]   2>   "operation":"state"} current state version: 3
   [junit4]   2> 438620 INFO  (coreLoadExecutor-2489-thread-1-processing-n:127.0.0.1:43827_) [n:127.0.0.1:43827_ c:collection1   x:collection1] o.a.s.c.c.ZkStateReader Deleting data for [collection1]
   [junit4]   2> 438620 INFO  (OverseerStateUpdate-96581376424083460-127.0.0.1:46039_-n_0000000000) [n:127.0.0.1:46039_    ] o.a.s.c.o.ReplicaMutator Update state numShards=2 message={
   [junit4]   2>   "core":"collection1",
   [junit4]   2>   "roles":null,
   [junit4]   2>   "base_url":"http://127.0.0.1:43827",
   [junit4]   2>   "node_name":"127.0.0.1:43827_",
   [junit4]   2>   "numShards":"2",
   [junit4]   2>   "state":"down",
   [junit4]   2>   "shard":null,
   [junit4]   2>   "collection":"collection1",
   [junit4]   2>   "operation":"state"}
   [junit4]   2> 438621 INFO  (OverseerStateUpdate-96581376424083460-127.0.0.1:46039_-n_0000000000) [n:127.0.0.1:46039_    ] o.a.s.c.o.ClusterStateMutator building a new cName: collection1
   [junit4]   2> 438621 INFO  (coreLoadExecutor-2489-thread-1-processing-n:127.0.0.1:43827_) [n:127.0.0.1:43827_ c:collection1   x:collection1] o.a.s.c.ZkController look for our core node name
   [junit4]   2> 438621 INFO  (OverseerStateUpdate-96581376424083460-127.0.0.1:46039_-n_0000000000) [n:127.0.0.1:46039_    ] o.a.s.c.o.ReplicaMutator Assigning new node to shard shard=shard2
   [junit4]   2> 438722 INFO  (zkCallback-470-thread-1) [    ] o.a.s.c.c.ZkStateReader A cluster state change: [WatchedEvent state:SyncConnected type:NodeDataChanged path:/clusterstate.json], has occurred - updating... (live nodes size: [2])
   [junit4]   2> 438722 INFO  (zkCallback-468-thread-1-processing-n:127.0.0.1:46039_) [n:127.0.0.1:46039_    ] o.a.s.c.c.ZkStateReader A cluster state change: [WatchedEvent state:SyncConnected type:NodeDataChanged path:/clusterstate.json], has occurred - updating... (live nodes size: [2])
   [junit4]   2> 438722 INFO  (zkCallback-475-thread-1-processing-n:127.0.0.1:43827_) [n:127.0.0.1:43827_    ] o.a.s.c.c.ZkStateReader A cluster state change: [WatchedEvent state:SyncConnected type:NodeDataChanged path:/clusterstate.json], has occurred - updating... (live nodes size: [2])
   [junit4]   2> 439621 INFO  (coreLoadExecutor-2489-thread-1-processing-n:127.0.0.1:43827_) [n:127.0.0.1:43827_ c:collection1   x:collection1] o.a.s.c.ZkController waiting to find shard id in clusterstate for collection1
   [junit4]   2> 439621 INFO  (coreLoadExecutor-2489-thread-1-processing-n:127.0.0.1:43827_) [n:127.0.0.1:43827_ c:collection1   x:collection1] o.a.s.c.ZkController Check for collection zkNode:collection1
   [junit4]   2> 439621 INFO  (coreLoadExecutor-2489-thread-1-processing-n:127.0.0.1:43827_) [n:127.0.0.1:43827_ c:collection1   x:collection1] o.a.s.c.ZkController Collection zkNode exists
   [junit4]   2> 439621 INFO  (coreLoadExecutor-2489-thread-1-processing-n:127.0.0.1:43827_) [n:127.0.0.1:43827_ c:collection1   x:collection1] o.a.s.c.c.ZkStateReader Load collection config from: [/collections/collection1]
   [junit4]   2> 439621 INFO  (coreLoadExecutor-2489-thread-1-processing-n:127.0.0.1:43827_) [n:127.0.0.1:43827_ c:collection1   x:collection1] o.a.s.c.c.ZkStateReader path=[/collections/collection1] [configName]=[conf1] specified config exists in ZooKeeper
   [junit4]   2> 439622 INFO  (coreLoadExecutor-2489-thread-1-processing-n:127.0.0.1:43827_) [n:127.0.0.1:43827_ c:collection1   x:collection1] o.a.s.c.SolrResourceLoader new SolrResourceLoader for directory: '/home/jenkins/workspace/Lucene-Solr-5.5-Linux/solr/build/solr-core/test/J0/temp/solr.handler.TestSolrConfigHandlerCloud_64370980C7089CB8-001/shard-1-001/cores/collection1'
   [junit4]   2> 439622 INFO  (coreLoadExecutor-2489-thread-1-processing-n:127.0.0.1:43827_) [n:127.0.0.1:43827_ c:collection1   x:collection1] o.a.s.c.SolrResourceLoader JNDI not configured for solr (NoInitialContextEx)
   [junit4]   2> 439622 INFO  (coreLoadExecutor-2489-thread-1-processing-n:127.0.0.1:43827_) [n:127.0.0.1:43827_ c:collection1   x:collection1] o.a.s.c.SolrResourceLoader solr home defaulted to 'solr/' (could not find system property or JNDI)
   [junit4]   2> 439623 INFO  (coreLoadExecutor-2489-thread-1-processing-n:127.0.0.1:43827_) [n:127.0.0.1:43827_ c:collection1   x:collection1] o.a.s.c.Config loaded config solrconfig.xml with version 0 
   [junit4]   2> 439626 INFO  (coreLoadExecutor-2489-thread-1-processing-n:127.0.0.1:43827_) [n:127.0.0.1:43827_ c:collection1   x:collection1] o.a.s.c.SolrConfig current version of requestparams : -1
   [junit4]   2> 439636 WARN  (coreLoadExecutor-2489-thread-1-processing-n:127.0.0.1:43827_) [n:127.0.0.1:43827_ c:collection1   x:collection1] o.a.s.c.Config Beginning with Solr 5.5, <mergePolicy> is deprecated, use <mergePolicyFactory> instead.
   [junit4]   2> 439636 INFO  (coreLoadExecutor-2489-thread-1-processing-n:127.0.0.1:43827_) [n:127.0.0.1:43827_ c:collection1   x:collection1] o.a.s.c.SolrConfig Using Lucene MatchVersion: 5.5.4
   [junit4]   2> 439644 INFO  (coreLoadExecutor-2489-thread-1-processing-n:127.0.0.1:43827_) [n:127.0.0.1:43827_ c:collection1   x:collection1] o.a.s.c.SolrConfig Loaded SolrConfig: solrconfig.xml
   [junit4]   2> 439649 INFO  (coreLoadExecutor-2489-thread-1-processing-n:127.0.0.1:43827_) [n:127.0.0.1:43827_ c:collection1   x:collection1] o.a.s.s.IndexSchema [collection1] Schema name=test
   [junit4]   2> 439711 INFO  (coreLoadExecutor-2489-thread-1-processing-n:127.0.0.1:43827_) [n:127.0.0.1:43827_ c:collection1   x:collection1] o.a.s.s.OpenExchangeRatesOrgProvider Initialized with rates=open-exchange-rates.json, refreshInterval=1440.
   [junit4]   2> 439717 INFO  (coreLoadExecutor-2489-thread-1-processing-n:127.0.0.1:43827_) [n:127.0.0.1:43827_ c:collection1   x:collection1] o.a.s.s.IndexSchema default search field in schema is text
   [junit4]   2> 439718 INFO  (coreLoadExecutor-2489-thread-1-processing-n:127.0.0.1:43827_) [n:127.0.0.1:43827_ c:collection1   x:collection1] o.a.s.s.IndexSchema unique key field: id
   [junit4]   2> 439722 INFO  (coreLoadExecutor-2489-thread-1-processing-n:127.0.0.1:43827_) [n:127.0.0.1:43827_ c:collection1   x:collection1] o.a.s.s.FileExchangeRateProvider Reloading exchange rates from file currency.xml
   [junit4]   2> 439723 INFO  (coreLoadExecutor-2489-thread-1-processing-n:127.0.0.1:43827_) [n:127.0.0.1:43827_ c:collection1   x:collection1] o.a.s.s.FileExchangeRateProvider Reloading exchange rates from file currency.xml
   [junit4]   2> 439724 INFO  (coreLoadExecutor-2489-thread-1-processing-n:127.0.0.1:43827_) [n:127.0.0.1:43827_ c:collection1   x:collection1] o.a.s.s.OpenExchangeRatesOrgProvider Reloading exchange rates from open-exchange-rates.json
   [junit4]   2> 439724 INFO  (coreLoadExecutor-2489-thread-1-processing-n:127.0.0.1:43827_) [n:127.0.0.1:43827_ c:collection1   x:collection1] o.a.s.s.OpenExchangeRatesOrgProvider Reloading exchange rates from open-exchange-rates.json
   [junit4]   2> 439725 INFO  (coreLoadExecutor-2489-thread-1-processing-n:127.0.0.1:43827_) [n:127.0.0.1:43827_ c:collection1   x:collection1] o.a.s.c.ConfigSetProperties Did not find ConfigSet properties, assuming default properties: Can't find resource 'configsetprops.json' in classpath or '/configs/conf1', cwd=/home/jenkins/workspace/Lucene-Solr-5.5-Linux/solr/build/solr-core/test/J0
   [junit4]   2> 439725 INFO  (coreLoadExecutor-2489-thread-1-processing-n:127.0.0.1:43827_) [n:127.0.0.1:43827_ c:collection1   x:collection1] o.a.s.c.CoreContainer Creating SolrCore 'collection1' using configuration from collection collection1
   [junit4]   2> 439725 INFO  (coreLoadExecutor-2489-thread-1-processing-n:127.0.0.1:43827_) [n:127.0.0.1:43827_ c:collection1 s:shard2 r:core_node1 x:collection1] o.a.s.c.SolrCore org.apache.solr.core.MockDirectoryFactory
   [junit4]   2> 439725 INFO  (coreLoadExecutor-2489-thread-1-processing-n:127.0.0.1:43827_) [n:127.0.0.1:43827_ c:collection1 s:shard2 r:core_node1 x:collection1] o.a.s.c.SolrCore [[collection1] ] Opening new SolrCore at [/home/jenkins/workspace/Lucene-Solr-5.5-Linux/solr/build/solr-core/test/J0/temp/solr.handler.TestSolrConfigHandlerCloud_64370980C7089CB8-001/shard-1-001/cores/collection1], dataDir=[/home/jenkins/workspace/Lucene-Solr-5.5-Linux/solr/build/solr-core/test/J0/temp/solr.handler.TestSolrConfigHandlerCloud_64370980C7089CB8-001/shard-1-001/cores/collection1/data/]
   [junit4]   2> 439725 INFO  (coreLoadExecutor-2489-thread-1-processing-n:127.0.0.1:43827_) [n:127.0.0.1:43827_ c:collection1 s:shard2 r:core_node1 x:collection1] o.a.s.c.JmxMonitoredMap JMX monitoring is enabled. Adding Solr mbeans to JMX Server: com.sun.jmx.mbeanserver.JmxMBeanServer@16e7d1f
   [junit4]   2> 439726 INFO  (coreLoadExecutor-2489-thread-1-processing-n:127.0.0.1:43827_) [n:127.0.0.1:43827_ c:collection1 s:shard2 r:core_node1 x:collection1] o.a.s.c.CachingDirectoryFactory return new directory for /home/jenkins/workspace/Lucene-Solr-5.5-Linux/solr/build/solr-core/test/J0/temp/solr.handler.TestSolrConfigHandlerCloud_64370980C7089CB8-001/shard-1-001/cores/collection1/data
   [junit4]   2> 439726 INFO  (coreLoadExecutor-2489-thread-1-processing-n:127.0.0.1:43827_) [n:127.0.0.1:43827_ c:collection1 s:shard2 r:core_node1 x:collection1] o.a.s.c.SolrCore New index directory detected: old=null new=/home/jenkins/workspace/Lucene-Solr-5.5-Linux/solr/build/solr-core/test/J0/temp/solr.handler.TestSolrConfigHandlerCloud_64370980C7089CB8-001/shard-1-001/cores/collection1/data/index/
   [junit4]   2> 439726 WARN  (coreLoadExecutor-2489-thread-1-processing-n:127.0.0.1:43827_) [n:127.0.0.1:43827_ c:collection1 s:shard2 r:core_node1 x:collection1] o.a.s.c.SolrCore [collection1] Solr index directory '/home/jenkins/workspace/Lucene-Solr-5.5-Linux/solr/build/solr-core/test/J0/temp/solr.handler.TestSolrConfigHandlerCloud_64370980C7089CB8-001/shard-1-001/cores/collection1/data/index' doesn't exist. Creating new index...
   [junit4]   2> 439726 INFO  (coreLoadExecutor-2489-thread-1-processing-n:127.0.0.1:43827_) [n:127.0.0.1:43827_ c:collection1 s:shard2 r:core_node1 x:collection1] o.a.s.c.CachingDirectoryFactory return new directory for /home/jenkins/workspace/Lucene-Solr-5.5-Linux/solr/build/solr-core/test/J0/temp/solr.handler.TestSolrConfigHandlerCloud_64370980C7089CB8-001/shard-1-001/cores/collection1/data/index
   [junit4]   2> 439726 INFO  (coreLoadExecutor-2489-thread-1-processing-n:127.0.0.1:43827_) [n:127.0.0.1:43827_ c:collection1 s:shard2 r:core_node1 x:collection1] o.a.s.u.RandomMergePolicy RandomMergePolicy wrapping class org.apache.lucene.index.LogByteSizeMergePolicy: [LogByteSizeMergePolicy: minMergeSize=1677721, mergeFactor=29, maxMergeSize=2147483648, maxMergeSizeForForcedMerge=9223372036854775807, calibrateSizeByDeletes=false, maxMergeDocs=2147483647, maxCFSSegmentSizeMB=8.796093022207999E12, noCFSRatio=1.0]
   [junit4]   2> 439727 INFO  (coreLoadExecutor-2489-thread-1-processing-n:127.0.0.1:43827_) [n:127.0.0.1:43827_ c:collection1 s:shard2 r:core_node1 x:collection1] o.a.s.c.SolrDeletionPolicy SolrDeletionPolicy.onCommit: commits: num=1
   [junit4]   2> 	commit{dir=MockDirectoryWrapper(RAMDirectory@168e5de lockFactory=org.apache.lucene.store.SingleInstanceLockFactory@14dce81),segFN=segments_1,generation=1}
   [junit4]   2> 439727 INFO  (coreLoadExecutor-2489-thread-1-processing-n:127.0.0.1:43827_) [n:127.0.0.1:43827_ c:collection1 s:shard2 r:core_node1 x:collection1] o.a.s.c.SolrDeletionPolicy newest commit generation = 1
   [junit4]   2> 439727 INFO  (OldIndexDirectoryCleanupThreadForCore-collection1) [n:127.0.0.1:43827_ c:collection1 s:shard2 r:core_node1 x:collection1] o.a.s.c.SolrCore Looking for old index directories to cleanup for core collection1 in /home/jenkins/workspace/Lucene-Solr-5.5-Linux/solr/build/solr-core/test/J0/temp/solr.handler.TestSolrConfigHandlerCloud_64370980C7089CB8-001/shard-1-001/cores/collection1/data/
   [junit4]   2> 439727 WARN  (OldIndexDirectoryCleanupThreadForCore-collection1) [n:127.0.0.1:43827_ c:collection1 s:shard2 r:core_node1 x:collection1] o.a.s.c.DirectoryFactory /home/jenkins/workspace/Lucene-Solr-5.5-Linux/solr/build/solr-core/test/J0/temp/solr.handler.TestSolrConfigHandlerCloud_64370980C7089CB8-001/shard-1-001/cores/collection1/data/ does not point to a valid data directory; skipping clean-up of old index directories.
   [junit4]   2> 439729 INFO  (coreLoadExecutor-2489-thread-1-processing-n:127.0.0.1:43827_) [n:127.0.0.1:43827_ c:collection1 s:shard2 r:core_node1 x:collection1] o.a.s.u.p.UpdateRequestProcessorChain creating updateRequestProcessorChain "nodistrib"
   [junit4]   2> 439729 INFO  (coreLoadExecutor-2489-thread-1-processing-n:127.0.0.1:43827_) [n:127.0.0.1:43827_ c:collection1 s:shard2 r:core_node1 x:collection1] o.a.s.u.p.UpdateRequestProcessorChain creating updateRequestProcessorChain "dedupe"
   [junit4]   2> 439729 INFO  (coreLoadExecutor-2489-thread-1-processing-n:127.0.0.1:43827_) [n:127.0.0.1:43827_ c:collection1 s:shard2 r:core_node1 x:collection1] o.a.s.u.p.UpdateRequestProcessorChain inserting DistributedUpdateProcessorFactory into updateRequestProcessorChain "dedupe"
   [junit4]   2> 439729 INFO  (coreLoadExecutor-2489-thread-1-processing-n:127.0.0.1:43827_) [n:127.0.0.1:43827_ c:collection1 s:shard2 r:core_node1 x:collection1] o.a.s.u.p.UpdateRequestProcessorChain creating updateRequestProcessorChain "stored_sig"
   [junit4]   2> 439729 INFO  (coreLoadExecutor-2489-thread-1-processing-n:127.0.0.1:43827_) [n:127.0.0.1:43827_ c:collection1 s:shard2 r:core_node1 x:collection1] o.a.s.u.p.UpdateRequestProcessorChain inserting DistributedUpdateProcessorFactory into updateRequestProcessorChain "stored_sig"
   [junit4]   2> 439729 INFO  (coreLoadExecutor-2489-thread-1-processing-n:127.0.0.1:43827_) [n:127.0.0.1:43827_ c:collection1 s:shard2 r:core_node1 x:collection1] o.a.s.u.p.UpdateRequestProcessorChain creating updateRequestProcessorChain "distrib-dup-test-chain-explicit"
   [junit4]   2> 439729 INFO  (coreLoadExecutor-2489-thread-1-processing-n:127.0.0.1:43827_) [n:127.0.0.1:43827_ c:collection1 s:shard2 r:core_node1 x:collection1] o.a.s.u.p.UpdateRequestProcessorChain creating updateRequestProcessorChain "distrib-dup-test-chain-implicit"
   [junit4]   2> 439730 INFO  (coreLoadExecutor-2489-thread-1-processing-n:127.0.0.1:43827_) [n:127.0.0.1:43827_ c:collection1 

[...truncated too long message...]

a(SolrResourceLoader.java:355)
   [junit4]   2> 	at org.apache.solr.schema.IndexSchemaFactory.create(IndexSchemaFactory.java:48)
   [junit4]   2> 	... 6 more
   [junit4]   2> Caused by: org.apache.zookeeper.KeeperException$SessionExpiredException: KeeperErrorCode = Session expired for /configs/conf1/schema.xml
   [junit4]   2> 	at org.apache.zookeeper.KeeperException.create(KeeperException.java:127)
   [junit4]   2> 	at org.apache.zookeeper.KeeperException.create(KeeperException.java:51)
   [junit4]   2> 	at org.apache.zookeeper.ZooKeeper.exists(ZooKeeper.java:1045)
   [junit4]   2> 	at org.apache.solr.common.cloud.SolrZkClient$5.execute(SolrZkClient.java:311)
   [junit4]   2> 	at org.apache.solr.common.cloud.SolrZkClient$5.execute(SolrZkClient.java:308)
   [junit4]   2> 	at org.apache.solr.common.cloud.ZkCmdExecutor.retryOperation(ZkCmdExecutor.java:60)
   [junit4]   2> 	at org.apache.solr.common.cloud.SolrZkClient.exists(SolrZkClient.java:308)
   [junit4]   2> 	at org.apache.solr.cloud.ZkController.pathExists(ZkController.java:839)
   [junit4]   2> 	at org.apache.solr.cloud.ZkSolrResourceLoader.openResource(ZkSolrResourceLoader.java:89)
   [junit4]   2> 	... 8 more
   [junit4]   2> Sep 12, 2016 9:15:03 PM com.carrotsearch.randomizedtesting.ThreadLeakControl checkThreadLeaks
   [junit4]   2> SEVERE: 1 thread leaked from SUITE scope at org.apache.solr.handler.TestSolrConfigHandlerCloud: 
   [junit4]   2>    1) Thread[id=4420, name=Thread-1996, state=TIMED_WAITING, group=TGRP-TestSolrConfigHandlerCloud]
   [junit4]   2>         at java.lang.Thread.sleep(Native Method)
   [junit4]   2>         at org.apache.solr.cloud.ZkSolrResourceLoader.openResource(ZkSolrResourceLoader.java:101)
   [junit4]   2>         at org.apache.solr.core.SolrResourceLoader.openSchema(SolrResourceLoader.java:355)
   [junit4]   2>         at org.apache.solr.schema.IndexSchemaFactory.create(IndexSchemaFactory.java:48)
   [junit4]   2>         at org.apache.solr.schema.IndexSchemaFactory.buildIndexSchema(IndexSchemaFactory.java:70)
   [junit4]   2>         at org.apache.solr.core.ConfigSetService.createIndexSchema(ConfigSetService.java:108)
   [junit4]   2>         at org.apache.solr.core.ConfigSetService.getConfig(ConfigSetService.java:79)
   [junit4]   2>         at org.apache.solr.core.CoreContainer.reload(CoreContainer.java:920)
   [junit4]   2>         at org.apache.solr.core.SolrCore$11.run(SolrCore.java:2623)
   [junit4]   2>         at org.apache.solr.cloud.ZkController$5.run(ZkController.java:2480)
   [junit4]   2> Sep 12, 2016 9:15:03 PM com.carrotsearch.randomizedtesting.ThreadLeakControl tryToInterruptAll
   [junit4]   2> INFO: Starting to interrupt leaked threads:
   [junit4]   2>    1) Thread[id=4420, name=Thread-1996, state=TIMED_WAITING, group=TGRP-TestSolrConfigHandlerCloud]
   [junit4]   2> 489486 ERROR (Thread-1996) [n:127.0.0.1:38618_    ] o.a.s.s.IndexSchemaFactory Error loading schema resource schema.xml
   [junit4]   2> java.io.IOException: Could not load resource=schema.xml
   [junit4]   2> 	at org.apache.solr.cloud.ZkSolrResourceLoader.openResource(ZkSolrResourceLoader.java:105)
   [junit4]   2> 	at org.apache.solr.core.SolrResourceLoader.openSchema(SolrResourceLoader.java:355)
   [junit4]   2> 	at org.apache.solr.schema.IndexSchemaFactory.create(IndexSchemaFactory.java:48)
   [junit4]   2> 	at org.apache.solr.schema.IndexSchemaFactory.buildIndexSchema(IndexSchemaFactory.java:70)
   [junit4]   2> 	at org.apache.solr.core.ConfigSetService.createIndexSchema(ConfigSetService.java:108)
   [junit4]   2> 	at org.apache.solr.core.ConfigSetService.getConfig(ConfigSetService.java:79)
   [junit4]   2> 	at org.apache.solr.core.CoreContainer.reload(CoreContainer.java:920)
   [junit4]   2> 	at org.apache.solr.core.SolrCore$11.run(SolrCore.java:2623)
   [junit4]   2> 	at org.apache.solr.cloud.ZkController$5.run(ZkController.java:2480)
   [junit4]   2> Caused by: java.lang.InterruptedException: sleep interrupted
   [junit4]   2> 	at java.lang.Thread.sleep(Native Method)
   [junit4]   2> 	at org.apache.solr.cloud.ZkSolrResourceLoader.openResource(ZkSolrResourceLoader.java:101)
   [junit4]   2> 	... 8 more
   [junit4]   2> 489486 WARN  (Thread-1996) [n:127.0.0.1:38618_    ] o.a.s.c.SolrCores Tried to remove core collection1 from pendingCoreOps and it wasn't there. 
   [junit4]   2> 489486 WARN  (Thread-1996) [n:127.0.0.1:38618_    ] o.a.s.c.ZkController listener throws error
   [junit4]   2> org.apache.solr.common.SolrException: Unable to reload core [collection1]
   [junit4]   2> 	at org.apache.solr.core.CoreContainer.reload(CoreContainer.java:927)
   [junit4]   2> 	at org.apache.solr.core.SolrCore$11.run(SolrCore.java:2623)
   [junit4]   2> 	at org.apache.solr.cloud.ZkController$5.run(ZkController.java:2480)
   [junit4]   2> Caused by: org.apache.solr.common.SolrException: Could not load conf for core collection1: Error loading schema resource schema.xml
   [junit4]   2> 	at org.apache.solr.core.ConfigSetService.getConfig(ConfigSetService.java:86)
   [junit4]   2> 	at org.apache.solr.core.CoreContainer.reload(CoreContainer.java:920)
   [junit4]   2> 	... 2 more
   [junit4]   2> Caused by: org.apache.solr.common.SolrException: Error loading schema resource schema.xml
   [junit4]   2> 	at org.apache.solr.schema.IndexSchemaFactory.create(IndexSchemaFactory.java:52)
   [junit4]   2> 	at org.apache.solr.schema.IndexSchemaFactory.buildIndexSchema(IndexSchemaFactory.java:70)
   [junit4]   2> 	at org.apache.solr.core.ConfigSetService.createIndexSchema(ConfigSetService.java:108)
   [junit4]   2> 	at org.apache.solr.core.ConfigSetService.getConfig(ConfigSetService.java:79)
   [junit4]   2> 	... 3 more
   [junit4]   2> Caused by: java.io.IOException: Could not load resource=schema.xml
   [junit4]   2> 	at org.apache.solr.cloud.ZkSolrResourceLoader.openResource(ZkSolrResourceLoader.java:105)
   [junit4]   2> 	at org.apache.solr.core.SolrResourceLoader.openSchema(SolrResourceLoader.java:355)
   [junit4]   2> 	at org.apache.solr.schema.IndexSchemaFactory.create(IndexSchemaFactory.java:48)
   [junit4]   2> 	... 6 more
   [junit4]   2> Caused by: java.lang.InterruptedException: sleep interrupted
   [junit4]   2> 	at java.lang.Thread.sleep(Native Method)
   [junit4]   2> 	at org.apache.solr.cloud.ZkSolrResourceLoader.openResource(ZkSolrResourceLoader.java:101)
   [junit4]   2> 	... 8 more
   [junit4]   2> Sep 12, 2016 9:15:03 PM com.carrotsearch.randomizedtesting.ThreadLeakControl tryToInterruptAll
   [junit4]   2> INFO: All leaked threads terminated.
   [junit4]   2> NOTE: test params are: codec=Asserting(Lucene54): {}, docValues:{}, sim=DefaultSimilarity, locale=es-CR, timezone=Asia/Oral
   [junit4]   2> NOTE: Linux 4.4.0-36-generic i386/Oracle Corporation 1.8.0_102 (32-bit)/cpus=12,threads=1,free=145467456,total=244580352
   [junit4]   2> NOTE: All tests run in this JVM: [QueryElevationComponentTest, TestFieldResource, SaslZkACLProviderTest, ChangedSchemaMergeTest, TestCustomDocTransformer, LeaderFailoverAfterPartitionTest, TestSchemaSimilarityResource, ZkNodePropsTest, DistributedSpellCheckComponentTest, TestMiniSolrCloudClusterSSL, TestPhraseSuggestions, AlternateDirectoryTest, VersionInfoTest, SuggestComponentTest, BlockJoinFacetDistribTest, TestRemoveLastDynamicCopyField, TestRandomCollapseQParserPlugin, TestXmlQParser, TestSolrConfigHandler, CloneFieldUpdateProcessorFactoryTest, PrimUtilsTest, HdfsChaosMonkeySafeLeaderTest, ExternalFileFieldSortTest, JsonLoaderTest, EchoParamsTest, TestBlendedInfixSuggestions, HdfsBasicDistributedZk2Test, RequestLoggingTest, RestartWhileUpdatingTest, TestLazyCores, DistributedExpandComponentTest, FileBasedSpellCheckerTest, RAMDirectoryFactoryTest, DeleteInactiveReplicaTest, TestRandomDVFaceting, DistributedFacetPivotSmallAdvancedTest, RequiredFieldsTest, URLClassifyProcessorTest, TestSchemaManager, TestComplexPhraseQParserPlugin, JSONWriterTest, ResponseHeaderTest, QueryResultKeyTest, TestIntervalFaceting, PeerSyncTest, TestMergePolicyConfig, TestReplicationHandler, CleanupOldIndexTest, ExplicitHLLTest, TestIBSimilarityFactory, TestHashQParserPlugin, TestSolr4Spatial, AddBlockUpdateTest, TestRebalanceLeaders, TestSolrConfigHandlerCloud]
   [junit4]   2> NOTE: reproduce with: ant test  -Dtestcase=TestSolrConfigHandlerCloud -Dtests.seed=64370980C7089CB8 -Dtests.multiplier=3 -Dtests.slow=true -Dtests.locale=es-CR -Dtests.timezone=Asia/Oral -Dtests.asserts=true -Dtests.file.encoding=ISO-8859-1
   [junit4] ERROR   0.00s J0 | TestSolrConfigHandlerCloud (suite) <<<
   [junit4]    > Throwable #1: com.carrotsearch.randomizedtesting.ThreadLeakError: 1 thread leaked from SUITE scope at org.apache.solr.handler.TestSolrConfigHandlerCloud: 
   [junit4]    >    1) Thread[id=4420, name=Thread-1996, state=TIMED_WAITING, group=TGRP-TestSolrConfigHandlerCloud]
   [junit4]    >         at java.lang.Thread.sleep(Native Method)
   [junit4]    >         at org.apache.solr.cloud.ZkSolrResourceLoader.openResource(ZkSolrResourceLoader.java:101)
   [junit4]    >         at org.apache.solr.core.SolrResourceLoader.openSchema(SolrResourceLoader.java:355)
   [junit4]    >         at org.apache.solr.schema.IndexSchemaFactory.create(IndexSchemaFactory.java:48)
   [junit4]    >         at org.apache.solr.schema.IndexSchemaFactory.buildIndexSchema(IndexSchemaFactory.java:70)
   [junit4]    >         at org.apache.solr.core.ConfigSetService.createIndexSchema(ConfigSetService.java:108)
   [junit4]    >         at org.apache.solr.core.ConfigSetService.getConfig(ConfigSetService.java:79)
   [junit4]    >         at org.apache.solr.core.CoreContainer.reload(CoreContainer.java:920)
   [junit4]    >         at org.apache.solr.core.SolrCore$11.run(SolrCore.java:2623)
   [junit4]    >         at org.apache.solr.cloud.ZkController$5.run(ZkController.java:2480)
   [junit4]    > 	at __randomizedtesting.SeedInfo.seed([64370980C7089CB8]:0)
   [junit4] Completed [172/575 (1!)] on J0 in 53.77s, 1 test, 1 error <<< FAILURES!

[...truncated 50447 lines...]


Mime
View raw message