lucene-dev mailing list archives

Site index · List index
Message view « Date » · « Thread »
Top « Date » · « Thread »
From Policeman Jenkins Server <jenk...@thetaphi.de>
Subject [JENKINS] Lucene-Solr-master-Linux (64bit/jdk1.8.0_102) - Build # 17802 - Unstable!
Date Sun, 11 Sep 2016 20:45:01 GMT
Build: http://jenkins.thetaphi.de/job/Lucene-Solr-master-Linux/17802/
Java: 64bit/jdk1.8.0_102 -XX:+UseCompressedOops -XX:+UseConcMarkSweepGC

1 tests failed.
FAILED:  org.apache.solr.core.TestDynamicLoading.testDynamicLoading

Error Message:
Could not get expected value  'X val' for path 'x' full output: {   "responseHeader":{     "status":0,     "QTime":0},   "params":{"wt":"json"},   "context":{     "webapp":"/btv/gk",     "path":"/test1",     "httpMethod":"GET"},   "class":"org.apache.solr.core.BlobStoreTestRequestHandler",   "x":null},  from server:  null

Stack Trace:
java.lang.AssertionError: Could not get expected value  'X val' for path 'x' full output: {
  "responseHeader":{
    "status":0,
    "QTime":0},
  "params":{"wt":"json"},
  "context":{
    "webapp":"/btv/gk",
    "path":"/test1",
    "httpMethod":"GET"},
  "class":"org.apache.solr.core.BlobStoreTestRequestHandler",
  "x":null},  from server:  null
	at __randomizedtesting.SeedInfo.seed([578E62177CC72114:8FC34F408B1A84B4]:0)
	at org.junit.Assert.fail(Assert.java:93)
	at org.junit.Assert.assertTrue(Assert.java:43)
	at org.apache.solr.core.TestSolrConfigHandler.testForResponseElement(TestSolrConfigHandler.java:535)
	at org.apache.solr.core.TestDynamicLoading.testDynamicLoading(TestDynamicLoading.java:232)
	at sun.reflect.NativeMethodAccessorImpl.invoke0(Native Method)
	at sun.reflect.NativeMethodAccessorImpl.invoke(NativeMethodAccessorImpl.java:62)
	at sun.reflect.DelegatingMethodAccessorImpl.invoke(DelegatingMethodAccessorImpl.java:43)
	at java.lang.reflect.Method.invoke(Method.java:498)
	at com.carrotsearch.randomizedtesting.RandomizedRunner.invoke(RandomizedRunner.java:1764)
	at com.carrotsearch.randomizedtesting.RandomizedRunner$8.evaluate(RandomizedRunner.java:871)
	at com.carrotsearch.randomizedtesting.RandomizedRunner$9.evaluate(RandomizedRunner.java:907)
	at com.carrotsearch.randomizedtesting.RandomizedRunner$10.evaluate(RandomizedRunner.java:921)
	at org.apache.solr.BaseDistributedSearchTestCase$ShardsRepeatRule$ShardsFixedStatement.callStatement(BaseDistributedSearchTestCase.java:985)
	at org.apache.solr.BaseDistributedSearchTestCase$ShardsRepeatRule$ShardsStatement.evaluate(BaseDistributedSearchTestCase.java:960)
	at com.carrotsearch.randomizedtesting.rules.SystemPropertiesRestoreRule$1.evaluate(SystemPropertiesRestoreRule.java:57)
	at org.apache.lucene.util.TestRuleSetupTeardownChained$1.evaluate(TestRuleSetupTeardownChained.java:49)
	at org.apache.lucene.util.AbstractBeforeAfterRule$1.evaluate(AbstractBeforeAfterRule.java:45)
	at org.apache.lucene.util.TestRuleThreadAndTestName$1.evaluate(TestRuleThreadAndTestName.java:48)
	at org.apache.lucene.util.TestRuleIgnoreAfterMaxFailures$1.evaluate(TestRuleIgnoreAfterMaxFailures.java:64)
	at org.apache.lucene.util.TestRuleMarkFailure$1.evaluate(TestRuleMarkFailure.java:47)
	at com.carrotsearch.randomizedtesting.rules.StatementAdapter.evaluate(StatementAdapter.java:36)
	at com.carrotsearch.randomizedtesting.ThreadLeakControl$StatementRunner.run(ThreadLeakControl.java:367)
	at com.carrotsearch.randomizedtesting.ThreadLeakControl.forkTimeoutingTask(ThreadLeakControl.java:809)
	at com.carrotsearch.randomizedtesting.ThreadLeakControl$3.evaluate(ThreadLeakControl.java:460)
	at com.carrotsearch.randomizedtesting.RandomizedRunner.runSingleTest(RandomizedRunner.java:880)
	at com.carrotsearch.randomizedtesting.RandomizedRunner$5.evaluate(RandomizedRunner.java:781)
	at com.carrotsearch.randomizedtesting.RandomizedRunner$6.evaluate(RandomizedRunner.java:816)
	at com.carrotsearch.randomizedtesting.RandomizedRunner$7.evaluate(RandomizedRunner.java:827)
	at com.carrotsearch.randomizedtesting.rules.StatementAdapter.evaluate(StatementAdapter.java:36)
	at com.carrotsearch.randomizedtesting.rules.SystemPropertiesRestoreRule$1.evaluate(SystemPropertiesRestoreRule.java:57)
	at org.apache.lucene.util.AbstractBeforeAfterRule$1.evaluate(AbstractBeforeAfterRule.java:45)
	at com.carrotsearch.randomizedtesting.rules.StatementAdapter.evaluate(StatementAdapter.java:36)
	at org.apache.lucene.util.TestRuleStoreClassName$1.evaluate(TestRuleStoreClassName.java:41)
	at com.carrotsearch.randomizedtesting.rules.NoShadowingOrOverridesOnMethodsRule$1.evaluate(NoShadowingOrOverridesOnMethodsRule.java:40)
	at com.carrotsearch.randomizedtesting.rules.NoShadowingOrOverridesOnMethodsRule$1.evaluate(NoShadowingOrOverridesOnMethodsRule.java:40)
	at com.carrotsearch.randomizedtesting.rules.StatementAdapter.evaluate(StatementAdapter.java:36)
	at com.carrotsearch.randomizedtesting.rules.StatementAdapter.evaluate(StatementAdapter.java:36)
	at com.carrotsearch.randomizedtesting.rules.StatementAdapter.evaluate(StatementAdapter.java:36)
	at org.apache.lucene.util.TestRuleAssertionsRequired$1.evaluate(TestRuleAssertionsRequired.java:53)
	at org.apache.lucene.util.TestRuleMarkFailure$1.evaluate(TestRuleMarkFailure.java:47)
	at org.apache.lucene.util.TestRuleIgnoreAfterMaxFailures$1.evaluate(TestRuleIgnoreAfterMaxFailures.java:64)
	at org.apache.lucene.util.TestRuleIgnoreTestSuites$1.evaluate(TestRuleIgnoreTestSuites.java:54)
	at com.carrotsearch.randomizedtesting.rules.StatementAdapter.evaluate(StatementAdapter.java:36)
	at com.carrotsearch.randomizedtesting.ThreadLeakControl$StatementRunner.run(ThreadLeakControl.java:367)
	at java.lang.Thread.run(Thread.java:745)




Build Log:
[...truncated 12221 lines...]
   [junit4] Suite: org.apache.solr.core.TestDynamicLoading
   [junit4]   2> Creating dataDir: /home/jenkins/workspace/Lucene-Solr-master-Linux/solr/build/solr-core/test/J0/temp/solr.core.TestDynamicLoading_578E62177CC72114-001/init-core-data-001
   [junit4]   2> 1759066 INFO  (SUITE-TestDynamicLoading-seed#[578E62177CC72114]-worker) [    ] o.a.s.SolrTestCaseJ4 Randomized ssl (true) and clientAuth (true) via: @org.apache.solr.util.RandomizeSSL(reason=, value=NaN, ssl=NaN, clientAuth=NaN)
   [junit4]   2> 1759066 INFO  (SUITE-TestDynamicLoading-seed#[578E62177CC72114]-worker) [    ] o.a.s.BaseDistributedSearchTestCase Setting hostContext system property: /btv/gk
   [junit4]   2> 1759068 INFO  (TEST-TestDynamicLoading.testDynamicLoading-seed#[578E62177CC72114]) [    ] o.a.s.c.ZkTestServer STARTING ZK TEST SERVER
   [junit4]   2> 1759069 INFO  (Thread-2911) [    ] o.a.s.c.ZkTestServer client port:0.0.0.0/0.0.0.0:0
   [junit4]   2> 1759069 INFO  (Thread-2911) [    ] o.a.s.c.ZkTestServer Starting server
   [junit4]   2> 1759169 INFO  (TEST-TestDynamicLoading.testDynamicLoading-seed#[578E62177CC72114]) [    ] o.a.s.c.ZkTestServer start zk server on port:40207
   [junit4]   2> 1759169 INFO  (TEST-TestDynamicLoading.testDynamicLoading-seed#[578E62177CC72114]) [    ] o.a.s.c.c.SolrZkClient Using default ZkCredentialsProvider
   [junit4]   2> 1759169 INFO  (TEST-TestDynamicLoading.testDynamicLoading-seed#[578E62177CC72114]) [    ] o.a.s.c.c.ConnectionManager Waiting for client to connect to ZooKeeper
   [junit4]   2> 1759172 INFO  (zkCallback-20495-thread-1) [    ] o.a.s.c.c.ConnectionManager Watcher org.apache.solr.common.cloud.ConnectionManager@3fd1e3fa name:ZooKeeperConnection Watcher:127.0.0.1:40207 got event WatchedEvent state:SyncConnected type:None path:null path:null type:None
   [junit4]   2> 1759172 INFO  (TEST-TestDynamicLoading.testDynamicLoading-seed#[578E62177CC72114]) [    ] o.a.s.c.c.ConnectionManager Client is connected to ZooKeeper
   [junit4]   2> 1759172 INFO  (TEST-TestDynamicLoading.testDynamicLoading-seed#[578E62177CC72114]) [    ] o.a.s.c.c.SolrZkClient Using default ZkACLProvider
   [junit4]   2> 1759172 INFO  (TEST-TestDynamicLoading.testDynamicLoading-seed#[578E62177CC72114]) [    ] o.a.s.c.c.SolrZkClient makePath: /solr
   [junit4]   2> 1759174 INFO  (TEST-TestDynamicLoading.testDynamicLoading-seed#[578E62177CC72114]) [    ] o.a.s.c.c.SolrZkClient Using default ZkCredentialsProvider
   [junit4]   2> 1759175 INFO  (TEST-TestDynamicLoading.testDynamicLoading-seed#[578E62177CC72114]) [    ] o.a.s.c.c.ConnectionManager Waiting for client to connect to ZooKeeper
   [junit4]   2> 1759176 INFO  (zkCallback-20496-thread-1) [    ] o.a.s.c.c.ConnectionManager Watcher org.apache.solr.common.cloud.ConnectionManager@15cbcff3 name:ZooKeeperConnection Watcher:127.0.0.1:40207/solr got event WatchedEvent state:SyncConnected type:None path:null path:null type:None
   [junit4]   2> 1759176 INFO  (TEST-TestDynamicLoading.testDynamicLoading-seed#[578E62177CC72114]) [    ] o.a.s.c.c.ConnectionManager Client is connected to ZooKeeper
   [junit4]   2> 1759176 INFO  (TEST-TestDynamicLoading.testDynamicLoading-seed#[578E62177CC72114]) [    ] o.a.s.c.c.SolrZkClient Using default ZkACLProvider
   [junit4]   2> 1759176 INFO  (TEST-TestDynamicLoading.testDynamicLoading-seed#[578E62177CC72114]) [    ] o.a.s.c.c.SolrZkClient makePath: /collections/collection1
   [junit4]   2> 1759178 INFO  (TEST-TestDynamicLoading.testDynamicLoading-seed#[578E62177CC72114]) [    ] o.a.s.c.c.SolrZkClient makePath: /collections/collection1/shards
   [junit4]   2> 1759178 INFO  (TEST-TestDynamicLoading.testDynamicLoading-seed#[578E62177CC72114]) [    ] o.a.s.c.c.SolrZkClient makePath: /collections/control_collection
   [junit4]   2> 1759179 INFO  (TEST-TestDynamicLoading.testDynamicLoading-seed#[578E62177CC72114]) [    ] o.a.s.c.c.SolrZkClient makePath: /collections/control_collection/shards
   [junit4]   2> 1759179 INFO  (TEST-TestDynamicLoading.testDynamicLoading-seed#[578E62177CC72114]) [    ] o.a.s.c.AbstractZkTestCase put /home/jenkins/workspace/Lucene-Solr-master-Linux/solr/core/src/test-files/solr/collection1/conf/solrconfig-tlog.xml to /configs/conf1/solrconfig.xml
   [junit4]   2> 1759179 INFO  (TEST-TestDynamicLoading.testDynamicLoading-seed#[578E62177CC72114]) [    ] o.a.s.c.c.SolrZkClient makePath: /configs/conf1/solrconfig.xml
   [junit4]   2> 1759180 INFO  (TEST-TestDynamicLoading.testDynamicLoading-seed#[578E62177CC72114]) [    ] o.a.s.c.AbstractZkTestCase put /home/jenkins/workspace/Lucene-Solr-master-Linux/solr/core/src/test-files/solr/collection1/conf/schema.xml to /configs/conf1/schema.xml
   [junit4]   2> 1759180 INFO  (TEST-TestDynamicLoading.testDynamicLoading-seed#[578E62177CC72114]) [    ] o.a.s.c.c.SolrZkClient makePath: /configs/conf1/schema.xml
   [junit4]   2> 1759181 INFO  (TEST-TestDynamicLoading.testDynamicLoading-seed#[578E62177CC72114]) [    ] o.a.s.c.AbstractZkTestCase put /home/jenkins/workspace/Lucene-Solr-master-Linux/solr/core/src/test-files/solr/collection1/conf/solrconfig.snippet.randomindexconfig.xml to /configs/conf1/solrconfig.snippet.randomindexconfig.xml
   [junit4]   2> 1759181 INFO  (TEST-TestDynamicLoading.testDynamicLoading-seed#[578E62177CC72114]) [    ] o.a.s.c.c.SolrZkClient makePath: /configs/conf1/solrconfig.snippet.randomindexconfig.xml
   [junit4]   2> 1759182 INFO  (TEST-TestDynamicLoading.testDynamicLoading-seed#[578E62177CC72114]) [    ] o.a.s.c.AbstractZkTestCase put /home/jenkins/workspace/Lucene-Solr-master-Linux/solr/core/src/test-files/solr/collection1/conf/stopwords.txt to /configs/conf1/stopwords.txt
   [junit4]   2> 1759182 INFO  (TEST-TestDynamicLoading.testDynamicLoading-seed#[578E62177CC72114]) [    ] o.a.s.c.c.SolrZkClient makePath: /configs/conf1/stopwords.txt
   [junit4]   2> 1759183 INFO  (TEST-TestDynamicLoading.testDynamicLoading-seed#[578E62177CC72114]) [    ] o.a.s.c.AbstractZkTestCase put /home/jenkins/workspace/Lucene-Solr-master-Linux/solr/core/src/test-files/solr/collection1/conf/protwords.txt to /configs/conf1/protwords.txt
   [junit4]   2> 1759183 INFO  (TEST-TestDynamicLoading.testDynamicLoading-seed#[578E62177CC72114]) [    ] o.a.s.c.c.SolrZkClient makePath: /configs/conf1/protwords.txt
   [junit4]   2> 1759183 INFO  (TEST-TestDynamicLoading.testDynamicLoading-seed#[578E62177CC72114]) [    ] o.a.s.c.AbstractZkTestCase put /home/jenkins/workspace/Lucene-Solr-master-Linux/solr/core/src/test-files/solr/collection1/conf/currency.xml to /configs/conf1/currency.xml
   [junit4]   2> 1759184 INFO  (TEST-TestDynamicLoading.testDynamicLoading-seed#[578E62177CC72114]) [    ] o.a.s.c.c.SolrZkClient makePath: /configs/conf1/currency.xml
   [junit4]   2> 1759185 INFO  (TEST-TestDynamicLoading.testDynamicLoading-seed#[578E62177CC72114]) [    ] o.a.s.c.AbstractZkTestCase put /home/jenkins/workspace/Lucene-Solr-master-Linux/solr/core/src/test-files/solr/collection1/conf/enumsConfig.xml to /configs/conf1/enumsConfig.xml
   [junit4]   2> 1759185 INFO  (TEST-TestDynamicLoading.testDynamicLoading-seed#[578E62177CC72114]) [    ] o.a.s.c.c.SolrZkClient makePath: /configs/conf1/enumsConfig.xml
   [junit4]   2> 1759185 INFO  (TEST-TestDynamicLoading.testDynamicLoading-seed#[578E62177CC72114]) [    ] o.a.s.c.AbstractZkTestCase put /home/jenkins/workspace/Lucene-Solr-master-Linux/solr/core/src/test-files/solr/collection1/conf/open-exchange-rates.json to /configs/conf1/open-exchange-rates.json
   [junit4]   2> 1759186 INFO  (TEST-TestDynamicLoading.testDynamicLoading-seed#[578E62177CC72114]) [    ] o.a.s.c.c.SolrZkClient makePath: /configs/conf1/open-exchange-rates.json
   [junit4]   2> 1759186 INFO  (TEST-TestDynamicLoading.testDynamicLoading-seed#[578E62177CC72114]) [    ] o.a.s.c.AbstractZkTestCase put /home/jenkins/workspace/Lucene-Solr-master-Linux/solr/core/src/test-files/solr/collection1/conf/mapping-ISOLatin1Accent.txt to /configs/conf1/mapping-ISOLatin1Accent.txt
   [junit4]   2> 1759186 INFO  (TEST-TestDynamicLoading.testDynamicLoading-seed#[578E62177CC72114]) [    ] o.a.s.c.c.SolrZkClient makePath: /configs/conf1/mapping-ISOLatin1Accent.txt
   [junit4]   2> 1759187 INFO  (TEST-TestDynamicLoading.testDynamicLoading-seed#[578E62177CC72114]) [    ] o.a.s.c.AbstractZkTestCase put /home/jenkins/workspace/Lucene-Solr-master-Linux/solr/core/src/test-files/solr/collection1/conf/old_synonyms.txt to /configs/conf1/old_synonyms.txt
   [junit4]   2> 1759187 INFO  (TEST-TestDynamicLoading.testDynamicLoading-seed#[578E62177CC72114]) [    ] o.a.s.c.c.SolrZkClient makePath: /configs/conf1/old_synonyms.txt
   [junit4]   2> 1759188 INFO  (TEST-TestDynamicLoading.testDynamicLoading-seed#[578E62177CC72114]) [    ] o.a.s.c.AbstractZkTestCase put /home/jenkins/workspace/Lucene-Solr-master-Linux/solr/core/src/test-files/solr/collection1/conf/synonyms.txt to /configs/conf1/synonyms.txt
   [junit4]   2> 1759188 INFO  (TEST-TestDynamicLoading.testDynamicLoading-seed#[578E62177CC72114]) [    ] o.a.s.c.c.SolrZkClient makePath: /configs/conf1/synonyms.txt
   [junit4]   2> 1759189 INFO  (TEST-TestDynamicLoading.testDynamicLoading-seed#[578E62177CC72114]) [    ] o.a.s.c.c.SolrZkClient Using default ZkCredentialsProvider
   [junit4]   2> 1759189 INFO  (TEST-TestDynamicLoading.testDynamicLoading-seed#[578E62177CC72114]) [    ] o.a.s.c.c.ConnectionManager Waiting for client to connect to ZooKeeper
   [junit4]   2> 1759190 INFO  (zkCallback-20498-thread-1) [    ] o.a.s.c.c.ConnectionManager Watcher org.apache.solr.common.cloud.ConnectionManager@7dcd0acd name:ZooKeeperConnection Watcher:127.0.0.1:40207/solr got event WatchedEvent state:SyncConnected type:None path:null path:null type:None
   [junit4]   2> 1759190 INFO  (TEST-TestDynamicLoading.testDynamicLoading-seed#[578E62177CC72114]) [    ] o.a.s.c.c.ConnectionManager Client is connected to ZooKeeper
   [junit4]   2> 1759190 INFO  (TEST-TestDynamicLoading.testDynamicLoading-seed#[578E62177CC72114]) [    ] o.a.s.c.c.SolrZkClient Using default ZkACLProvider
   [junit4]   2> 1759295 INFO  (TEST-TestDynamicLoading.testDynamicLoading-seed#[578E62177CC72114]) [    ] o.a.s.SolrTestCaseJ4 Writing core.properties file to /home/jenkins/workspace/Lucene-Solr-master-Linux/solr/build/solr-core/test/J0/temp/solr.core.TestDynamicLoading_578E62177CC72114-001/control-001/cores/collection1
   [junit4]   2> 1759297 INFO  (TEST-TestDynamicLoading.testDynamicLoading-seed#[578E62177CC72114]) [    ] o.e.j.s.Server jetty-9.3.8.v20160314
   [junit4]   2> 1759297 INFO  (TEST-TestDynamicLoading.testDynamicLoading-seed#[578E62177CC72114]) [    ] o.e.j.s.h.ContextHandler Started o.e.j.s.ServletContextHandler@5e65e56d{/btv/gk,null,AVAILABLE}
   [junit4]   2> 1759302 INFO  (TEST-TestDynamicLoading.testDynamicLoading-seed#[578E62177CC72114]) [    ] o.e.j.s.ServerConnector Started ServerConnector@421a800c{SSL,[ssl, http/1.1]}{127.0.0.1:45619}
   [junit4]   2> 1759302 INFO  (TEST-TestDynamicLoading.testDynamicLoading-seed#[578E62177CC72114]) [    ] o.e.j.s.Server Started @1761025ms
   [junit4]   2> 1759302 INFO  (TEST-TestDynamicLoading.testDynamicLoading-seed#[578E62177CC72114]) [    ] o.a.s.c.s.e.JettySolrRunner Jetty properties: {solr.data.dir=/home/jenkins/workspace/Lucene-Solr-master-Linux/solr/build/solr-core/test/J0/temp/solr.core.TestDynamicLoading_578E62177CC72114-001/tempDir-001/control/data, hostContext=/btv/gk, hostPort=45619, coreRootDirectory=/home/jenkins/workspace/Lucene-Solr-master-Linux/solr/build/solr-core/test/J0/../../../../../../../../../home/jenkins/workspace/Lucene-Solr-master-Linux/solr/build/solr-core/test/J0/temp/solr.core.TestDynamicLoading_578E62177CC72114-001/control-001/cores}
   [junit4]   2> 1759302 INFO  (TEST-TestDynamicLoading.testDynamicLoading-seed#[578E62177CC72114]) [    ] o.a.s.s.SolrDispatchFilter SolrDispatchFilter.init(): sun.misc.Launcher$AppClassLoader@73d16e93
   [junit4]   2> 1759302 INFO  (TEST-TestDynamicLoading.testDynamicLoading-seed#[578E62177CC72114]) [    ] o.a.s.c.SolrResourceLoader new SolrResourceLoader for directory: '/home/jenkins/workspace/Lucene-Solr-master-Linux/solr/build/solr-core/test/J0/temp/solr.core.TestDynamicLoading_578E62177CC72114-001/control-001'
   [junit4]   2> 1759302 INFO  (TEST-TestDynamicLoading.testDynamicLoading-seed#[578E62177CC72114]) [    ] o.a.s.c.SolrResourceLoader JNDI not configured for solr (NoInitialContextEx)
   [junit4]   2> 1759303 INFO  (TEST-TestDynamicLoading.testDynamicLoading-seed#[578E62177CC72114]) [    ] o.a.s.c.SolrResourceLoader solr home defaulted to 'solr/' (could not find system property or JNDI)
   [junit4]   2> 1759303 INFO  (TEST-TestDynamicLoading.testDynamicLoading-seed#[578E62177CC72114]) [    ] o.a.s.c.c.SolrZkClient Using default ZkCredentialsProvider
   [junit4]   2> 1759303 INFO  (TEST-TestDynamicLoading.testDynamicLoading-seed#[578E62177CC72114]) [    ] o.a.s.c.c.ConnectionManager Waiting for client to connect to ZooKeeper
   [junit4]   2> 1759304 INFO  (zkCallback-20499-thread-1) [    ] o.a.s.c.c.ConnectionManager Watcher org.apache.solr.common.cloud.ConnectionManager@252d89b2 name:ZooKeeperConnection Watcher:127.0.0.1:40207/solr got event WatchedEvent state:SyncConnected type:None path:null path:null type:None
   [junit4]   2> 1759304 INFO  (TEST-TestDynamicLoading.testDynamicLoading-seed#[578E62177CC72114]) [    ] o.a.s.c.c.ConnectionManager Client is connected to ZooKeeper
   [junit4]   2> 1759305 INFO  (TEST-TestDynamicLoading.testDynamicLoading-seed#[578E62177CC72114]) [    ] o.a.s.c.c.SolrZkClient Using default ZkACLProvider
   [junit4]   2> 1759305 INFO  (TEST-TestDynamicLoading.testDynamicLoading-seed#[578E62177CC72114]) [    ] o.a.s.s.SolrDispatchFilter Loading solr.xml from SolrHome (not found in ZooKeeper)
   [junit4]   2> 1759305 INFO  (TEST-TestDynamicLoading.testDynamicLoading-seed#[578E62177CC72114]) [    ] o.a.s.c.SolrXmlConfig Loading container configuration from /home/jenkins/workspace/Lucene-Solr-master-Linux/solr/build/solr-core/test/J0/temp/solr.core.TestDynamicLoading_578E62177CC72114-001/control-001/solr.xml
   [junit4]   2> 1759308 INFO  (TEST-TestDynamicLoading.testDynamicLoading-seed#[578E62177CC72114]) [    ] o.a.s.c.CorePropertiesLocator Config-defined core root directory: /home/jenkins/workspace/Lucene-Solr-master-Linux/solr/build/solr-core/test/J0/../../../../../../../../../home/jenkins/workspace/Lucene-Solr-master-Linux/solr/build/solr-core/test/J0/temp/solr.core.TestDynamicLoading_578E62177CC72114-001/control-001/cores
   [junit4]   2> 1759308 INFO  (TEST-TestDynamicLoading.testDynamicLoading-seed#[578E62177CC72114]) [    ] o.a.s.c.CoreContainer New CoreContainer 1117145756
   [junit4]   2> 1759308 INFO  (TEST-TestDynamicLoading.testDynamicLoading-seed#[578E62177CC72114]) [    ] o.a.s.c.CoreContainer Loading cores into CoreContainer [instanceDir=/home/jenkins/workspace/Lucene-Solr-master-Linux/solr/build/solr-core/test/J0/temp/solr.core.TestDynamicLoading_578E62177CC72114-001/control-001]
   [junit4]   2> 1759308 WARN  (TEST-TestDynamicLoading.testDynamicLoading-seed#[578E62177CC72114]) [    ] o.a.s.c.CoreContainer Couldn't add files from /home/jenkins/workspace/Lucene-Solr-master-Linux/solr/build/solr-core/test/J0/temp/solr.core.TestDynamicLoading_578E62177CC72114-001/control-001/lib to classpath: /home/jenkins/workspace/Lucene-Solr-master-Linux/solr/build/solr-core/test/J0/temp/solr.core.TestDynamicLoading_578E62177CC72114-001/control-001/lib
   [junit4]   2> 1759317 INFO  (TEST-TestDynamicLoading.testDynamicLoading-seed#[578E62177CC72114]) [    ] o.a.s.h.c.HttpShardHandlerFactory created with socketTimeout : 90000,urlScheme : ,connTimeout : 15000,maxConnectionsPerHost : 20,maxConnections : 10000,corePoolSize : 0,maximumPoolSize : 2147483647,maxThreadIdleTime : 5,sizeOfQueue : -1,fairnessPolicy : false,
   [junit4]   2> 1759318 INFO  (TEST-TestDynamicLoading.testDynamicLoading-seed#[578E62177CC72114]) [    ] o.a.s.u.UpdateShardHandler Created UpdateShardHandler HTTP client with params: socketTimeout=340000&connTimeout=45000&maxConnections=100000&maxConnectionsPerHost=100000
   [junit4]   2> 1759319 INFO  (TEST-TestDynamicLoading.testDynamicLoading-seed#[578E62177CC72114]) [    ] o.a.s.l.LogWatcher SLF4J impl is org.slf4j.impl.Log4jLoggerFactory
   [junit4]   2> 1759319 INFO  (TEST-TestDynamicLoading.testDynamicLoading-seed#[578E62177CC72114]) [    ] o.a.s.l.LogWatcher Registering Log Listener [Log4j (org.slf4j.impl.Log4jLoggerFactory)]
   [junit4]   2> 1759319 INFO  (TEST-TestDynamicLoading.testDynamicLoading-seed#[578E62177CC72114]) [    ] o.a.s.c.ZkContainer Zookeeper client=127.0.0.1:40207/solr
   [junit4]   2> 1759319 INFO  (TEST-TestDynamicLoading.testDynamicLoading-seed#[578E62177CC72114]) [    ] o.a.s.c.ZkController zkHost includes chroot
   [junit4]   2> 1759319 INFO  (TEST-TestDynamicLoading.testDynamicLoading-seed#[578E62177CC72114]) [    ] o.a.s.c.c.SolrZkClient Using default ZkCredentialsProvider
   [junit4]   2> 1759319 INFO  (TEST-TestDynamicLoading.testDynamicLoading-seed#[578E62177CC72114]) [    ] o.a.s.c.c.ConnectionManager Waiting for client to connect to ZooKeeper
   [junit4]   2> 1759319 INFO  (zkCallback-20502-thread-1) [    ] o.a.s.c.c.ConnectionManager Watcher org.apache.solr.common.cloud.ConnectionManager@4641c519 name:ZooKeeperConnection Watcher:127.0.0.1:40207 got event WatchedEvent state:SyncConnected type:None path:null path:null type:None
   [junit4]   2> 1759319 INFO  (TEST-TestDynamicLoading.testDynamicLoading-seed#[578E62177CC72114]) [    ] o.a.s.c.c.ConnectionManager Client is connected to ZooKeeper
   [junit4]   2> 1759320 INFO  (TEST-TestDynamicLoading.testDynamicLoading-seed#[578E62177CC72114]) [    ] o.a.s.c.c.SolrZkClient Using default ZkACLProvider
   [junit4]   2> 1759320 INFO  (TEST-TestDynamicLoading.testDynamicLoading-seed#[578E62177CC72114]) [n:127.0.0.1:45619_btv%2Fgk    ] o.a.s.c.ZkController Added new OnReconnect listener org.apache.solr.cloud.ZkController$$Lambda$116/1056893600@2da01874
   [junit4]   2> 1759320 INFO  (TEST-TestDynamicLoading.testDynamicLoading-seed#[578E62177CC72114]) [n:127.0.0.1:45619_btv%2Fgk    ] o.a.s.c.c.ConnectionManager Waiting for client to connect to ZooKeeper
   [junit4]   2> 1759321 INFO  (zkCallback-20503-thread-1-processing-n:127.0.0.1:45619_btv%2Fgk) [n:127.0.0.1:45619_btv%2Fgk    ] o.a.s.c.c.ConnectionManager Watcher org.apache.solr.common.cloud.ConnectionManager@25403527 name:ZooKeeperConnection Watcher:127.0.0.1:40207/solr got event WatchedEvent state:SyncConnected type:None path:null path:null type:None
   [junit4]   2> 1759321 INFO  (TEST-TestDynamicLoading.testDynamicLoading-seed#[578E62177CC72114]) [n:127.0.0.1:45619_btv%2Fgk    ] o.a.s.c.c.ConnectionManager Client is connected to ZooKeeper
   [junit4]   2> 1759321 INFO  (TEST-TestDynamicLoading.testDynamicLoading-seed#[578E62177CC72114]) [n:127.0.0.1:45619_btv%2Fgk    ] o.a.s.c.c.SolrZkClient makePath: /overseer/queue
   [junit4]   2> 1759322 INFO  (TEST-TestDynamicLoading.testDynamicLoading-seed#[578E62177CC72114]) [n:127.0.0.1:45619_btv%2Fgk    ] o.a.s.c.c.SolrZkClient makePath: /overseer/collection-queue-work
   [junit4]   2> 1759323 INFO  (TEST-TestDynamicLoading.testDynamicLoading-seed#[578E62177CC72114]) [n:127.0.0.1:45619_btv%2Fgk    ] o.a.s.c.c.SolrZkClient makePath: /overseer/collection-map-running
   [junit4]   2> 1759323 INFO  (TEST-TestDynamicLoading.testDynamicLoading-seed#[578E62177CC72114]) [n:127.0.0.1:45619_btv%2Fgk    ] o.a.s.c.c.SolrZkClient makePath: /overseer/collection-map-completed
   [junit4]   2> 1759324 INFO  (TEST-TestDynamicLoading.testDynamicLoading-seed#[578E62177CC72114]) [n:127.0.0.1:45619_btv%2Fgk    ] o.a.s.c.c.SolrZkClient makePath: /overseer/collection-map-failure
   [junit4]   2> 1759324 INFO  (TEST-TestDynamicLoading.testDynamicLoading-seed#[578E62177CC72114]) [n:127.0.0.1:45619_btv%2Fgk    ] o.a.s.c.c.SolrZkClient makePath: /live_nodes
   [junit4]   2> 1759325 INFO  (TEST-TestDynamicLoading.testDynamicLoading-seed#[578E62177CC72114]) [n:127.0.0.1:45619_btv%2Fgk    ] o.a.s.c.c.SolrZkClient makePath: /aliases.json
   [junit4]   2> 1759325 INFO  (TEST-TestDynamicLoading.testDynamicLoading-seed#[578E62177CC72114]) [n:127.0.0.1:45619_btv%2Fgk    ] o.a.s.c.c.SolrZkClient makePath: /clusterstate.json
   [junit4]   2> 1759326 INFO  (TEST-TestDynamicLoading.testDynamicLoading-seed#[578E62177CC72114]) [n:127.0.0.1:45619_btv%2Fgk    ] o.a.s.c.c.SolrZkClient makePath: /security.json
   [junit4]   2> 1759326 INFO  (TEST-TestDynamicLoading.testDynamicLoading-seed#[578E62177CC72114]) [n:127.0.0.1:45619_btv%2Fgk    ] o.a.s.c.c.ZkStateReader Updating cluster state from ZooKeeper... 
   [junit4]   2> 1759326 INFO  (TEST-TestDynamicLoading.testDynamicLoading-seed#[578E62177CC72114]) [n:127.0.0.1:45619_btv%2Fgk    ] o.a.s.c.c.ZkStateReader Loaded cluster properties: {urlScheme=https}
   [junit4]   2> 1759326 INFO  (TEST-TestDynamicLoading.testDynamicLoading-seed#[578E62177CC72114]) [n:127.0.0.1:45619_btv%2Fgk    ] o.a.s.c.c.ZkStateReader Updated live nodes from ZooKeeper... (0) -> (0)
   [junit4]   2> 1759327 INFO  (TEST-TestDynamicLoading.testDynamicLoading-seed#[578E62177CC72114]) [n:127.0.0.1:45619_btv%2Fgk    ] o.a.s.c.c.SolrZkClient makePath: /overseer_elect
   [junit4]   2> 1759328 INFO  (TEST-TestDynamicLoading.testDynamicLoading-seed#[578E62177CC72114]) [n:127.0.0.1:45619_btv%2Fgk    ] o.a.s.c.c.SolrZkClient makePath: /overseer_elect/election
   [junit4]   2> 1759328 INFO  (TEST-TestDynamicLoading.testDynamicLoading-seed#[578E62177CC72114]) [n:127.0.0.1:45619_btv%2Fgk    ] o.a.s.c.Overseer Overseer (id=null) closing
   [junit4]   2> 1759334 INFO  (TEST-TestDynamicLoading.testDynamicLoading-seed#[578E62177CC72114]) [n:127.0.0.1:45619_btv%2Fgk    ] o.a.s.c.LeaderElector Joined leadership election with path: /overseer_elect/election/96575498816651269-127.0.0.1:45619_btv%2Fgk-n_0000000000
   [junit4]   2> 1759334 INFO  (TEST-TestDynamicLoading.testDynamicLoading-seed#[578E62177CC72114]) [n:127.0.0.1:45619_btv%2Fgk    ] o.a.s.c.OverseerElectionContext I am going to be the leader 127.0.0.1:45619_btv%2Fgk
   [junit4]   2> 1759334 INFO  (TEST-TestDynamicLoading.testDynamicLoading-seed#[578E62177CC72114]) [n:127.0.0.1:45619_btv%2Fgk    ] o.a.s.c.c.SolrZkClient makePath: /overseer_elect/leader
   [junit4]   2> 1759334 INFO  (TEST-TestDynamicLoading.testDynamicLoading-seed#[578E62177CC72114]) [n:127.0.0.1:45619_btv%2Fgk    ] o.a.s.c.Overseer Overseer (id=96575498816651269-127.0.0.1:45619_btv%2Fgk-n_0000000000) starting
   [junit4]   2> 1759335 INFO  (TEST-TestDynamicLoading.testDynamicLoading-seed#[578E62177CC72114]) [n:127.0.0.1:45619_btv%2Fgk    ] o.a.s.c.c.SolrZkClient makePath: /overseer/queue-work
   [junit4]   2> 1759337 INFO  (TEST-TestDynamicLoading.testDynamicLoading-seed#[578E62177CC72114]) [n:127.0.0.1:45619_btv%2Fgk    ] o.a.s.c.OverseerAutoReplicaFailoverThread Starting OverseerAutoReplicaFailoverThread autoReplicaFailoverWorkLoopDelay=10000 autoReplicaFailoverWaitAfterExpiration=10000 autoReplicaFailoverBadNodeExpiration=60000
   [junit4]   2> 1759337 INFO  (OverseerCollectionConfigSetProcessor-96575498816651269-127.0.0.1:45619_btv%2Fgk-n_0000000000) [n:127.0.0.1:45619_btv%2Fgk    ] o.a.s.c.OverseerTaskProcessor Process current queue of overseer operations
   [junit4]   2> 1759337 INFO  (TEST-TestDynamicLoading.testDynamicLoading-seed#[578E62177CC72114]) [n:127.0.0.1:45619_btv%2Fgk    ] o.a.s.c.ZkController Register node as live in ZooKeeper:/live_nodes/127.0.0.1:45619_btv%2Fgk
   [junit4]   2> 1759337 INFO  (TEST-TestDynamicLoading.testDynamicLoading-seed#[578E62177CC72114]) [n:127.0.0.1:45619_btv%2Fgk    ] o.a.s.c.c.SolrZkClient makePath: /live_nodes/127.0.0.1:45619_btv%2Fgk
   [junit4]   2> 1759337 INFO  (OverseerStateUpdate-96575498816651269-127.0.0.1:45619_btv%2Fgk-n_0000000000) [n:127.0.0.1:45619_btv%2Fgk    ] o.a.s.c.Overseer Starting to work on the main queue
   [junit4]   2> 1759338 INFO  (zkCallback-20503-thread-1-processing-n:127.0.0.1:45619_btv%2Fgk) [n:127.0.0.1:45619_btv%2Fgk    ] o.a.s.c.c.ZkStateReader A live node change: [WatchedEvent state:SyncConnected type:NodeChildrenChanged path:/live_nodes], has occurred - updating... (live nodes size: [0])
   [junit4]   2> 1759338 INFO  (OverseerStateUpdate-96575498816651269-127.0.0.1:45619_btv%2Fgk-n_0000000000) [n:127.0.0.1:45619_btv%2Fgk    ] o.a.s.c.c.ZkStateReader Updated live nodes from ZooKeeper... (0) -> (1)
   [junit4]   2> 1759339 INFO  (zkCallback-20503-thread-1-processing-n:127.0.0.1:45619_btv%2Fgk) [n:127.0.0.1:45619_btv%2Fgk    ] o.a.s.c.c.ZkStateReader Updated live nodes from ZooKeeper... (1) -> (1)
   [junit4]   2> 1759359 INFO  (TEST-TestDynamicLoading.testDynamicLoading-seed#[578E62177CC72114]) [n:127.0.0.1:45619_btv%2Fgk    ] o.a.s.c.CoreContainer Security conf doesn't exist. Skipping setup for authorization module.
   [junit4]   2> 1759359 INFO  (TEST-TestDynamicLoading.testDynamicLoading-seed#[578E62177CC72114]) [n:127.0.0.1:45619_btv%2Fgk    ] o.a.s.c.CoreContainer No authentication plugin used.
   [junit4]   2> 1759359 INFO  (TEST-TestDynamicLoading.testDynamicLoading-seed#[578E62177CC72114]) [n:127.0.0.1:45619_btv%2Fgk    ] o.a.s.c.CorePropertiesLocator Looking for core definitions underneath /home/jenkins/workspace/Lucene-Solr-master-Linux/solr/build/solr-core/test/J0/../../../../../../../../../home/jenkins/workspace/Lucene-Solr-master-Linux/solr/build/solr-core/test/J0/temp/solr.core.TestDynamicLoading_578E62177CC72114-001/control-001/cores
   [junit4]   2> 1759360 INFO  (TEST-TestDynamicLoading.testDynamicLoading-seed#[578E62177CC72114]) [n:127.0.0.1:45619_btv%2Fgk    ] o.a.s.c.CoreDescriptor Created CoreDescriptor: {name=collection1, config=solrconfig.xml, transient=false, schema=schema.xml, loadOnStartup=true, configSetProperties=configsetprops.json, collection=control_collection, coreNodeName=, dataDir=data/, shard=}
   [junit4]   2> 1759360 INFO  (TEST-TestDynamicLoading.testDynamicLoading-seed#[578E62177CC72114]) [n:127.0.0.1:45619_btv%2Fgk    ] o.a.s.c.CorePropertiesLocator Found core collection1 in /home/jenkins/workspace/Lucene-Solr-master-Linux/solr/build/solr-core/test/J0/../../../../../../../../../home/jenkins/workspace/Lucene-Solr-master-Linux/solr/build/solr-core/test/J0/temp/solr.core.TestDynamicLoading_578E62177CC72114-001/control-001/cores/collection1
   [junit4]   2> 1759360 INFO  (TEST-TestDynamicLoading.testDynamicLoading-seed#[578E62177CC72114]) [n:127.0.0.1:45619_btv%2Fgk    ] o.a.s.c.CorePropertiesLocator Found 1 core definitions
   [junit4]   2> 1759361 INFO  (TEST-TestDynamicLoading.testDynamicLoading-seed#[578E62177CC72114]) [n:127.0.0.1:45619_btv%2Fgk    ] o.a.s.s.SolrDispatchFilter user.dir=/home/jenkins/workspace/Lucene-Solr-master-Linux/solr/build/solr-core/test/J0
   [junit4]   2> 1759361 INFO  (TEST-TestDynamicLoading.testDynamicLoading-seed#[578E62177CC72114]) [n:127.0.0.1:45619_btv%2Fgk    ] o.a.s.s.SolrDispatchFilter SolrDispatchFilter.init() done
   [junit4]   2> 1759361 INFO  (coreLoadExecutor-9981-thread-1-processing-n:127.0.0.1:45619_btv%2Fgk) [n:127.0.0.1:45619_btv%2Fgk c:control_collection   x:collection1] o.a.s.c.ZkController publishing state=down
   [junit4]   2> 1759361 INFO  (coreLoadExecutor-9981-thread-1-processing-n:127.0.0.1:45619_btv%2Fgk) [n:127.0.0.1:45619_btv%2Fgk c:control_collection   x:collection1] o.a.s.c.ZkController numShards not found on descriptor - reading it from system property
   [junit4]   2> 1759363 INFO  (coreLoadExecutor-9981-thread-1-processing-n:127.0.0.1:45619_btv%2Fgk) [n:127.0.0.1:45619_btv%2Fgk c:control_collection   x:collection1] o.a.s.c.ZkController Collection control_collection not visible yet, but flagging it so a watch is registered when it becomes visible
   [junit4]   2> 1759363 INFO  (OverseerStateUpdate-96575498816651269-127.0.0.1:45619_btv%2Fgk-n_0000000000) [n:127.0.0.1:45619_btv%2Fgk    ] o.a.s.c.Overseer processMessage: queueSize: 1, message = {
   [junit4]   2>   "core":"collection1",
   [junit4]   2>   "roles":null,
   [junit4]   2>   "base_url":"https://127.0.0.1:45619/btv/gk",
   [junit4]   2>   "node_name":"127.0.0.1:45619_btv%2Fgk",
   [junit4]   2>   "numShards":"1",
   [junit4]   2>   "state":"down",
   [junit4]   2>   "shard":null,
   [junit4]   2>   "collection":"control_collection",
   [junit4]   2>   "operation":"state"} current state version: 0
   [junit4]   2> 1759363 INFO  (OverseerStateUpdate-96575498816651269-127.0.0.1:45619_btv%2Fgk-n_0000000000) [n:127.0.0.1:45619_btv%2Fgk    ] o.a.s.c.o.ReplicaMutator Update state numShards=1 message={
   [junit4]   2>   "core":"collection1",
   [junit4]   2>   "roles":null,
   [junit4]   2>   "base_url":"https://127.0.0.1:45619/btv/gk",
   [junit4]   2>   "node_name":"127.0.0.1:45619_btv%2Fgk",
   [junit4]   2>   "numShards":"1",
   [junit4]   2>   "state":"down",
   [junit4]   2>   "shard":null,
   [junit4]   2>   "collection":"control_collection",
   [junit4]   2>   "operation":"state"}
   [junit4]   2> 1759364 INFO  (coreLoadExecutor-9981-thread-1-processing-n:127.0.0.1:45619_btv%2Fgk) [n:127.0.0.1:45619_btv%2Fgk c:control_collection   x:collection1] o.a.s.c.c.ZkStateReader Deleting data for [control_collection]
   [junit4]   2> 1759365 INFO  (OverseerStateUpdate-96575498816651269-127.0.0.1:45619_btv%2Fgk-n_0000000000) [n:127.0.0.1:45619_btv%2Fgk    ] o.a.s.c.o.ClusterStateMutator building a new cName: control_collection
   [junit4]   2> 1759365 INFO  (OverseerStateUpdate-96575498816651269-127.0.0.1:45619_btv%2Fgk-n_0000000000) [n:127.0.0.1:45619_btv%2Fgk    ] o.a.s.c.o.ReplicaMutator Assigning new node to shard shard=shard1
   [junit4]   2> 1759366 INFO  (coreLoadExecutor-9981-thread-1-processing-n:127.0.0.1:45619_btv%2Fgk) [n:127.0.0.1:45619_btv%2Fgk c:control_collection   x:collection1] o.a.s.c.ZkController look for our core node name
   [junit4]   2> 1759366 INFO  (zkCallback-20503-thread-1-processing-n:127.0.0.1:45619_btv%2Fgk) [n:127.0.0.1:45619_btv%2Fgk    ] o.a.s.c.c.ZkStateReader A cluster state change: [WatchedEvent state:SyncConnected type:NodeDataChanged path:/clusterstate.json], has occurred - updating... (live nodes size: [1])
   [junit4]   2> 1760366 INFO  (coreLoadExecutor-9981-thread-1-processing-n:127.0.0.1:45619_btv%2Fgk) [n:127.0.0.1:45619_btv%2Fgk c:control_collection   x:collection1] o.a.s.c.ZkController waiting to find shard id in clusterstate for collection1
   [junit4]   2> 1760366 INFO  (coreLoadExecutor-9981-thread-1-processing-n:127.0.0.1:45619_btv%2Fgk) [n:127.0.0.1:45619_btv%2Fgk c:control_collection   x:collection1] o.a.s.c.ZkController Check for collection zkNode:control_collection
   [junit4]   2> 1760367 INFO  (coreLoadExecutor-9981-thread-1-processing-n:127.0.0.1:45619_btv%2Fgk) [n:127.0.0.1:45619_btv%2Fgk c:control_collection   x:collection1] o.a.s.c.ZkController Collection zkNode exists
   [junit4]   2> 1760367 INFO  (coreLoadExecutor-9981-thread-1-processing-n:127.0.0.1:45619_btv%2Fgk) [n:127.0.0.1:45619_btv%2Fgk c:control_collection   x:collection1] o.a.s.c.c.ZkStateReader Load collection config from: [/collections/control_collection]
   [junit4]   2> 1760367 INFO  (coreLoadExecutor-9981-thread-1-processing-n:127.0.0.1:45619_btv%2Fgk) [n:127.0.0.1:45619_btv%2Fgk c:control_collection   x:collection1] o.a.s.c.c.ZkStateReader path=[/collections/control_collection] [configName]=[conf1] specified config exists in ZooKeeper
   [junit4]   2> 1760367 INFO  (coreLoadExecutor-9981-thread-1-processing-n:127.0.0.1:45619_btv%2Fgk) [n:127.0.0.1:45619_btv%2Fgk c:control_collection   x:collection1] o.a.s.c.SolrResourceLoader new SolrResourceLoader for directory: '/home/jenkins/workspace/Lucene-Solr-master-Linux/solr/build/solr-core/test/J0/temp/solr.core.TestDynamicLoading_578E62177CC72114-001/control-001/cores/collection1'
   [junit4]   2> 1760367 INFO  (coreLoadExecutor-9981-thread-1-processing-n:127.0.0.1:45619_btv%2Fgk) [n:127.0.0.1:45619_btv%2Fgk c:control_collection   x:collection1] o.a.s.c.SolrResourceLoader JNDI not configured for solr (NoInitialContextEx)
   [junit4]   2> 1760367 INFO  (coreLoadExecutor-9981-thread-1-processing-n:127.0.0.1:45619_btv%2Fgk) [n:127.0.0.1:45619_btv%2Fgk c:control_collection   x:collection1] o.a.s.c.SolrResourceLoader solr home defaulted to 'solr/' (could not find system property or JNDI)
   [junit4]   2> 1760368 INFO  (coreLoadExecutor-9981-thread-1-processing-n:127.0.0.1:45619_btv%2Fgk) [n:127.0.0.1:45619_btv%2Fgk c:control_collection   x:collection1] o.a.s.c.Config loaded config solrconfig.xml with version 0 
   [junit4]   2> 1760371 INFO  (coreLoadExecutor-9981-thread-1-processing-n:127.0.0.1:45619_btv%2Fgk) [n:127.0.0.1:45619_btv%2Fgk c:control_collection   x:collection1] o.a.s.c.SolrConfig current version of requestparams : -1
   [junit4]   2> 1760373 WARN  (coreLoadExecutor-9981-thread-1-processing-n:127.0.0.1:45619_btv%2Fgk) [n:127.0.0.1:45619_btv%2Fgk c:control_collection   x:collection1] o.a.s.c.Config Beginning with Solr 5.5, <mergePolicy> is deprecated, use <mergePolicyFactory> instead.
   [junit4]   2> 1760374 INFO  (coreLoadExecutor-9981-thread-1-processing-n:127.0.0.1:45619_btv%2Fgk) [n:127.0.0.1:45619_btv%2Fgk c:control_collection   x:collection1] o.a.s.c.SolrConfig Using Lucene MatchVersion: 7.0.0
   [junit4]   2> 1760382 INFO  (coreLoadExecutor-9981-thread-1-processing-n:127.0.0.1:45619_btv%2Fgk) [n:127.0.0.1:45619_btv%2Fgk c:control_collection   x:collection1] o.a.s.c.SolrConfig Loaded SolrConfig: solrconfig.xml
   [junit4]   2> 1760386 INFO  (coreLoadExecutor-9981-thread-1-processing-n:127.0.0.1:45619_btv%2Fgk) [n:127.0.0.1:45619_btv%2Fgk c:control_collection   x:collection1] o.a.s.s.IndexSchema [collection1] Schema name=test
   [junit4]   2> 1760456 INFO  (coreLoadExecutor-9981-thread-1-processing-n:127.0.0.1:45619_btv%2Fgk) [n:127.0.0.1:45619_btv%2Fgk c:control_collection   x:collection1] o.a.s.s.OpenExchangeRatesOrgProvider Initialized with rates=open-exchange-rates.json, refreshInterval=1440.
   [junit4]   2> 1760460 INFO  (coreLoadExecutor-9981-thread-1-processing-n:127.0.0.1:45619_btv%2Fgk) [n:127.0.0.1:45619_btv%2Fgk c:control_collection   x:collection1] o.a.s.s.IndexSchema default search field in schema is text
   [junit4]   2> 1760461 INFO  (coreLoadExecutor-9981-thread-1-processing-n:127.0.0.1:45619_btv%2Fgk) [n:127.0.0.1:45619_btv%2Fgk c:control_collection   x:collection1] o.a.s.s.IndexSchema unique key field: id
   [junit4]   2> 1760465 INFO  (coreLoadExecutor-9981-thread-1-processing-n:127.0.0.1:45619_btv%2Fgk) [n:127.0.0.1:45619_btv%2Fgk c:control_collection   x:collection1] o.a.s.s.FileExchangeRateProvider Reloading exchange rates from file currency.xml
   [junit4]   2> 1760466 INFO  (coreLoadExecutor-9981-thread-1-processing-n:127.0.0.1:45619_btv%2Fgk) [n:127.0.0.1:45619_btv%2Fgk c:control_collection   x:collection1] o.a.s.s.FileExchangeRateProvider Reloading exchange rates from file currency.xml
   [junit4]   2> 1760467 INFO  (coreLoadExecutor-9981-thread-1-processing-n:127.0.0.1:45619_btv%2Fgk) [n:127.0.0.1:45619_btv%2Fgk c:control_collection   x:collection1] o.a.s.s.OpenExchangeRatesOrgProvider Reloading exchange rates from open-exchange-rates.json
   [junit4]   2> 1760468 INFO  (coreLoadExecutor-9981-thread-1-processing-n:127.0.0.1:45619_btv%2Fgk) [n:127.0.0.1:45619_btv%2Fgk c:control_collection   x:collection1] o.a.s.s.OpenExchangeRatesOrgProvider Reloading exchange rates from open-exchange-rates.json
   [junit4]   2> 1760469 INFO  (coreLoadExecutor-9981-thread-1-processing-n:127.0.0.1:45619_btv%2Fgk) [n:127.0.0.1:45619_btv%2Fgk c:control_collection   x:collection1] o.a.s.c.ConfigSetProperties Did not find ConfigSet properties, assuming default properties: Can't find resource 'configsetprops.json' in classpath or '/configs/conf1', cwd=/home/jenkins/workspace/Lucene-Solr-master-Linux/solr/build/solr-core/test/J0
   [junit4]   2> 1760469 INFO  (coreLoadExecutor-9981-thread-1-processing-n:127.0.0.1:45619_btv%2Fgk) [n:127.0.0.1:45619_btv%2Fgk c:control_collection   x:collection1] o.a.s.c.CoreContainer Creating SolrCore 'collection1' using configuration from collection control_collection
   [junit4]   2> 1760470 INFO  (coreLoadExecutor-9981-thread-1-processing-n:127.0.0.1:45619_btv%2Fgk) [n:127.0.0.1:45619_btv%2Fgk c:control_collection s:shard1 r:core_node1 x:collection1] o.a.s.c.SolrCore org.apache.solr.core.MockDirectoryFactory
   [junit4]   2> 1760470 INFO  (coreLoadExecutor-9981-thread-1-processing-n:127.0.0.1:45619_btv%2Fgk) [n:127.0.0.1:45619_btv%2Fgk c:control_collection s:shard1 r:core_node1 x:collection1] o.a.s.c.SolrCore [[collection1] ] Opening new SolrCore at [/home/jenkins/workspace/Lucene-Solr-master-Linux/solr/build/solr-core/test/J0/temp/solr.core.TestDynamicLoading_578E62177CC72114-001/control-001/cores/collection1], dataDir=[/home/jenkins/workspace/Lucene-Solr-master-Linux/solr/build/solr-core/test/J0/../../../../../../../../../home/jenkins/workspace/Lucene-Solr-master-Linux/solr/build/solr-core/test/J0/temp/solr.core.TestDynamicLoading_578E62177CC72114-001/control-001/cores/collection1/data/]
   [junit4]   2> 1760470 INFO  (coreLoadExecutor-9981-thread-1-processing-n:127.0.0.1:45619_btv%2Fgk) [n:127.0.0.1:45619_btv%2Fgk c:control_collection s:shard1 r:core_node1 x:collection1] o.a.s.c.JmxMonitoredMap JMX monitoring is enabled. Adding Solr mbeans to JMX Server: com.sun.jmx.mbeanserver.JmxMBeanServer@4e5a5fbe
   [junit4]   2> 1760470 INFO  (coreLoadExecutor-9981-thread-1-processing-n:127.0.0.1:45619_btv%2Fgk) [n:127.0.0.1:45619_btv%2Fgk c:control_collection s:shard1 r:core_node1 x:collection1] o.a.s.c.CachingDirectoryFactory return new directory for /home/jenkins/workspace/Lucene-Solr-master-Linux/solr/build/solr-core/test/J0/../../../../../../../../../home/jenkins/workspace/Lucene-Solr-master-Linux/solr/build/solr-core/test/J0/temp/solr.core.TestDynamicLoading_578E62177CC72114-001/control-001/cores/collection1/data/snapshot_metadata
   [junit4]   2> 1760470 INFO  (coreLoadExecutor-9981-thread-1-processing-n:127.0.0.1:45619_btv%2Fgk) [n:127.0.0.1:45619_btv%2Fgk c:control_collection s:shard1 r:core_node1 x:collection1] o.a.s.c.s.SolrSnapshotMetaDataManager Loading from snapshot metadata file...
   [junit4]   2> 1760470 INFO  (coreLoadExecutor-9981-thread-1-processing-n:127.0.0.1:45619_btv%2Fgk) [n:127.0.0.1:45619_btv%2Fgk c:control_collection s:shard1 r:core_node1 x:collection1] o.a.s.c.CachingDirectoryFactory return new directory for /home/jenkins/workspace/Lucene-Solr-master-Linux/solr/build/solr-core/test/J0/../../../../../../../../../home/jenkins/workspace/Lucene-Solr-master-Linux/solr/build/solr-core/test/J0/temp/solr.core.TestDynamicLoading_578E62177CC72114-001/control-001/cores/collection1/data
   [junit4]   2> 1760470 INFO  (coreLoadExecutor-9981-thread-1-processing-n:127.0.0.1:45619_btv%2Fgk) [n:127.0.0.1:45619_btv%2Fgk c:control_collection s:shard1 r:core_node1 x:collection1] o.a.s.c.SolrCore New index directory detected: old=null new=/home/jenkins/workspace/Lucene-Solr-master-Linux/solr/build/solr-core/test/J0/../../../../../../../../../home/jenkins/workspace/Lucene-Solr-master-Linux/solr/build/solr-core/test/J0/temp/solr.core.TestDynamicLoading_578E62177CC72114-001/control-001/cores/collection1/data/index/
   [junit4]   2> 1760470 WARN  (coreLoadExecutor-9981-thread-1-processing-n:127.0.0.1:45619_btv%2Fgk) [n:127.0.0.1:45619_btv%2Fgk c:control_collection s:shard1 r:core_node1 x:collection1] o.a.s.c.SolrCore [collection1] Solr index directory '/home/jenkins/workspace/Lucene-Solr-master-Linux/solr/build/solr-core/test/J0/../../../../../../../../../home/jenkins/workspace/Lucene-Solr-master-Linux/solr/build/solr-core/test/J0/temp/solr.core.TestDynamicLoading_578E62177CC72114-001/control-001/cores/collection1/data/index' doesn't exist. Creating new index...
   [junit4]   2> 1760471 INFO  (coreLoadExecutor-9981-thread-1-processing-n:127.0.0.1:45619_btv%2Fgk) [n:127.0.0.1:45619_btv%2Fgk c:control_collection s:shard1 r:core_node1 x:collection1] o.a.s.c.CachingDirectoryFactory return new directory for /home/jenkins/workspace/Lucene-Solr-master-Linux/solr/build/solr-core/test/J0/../../../../../../../../../home/jenkins/workspace/Lucene-Solr-master-Linux/solr/build/solr-core/test/J0/temp/solr.core.TestDynamicLoading_578E62177CC72114-001/control-001/cores/collection1/data/index
   [junit4]   2> 1760471 INFO  (coreLoadExecutor-9981-thread-1-processing-n:127.0.0.1:45619_btv%2Fgk) [n:127.0.0.1:45619_btv%2Fgk c:control_collection s:shard1 r:core_node1 x:collection1] o.a.s.u.RandomMergePolicy RandomMergePolicy wrapping class org.apache.lucene.index.TieredMergePolicy: [TieredMergePolicy: maxMergeAtOnce=21, maxMergeAtOnceExplicit=49, maxMergedSegmentMB=79.296875, floorSegmentMB=1.568359375, forceMergeDeletesPctAllowed=10.157504298085255, segmentsPerTier=34.0, maxCFSSegmentSizeMB=8.796093022207999E12, noCFSRatio=0.32878988863725067
   [junit4]   2> 1760471 INFO  (coreLoadExecutor-9981-thread-1-processing-n:127.0.0.1:45619_btv%2Fgk) [n:127.0.0.1:45619_btv%2Fgk c:control_collection s:shard1 r:core_node1 x:collection1] o.a.s.c.SolrDeletionPolicy SolrDeletionPolicy.onCommit: commits: num=1
   [junit4]   2> 	commit{dir=MockDirectoryWrapper(RAMDirectory@40f1be0a lockFactory=org.apache.lucene.store.SingleInstanceLockFactory@6bc989e0),segFN=segments_1,generation=1}
   [junit4]   2> 1760471 INFO  (coreLoadExecutor-9981-thread-1-processing-n:127.0.0.1:45619_btv%2Fgk) [n:127.0.0.1:45619_btv%2Fgk c:control_collection s:shard1 r:core_node1 x:collection1] o.a.s.c.SolrDeletionPolicy newest commit generation = 1
   [junit4]   2> 1760471 INFO  (OldIndexDirectoryCleanupThreadForCore-collection1) [n:127.0.0.1:45619_btv%2Fgk c:control_collection s:shard1 r:core_node1 x:collection1] o.a.s.c.SolrCore Looking for old index directories to cleanup for core collection1 in /home/jenkins/workspace/Lucene-Solr-master-Linux/solr/build/solr-core/test/J0/../../../../../../../../../home/jenkins/workspace/Lucene-Solr-master-Linux/solr/build/solr-core/test/J0/temp/solr.core.TestDynamicLoading_578E62177CC72114-001/control-001/cores/collection1/data/
   [junit4]   2> 1760471 WARN  (OldIndexDirectoryCleanupThreadForCore-collection1) [n:127.0.0.1:45619_btv%2Fgk c:control_collection s:shard1 r:core_node1 x:collection1] o.a.s.c.DirectoryFactory /home/jenkins/workspace/Lucene-Solr-master-Linux/solr/build/solr-core/test/J0/../../../../../../../../../home/jenkins/workspace/Lucene-Solr-master-Linux/solr/build/solr-core/test/J0/temp/solr.core.TestDynamicLoading_578E62177CC72114-001/control-001/cores/collection1/data/ does not point to a valid data directory; skipping clean-up of old index directories.
   [junit4]   2> 1760473 INFO  (coreLoadExecutor-9981-thread-1-processing-n:127.0.0.1:45619_btv%2Fgk) [n:127.0.0.1:45619_btv%2Fgk c:control_collection s:shard1 r:core_node1 x:collection1] o.a.s.u.p.UpdateRequestProcessorChain creating updateRequestProcessorChain "nodistrib"
   [junit4]   2> 1760473 INFO  (coreLoadExecutor-9981-thread-1-processing-n:127.0.0.1:45619_btv%2Fgk) [n:127.0.0.1:45619_btv%2Fgk c:control_collection s:shard1 r:core_node1 x:collection1] o.a.s.u.p.UpdateRequestProcessorChain creating updateRequestProcessorChain "dedupe"
   [junit4]   2> 1760473 INFO  (coreLoadExecutor-9981-thread-1-processing-n:127.0.0.1:45619_btv%2Fgk) [n:127.0.0.1:45619_btv%2Fgk c:control_collection s:shard1 r:core_node1 x:collection1] o.a.s.u.p.UpdateRequestProcessorChain inserting DistributedUpdateProcessorFactory into updateRequestProcessorChain "dedupe"
   [junit4]   2> 1760473 INFO  (coreLoadExecutor-9981-thread-1-processing-n:127.0.0.1:45619_btv%2Fgk) [n:127.0.0.1:45619_btv%2Fgk c:control_collection s:shard1 r:core_node1 x:collection1] o.a.s.u.p.UpdateRequestProcessorChain creating updateRequestProcessorChain "stored_sig"
   [junit4]   2> 1760473 INFO  (coreLoadExecutor-9981-thread-1-processing-n:127.0.0.1:45619_btv%2Fgk) [n:127.0.0.1:45619_btv%2Fgk c:control_collection s:shard1 r:core_node1 x:collection1] o.a.s.u.p.UpdateRequestProcessorChain inserting DistributedUpdateProcessorFactory into updateRequestProcessorChain "stored_sig"
   [junit4]   2> 1760473 INFO  (coreLoadExecutor-9981-thread-1-processing-n:127.0.0.1:45619_btv%2Fgk) [n:127.0.0.1:45619_btv%2Fgk c:control_collection s:shard1 r:core_node1 x:collection1] o.a.s.u.p.UpdateRequestProcessorChain creating updateRequestProcessorChain "distrib-dup-test-chain-explicit"
   [junit4]   2> 1760473 INFO  (coreLoadExecutor-9981-thread-1-processing-n:127.0.0.1:45619_btv%2Fgk) [n:127.0.0.1:45619_btv%2Fgk c:control_collection s:shard1 r:core_node1 x:collection1] o.a.s.u.p.UpdateRequestProcessorChain creating updateRequestProcessorChain "distrib-dup-test-chain-implicit"
   [junit4]   2> 1760474 INFO  (coreLoadExecutor-9981-thread-1-processing-n:127.0.0.1:45619_btv%2Fgk) [n:127.0.0.1:45619_btv%2Fgk c:control_collection s:shard1 r:core_node1 x:collection1] o.a.s.u.p.UpdateRequestProcessorChain inserting DistributedUpdateProcessorFactory into updateRequestProcessorChain "distrib-dup-test-chain-implicit"
   [junit4]   2> 1760474 INFO  (coreLoadExecutor-9981-thread-1-processing-n:127.0.0.1:45619_btv%2Fgk) [n:127.0.0.1:45619_btv%2Fgk c:control_collection s:shard1 r:core_node1 x:collection1] o.a.s.c.SolrCore no updateRequestProcessorChain defined as default, creating implicit default
   [junit4]   2> 1760474 WARN  (coreLoadExecutor-9981-thread-1-processing-n:127.0.0.1:45619_btv%2Fgk) [n:127.0.0.1:45619_btv%2Fgk c:control_collection s:shard1 r:core_node1 x:collection1] o.a.s.c.RequestHandlers INVALID paramSet a in requestHandler {type = requestHandler,name = /dump,class = DumpRequestHandler,args = {defaults={a=A,b=B}}}
   [junit4]   2> 1760475 INFO  (coreLoadExecutor-9981-thread-1-processing-n:127.0.0.1:45619_btv%2Fgk) [n:127.0.0.1:45619_btv%2Fgk c:control_collection s:shard1 r:core_node1 x:collection1] o.a.s.h.l.XMLLoader xsltCacheLifetimeSeconds=60
   [junit4]   2> 1760475 INFO  (coreLoadExecutor-9981-thread-1-processing-n:127.0.0.1:45619_btv%2Fgk) [n:127.0.0.1:45619_btv%2Fgk c:control_collection s:shard1 r:core_node1 x:collection1] o.a.s.h.l.XMLLoader xsltCacheLifetimeSeconds=60
   [junit4]   2> 1760476 INFO  (coreLoadExecutor-9981-thread-1-processing-n:127.0.0.1:45619_btv%2Fgk) [n:127.0.0.1:45619_btv%2Fgk c:control_collection s:shard1 r:core_node1 x:collection1] o.a.s.h.l.XMLLoader xsltCacheLifetimeSeconds=60
   [junit4]   2> 1760476 INFO  (coreLoadExecutor-9981-thread-1-processing-n:127.0.0.1:45619_btv%2Fgk) [n:127.0.0.1:45619_btv%2Fgk c:control_collection s:shard1 r:core_node1 x:collection1] o.a.s.h.l.XMLLoader xsltCacheLifetimeSeconds=60
   [junit4]   2> 1760478 INFO  (coreLoadExecutor-9981-thread-1-processing-n:127.0.0.1:45619_btv%2Fgk) [n:127.0.0.1:45619_btv%2Fgk c:control_collection s:shard1 r:core_node1 x:collection1] o.a.s.c.RequestHandlers Registered paths: /admin/mbeans,standard,/update/json/docs,/admin/luke,/export,/get,/admin/properties,/update/json,/admin/threads,/dump,/update/csv,/sql,/graph,/admin/segments,/admin/system,/replication,/config,/stream,/schema,/admin/plugins,/admin/logging,/admin/ping,/update,/admin/file,/terms
   [junit4]   2> 1760478 INFO  (coreLoadExecutor-9981-thread-1-processing-n:127.0.0.1:45619_btv%2Fgk) [n:127.0.0.1:45619_btv%2Fgk c:control_collection s:shard1 r:core_node1 x:collection1] o.a.s.c.SolrCore Using default statsCache cache: org.apache.solr.search.stats.LocalStatsCache
   [junit4]   2> 1760479 INFO  (coreLoadExecutor-9981-thread-1-processing-n:127.0.0.1:45619_btv%2Fgk) [n:127.0.0.1:45619_btv%2Fgk c:control_collection s:shard1 r:core_node1 x:collection1] o.a.s.u.UpdateHandler Using UpdateLog implementation: org.apache.solr.update.UpdateLog
   [junit4]   2> 1760479 INFO  (coreLoadExecutor-9981-thread-1-processing-n:127.0.0.1:45619_btv%2Fgk) [n:127.0.0.1:45619_btv%2Fgk c:control_collection s:shard1 r:core_node1 x:collection1] o.a.s.u.UpdateLog Initializing UpdateLog: dataDir= defaultSyncLevel=FLUSH numRecordsToKeep=100 maxNumLogsToKeep=10 numVersionBuckets=65536
   [junit4]   2> 1760479 INFO  (coreLoadExecutor-9981-thread-1-processing-n:127.0.0.1:45619_btv%2Fgk) [n:127.0.0.1:45619_btv%2Fgk c:control_collection s:shard1 r:core_node1 x:collection1] o.a.s.u.CommitTracker Hard AutoCommit: disabled
   [junit4]   2> 1760479 INFO  (coreLoadExecutor-9981-thread-1-processing-n:127.0.0.1:45619_btv%2Fgk) [n:127.0.0.1:45619_btv%2Fgk c:control_collection s:shard1 r:core_node1 x:collection1] o.a.s.u.CommitTracker Soft AutoCommit: disabled
   [junit4]   2> 1760479 INFO  (coreLoadExecutor-9981-thread-1-processing-n:127.0.0.1:45619_btv%2Fgk) [n:127.0.0.1:45619_btv%2Fgk c:control_collection s:shard1 r:core_node1 x:collection1] o.a.s.u.RandomMergePolicy RandomMergePolicy wrapping class org.apache.lucene.index.TieredMergePolicy: [TieredMergePolicy: maxMergeAtOnce=17, maxMergeAtOnceExplicit=36, maxMergedSegmentMB=12.8876953125, floorSegmentMB=1.5546875, forceMergeDeletesPctAllowed=2.8384827078872386, segmentsPerTier=17.0, maxCFSSegmentSizeMB=8.796093022207999E12, noCFSRatio=0.8555939590591461
   [junit4]   2> 1760480 INFO  (coreLoadExecutor-9981-thread-1-processing-n:127.0.0.1:45619_btv%2Fgk) [n:127.0.0.1:45619_btv%2Fgk c:control_collection s:shard1 r:core_node1 x:collection1] o.a.s.c.SolrDeletionPolicy SolrDeletionPolicy.onInit: commits: num=1
   [junit4]   2> 	commit{dir=MockDirectoryWrapper(RAMDirectory@40f1be0a lockFactory=org.apache.lucene.store.SingleInstanceLockFactory@6bc989e0),segFN=segments_1,generation=1}
   [junit4]   2> 1760480 INFO  (coreLoadExecutor-9981-thread-1-processing-n:127.0.0.1:45619_btv%2Fgk) [n:127.0.0.1:45619_btv%2Fgk c:control_collection s:shard1 r:core_node1 x:collection1] o.a.s.c.SolrDeletionPolicy newest commit generation = 1
   [junit4]   2> 1760480 INFO  (coreLoadExecutor-9981-thread-1-processing-n:127.0.0.1:45619_btv%2Fgk) [n:127.0.0.1:45619_btv%2Fgk c:control_collection s:shard1 r:core_node1 x:collection1] o.a.s.s.SolrIndexSearcher Opening [Searcher@7c5eb6d3[collection1] main]
   [junit4]   2> 1760480 INFO  (coreLoadExecutor-9981-thread-1-processing-n:127.0.0.1:45619_btv%2Fgk) [n:127.0.0.1:45619_btv%2Fgk c:control_collection s:shard1 r:core_node1 x:collection1] o.a.s.c.c.ZkStateReader Load collection config from: [/collections/control_collection]
   [junit4]   2> 1760481 INFO  (coreLoadExecutor-9981-thread-1-processing-n:127.0.0.1:45619_btv%2Fgk) [n:127.0.0.1:45619_btv%2Fgk c:control_collection s:shard1 r:core_node1 x:collection1] o.a.s.c.c.ZkStateReader path=[/collections/control_collection] [configName]=[conf1] specified config exists in ZooKeeper
   [junit4]   2> 1760481 INFO  (coreLoadExecutor-9981-thread-1-processing-n:127.0.0.1:45619_btv%2Fgk) [n:127.0.0.1:45619_btv%2Fgk c:control_collection s:shard1 r:core_node1 x:collection1] o.a.s.r.ManagedResourceStorage Setting up ZooKeeper-based storage for the RestManager with znodeBase: /configs/conf1
   [junit4]   2> 1760481 INFO  (coreLoadExecutor-9981-thread-1-processing-n:127.0.0.1:45619_btv%2Fgk) [n:127.0.0.1:45619_btv%2Fgk c:control_collection s:shard1 r:core_node1 x:collection1] o.a.s.r.ManagedResourceStorage Configured ZooKeeperStorageIO with znodeBase: /configs/conf1
   [junit4]   2> 1760481 INFO  (coreLoadExecutor-9981-thread-1-processing-n:127.0.0.1:45619_btv%2Fgk) [n:127.0.0.1:45619_btv%2Fgk c:control_collection s:shard1 r:core_node1 x:collection1] o.a.s.r.RestManager Initializing RestManager with initArgs: {}
   [junit4]   2> 1760481 INFO  (coreLoadExecutor-9981-thread-1-processing-n:127.0.0.1:45619_btv%2Fgk) [n:127.0.0.1:45619_btv%2Fgk c:control_collection s:shard1 r:core_node1 x:collection1] o.a.s.r.ManagedResourceStorage Reading _rest_managed.json using ZooKeeperStorageIO:path=/configs/conf1
   [junit4]   2> 1760481 INFO  (coreLoadExecutor-9981-thread-1-processing-n:127.0.0.1:45619_btv%2Fgk) [n:127.0.0.1:45619_btv%2Fgk c:control_collection s:shard1 r:core_node1 x:collection1] o.a.s.r.ManagedResourceStorage No data found for znode /configs/conf1/_rest_managed.json
   [junit4]   2> 1760481 INFO  (coreLoadExecutor-9981-thread-1-processing-n:127.0.0.1:45619_btv%2Fgk) [n:127.0.0.1:45619_btv%2Fgk c:control_collection s:shard1 r:core_node1 x:collection1] o.a.s.r.ManagedResourceStorage Loaded null at path _rest_managed.json using ZooKeeperStorageIO:path=/configs/conf1
   [junit4]   2> 1760481 INFO  (coreLoadExecutor-9981-thread-1-processing-n:127.0.0.1:45619_btv%2Fgk) [n:127.0.0.1:45619_btv%2Fgk c:control_collection s:shard1 r:core_node1 x:collection1] o.a.s.r.RestManager Initializing 0 registered ManagedResources
   [junit4]   2> 1760482 INFO  (coreLoadExecutor-9981-thread-1-processing-n:127.0.0.1:45619_btv%2Fgk) [n:127.0.0.1:45619_btv%2Fgk c:control_collection s:shard1 r:core_node1 x:collection1] o.a.s.h.ReplicationHandler Commits will be reserved for  10000
   [junit4]   2> 1760482 INFO  (searcherExecutor-9982-thread-1-processing-n:127.0.0.1:45619_btv%2Fgk x:collection1 s:shard1 c:control_collection r:core_node1) [n:127.0.0.1:45619_btv%2Fgk c:control_collection s:shard1 r:core_node1 x:collection1] o.a.s.c.SolrCore [collection1] Registered new searcher Searcher@7c5eb6d3[collection1] main{ExitableDirectoryReader(UninvertingDirectoryReader())}
   [junit4]   2> 1760482 INFO  (coreLoadExecutor-9981-thread-1-processing-n:127.0.0.1:45619_btv%2Fgk) [n:127.0.0.1:45619_btv%2Fgk c:control_collection s:shard1 r:core_node1 x:collection1] o.a.s.u.UpdateLog Looking up max value of version field to seed version buckets
   [junit4]   2> 1760482 INFO  (coreLoadExecutor-9981-thread-1-processing-n:127.0.0.1:45619_btv%2Fgk) [n:127.0.0.1:45619_btv%2Fgk c:control_collection s:shard1 r:core_node1 x:collection1] o.a.s.u.VersionInfo Refreshing highest value of _version_ for 65536 version buckets from index
   [junit4]   2> 1760482 INFO  (coreLoadExecutor-9981-thread-1-processing-n:127.0.0.1:45619_btv%2Fgk) [n:127.0.0.1:45619_btv%2Fgk c:control_collection s:shard1 r:core_node1 x:collection1] o.a.s.u.VersionInfo No terms found for _version_, cannot seed version bucket highest value from index
   [junit4]   2> 1760482 INFO  (coreLoadExecutor-9981-thread-1-processing-n:127.0.0.1:45619_btv%2Fgk) [n:127.0.0.1:45619_btv%2Fgk c:control_collection s:shard1 r:core_node1 x:collection1] o.a.s.u.UpdateLog Could not find max version in index or recent updates, using new clock 1545207982548058112
   [junit4]   2> 1760484 INFO  (coreLoadExecutor-9981-thread-1-processing-n:127.0.0.1:45619_btv%2Fgk) [n:127.0.0.1:45619_btv%2Fgk c:control_collection s:shard1 r:core_node1 x:collection1] o.a.s.u.UpdateLog Took 1.0ms to seed version buckets with highest version 1545207982548058112
   [junit4]   2> 1760484 INFO  (coreLoadExecutor-9981-thread-1-processing-n:127.0.0.1:45619_btv%2Fgk) [n:127.0.0.1:45619_btv%2Fgk c:control_collection s:shard1 r:core_node1 x:collection1] o.a.s.c.ZkController watch zkdir /configs/conf1
   [junit4]   2> 1760485 INFO  (coreLoadExecutor-9981-thread-1-processing-n:127.0.0.1:45619_btv%2Fgk) [n:127.0.0.1:45619_btv%2Fgk c:control_collection s:shard1 r:core_node1 x:collection1] o.a.s.c.CoreContainer registering core: collection1
   [junit4]   2> 1760485 INFO  (coreZkRegister-9974-thread-1-processing-n:127.0.0.1:45619_btv%2Fgk x:collection1 s:shard1 c:control_collection r:core_node1) [n:127.0.0.1:45619_btv%2Fgk c:control_collection s:shard1 r:core_node1 x:collection1] o.a.s.c.ZkController Register replica - core:collection1 address:https://127.0.0.1:45619/btv/gk collection:control_collection shard:shard1
   [junit4]   2> 1760485 INFO  (coreZkRegister-9974-thread-1-processing-n:127.0.0.1:45619_btv%2Fgk x:collection1 s:shard1 c:control_collection r:core_node1) [n:127.0.0.1:45619_btv%2Fgk c:control_collection s:shard1 r:core_node1 x:collection1] o.a.s.c.c.SolrZkClient makePath: /collections/control_collection/leader_elect/shard1/election
   [junit4]   2> 1760486 INFO  (coreZkRegister-9974-thread-1-processing-n:127.0.0.1:45619_btv%2Fgk x:collection1 s:shard1 c:control_collection r:core_node1) [n:127.0.0.1:45619_btv%2Fgk c:control_collection s:shard1 r:core_node1 x:collection1] o.a.s.c.LeaderElector Joined leadership election with path: /collections/control_collection/leader_elect/shard1/election/96575498816651269-core_node1-n_0000000000
   [junit4]   2> 1760486 INFO  (coreZkRegister-9974-thread-1-processing-n:127.0.0.1:45619_btv%2Fgk x:collection1 s:shard1 c:control_collection r:core_node1) [n:127.0.0.1:45619_btv%2Fgk c:control_collection s:shard1 r:core_node1 x:collection1] o.a.s.c.ShardLeaderElectionContext Running the leader process for shard=shard1 and weAreReplacement=false and leaderVoteWait=10000
   [junit4]   2> 1760487 INFO  (coreZkRegister-9974-thread-1-processing-n:127.0.0.1:45619_btv%2Fgk x:collection1 s:shard1 c:control_collection r:core_node1) [n:127.0.0.1:45619_btv%2Fgk c:control_collection s:shard1 r:core_node1 x:collection1] o.a.s.c.ShardLeaderElectionContext Enough replicas found to continue.
   [junit4]   2> 1760487 INFO  (coreZkRegister-9974-thread-1-processing-n:127.0.0.1:45619_btv%2Fgk x:collection1 s:shard1 c:control_collection r:core_node1) [n:127.0.0.1:45619_btv%2Fgk c:control_collection s:shard1 r:core_node1 x:collection1] o.a.s.c.ShardLeaderElectionContext I may be the new leader - try and sync
   [junit4]   2> 1760487 INFO  (coreZkRegister-9974-thread-1-processing-n:127.0.0.1:45619_btv%2Fgk x:collection1 s:shard1 c:control_collection r:core_node1) [n:127.0.0.1:45619_btv%2Fgk c:control_collection s:shard1 r:core_node1 x:collection1] o.a.s.c.SyncStrategy Sync replicas to https://127.0.0.1:45619/btv/gk/collection1/
   [junit4]   2> 1760487 INFO  (coreZkRegister-9974-thread-1-processing-n:127.0.0.1:45619_btv%2Fgk x:collection1 s:shard1 c:control_collection r:core_node1) [n:127.0.0.1:45619_btv%2Fgk c:control_collection s:shard1 r:core_node1 x:collection1] o.a.s.c.SyncStrategy Sync Success - now sync replicas to me
   [junit4]   2> 1760487 INFO  (OverseerStateUpdate-96575498816651269-127.0.0.1:45619_btv%2Fgk-n_0000000000) [n:127.0.0.1:45619_btv%2Fgk    ] o.a.s.c.Overseer processMessage: queueSize: 1, message = {
   [junit4]   2>   "operation":"leader",
   [junit4]   2>   "shard":"shard1",
   [junit4]   2>   "collection":"control_collection"} current state version: 1
   [junit4]   2> 1760487 INFO  (coreZkRegister-9974-thread-1-processing-n:127.0.0.1:45619_btv%2Fgk x:collection1 s:shard1 c:control_collection r:core_node1) [n:127.0.0.1:45619_btv%2Fgk c:control_collection s:shard1 r:core_node1 x:collection1] o.a.s.c.SyncStrategy https://127.0.0.1:45619/btv/gk/collection1/ has no replicas
   [junit4]   2> 1760488 INFO  (coreZkRegister-9974-thread-1-processing-n:127.0.0.1:45619_btv%2Fgk x:collection1 s:shard1 c:control_collection r:core_node1) [n:127.0.0.1:45619_btv%2Fgk c:control_collection s:shard1 r:core_node1 x:collection1] o.a.s.c.c.SolrZkClient makePath: /collections/control_collection/leaders/shard1
   [junit4]   2> 1760489 INFO  (coreZkRegister-9974-thread-1-processing-n:127.0.0.1:45619_btv%2Fgk x:collection1 s:shard1 c:control_collection r:core_node1) [n:127.0.0.1:45619_btv%2Fgk c:control_collection s:shard1 r:core_node1 x:collection1] o.a.s.c.ShardLeaderElectionContextBase Creating leader registration node /collections/control_collection/leaders/shard1/leader after winning as /collections/control_collection/leader_elect/shard1/election/96575498816651269-core_node1-n_0000000000
   [junit4]   2> 1760489 INFO  (coreZkRegister-9974-thread-1-processing-n:127.0.0.1:45619_btv%2Fgk x:collection1 s:shard1 c:control_collection r:core_node1) [n:127.0.0.1:45619_btv%2Fgk c:control_collection s:shard1 r:core_node1 x:collection1] o.a.s.c.ShardLeaderElectionContext I am the new leader: https://127.0.0.1:45619/btv/gk/collection1/ shard1
   [junit4]   2> 1760490 INFO  (OverseerStateUpdate-96575498816651269-127.0.0.1:45619_btv%2Fgk-n_0000000000) [n:127.0.0.1:45619_btv%2Fgk    ] o.a.s.c.Overseer processMessage: queueSize: 1, message = {
   [junit4]   2>   "operation":"leader",
   [junit4]   2>   "shard":"shard1",
   [junit4]   2>   "collection":"control_collection",
   [junit4]   2>   "base_url":"https://127.0.0.1:45619/btv/gk",
   [junit4]   2>   "core":"collection1",
   [junit4]   2>   "state":"active"} current state version: 1
   [junit4]   2> 1760591 INFO  (zkCallback-20503-thread-1-processing-n:127.0.0.1:45619_btv%2Fgk) [n:127.0.0.1:45619_btv%2Fgk    ] o.a.s.c.c.ZkStateReader A cluster state change: [WatchedEvent state:SyncConnected type:NodeDataChanged path:/clusterstate.json], has occurred - updating... (live nodes size: [1])
   [junit4]   2> 1760640 INFO  (coreZkRegister-9974-thread-1-processing-n:127.0.0.1:45619_btv%2Fgk x:collection1 s:shard1 c:control_collection r:core_node1) [n:127.0.0.1:45619_btv%2Fgk c:control_collection s:shard1 r:core_node1 x:collection1] o.a.s.c.ZkController We are https://127.0.0.1:45619/btv/gk/collection1/ and leader is https://127.0.0.1:45619/btv/gk/collection1/
   [junit4]   2> 1760640 INFO  (coreZkRegister-9974-thread-1-processing-n:127.0.0.1:45619_btv%2Fgk x:collection1 s:shard1 c:control_collection r:core_node1) [n:127.0.0.1:45619_btv%2Fgk c:control_collection s:shard1 r:core_node1 x:collection1] o.a.s.c.ZkController No LogReplay needed for core=collection1 baseURL=https://127.0.0.1:45619/btv/gk
   [junit4]   2> 1760640 INFO  (coreZkRegister-9974-thread-1-processing-n:127.0.0.1:45619_btv%2Fgk x:collection1 s:shard1 c:control_collection r:core_node1) [n:127.0.0.1:45619_btv%2Fgk c:control_collection s:shard1 r:core_node1 x:collection1] o.a.s.c.ZkController I am the leader, no recovery necessary
   [junit4]   2> 1760640 INFO  (coreZkRegister-9974-thread-1-processing-n:127.0.0.1:45619_btv%2Fgk x:collection1 s:shard1 c:control_collection r:core_node1) [n:127.0.0.1:45619_btv%2Fgk c:control_collection s:shard1 r:core_node1 x:collection1] o.a.s.c.ZkController publishing state=active
   [junit4]   2> 1760640 INFO  (coreZkRegister-9974-thread-1-processing-n:127.0.0.1:45619_btv%2Fgk x:collection1 s:shard1 c:control_collection r:core_node1) [n:127.0.0.1:45619_btv%2Fgk c:control_collection s:shard1 r:core_node1 x:collection1] o.a.s.c.ZkController numShards not found on descriptor - reading it from system property
   [junit4]   2> 1760641 INFO  (coreZkRegister-9974-thread-1-processing-n:127.0.0.1:45619_btv%2Fgk x:collection1 s:shard1 c:control_collection r:core_node1) [n:127.0.0.1:45619_btv%2Fgk c:control_collection s:shard1 r:core_node1 x:collection1] o.a.s.c.c.ZkStateReader Checking legacy cluster state for collection control_collection
   [junit4]   2> 1760641 INFO  (OverseerStateUpdate-96575498816651269-127.0.0.1:45619_btv%2Fgk-n_0000000000) [n:127.0.0.1:45619_btv%2Fgk    ] o.a.s.c.Overseer processMessage: queueSize: 1, message = {
   [junit4]   2>   "core":"collection1",
   [junit4]   2>   "core_node_name":"core_node1",
   [junit4]   2>   "roles":null,
   [junit4]   2>   "base_url":"https://127.0.0.1:45619/btv/gk",
   [junit4]   2>   "node_name":"127.0.0.1:45619_btv%2Fgk",
   [junit4]   2>   "numShards":"1",
   [junit4]   2>   "state":"active",
   [junit4]   2>   "shard":"shard1",
   [junit4]   2>   "collection":"control_collection",
   [junit4]   2>   "operation":"state"} current state version: 2
   [junit4]   2> 1760641 INFO  (OverseerStateUpdate-96575498816651269-127.0.0.1:45619_btv%2Fgk-n_0000000000) [n:127.0.0.1:45619_btv%2Fgk    ] o.a.s.c.o.ReplicaMutator Update state numShards=1 message={
   [junit4]   2>   "core":"collection1",
   [junit4]   2>   "core_node_name":"core_node1",
   [junit4]   2>   "roles":null,
   [junit4]   2>   "base_url":"https://127.0.0.1:45619/btv/gk",
   [junit4]   2>   "node_name":"127.0.0.1:45619_btv%2Fgk",
   [junit4]   2>   "numShards":"1",
   [junit4]   2>   "state":"active",
   [junit4]   2>   "shard":"shard1",
   [junit4]   2>   "collection":"control_collection",
   [junit4]   2>   "operation":"state"}
   [junit4]   2> 1760743 INFO  (zkCallback-20503-thread-2-processing-n:127.0.0.1:45619_btv%2Fgk) [n:127.0.0.1:45619_btv%2Fgk    ] o.a.s.c.c.ZkStateReader A cluster state change: [WatchedEvent state:SyncConnected type:NodeDataChanged path:/clusterstate.json], has occurred - updating... (live nodes size: [1])
   [junit4]   2> 1760863 INFO  (TEST-TestDynamicLoading.testDynamicLoading-seed#[578E62177CC72114]) [    ] o.a.s.c.c.SolrZkClient Using default ZkCredentialsProvider
   [junit4]   2> 1760864 INFO  (TEST-TestDynamicLoading.testDynamicLoading-seed#[578E62177CC72114]) [    ] o.a.s.c.c.ConnectionManager Waiting for client to connect to ZooKeeper
   [junit4]   2> 1760865 INFO  (zkCallback-20507-thread-1) [    ] o.a.s.c.c.ConnectionManager Watcher org.apache.solr.common.cloud.ConnectionManager@61ef3d48 name:ZooKeeperConnection Watcher:127.0.0.1:40207/solr got event WatchedEvent state:SyncConnected type:None path:null path:null type:None
   [junit4]   2> 1760865 INFO  (TEST-TestDynamicLoading.testDynamicLoading-seed#[578E62177CC72114]) [    ] o.a.s.c.c.ConnectionManager Client is connected to ZooKeeper
   [junit4]   2> 1760865 INFO  (TEST-TestDynamicLoading.testDynamicLoading-seed#[578E62177CC72114]) [    ] o.a.s.c.c.SolrZkClient Using default ZkACLProvider
   [junit4]   2> 1760865 INFO  (TEST-TestDynamicLoading.testDynamicLoading-seed#[578E62177CC72114]) [    ] o.a.s.c.c.ZkStateReader Updating cluster state from ZooKeeper... 
   [junit4]   2> 1760865 INFO  (TEST-TestDynamicLoading.testDynamicLoading-seed#[578E62177CC72114]) [    ] o.a.s.c.c.ZkStateReader Loaded cluster properties: {urlScheme=https}
   [junit4]   2> 1760865 INFO  (TEST-TestDynamicLoading.testDynamicLoading-seed#[578E62177CC72114]) [    ] o.a.s.c.c.ZkStateReader Updated live nodes from ZooKeeper... (0) -> (1)
   [junit4]   2> 1760866 INFO  (TEST-TestDynamicLoading.testDynamicLoading-seed#[578E62177CC72114]) [    ] o.a.s.c.ChaosMonkey monkey: init - expire sessions:false cause connection loss:false
   [junit4]   2> 1760866 INFO  (TEST-TestDynamicLoading.testDynamicLoading-seed#[578E62177CC72114]) [    ] o.a.s.c.AbstractFullDistribZkTestBase Creating collection1 with stateFormat=2
   [junit4]   2> 1760866 INFO  (TEST-TestDynamicLoading.testDynamicLoading-seed#[578E62177CC72114]) [    ] o.a.s.c.c.SolrZkClient Using default ZkCredentialsProvider
   [junit4]   2> 1760866 INFO  (TEST-TestDynamicLoading.testDynamicLoading-seed#[578E62177CC72114]) [    ] o.a.s.c.c.ConnectionManager Waiting for client to connect to ZooKeeper
   [junit4]   2> 1760867 INFO  (zkCallback-20508-thread-1) [    ] o.a.s.c.c.ConnectionManager Watcher org.apache.solr.common.cloud.ConnectionManager@37836810 name:ZooKeeperConnection Watcher:127.0.0.1:40207/solr got event WatchedEvent state:SyncConnected type:None path:null path:null type:None
   [junit4]   2> 1760867 INFO  (TEST-TestDynamicLoading.testDynamicLoading-seed#[578E62177CC72114]) [    ] o.a.s.c.c.ConnectionManager Client is connected to ZooKeeper
   [junit4]   2> 1760867 INFO  (TEST-TestDynamicLoading.testDynamicLoading-seed#[578E62177CC72114]) [    ] o.a.s.c.c.SolrZkClient Using default ZkACLProvider
   [junit4]   2> 1760868 INFO  (OverseerStateUpdate-96575498816651269-127.0.0.1:45619_btv%2Fgk-n_0000000000) [n:127.0.0.1:45619_btv%2Fgk    ] o.a.s.c.Overseer processMessage: queueSize: 1, message = {
   [junit4]   2>   "operation":"create",
   [junit4]   2>   "name":"collection1",
   [junit4]   2>   "numShards":"2",
   [junit4]   2>   "stateFormat":"2"} current state version: 3
   [junit4]   2> 1760868 INFO  (OverseerStateUpdate-96575498816651269-127.0.0.1:45619_btv%2Fgk-n_0000000000) [n:127.0.0.1:45619_btv%2Fgk    ] o.a.s.c.o.ClusterStateMutator building a new cName: collection1
   [junit4]   2> 1760920 INFO  (TEST-TestDynamicLoading.testDynamicLoading-seed#[578E62177CC72114]) [    ] o.a.s.SolrTestCaseJ4 Writing core.properties file to /home/jenkins/workspace/Lucene-Solr-master-Linux/solr/build/solr-core/test/J0/temp/solr.core.TestDynamicLoading_578E62177CC72114-001/shard-1-001/cores/collection1
   [junit4]   2> 1760920 INFO  (TEST-TestDynamicLoading.testDynamicLoading-seed#[578E62177CC72114]) [    ] o.a.s.c.AbstractFullDistribZkTestBase create jetty 1 in directory /home/jenkins/workspace/Lucene-Solr-master-Linux/solr/build/solr-core/test/J0/temp/solr.core.TestDynamicLoading_578E62177CC72114-001/shard-1-001
   [junit4]   2> 1760921 INFO  (TEST-TestDynamicLoading.testDynamicLoading-seed#[578E62177CC72114]) [    ] o.e.j.s.Server jetty-9.3.8.v20160314
   [junit4]   2> 1760922 INFO  (TEST-TestDynamicLoading.testDynamicLoading-seed#[578E62177CC72114]) [    ] o.e.j.s.h.ContextHandler Started o.e.j.s.ServletContextHandler@7b2e9082{/btv/gk,null,AVAILABLE}
   [junit4]   2> 1760924 INFO  (TEST-TestDynamicLoading.testDynamicLoading-seed#[578E62177CC72114]) [    ] o.e.j.s.ServerConnector Started ServerConnector@1d92465{SSL,[ssl, http/1.1]}{127.0.0.1:36381}
   [junit4]   2> 1760924 INFO  (TEST-TestDynamicLoading.testDynamicLoading-seed#[578E62177CC72114]) [    ] o.e.j.s.Server Started @1762647ms
   [junit4]   2> 1760924 INFO  (TEST-TestDynamicLoading.testDynamicLoading-seed#[578E62177CC72114]) [    ] o.a.s.c.s.e.JettySolrRunner Jetty properties: {solr.data.dir=/home/jenkins/workspace/Lucene-Solr-master-Linux/solr/build/solr-core/test/J0/temp/solr.core.TestDynamicLoading_578E62177CC72114-001/tempDir-001/jetty1, solrconfig=solrconfig.xml, hostContext=/btv/gk, hostPort=36381, coreRootDirectory=/home/jenkins/workspace/Lucene-Solr-master-Linux/solr/build/solr-core/test/J0/temp/solr.core.TestDynamicLoading_578E62177CC72114-001/shard-1-001/cores}
   [junit4]   2> 1760924 INFO  (TEST-TestDynamicLoading.testDynamicLoading-seed#[578E62177CC72114]) [    ] o.a.s.s.SolrDispatchFilter SolrDispatchFilter.init(): sun.misc.Launcher$AppClassLoader@73d16e93
   [junit4]   2> 1760925 INFO  (TEST-TestDynamicLoading.testDynamicLoading-seed#[578E62177CC72114]) [    ] o.a.s.c.SolrResourceLoader new SolrResourceLoader for directory: '/home/jenkins/workspace/Lucene-Solr-master-Linux/solr/build/solr-core/test/J0/temp/solr.core.TestDynamicLoading_578E62177CC72114-001/shard-1-001'
   [junit4]   2> 1760925 INFO  (TEST-TestDynamicLoading.testDynamicLoading-seed#[578E62177CC72114]) [    ] o.a.s.c.SolrResourceLoader JNDI not configured for solr (NoInitialContextEx)
   [junit4]   2> 1760925 INFO  (TEST-TestDynamicLoading.testDynamicLoading-seed#[578E62177CC72114]) [    ] o.a.s.c.SolrResourceLoader solr home defaulted to 'solr/' (could not find system property or JNDI)
   [junit4]   2> 1760925 INFO  (TEST-TestDynamicLoading.testDynamicLoading-seed#[578E62177CC72114]) [    ] o.a.s.c.c.SolrZkClient Using default ZkCredentialsProvider
   [junit4]   2> 1760925 INFO  (TEST-TestDynamicLoading.testDynamicLoading-seed#[578E62177CC72114]) [    ] o.a.s.c.c.ConnectionManager Waiting for client to connect to ZooKeeper
   [junit4]   2> 1760926 INFO  (zkCallback-20509-thread-1) [    ] o.a.s.c.c.ConnectionManager Watcher org.apache.solr.common.cloud.ConnectionManager@9f8e787 name:ZooKeeperConnection Watcher:127.0.0.1:40207/solr got event WatchedEvent state:SyncConnected type:None path:null path:null type:None
   [junit4]   2> 1760926 INFO  (TEST-TestDynamicLoading.testDynamicLoading-seed#[578E62177CC72114]) [    ] o.a.s.c.c.ConnectionManager Client is connected to ZooKeeper
   [junit4]   2> 1760926 INFO  (TEST-TestDynamicLoading.testDynamicLoading-seed#[578E62177CC72114]) [    ] o.a.s.c.c.SolrZkClient Using default ZkACLProvider
   [junit4]   2> 1760926 INFO  (TEST-TestDynamicLoading.testDynamicLoading-seed#[578E62177CC72114]) [    ] o.a.s.s.SolrDispatchFilter Loading solr.xml from SolrHome (not found in ZooKeeper)
   [junit4]   2> 1760926 INFO  (TEST-TestDynamicLoading.testDynamicLoading-seed#[578E62177CC72114]) [    ] o.a.s.c.SolrXmlConfig Loading container configuration from /home/jenkins/workspace/Lucene-Solr-master-Linux/solr/build/solr-core/test/J0/temp/solr.core.TestDynamicLoading_578E62177CC72114-001/shard-1-001/solr.xml
   [junit4]   2> 1760930 INFO  (TEST-TestDynamicLoading.testDynamicLoading-seed#[578E62177CC72114]) [    ] o.a.s.c.CorePropertiesLocator Config-defined core root directory: /home/jenkins/workspace/Lucene-Solr-master-Linux/solr/build/solr-core/test/J0/temp/solr.core.TestDynamicLoading_578E62177CC72114-001/shard-1-001/cores
   [junit4]   2> 1760930 INFO  (TEST-TestDynamicLoading.testDynamicLoading-seed#[578E62177CC72114]) [    ] o.a.s.c.CoreContainer New CoreContainer 490075875
   [junit4]   2> 1760930 INFO  (TEST-TestDynamicLoading.testDynamicLoading-seed#[578E62177CC72114]) [    ] o.a.s.c.CoreContainer Loading cores into CoreContainer [instanceDir=/home/jenkins/workspace/Lucene-Solr-master-Linux/solr/build/solr-core/test/J0/temp/solr.core.TestDynamicLoading_578E62177CC72114-001/shard-1-001]
   [junit4]   2> 1760930 WARN  (TEST-TestDynamicLoading.testDynamicLoading-seed#[578E62177CC72114]) [    ] o.a.s.c.CoreContainer Couldn't add files from /home/jenkins/workspace/Lucene-Solr-master-Linux/solr/build/solr-core/test/J0/temp/solr.core.TestDynamicLoading_578E62177CC72114-001/shard-1-001/lib to classpath: /home/jenkins/workspace/Lucene-Solr-master-Linux/solr/build/solr-core/test/J0/temp/solr.core.TestDynamicLoading_578E62177CC72114-001/shard-1-001/lib
   [junit4]   2> 1760930 INFO  (TEST-TestDynamicLoading.testDynamicLoading-seed#[578E62177CC72114]) [    ] o.a.s.h.c.HttpShardHandlerFactory created with socketTimeout : 90000,urlScheme : ,connTimeout : 15000,maxConnectionsPerHost : 20,maxConnections : 10000,corePoolSize : 0,maximumPoolSize : 2147483647,maxThreadIdleTime : 5,sizeOfQueue : -1,fairnessPolicy : false,
   [junit4]   2> 1760931 INFO  (TEST-TestDynamicLoading.testDynamicLoading-seed#[578E62177CC72114]) [    ] o.a.s.u.UpdateShardHandler Created UpdateShardHandler HTTP client with params: socketTimeout=340000&connTimeout=45000&maxConnections=100000&maxConnectionsPerHost=100000
   [junit4]   2> 1760931 INFO  (TEST-TestDynamicLoading.testDynamicLoading-seed#[578E62177CC72114]) [    ] o.a.s.l.LogWatcher SLF4J impl is org.slf4j.impl.Log4jLoggerFactory
   [junit4]   2> 1760931 INFO  (TEST-TestDynamicLoading.testDynamicLoading-seed#[578E62177CC72114]) [    ] o.a.s.l.LogWatcher Registering Log Listener [Log4j (org.slf4j.impl.Log4jLoggerFactory)]
   [junit4]   2> 1760931 INFO  (TEST-TestDynamicLoading.testDynamicLoading-seed#[578E62177CC72114]) [    ] o.a.s.c.ZkContainer Zookeeper client=127.0.0.1:40207/solr
   [junit4]   2> 1760932 INFO  (TEST-TestDynamicLoading.testDynamicLoading-seed#[578E62177CC72114]) [    ] o.a.s.c.ZkController zkHost includes chroot
   [junit4]   2> 1760932 INFO  (TEST-TestDynamicLoading.testDynamicLoading-seed#[578E62177CC72114]) [    ] o.a.s.c.c.SolrZkClient Using default ZkCredentialsProvider
   [junit4]   2> 1760932 INFO  (TEST-TestDynamicLoading.testDynamicLoading-seed#[578E62177CC72114]) [    ] o.a.s.c.c.ConnectionManager Waiting for client to connect to ZooKeeper
   [junit4]   2> 1760932 INFO  (zkCallback-20512-thread-1) [    ] o.a.s.c.c.ConnectionManager Watcher org.apache.solr.common.cloud.ConnectionManager@414134d name:ZooKeeperConnection Watcher:127.0.0.1:40207 got event WatchedEvent state:SyncConnected type:None path:null path:null type:None
   [junit4]   2> 1760932 INFO  (TEST-TestDynamicLoading.testDynamicLoading-seed#[578E62177CC72114]) [    ] o.a.s.c.c.ConnectionManager Client is connected to ZooKeeper
   [junit4]   2> 1760933 INFO  (TEST-TestDynamicLoading.testDynamicLoading-seed#[578E62177CC72114]) [    ] o.a.s.c.c.SolrZkClient Using default ZkACLProvider
   [junit4]   2> 1760933 INFO  (TEST-TestDynamicLoading.testDynamicLoading-seed#[578E62177CC72114]) [n:127.0.0.1:36381_btv%2Fgk    ] o.a.s.c.ZkController Added new OnReconnect listener org.apache.solr.cloud.ZkController$$Lambda$116/1056893600@5ba20713
   [junit4]   2> 1760933 INFO  (TEST-TestDynamicLoading.testDynamicLoading-seed#[578E62177CC72114]) [n:127.0.0.1:36381_btv%2Fgk    ] o.a.s.c.c.ConnectionManager Waiting for client to connect to ZooKeeper
   [junit4]   2> 1760933 INFO  (zkCallback-20513-thread-1-processing-n:127.0.0.1:36381_btv%2Fgk) [n:127.0.0.1:36381_btv%2Fgk    ] o.a.s.c.c.ConnectionManager Watcher org.apache.solr.common.cloud.ConnectionManager@78764b96 name:ZooKeeperConnection Watcher:127.0.0.1:40207/solr got event WatchedEvent state:SyncConnected type:None path:null path:null type:None
   [junit4]   2> 1760934 INFO  (TEST-TestDynamicLoading.testDynamicLoading-seed#[578E62177CC72114]) [n:127.0.0.1:36381_btv%2Fgk    ] o.a.s.c.c.ConnectionManager Client is connected to ZooKeeper
   [junit4]   2> 1760937 INFO  (TEST-TestDynamicLoading.testDynamicLoading-seed#[578E62177CC72114]) [n:127.0.0.1:36381_btv%2Fgk    ] o.a.s.c.c.ZkStateReader Updating cluster state from ZooKeeper... 
   [junit4]   2> 1760937 INFO  (TEST-TestDynamicLoading.testDynamicLoading-seed#[578E62177CC72114]) [n:127.0.0.1:36381_btv%2Fgk    ] o.a.s.c.c.ZkStateReader Loaded cluster properties: {urlScheme=https}
   [junit4]   2> 1760937 INFO  (TEST-TestDynamicLoading.testDynamicLoading-seed#[578E62177CC72114]) [n:127.0.0.1:36381_btv%2Fgk    ] o.a.s.c.c.ZkStateReader Updated live nodes from ZooKeeper... (0) -> (1)
   [junit4]   2> 1760938 INFO  (TEST-TestDynamicLoading.testDynamicLoading-seed#[578E62177CC72114]) [n:127.0.0.1:36381_btv%2Fgk    ] o.a.s.c.Overseer Overseer (id=null) closing
   [junit4]   2> 1760938 INFO  (TEST-TestDynamicLoading.testDynamicLoading-seed#[578E62177CC72114]) [n:127.0.0.1:36381_btv%2Fgk    ] o.a.s.c.LeaderElector Joined leadership election with path: /overseer_elect/election/96575498816651274-127.0.0.1:36381_btv%2Fgk-n_0000000001
   [junit4]   2> 1760939 INFO  (TEST-TestDynamicLoading.testDynamicLoading-seed#[578E62177CC72114]) [n:127.0.0.1:36381_btv%2Fgk    ] o.a.s.c.LeaderElector Watching path /overseer_elect/election/96575498816651269-127.0.0.1:45619_btv%2Fgk-n_0000000000 to know if I could be the leader
   [junit4]   2> 1760939 INFO  (TEST-TestDynamicLoading.testDynamicLoading-seed#[578E62177CC72114]) [n:127.0.0.1:36381_btv%2Fgk    ] o.a.s.c.ZkController Publish node=127.0.0.1:36381_btv%2Fgk as DOWN
   [junit4]   2> 1760939 INFO  (TEST-TestDynamicLoading.testDynamicLoading-seed#[578E62177CC72114]) [n:127.0.0.1:36381_btv%2Fgk    ] o.a.s.c.ZkController Register node as live in ZooKeeper:/live_nodes/127.0.0.1:36381_btv%2Fgk
   [junit4]   2> 1760939 INFO  (TEST-TestDynamicLoading.testDynamicLoading-seed#[578E62177CC72114]) [n:127.0.0.1:36381_btv%2Fgk    ] o.a.s.c.c.SolrZkClient makePath: /live_nodes/127.0.0.1:36381_btv%2Fgk
   [junit4]   2> 1760939 INFO  (OverseerStateUpdate-96575498816651269-127.0.0.1:45619_btv%2Fgk-n_0000000000) [n:127.0.0.1:45619_btv%2Fgk    ] o.a.s.c.Overseer processMessage: queueSize: 1, message = {
   [junit4]   2>   "operation":"downnode",
   [junit4]   2>   "node_name":"127.0.0.1:36381_btv%2Fgk"} current state version: 3
   [junit4]   2> 1760939 INFO  (OverseerStateUpdate-96575498816651269-127.0.0.1:45619_btv%2Fgk-n_0000000000) [n:127.0.0.1:45619_btv%2Fgk    ] o.a.s.c.o.NodeMutator DownNode state invoked for node: 127.0.0.1:36381_btv%2Fgk
   [junit4]   2> 1760939 INFO  (zkCallback-20513-thread-1-processing-n:127.0.0.1:36381_btv%2Fgk) [n:127.0.0.1:36381_btv%2Fgk    ] o.a.s.c.c.ZkStateReader A live node change: [WatchedEvent state:SyncConnected type:NodeChildrenChanged path:/live_nodes], has occurred - updating... (live nodes size: [1])
   [junit4]   2> 1760939 INFO  (zkCallback-20507-thread-1) [    ] o.a.s.c.c.ZkStateReader A live node change: [WatchedEvent state:SyncConnected type:NodeChildrenChanged path:/live_nodes], has occurred - updating... (live nodes size: [1])
   [junit4]   2> 1760939 INFO  (zkCallback-20503-thread-2-processing-n:127.0.0.1:45619_btv%2Fgk) [n:127.0.0.1:45619_btv%2Fgk    ] o.a.s.c.c.ZkStateReader A live node change: [WatchedEvent state:SyncConnected type:NodeChildrenChanged path:/live_nodes], has occurred - updating... (live nodes size: [1])
   [junit4]   2> 1760940 INFO  (zkCallback-20513-thread-1-processing-n:127.0.0.1:36381_btv%2Fgk) [n:127.0.0.1:36381_btv%2Fgk    ] o.a.s.c.c.ZkStateReader Updated live nodes from ZooKeeper... (1) -> (2)
   [junit4]   2> 1760940 INFO  (OverseerStateUpdate-96575498816651269-127.0.0.1:45619_btv%2Fgk-n_0000000000) [n:127.0.0.1:45619_btv%2Fgk    ] o.a.s.c.o.ZkStateWriter going to create_collection /collections/collection1/state.json
   [junit4]   2> 1760941 INFO  (zkCallback-20507-thread-1) [    ] o.a.s.c.c.ZkStateReader Updated live nodes from ZooKeeper... (1) -> (2)
   [junit4]   2> 1760941 INFO  (zkCallback-20503-thread-2-processing-n:127.0.0.1:45619_btv%2Fgk) [n:127.0.0.1:45619_btv%2Fgk    ] o.a.s.c.c.ZkStateReader Updated live nodes from ZooKeeper... (1) -> (2)
   [junit4]   2> 1760942 INFO  (zkCallback-20503-thread-2-processing-n:127.0.0.1:45619_btv%2Fgk) [n:127.0.0.1:45619_btv%2Fgk    ] o.a.s.c.c.ZkStateReader A cluster state change: [WatchedEvent state:SyncConnected type:NodeDataChanged path:/clusterstate.json], has occurred - updating... (live nodes size: [2])
   [junit4]   2> 1760942 INFO  (zkCallback-20507-thread-1) [    ] o.a.s.c.c.ZkStateReader A cluster state change: [WatchedEvent state:SyncConnected type:NodeDataChanged path:/clusterstate.json], has occurred - updating... (live nodes size: [2])
   [junit4]   2> 1760942 INFO  (zkCallback-20513-thread-1-processing-n:127.0.0.1:36381_btv%2Fgk) [n:127.0.0.1:36381_btv%2Fgk    ] o.a.s.c.c.ZkStateReader A cluster state change: [WatchedEvent state:SyncConnected type:NodeDataChanged path:/clusterstate.json], has occurred - updating... (live nodes size: [2])
   [junit4]   2> 1760951 INFO  (TEST-TestDynamicLoading.testDynamicLoading-seed#[578E62177CC72114]) [n:127.0.0.1:36381_btv%2Fgk    ] o.a.s.c.CoreContainer Security conf doesn't exist. Skipping setup for authorization module.
   [junit4]   2> 1760951 INFO  (TEST-TestDynamicLoading.testDynamicLoading-seed#[578E62177CC72114]) [n:127.0.0.1:36381_btv%2Fgk    ] o.a.s.c.CoreContainer No authentication plugin used.
   [junit4]   2> 1760951 INFO  (TEST-TestDynamicLoading.testDynamicLoading-seed#[578E62177CC72114]) [n:127.0.0.1:36381_btv%2Fgk    ] o.a.s.c.CorePropertiesLocator Looking for core definitions underneath /home/jenkins/workspace/Lucene-Solr-master-Linux/solr/build/solr-core/test/J0/temp/solr.core.TestDynamicLoading_578E62177CC72114-001/shard-1-001/cores
   [junit4]   2> 1760952 INFO  (TEST-TestDynamicLoading.testDynamicLoading-seed#[578E62177CC72114]) [n:127.0.0.1:36381_btv%2Fgk    ] o.a.s.c.CoreDescriptor Created CoreDescriptor: {name=collection1, config=solrconfig.xml, transient=false, schema=schema.xml, loadOnStartup=true, configSetProperties=configsetprops.json, collection=collection1, coreNodeName=, dataDir=data/, shard=}
   [junit4]   2> 1760952 INFO  (TEST-TestDynamicLoading.testDynamicLoading-seed#[578E62177CC72114]) [n:127.0.0.1:36381_btv%2Fgk    ] o.a.s.c.CorePropertiesLocator Found core collection1 in /home/jenkins/workspace/Lucene-Solr-master-Linux/solr/build/solr-core/test/J0/temp/solr.core.TestDynamicLoading_578E62177CC72114-001/shard-1-001/cores/collection1
   [junit4]   2> 1760952 INFO  (TEST-TestDynamicLoading.testDynamicLoading-seed#[578E62177CC72114]) [n:127.0.0.1:36381_btv%2Fgk    ] o.a.s.c.CorePropertiesLocator Found 1 core definitions
   [junit4]   2> 1760952 INFO  (TEST-TestDynamicLoading.testDynamicLoading-seed#[578E62177CC72114]) [n:127.0.0.1:36381_btv%2Fgk    ] o.a.s.s.SolrDispatchFilter user.dir=/home/jenkins/workspace/Lucene-Solr-master-Linux/solr/build/solr-core/test/J0
   [junit4]   2> 1760952 INFO  (TEST-TestDynamicLoading.testDynamicLoading-seed#[578E62177CC72114]) [n:127.0.0.1:36381_btv%2Fgk    ] o.a.s.s.SolrDispatchFilter SolrDispatchFilter.init() done
   [junit4]   2> 1760952 INFO  (coreLoadExecutor-9992-thread-1-processing-n:127.0.0.1:36381_btv%2Fgk) [n:127.0.0.1:36381_btv%2Fgk c:collection1   x:collection1] o.a.s.c.ZkController publishing state=down
   [junit4]   2> 1760952 INFO  (coreLoadExecutor-9992-thread-1-processing-n:127.0.0.1:36381_btv%2Fgk) [n:127.0.0.1:36381_btv%2Fgk c:collection1   x:collection1] o.a.s.c.ZkController numShards not found on descriptor - reading it from system property
   [junit4]   2> 1760953 INFO  (coreLoadExecutor-9992-thread-1-processing-n:127.0.0.1:36381_btv%2Fgk) [n:127.0.0.1:36381_btv%2Fgk c:collection1   x:collection1] o.a.s.c.ZkController Registering watch for collection collection1
   [junit4]   2> 1760953 INFO  (OverseerStateUpdate-96575498816651269-127.0.0.1:45619_btv%2Fgk-n_0000000000) [n:127.0.0.1:45619_btv%2Fgk    ] o.a.s.c.Overseer processMessage: queueSize: 1, message = {
   [junit4]   2>   "core":"collection1",
   [junit4]   2>   "roles":null,
   [junit4]   2>   "base_url":"https://127.0.0.1:36381/btv/gk",
   [junit4]   2>   "node_name":"127.0.0.1:36381_btv%2Fgk",
   [junit4]   2>   "numShards":"2",
   [junit4]   2>   "state":"down",
   [junit4]   2>   "shard":null,
   [junit4]   2>   "collection":"collection1",
   [junit4]   2>   "operation":"state"} current state 

[...truncated too long message...]

FO  (TEST-TestDynamicLoading.testDynamicLoading-seed#[578E62177CC72114]) [    ] o.a.s.c.Overseer Overseer (id=96575498816651283-127.0.0.1:35180_btv%2Fgk-n_0000000004) closing
   [junit4]   2> 1811526 INFO  (OverseerStateUpdate-96575498816651283-127.0.0.1:35180_btv%2Fgk-n_0000000004) [n:127.0.0.1:35180_btv%2Fgk    ] o.a.s.c.Overseer Overseer Loop exiting : 127.0.0.1:35180_btv%2Fgk
   [junit4]   2> 1811533 INFO  (zkCallback-20532-thread-4-processing-n:127.0.0.1:35180_btv%2Fgk) [n:127.0.0.1:35180_btv%2Fgk    ] o.a.s.c.c.ZkStateReader A live node change: [WatchedEvent state:SyncConnected type:NodeChildrenChanged path:/live_nodes], has occurred - updating... (live nodes size: [1])
   [junit4]   2> 1811534 WARN  (zkCallback-20532-thread-4-processing-n:127.0.0.1:35180_btv%2Fgk) [n:127.0.0.1:35180_btv%2Fgk    ] o.a.s.c.c.ZkStateReader ZooKeeper watch triggered, but Solr cannot talk to ZK: [KeeperErrorCode = Session expired for /live_nodes]
   [junit4]   2> 1811534 INFO  (TEST-TestDynamicLoading.testDynamicLoading-seed#[578E62177CC72114]) [    ] o.e.j.s.ServerConnector Stopped ServerConnector@1d02f748{SSL,[ssl, http/1.1]}{127.0.0.1:0}
   [junit4]   2> 1811535 INFO  (TEST-TestDynamicLoading.testDynamicLoading-seed#[578E62177CC72114]) [    ] o.e.j.s.h.ContextHandler Stopped o.e.j.s.ServletContextHandler@2533cb60{/btv/gk,null,UNAVAILABLE}
   [junit4]   2> 1811536 INFO  (TEST-TestDynamicLoading.testDynamicLoading-seed#[578E62177CC72114]) [    ] o.a.s.c.ZkTestServer connecting to 127.0.0.1:40207 40207
   [junit4]   2> 1811626 INFO  (Thread-2911) [    ] o.a.s.c.ZkTestServer connecting to 127.0.0.1:40207 40207
   [junit4]   2> 1811627 WARN  (Thread-2911) [    ] o.a.s.c.ZkTestServer Watch limit violations: 
   [junit4]   2> Maximum concurrent create/delete watches above limit:
   [junit4]   2> 
   [junit4]   2> 	35	/solr/configs/conf1
   [junit4]   2> 	6	/solr/aliases.json
   [junit4]   2> 	5	/solr/security.json
   [junit4]   2> 	2	/solr/configs/.system
   [junit4]   2> 	2	/solr/configs/.system/managed-schema
   [junit4]   2> 
   [junit4]   2> Maximum concurrent data watches above limit:
   [junit4]   2> 
   [junit4]   2> 	6	/solr/clusterstate.json
   [junit4]   2> 	6	/solr/clusterprops.json
   [junit4]   2> 	4	/solr/collections/collection1/state.json
   [junit4]   2> 	2	/solr/collections/.system/state.json
   [junit4]   2> 
   [junit4]   2> Maximum concurrent children watches above limit:
   [junit4]   2> 
   [junit4]   2> 	51	/solr/overseer/collection-queue-work
   [junit4]   2> 	28	/solr/overseer/queue
   [junit4]   2> 	21	/solr/overseer/queue-work
   [junit4]   2> 	6	/solr/live_nodes
   [junit4]   2> 	6	/solr/collections
   [junit4]   2> 
   [junit4]   2> NOTE: reproduce with: ant test  -Dtestcase=TestDynamicLoading -Dtests.method=testDynamicLoading -Dtests.seed=578E62177CC72114 -Dtests.multiplier=3 -Dtests.slow=true -Dtests.locale=el-CY -Dtests.timezone=Asia/Yakutsk -Dtests.asserts=true -Dtests.file.encoding=ISO-8859-1
   [junit4] FAILURE 52.6s J0 | TestDynamicLoading.testDynamicLoading <<<
   [junit4]    > Throwable #1: java.lang.AssertionError: Could not get expected value  'X val' for path 'x' full output: {
   [junit4]    >   "responseHeader":{
   [junit4]    >     "status":0,
   [junit4]    >     "QTime":0},
   [junit4]    >   "params":{"wt":"json"},
   [junit4]    >   "context":{
   [junit4]    >     "webapp":"/btv/gk",
   [junit4]    >     "path":"/test1",
   [junit4]    >     "httpMethod":"GET"},
   [junit4]    >   "class":"org.apache.solr.core.BlobStoreTestRequestHandler",
   [junit4]    >   "x":null},  from server:  null
   [junit4]    > 	at __randomizedtesting.SeedInfo.seed([578E62177CC72114:8FC34F408B1A84B4]:0)
   [junit4]    > 	at org.apache.solr.core.TestSolrConfigHandler.testForResponseElement(TestSolrConfigHandler.java:535)
   [junit4]    > 	at org.apache.solr.core.TestDynamicLoading.testDynamicLoading(TestDynamicLoading.java:232)
   [junit4]    > 	at org.apache.solr.BaseDistributedSearchTestCase$ShardsRepeatRule$ShardsFixedStatement.callStatement(BaseDistributedSearchTestCase.java:985)
   [junit4]    > 	at org.apache.solr.BaseDistributedSearchTestCase$ShardsRepeatRule$ShardsStatement.evaluate(BaseDistributedSearchTestCase.java:960)
   [junit4]    > 	at java.lang.Thread.run(Thread.java:745)
   [junit4]   2> 1811636 INFO  (SUITE-TestDynamicLoading-seed#[578E62177CC72114]-worker) [    ] o.a.s.SolrTestCaseJ4 ###deleteCore
   [junit4]   2> NOTE: leaving temporary files on disk at: /home/jenkins/workspace/Lucene-Solr-master-Linux/solr/build/solr-core/test/J0/temp/solr.core.TestDynamicLoading_578E62177CC72114-001
   [junit4]   2> Sep 11, 2016 8:20:17 PM com.carrotsearch.randomizedtesting.ThreadLeakControl checkThreadLeaks
   [junit4]   2> WARNING: Will linger awaiting termination of 1 leaked thread(s).
   [junit4]   2> NOTE: test params are: codec=Asserting(Lucene62): {blobName=PostingsFormat(name=MockRandom), size=PostingsFormat(name=LuceneVarGapDocFreqInterval), _version_=PostingsFormat(name=LuceneVarGapFixedInterval), id=PostingsFormat(name=Direct), version=PostingsFormat(name=LuceneVarGapFixedInterval), md5=PostingsFormat(name=MockRandom), timestamp=PostingsFormat(name=MockRandom)}, docValues:{}, maxPointsInLeafNode=1243, maxMBSortInHeap=6.45819097463329, sim=RandomSimilarity(queryNorm=false): {}, locale=el-CY, timezone=Asia/Yakutsk
   [junit4]   2> NOTE: Linux 4.4.0-36-generic amd64/Oracle Corporation 1.8.0_102 (64-bit)/cpus=12,threads=1,free=220715800,total=518979584
   [junit4]   2> NOTE: All tests run in this JVM: [TestRandomDVFaceting, FileBasedSpellCheckerTest, RankQueryTest, DefaultValueUpdateProcessorTest, DistributedSpellCheckComponentTest, TestQuerySenderNoQuery, TestSolrDeletionPolicy2, TestPKIAuthenticationPlugin, TestLazyCores, SmileWriterTest, TestFastLRUCache, TestSolrConfigHandler, DistributedQueryElevationComponentTest, CleanupOldIndexTest, TestSortByMinMaxFunction, BasicZkTest, TestRTimerTree, ReturnFieldsTest, TestFieldCacheSanityChecker, TestStressLucene, TestCustomSort, RestartWhileUpdatingTest, ChaosMonkeyNothingIsSafeTest, TestRandomFlRTGCloud, DistributedQueueTest, ExternalFileFieldSortTest, ConnectionReuseTest, TestScoreJoinQPNoScore, TestConfigSetsAPIExclusivity, TestJsonFacets, TestFaceting, JavabinLoaderTest, TestCloudDeleteByQuery, ConnectionManagerTest, TestCodecSupport, TestCloudPseudoReturnFields, SignatureUpdateProcessorFactoryTest, TestStressCloudBlindAtomicUpdates, TestHdfsCloudBackupRestore, SharedFSAutoReplicaFailoverUtilsTest, TestLocalFSCloudBackupRestore, TestBinaryResponseWriter, TestFastWriter, UUIDFieldTest, TestPHPSerializedResponseWriter, AddBlockUpdateTest, TestDocumentBuilder, SecurityConfHandlerTest, CdcrBootstrapTest, DistributedExpandComponentTest, TestSchemaResource, TestDocSet, CoreAdminRequestStatusTest, TestSolrCoreProperties, HttpPartitionTest, BlockJoinFacetRandomTest, DeleteInactiveReplicaTest, HdfsRestartWhileUpdatingTest, WrapperMergePolicyFactoryTest, TestUniqueKeyFieldResource, TestRemoteStreaming, TestSolrCoreSnapshots, RequiredFieldsTest, TestHighFrequencyDictionaryFactory, TestMacroExpander, HdfsChaosMonkeyNothingIsSafeTest, HLLUtilTest, PolyFieldTest, TestRandomFaceting, CdcrRequestHandlerTest, QueryElevationComponentTest, TestDFISimilarityFactory, TestSimpleQParserPlugin, SpatialRPTFieldTypeTest, TestExactSharedStatsCache, TestHdfsUpdateLog, CollectionsAPISolrJTest, CollectionStateFormat2Test, ScriptEngineTest, FastVectorHighlighterTest, DistributedFacetPivotWhiteBoxTest, TestPerFieldSimilarity, TestValueSourceCache, CloudMLTQParserTest, SolrCloudExampleTest, TestUseDocValuesAsStored, ZkStateWriterTest, TestCSVLoader, TestBlendedInfixSuggestions, PeerSyncTest, TestLegacyNumericRangeQueryBuilder, CursorPagingTest, TestSolrCloudWithDelegationTokens, TestComponentsName, TestCrossCoreJoin, TestExpandComponent, AnalyticsQueryTest, ClusterStateTest, HdfsNNFailoverTest, TestRandomCollapseQParserPlugin, ExitableDirectoryReaderTest, NumericFieldsTest, BasicDistributedZkTest, CollectionsAPIDistributedZkTest, ZkCLITest, TestDistributedSearch, TestRecovery, TermVectorComponentDistributedTest, TestStressVersions, TestRangeQuery, SolrCoreTest, SpellCheckComponentTest, TestSort, TestBadConfig, TestIndexSearcher, TestCoreDiscovery, SuggesterFSTTest, SpatialFilterTest, TestUpdate, FieldMutatingUpdateProcessorTest, TestWordDelimiterFilterFactory, DirectUpdateHandlerOptimizeTest, DocValuesMultiTest, SolrInfoMBeanTest, DebugComponentTest, IndexBasedSpellCheckerTest, DisMaxRequestHandlerTest, StandardRequestHandlerTest, TestQueryTypes, DocumentBuilderTest, LoggingHandlerTest, IndexSchemaTest, JSONWriterTest, UniqFieldsUpdateProcessorFactoryTest, BinaryUpdateRequestHandlerTest, HighlighterConfigTest, TestSolrIndexConfig, SolrIndexConfigTest, TestSearchPerf, MinimalSchemaTest, TestConfig, OutputWriterTest, TestFuzzyAnalyzedSuggestions, TestPostingsSolrHighlighter, DirectSolrConnectionTest, NotRequiredUniqueKeyTest, SynonymTokenizerTest, TestDFRSimilarityFactory, TestIBSimilarityFactory, TimeZoneUtilsTest, TestFastOutputStream, PluginInfoTest, TestSuggestSpellingConverter, SpellingQueryConverterTest, ZkNodePropsTest, SystemInfoHandlerTest, CircularListTest, TestRTGBase, SolrTestCaseJ4Test, TestCursorMarkWithoutUniqueKey, TestHighlightDedupGrouping, TestTolerantSearch, TestEmbeddedSolrServerConstructors, ActionThrottleTest, CdcrReplicationDistributedZkTest, CdcrVersionReplicationTest, DeleteLastCustomShardedReplicaTest, DeleteReplicaTest, LeaderInitiatedRecoveryOnShardRestartTest, MigrateRouteKeyTest, OverseerRolesTest, RemoteQueryErrorTest, ReplicationFactorTest, SSLMigrationTest, SaslZkACLProviderTest, SolrCLIZkUtilsTest, SolrXmlInZkTest, TestAuthenticationFramework, TestMiniSolrCloudClusterSSL, TestSSLRandomization, TestShortCircuitedRequests, TestStressLiveNodes, BlobRepositoryCloudTest, TestConfigSetProperties, TestConfigSets, TestDynamicLoading]
   [junit4] Completed [523/631 (1!)] on J0 in 53.09s, 1 test, 1 failure <<< FAILURES!

[...truncated 60516 lines...]


Mime
View raw message