lucene-dev mailing list archives

Site index · List index
Message view « Date » · « Thread »
Top « Date » · « Thread »
From "Uwe Schindler" <...@thetaphi.de>
Subject RE: [JENKINS] Lucene-Solr-master-Windows (32bit/jdk1.8.0_102) - Build # 6096 - Still Unstable!
Date Sat, 03 Sep 2016 18:32:23 GMT
Sorry, 
I fixed the test setup (I don't fully understand why the assumeFalse did not fully work, I
have the feeling there was some static initialization in effect).

Uwe

-----
Uwe Schindler
H.-H.-Meier-Allee 63, D-28213 Bremen
http://www.thetaphi.de
eMail: uwe@thetaphi.de

> -----Original Message-----
> From: Policeman Jenkins Server [mailto:jenkins@thetaphi.de]
> Sent: Saturday, September 3, 2016 5:52 PM
> To: uwe@thetaphi.de; mkhl@apache.org; dev@lucene.apache.org
> Subject: [JENKINS] Lucene-Solr-master-Windows (32bit/jdk1.8.0_102) - Build
> # 6096 - Still Unstable!
> 
> Build: http://jenkins.thetaphi.de/job/Lucene-Solr-master-Windows/6096/
> Java: 32bit/jdk1.8.0_102 -client -XX:+UseConcMarkSweepGC
> 
> 2 tests failed.
> FAILED:
> junit.framework.TestSuite.org.apache.solr.cloud.TestSolrCloudWithSecureIm
> personation
> 
> Error Message:
> Hadoop does not work on Windows
> 
> Stack Trace:
> com.carrotsearch.randomizedtesting.InternalAssumptionViolatedException:
> Hadoop does not work on Windows
> 	at __randomizedtesting.SeedInfo.seed([61C61210C8C843F0]:0)
> 	at
> com.carrotsearch.randomizedtesting.RandomizedTest.assumeTrue(Randomi
> zedTest.java:627)
> 	at
> com.carrotsearch.randomizedtesting.RandomizedTest.assumeFalse(Random
> izedTest.java:635)
> 	at
> org.apache.lucene.util.LuceneTestCase.assumeFalse(LuceneTestCase.java:84
> 9)
> 	at
> org.apache.solr.cloud.TestSolrCloudWithSecureImpersonation.startup(TestS
> olrCloudWithSecureImpersonation.java:96)
> 	at sun.reflect.NativeMethodAccessorImpl.invoke0(Native Method)
> 	at
> sun.reflect.NativeMethodAccessorImpl.invoke(NativeMethodAccessorImpl.ja
> va:62)
> 	at
> sun.reflect.DelegatingMethodAccessorImpl.invoke(DelegatingMethodAccess
> orImpl.java:43)
> 	at java.lang.reflect.Method.invoke(Method.java:498)
> 	at
> com.carrotsearch.randomizedtesting.RandomizedRunner.invoke(Randomize
> dRunner.java:1764)
> 	at
> com.carrotsearch.randomizedtesting.RandomizedRunner$6.evaluate(Rando
> mizedRunner.java:811)
> 	at
> com.carrotsearch.randomizedtesting.RandomizedRunner$7.evaluate(Rando
> mizedRunner.java:827)
> 	at
> com.carrotsearch.randomizedtesting.rules.StatementAdapter.evaluate(State
> mentAdapter.java:36)
> 	at
> com.carrotsearch.randomizedtesting.rules.SystemPropertiesRestoreRule$1.e
> valuate(SystemPropertiesRestoreRule.java:57)
> 	at
> org.apache.lucene.util.AbstractBeforeAfterRule$1.evaluate(AbstractBeforeAf
> terRule.java:45)
> 	at
> com.carrotsearch.randomizedtesting.rules.StatementAdapter.evaluate(State
> mentAdapter.java:36)
> 	at
> org.apache.lucene.util.TestRuleStoreClassName$1.evaluate(TestRuleStoreCla
> ssName.java:41)
> 	at
> com.carrotsearch.randomizedtesting.rules.NoShadowingOrOverridesOnMet
> hodsRule$1.evaluate(NoShadowingOrOverridesOnMethodsRule.java:40)
> 	at
> com.carrotsearch.randomizedtesting.rules.NoShadowingOrOverridesOnMet
> hodsRule$1.evaluate(NoShadowingOrOverridesOnMethodsRule.java:40)
> 	at
> com.carrotsearch.randomizedtesting.rules.StatementAdapter.evaluate(State
> mentAdapter.java:36)
> 	at
> com.carrotsearch.randomizedtesting.rules.StatementAdapter.evaluate(State
> mentAdapter.java:36)
> 	at
> com.carrotsearch.randomizedtesting.rules.StatementAdapter.evaluate(State
> mentAdapter.java:36)
> 	at
> org.apache.lucene.util.TestRuleAssertionsRequired$1.evaluate(TestRuleAsse
> rtionsRequired.java:53)
> 	at
> org.apache.lucene.util.TestRuleMarkFailure$1.evaluate(TestRuleMarkFailure.
> java:47)
> 	at
> org.apache.lucene.util.TestRuleIgnoreAfterMaxFailures$1.evaluate(TestRuleI
> gnoreAfterMaxFailures.java:64)
> 	at
> org.apache.lucene.util.TestRuleIgnoreTestSuites$1.evaluate(TestRuleIgnoreT
> estSuites.java:54)
> 	at
> com.carrotsearch.randomizedtesting.rules.StatementAdapter.evaluate(State
> mentAdapter.java:36)
> 	at
> com.carrotsearch.randomizedtesting.ThreadLeakControl$StatementRunner.r
> un(ThreadLeakControl.java:367)
> 	at java.lang.Thread.run(Thread.java:745)
> 
> 
> FAILED:
> junit.framework.TestSuite.org.apache.solr.cloud.TestSolrCloudWithSecureIm
> personation
> 
> Error Message:
> 
> 
> Stack Trace:
> java.lang.NullPointerException
> 	at __randomizedtesting.SeedInfo.seed([61C61210C8C843F0]:0)
> 	at
> org.apache.solr.cloud.TestSolrCloudWithSecureImpersonation.shutdown(Te
> stSolrCloudWithSecureImpersonation.java:157)
> 	at sun.reflect.NativeMethodAccessorImpl.invoke0(Native Method)
> 	at
> sun.reflect.NativeMethodAccessorImpl.invoke(NativeMethodAccessorImpl.ja
> va:62)
> 	at
> sun.reflect.DelegatingMethodAccessorImpl.invoke(DelegatingMethodAccess
> orImpl.java:43)
> 	at java.lang.reflect.Method.invoke(Method.java:498)
> 	at
> com.carrotsearch.randomizedtesting.RandomizedRunner.invoke(Randomize
> dRunner.java:1764)
> 	at
> com.carrotsearch.randomizedtesting.RandomizedRunner$7.evaluate(Rando
> mizedRunner.java:834)
> 	at
> com.carrotsearch.randomizedtesting.rules.StatementAdapter.evaluate(State
> mentAdapter.java:36)
> 	at
> com.carrotsearch.randomizedtesting.rules.SystemPropertiesRestoreRule$1.e
> valuate(SystemPropertiesRestoreRule.java:57)
> 	at
> org.apache.lucene.util.AbstractBeforeAfterRule$1.evaluate(AbstractBeforeAf
> terRule.java:45)
> 	at
> com.carrotsearch.randomizedtesting.rules.StatementAdapter.evaluate(State
> mentAdapter.java:36)
> 	at
> org.apache.lucene.util.TestRuleStoreClassName$1.evaluate(TestRuleStoreCla
> ssName.java:41)
> 	at
> com.carrotsearch.randomizedtesting.rules.NoShadowingOrOverridesOnMet
> hodsRule$1.evaluate(NoShadowingOrOverridesOnMethodsRule.java:40)
> 	at
> com.carrotsearch.randomizedtesting.rules.NoShadowingOrOverridesOnMet
> hodsRule$1.evaluate(NoShadowingOrOverridesOnMethodsRule.java:40)
> 	at
> com.carrotsearch.randomizedtesting.rules.StatementAdapter.evaluate(State
> mentAdapter.java:36)
> 	at
> com.carrotsearch.randomizedtesting.rules.StatementAdapter.evaluate(State
> mentAdapter.java:36)
> 	at
> com.carrotsearch.randomizedtesting.rules.StatementAdapter.evaluate(State
> mentAdapter.java:36)
> 	at
> org.apache.lucene.util.TestRuleAssertionsRequired$1.evaluate(TestRuleAsse
> rtionsRequired.java:53)
> 	at
> org.apache.lucene.util.TestRuleMarkFailure$1.evaluate(TestRuleMarkFailure.
> java:47)
> 	at
> org.apache.lucene.util.TestRuleIgnoreAfterMaxFailures$1.evaluate(TestRuleI
> gnoreAfterMaxFailures.java:64)
> 	at
> org.apache.lucene.util.TestRuleIgnoreTestSuites$1.evaluate(TestRuleIgnoreT
> estSuites.java:54)
> 	at
> com.carrotsearch.randomizedtesting.rules.StatementAdapter.evaluate(State
> mentAdapter.java:36)
> 	at
> com.carrotsearch.randomizedtesting.ThreadLeakControl$StatementRunner.r
> un(ThreadLeakControl.java:367)
> 	at java.lang.Thread.run(Thread.java:745)
> 
> 
> 
> 
> Build Log:
> [...truncated 12101 lines...]
>    [junit4] Suite:
> org.apache.solr.cloud.TestSolrCloudWithSecureImpersonation
>    [junit4]   2> Creating dataDir: C:\Users\jenkins\workspace\Lucene-Solr-
> master-Windows\solr\build\solr-
> core\test\J1\temp\solr.cloud.TestSolrCloudWithSecureImpersonation_61C61
> 210C8C843F0-001\init-core-data-001
>    [junit4]   2> 2603286 INFO  (SUITE-TestSolrCloudWithSecureImpersonation-
> seed#[61C61210C8C843F0]-worker) [    ] o.a.s.SolrTestCaseJ4 Randomized ssl
> (false) and clientAuth (false) via:
> @org.apache.solr.util.RandomizeSSL(reason=, value=NaN, ssl=NaN,
> clientAuth=NaN)
>    [junit4]   2> 2603287 INFO  (SUITE-TestSolrCloudWithSecureImpersonation-
> seed#[61C61210C8C843F0]-worker) [    ] o.a.s.SolrTestCaseJ4 ###deleteCore
>    [junit4]   2> NOTE: test params are: codec=Asserting(Lucene62): {},
> docValues:{}, maxPointsInLeafNode=1557,
> maxMBSortInHeap=6.066277424497, sim=ClassicSimilarity, locale=ro,
> timezone=Europe/Zurich
>    [junit4]   2> NOTE: Windows 10 10.0 x86/Oracle Corporation 1.8.0_102 (32-
> bit)/cpus=3,threads=1,free=144082152,total=518979584
>    [junit4]   2> NOTE: All tests run in this JVM: [EnumFieldTest, TestBinaryField,
> SuggesterWFSTTest, FacetPivotSmallTest, TestStandardQParsers,
> TestRequestStatusCollectionAPI, TestRTimerTree, TestQuerySenderListener,
> TestCollationField, TestFreeTextSuggestions, TestBlobHandler,
> SaslZkACLProviderTest, CacheHeaderTest, TestFieldCacheSanityChecker,
> EchoParamsTest, TestTestInjection, TestSimpleQParserPlugin,
> TestConfigSetsAPI, TestSystemIdResolver, PluginInfoTest,
> LeaderElectionIntegrationTest, TestReload, LeaderFailoverAfterPartitionTest,
> SegmentsInfoRequestHandlerTest, DistributedIntervalFacetingTest,
> CSVRequestHandlerTest, HdfsChaosMonkeyNothingIsSafeTest,
> TestShardHandlerFactory, DistributedFacetPivotSmallAdvancedTest,
> SolrCmdDistributorTest, DateRangeFieldTest, TestDistributedMissingSort,
> TestReloadDeadlock, SuggestComponentContextFilterQueryTest,
> HdfsRestartWhileUpdatingTest, SolrCoreCheckLockOnStartupTest,
> BasicFunctionalityTest, TestLMJelinekMercerSimilarityFactory,
> CustomCollectionTest, TestSimpleTrackingShardHandler,
> TestIndexingPerformance, DistributedTermsComponentTest,
> BaseCdcrDistributedZkTest, CollectionStateFormat2Test,
> TestLeaderElectionZkExpiry, TestJettySolrRunner, TestWriterPerf,
> SolrIndexSplitterTest, SuggesterTSTTest, DefaultValueUpdateProcessorTest,
> TestSolr4Spatial2, OverriddenZkACLAndCredentialsProvidersTest,
> NumericFieldsTest, HdfsRecoverLeaseTest, CoreAdminRequestStatusTest,
> TestSchemaVersionResource, OpenExchangeRatesOrgProviderTest,
> TestSortByMinMaxFunction, TestStressRecovery, DeleteReplicaTest,
> AliasIntegrationTest, TestReRankQParserPlugin, TestSolrDynamicMBean,
> TestCollapseQParserPlugin, TestSolrQueryResponse, BasicZkTest,
> TestPerFieldSimilarityWithDefaultOverride,
> TestSolrCloudWithDelegationTokens, DirectSolrConnectionTest,
> TestShortCircuitedRequests, TestCollationFieldDocValues, TestMacros,
> TestManagedSynonymFilterFactory, ExitableDirectoryReaderTest,
> TolerantUpdateProcessorTest, DistributedMLTComponentTest,
> CollectionsAPIAsyncDistributedZkTest, RAMDirectoryFactoryTest,
> TestSolrConfigHandlerConcurrent, IndexSchemaRuntimeFieldTest,
> CheckHdfsIndexTest, TestOverriddenPrefixQueryForCustomFieldType,
> TestMinMaxOnMultiValuedField, TestBlendedInfixSuggestions,
> SuggesterTest, TestChildDocTransformer, SmileWriterTest,
> SpellCheckComponentTest, TestLocalFSCloudBackupRestore,
> HdfsThreadLeakTest, TestRandomRequestDistribution, SparseHLLTest,
> TestStressLiveNodes, TriLevelCompositeIdRoutingTest,
> UniqFieldsUpdateProcessorFactoryTest, TestConfigSetProperties,
> BinaryUpdateRequestHandlerTest, AsyncCallRequestStatusResponseTest,
> BlockCacheTest, VersionInfoTest, TestFoldingMultitermQuery,
> DistributedFacetPivotLargeTest, HdfsCollectionsAPIDistributedZkTest,
> TestSolrCoreProperties, TestConfigSetsAPIZkFailure,
> UpdateRequestProcessorFactoryTest, TestCSVResponseWriter,
> MultiTermTest, ShowFileRequestHandlerTest,
> CollectionsAPIDistributedZkTest, SimpleMLTQParserTest, TestFieldCache,
> TestBM25SimilarityFactory, ZkStateReaderTest, TestCoreDiscovery,
> TestDFISimilarityFactory, TestFieldResource, StressHdfsTest,
> TestRangeQuery, TestIndexSearcher, TestRandomFaceting,
> RequestHandlersTest, StatsComponentTest, BooleanFieldTest,
> ResourceLoaderTest, DeleteLastCustomShardedReplicaTest,
> QueryResultKeyTest, ConcurrentDeleteAndCreateCollectionTest,
> TestOmitPositions, TestManagedResource, BlockJoinFacetSimpleTest,
> MinimalSchemaTest, ConnectionReuseTest, TestUniqueKeyFieldResource,
> ConvertedLegacyTest, TestReversedWildcardFilterFactory,
> SortByFunctionTest, TestMissingGroups, TestReplicaProperties,
> TestUninvertingReader, TestRestManager, TestSolr4Spatial,
> TestFuzzyAnalyzedSuggestions, TermVectorComponentDistributedTest,
> TestDistributedStatsComponentCardinality,
> TestOnReconnectListenerSupport, RemoteQueryErrorTest,
> TestMiniSolrCloudCluster, TestInfoStreamLogging,
> TestRandomCollapseQParserPlugin, TestTrieFacet, CursorMarkTest,
> BasicDistributedZk2Test, SyncSliceTest, RecoveryZkTest, ZkSolrClientTest,
> TestZkChroot, ShardRoutingCustomTest, TestDistributedGrouping,
> TestHashPartitioner, TestJoin, TestStressVersions, SimpleFacetsTest,
> BadIndexSchemaTest, TestFunctionQuery, DirectUpdateHandlerTest,
> TestBadConfig, HighlighterTest, CurrencyFieldOpenExchangeTest,
> SignatureUpdateProcessorFactoryTest, SpellCheckCollatorTest, TestTrie,
> TestCSVLoader, WordBreakSolrSpellCheckerTest, TestUpdate,
> DirectUpdateHandlerOptimizeTest,
> StatelessScriptUpdateProcessorFactoryTest, XsltUpdateRequestHandlerTest,
> DebugComponentTest, LukeRequestHandlerTest, TestQueryTypes,
> XmlUpdateRequestHandlerTest, PathHierarchyTokenizerFactoryTest,
> MoreLikeThisHandlerTest, FieldAnalysisRequestHandlerTest,
> FastVectorHighlighterTest, SolrPluginUtilsTest, QueryParsingTest,
> TestComponentsName, TestBinaryResponseWriter, HighlighterConfigTest,
> SOLR749Test, AlternateDirectoryTest, TestSolrIndexConfig, CopyFieldTest,
> ResponseLogComponentTest, BadComponentTest, TestMergePolicyConfig,
> TestSolrDeletionPolicy2, SampleTest, TestSearchPerf,
> TestElisionMultitermQuery, OutputWriterTest, TestPostingsSolrHighlighter,
> NotRequiredUniqueKeyTest, TestPhraseSuggestions,
> SpellPossibilityIteratorTest, TestCharFilters, SynonymTokenizerTest,
> TestPerFieldSimilarity, TestLMDirichletSimilarityFactory, TestFastWriter,
> TimeZoneUtilsTest, TestFastOutputStream, ScriptEngineTest,
> URLClassifyProcessorTest, DateMathParserTest, PreAnalyzedFieldTest,
> PrimUtilsTest, TestSuggestSpellingConverter, DateFieldTest,
> SpellingQueryConverterTest, TestSolrJ, TestUtils, SystemInfoHandlerTest,
> UUIDFieldTest, CircularListTest, TestRTGBase,
> TestCursorMarkWithoutUniqueKey, TestTolerantSearch, CdcrBootstrapTest,
> CleanupOldIndexTest, CollectionTooManyReplicasTest,
> DistribCursorPagingTest, DistributedQueueTest, ForceLeaderTest,
> LeaderInitiatedRecoveryOnCommitTest,
> LeaderInitiatedRecoveryOnShardRestartTest, MultiThreadedOCPTest,
> OverseerStatusTest, ReplaceNodeTest, ReplicationFactorTest,
> RestartWhileUpdatingTest, RollingRestartTest, SSLMigrationTest,
> ShardSplitTest, TestCollectionAPI, TestHdfsCloudBackupRestore,
> TestLockTree, TestMiniSolrCloudClusterSSL, TestRequestForwarding,
> TestSolrCloudWithSecureImpersonation]
>    [junit4]   2> NOTE: reproduce with: ant test  -
> Dtestcase=TestSolrCloudWithSecureImpersonation -
> Dtests.seed=61C61210C8C843F0 -Dtests.slow=true -Dtests.locale=ro -
> Dtests.timezone=Europe/Zurich -Dtests.asserts=true -
> Dtests.file.encoding=UTF-8
>    [junit4] ERROR   0.00s J1 | TestSolrCloudWithSecureImpersonation (suite)
> <<<
>    [junit4]    > Assumption #1: Hadoop does not work on WindowsThrowable
> #2: java.lang.NullPointerException
>    [junit4]    > 	at
> __randomizedtesting.SeedInfo.seed([61C61210C8C843F0]:0)
>    [junit4]    > 	at
> org.apache.solr.cloud.TestSolrCloudWithSecureImpersonation.shutdown(Te
> stSolrCloudWithSecureImpersonation.java:157)
>    [junit4]    > 	at java.lang.Thread.run(Thread.java:745)
>    [junit4] Completed [492/633 (1!)] on J1 in 0.03s, 0 tests, 1 error <<<
> FAILURES!
> 
> [...truncated 52891 lines...]



---------------------------------------------------------------------
To unsubscribe, e-mail: dev-unsubscribe@lucene.apache.org
For additional commands, e-mail: dev-help@lucene.apache.org


Mime
View raw message