lucene-dev mailing list archives

Site index · List index
Message view « Date » · « Thread »
Top « Date » · « Thread »
From Karl Wright <daddy...@gmail.com>
Subject Re: [JENKINS] Lucene-Solr-6.x-Linux (64bit/jdk1.8.0_102) - Build # 1397 - Unstable!
Date Mon, 08 Aug 2016 08:33:28 GMT
LUCENE-7408

Karl


On Mon, Aug 8, 2016 at 4:26 AM, Karl Wright <daddywri@gmail.com> wrote:

> Is there any way to get  a "how to reproduce" line for this?
>
> Karl
>
>
> On Sun, Aug 7, 2016 at 8:42 AM, Policeman Jenkins Server <
> jenkins@thetaphi.de> wrote:
>
>> Build: http://jenkins.thetaphi.de/job/Lucene-Solr-6.x-Linux/1397/
>> Java: 64bit/jdk1.8.0_102 -XX:-UseCompressedOops -XX:+UseG1GC
>>
>> 2 tests failed.
>> FAILED:  org.apache.lucene.spatial3d.TestGeo3DPoint.testRandomMedium
>>
>> Error Message:
>> FAIL: id=20600 should have matched but did not   shape=GeoStandardCircle:
>> {planetmodel=PlanetModel.WGS84, center=[lat=-2.7574435614238194E-13,
>> lon=0.0([X=1.0011188539924791, Y=0.0, Z=-2.760528738161554E-13])],
>> radius=1.5887859182593391(91.03072766607713)}   bounds=XYZBounds:
>> [xmin=-0.01779006715405413 xmax=1.0011188549924792 ymin=-1.0011188549924792
>> ymax=1.0011188549924792 zmin=-0.9977622930221051 zmax=0.9977622930221051]
>>  world bounds=( minX=-1.0011188539924791 maxX=1.0011188539924791
>> minY=-1.0011188539924791 maxY=1.0011188539924791 minZ=-0.9977622920221051
>> maxZ=0.9977622920221051   quantized point=[X=-0.017929931093965013,
>> Y=0.6974607560008638, Z=0.7155524064776803] within shape? true within
>> bounds? false   unquantized point=[lat=0.7980359504429014,
>> lon=1.5964981068121482([X=-0.017929931150094086, Y=0.6974607557894967,
>> Z=0.7155524064918857])] within shape? true within bounds? false
>>  docID=20241 deleted?=false   query=PointInGeo3DShapeQuery: field=point:
>> Shape: GeoStandardCircle: {planetmodel=PlanetModel.WGS84,
>> center=[lat=-2.7574435614238194E-13, lon=0.0([X=1.0011188539924791,
>> Y=0.0, Z=-2.760528738161554E-13])], radius=1.5887859182593391(91.03072766607713)}
>>  explanation:     target is in leaf _1(6.2.0):C40793 of full reader
>> StandardDirectoryReader(segments:5:nrt _1(6.2.0):C40793)     full BKD
>> path to target doc:       Cell(x=-1.0011188543037526 TO 1.0011188543037524
>> y=-1.0011188510404756 TO 1.0011188543037524 z=-0.9977622923536127 TO
>> 0.9977622923536126); Shape relationship = OVERLAPS; Quantized point within
>> cell = true; Unquantized point within cell = true
>>  Cell(x=-1.0011188543037526 TO 7.390138260796596E-4 y=-1.0011188510404756
>> TO 1.0011188543037524 z=-0.9977622923536127 TO 0.9977622923536126); Shape
>> relationship = OVERLAPS; Quantized point within cell = true; Unquantized
>> point within cell = true       Cell(x=-1.0011188543037526 TO
>> 7.390138260796596E-4 y=-1.0011188510404756 TO 1.0011188543037524 z=0.0 TO
>> 0.9977622923536126); Shape relationship = OVERLAPS; Quantized point within
>> cell = true; Unquantized point within cell = true
>>  Cell(x=-0.36164092093242806 TO 7.390138260796596E-4 y=-1.0011188510404756
>> TO 1.0011188543037524 z=0.0 TO 0.9977622923536126); Shape relationship =
>> OVERLAPS; Quantized point within cell = true; Unquantized point within cell
>> = true       Cell(x=-0.36164092093242806 TO 7.390138260796596E-4
>> y=-1.0011188510404756 TO 1.0011188543037524 z=0.0 TO 0.9913910577870918);
>> Shape relationship = OVERLAPS; Quantized point within cell = true;
>> Unquantized point within cell = true       Cell(x=-0.36164092093242806 TO
>> 7.390138260796596E-4 y=-1.0011188510404756 TO 1.0011188543037524 z=0.0 TO
>> 0.8703133879741732); Shape relationship = OVERLAPS; Quantized point within
>> cell = true; Unquantized point within cell = true
>>  Cell(x=-0.36164092093242806 TO 7.390138260796596E-4 y=-1.0011188510404756
>> TO 1.0011188543037524 z=0.4397491496027799 TO 0.8703133879741732); Shape
>> relationship = OVERLAPS; Quantized point within cell = true; Unquantized
>> point within cell = true       Cell(x=-0.36164092093242806 TO
>> 7.390138260796596E-4 y=-1.0011188510404756 TO 1.0011188543037524
>> z=0.4397491496027799 TO 0.7233329727533392); Shape relationship = OVERLAPS;
>> Quantized point within cell = true; Unquantized point within cell = true
>>    Cell(x=-0.2013357411633494 TO 7.390138260796596E-4 y=-1.0011188510404756
>> TO 1.0011188543037524 z=0.4397491496027799 TO 0.7233329727533392); Shape
>> relationship = OVERLAPS; Quantized point within cell = true; Unquantized
>> point within cell = true     on cell Cell(x=-1.0011188543037526 TO
>> 1.0011188543037524 y=-1.0011188510404756 TO 1.0011188543037524
>> z=-0.9977622923536127 TO 0.9977622923536126); Shape relationship =
>> OVERLAPS; Quantized point within cell = true; Unquantized point within cell
>> = true, wrapped visitor returned CELL_CROSSES_QUERY     on cell
>> Cell(x=-1.0011188543037526 TO 7.390138260796596E-4 y=-1.0011188510404756 TO
>> 1.0011188543037524 z=-0.9977622923536127 TO 0.9977622923536126); Shape
>> relationship = OVERLAPS; Quantized point within cell = true; Unquantized
>> point within cell = true, wrapped visitor returned CELL_CROSSES_QUERY
>>  on cell Cell(x=-1.0011188543037526 TO 7.390138260796596E-4
>> y=-1.0011188510404756 TO 1.0011188543037524 z=0.0 TO 0.9977622923536126);
>> Shape relationship = OVERLAPS; Quantized point within cell = true;
>> Unquantized point within cell = true, wrapped visitor returned
>> CELL_CROSSES_QUERY     on cell Cell(x=-0.36164092093242806 TO
>> 7.390138260796596E-4 y=-1.0011188510404756 TO 1.0011188543037524 z=0.0 TO
>> 0.9977622923536126); Shape relationship = OVERLAPS; Quantized point within
>> cell = true; Unquantized point within cell = true, wrapped visitor returned
>> CELL_CROSSES_QUERY     on cell Cell(x=-0.36164092093242806 TO
>> 7.390138260796596E-4 y=-1.0011188510404756 TO 1.0011188543037524 z=0.0 TO
>> 0.9913910577870918); Shape relationship = OVERLAPS; Quantized point within
>> cell = true; Unquantized point within cell = true, wrapped visitor returned
>> CELL_CROSSES_QUERY     on cell Cell(x=-0.36164092093242806 TO
>> 7.390138260796596E-4 y=-1.0011188510404756 TO 1.0011188543037524 z=0.0 TO
>> 0.8703133879741732); Shape relationship = OVERLAPS; Quantized point within
>> cell = true; Unquantized point within cell = true, wrapped visitor returned
>> CELL_CROSSES_QUERY     on cell Cell(x=-0.36164092093242806 TO
>> 7.390138260796596E-4 y=-1.0011188510404756 TO 1.0011188543037524
>> z=0.4397491496027799 TO 0.8703133879741732); Shape relationship = OVERLAPS;
>> Quantized point within cell = true; Unquantized point within cell = true,
>> wrapped visitor returned CELL_CROSSES_QUERY     on cell
>> Cell(x=-0.36164092093242806 TO 7.390138260796596E-4 y=-1.0011188510404756
>> TO 1.0011188543037524 z=0.4397491496027799 TO 0.7233329727533392); Shape
>> relationship = OVERLAPS; Quantized point within cell = true; Unquantized
>> point within cell = true, wrapped visitor returned CELL_CROSSES_QUERY
>>  on cell Cell(x=-0.2013357411633494 TO 7.390138260796596E-4
>> y=-1.0011188510404756 TO 1.0011188543037524 z=0.4397491496027799 TO
>> 0.7233329727533392); Shape relationship = OVERLAPS; Quantized point within
>> cell = true; Unquantized point within cell = true, wrapped visitor returned
>> CELL_CROSSES_QUERY   leaf visit docID=20241 x=-0.017929931093965013
>> y=0.6974607560008638 z=0.7155524064776803
>>
>> Stack Trace:
>> java.lang.AssertionError: FAIL: id=20600 should have matched but did not
>>   shape=GeoStandardCircle: {planetmodel=PlanetModel.WGS84,
>> center=[lat=-2.7574435614238194E-13, lon=0.0([X=1.0011188539924791,
>> Y=0.0, Z=-2.760528738161554E-13])], radius=1.5887859182593391(91.0
>> 3072766607713)}
>>   bounds=XYZBounds: [xmin=-0.01779006715405413 xmax=1.0011188549924792
>> ymin=-1.0011188549924792 ymax=1.0011188549924792 zmin=-0.9977622930221051
>> zmax=0.9977622930221051]
>>   world bounds=( minX=-1.0011188539924791 maxX=1.0011188539924791
>> minY=-1.0011188539924791 maxY=1.0011188539924791 minZ=-0.9977622920221051
>> maxZ=0.9977622920221051
>>   quantized point=[X=-0.017929931093965013, Y=0.6974607560008638,
>> Z=0.7155524064776803] within shape? true within bounds? false
>>   unquantized point=[lat=0.7980359504429014,
>> lon=1.5964981068121482([X=-0.017929931150094086, Y=0.6974607557894967,
>> Z=0.7155524064918857])] within shape? true within bounds? false
>>   docID=20241 deleted?=false
>>   query=PointInGeo3DShapeQuery: field=point: Shape: GeoStandardCircle:
>> {planetmodel=PlanetModel.WGS84, center=[lat=-2.7574435614238194E-13,
>> lon=0.0([X=1.0011188539924791, Y=0.0, Z=-2.760528738161554E-13])],
>> radius=1.5887859182593391(91.03072766607713)}
>>   explanation:
>>     target is in leaf _1(6.2.0):C40793 of full reader
>> StandardDirectoryReader(segments:5:nrt _1(6.2.0):C40793)
>>     full BKD path to target doc:
>>       Cell(x=-1.0011188543037526 TO 1.0011188543037524
>> y=-1.0011188510404756 TO 1.0011188543037524 z=-0.9977622923536127 TO
>> 0.9977622923536126); Shape relationship = OVERLAPS; Quantized point within
>> cell = true; Unquantized point within cell = true
>>       Cell(x=-1.0011188543037526 TO 7.390138260796596E-4
>> y=-1.0011188510404756 TO 1.0011188543037524 z=-0.9977622923536127 TO
>> 0.9977622923536126); Shape relationship = OVERLAPS; Quantized point within
>> cell = true; Unquantized point within cell = true
>>       Cell(x=-1.0011188543037526 TO 7.390138260796596E-4
>> y=-1.0011188510404756 TO 1.0011188543037524 z=0.0 TO 0.9977622923536126);
>> Shape relationship = OVERLAPS; Quantized point within cell = true;
>> Unquantized point within cell = true
>>       Cell(x=-0.36164092093242806 TO 7.390138260796596E-4
>> y=-1.0011188510404756 TO 1.0011188543037524 z=0.0 TO 0.9977622923536126);
>> Shape relationship = OVERLAPS; Quantized point within cell = true;
>> Unquantized point within cell = true
>>       Cell(x=-0.36164092093242806 TO 7.390138260796596E-4
>> y=-1.0011188510404756 TO 1.0011188543037524 z=0.0 TO 0.9913910577870918);
>> Shape relationship = OVERLAPS; Quantized point within cell = true;
>> Unquantized point within cell = true
>>       Cell(x=-0.36164092093242806 TO 7.390138260796596E-4
>> y=-1.0011188510404756 TO 1.0011188543037524 z=0.0 TO 0.8703133879741732);
>> Shape relationship = OVERLAPS; Quantized point within cell = true;
>> Unquantized point within cell = true
>>       Cell(x=-0.36164092093242806 TO 7.390138260796596E-4
>> y=-1.0011188510404756 TO 1.0011188543037524 z=0.4397491496027799 TO
>> 0.8703133879741732); Shape relationship = OVERLAPS; Quantized point within
>> cell = true; Unquantized point within cell = true
>>       Cell(x=-0.36164092093242806 TO 7.390138260796596E-4
>> y=-1.0011188510404756 TO 1.0011188543037524 z=0.4397491496027799 TO
>> 0.7233329727533392); Shape relationship = OVERLAPS; Quantized point within
>> cell = true; Unquantized point within cell = true
>>       Cell(x=-0.2013357411633494 TO 7.390138260796596E-4
>> y=-1.0011188510404756 TO 1.0011188543037524 z=0.4397491496027799 TO
>> 0.7233329727533392); Shape relationship = OVERLAPS; Quantized point within
>> cell = true; Unquantized point within cell = true
>>     on cell Cell(x=-1.0011188543037526 TO 1.0011188543037524
>> y=-1.0011188510404756 TO 1.0011188543037524 z=-0.9977622923536127 TO
>> 0.9977622923536126); Shape relationship = OVERLAPS; Quantized point within
>> cell = true; Unquantized point within cell = true, wrapped visitor returned
>> CELL_CROSSES_QUERY
>>     on cell Cell(x=-1.0011188543037526 TO 7.390138260796596E-4
>> y=-1.0011188510404756 TO 1.0011188543037524 z=-0.9977622923536127 TO
>> 0.9977622923536126); Shape relationship = OVERLAPS; Quantized point within
>> cell = true; Unquantized point within cell = true, wrapped visitor returned
>> CELL_CROSSES_QUERY
>>     on cell Cell(x=-1.0011188543037526 TO 7.390138260796596E-4
>> y=-1.0011188510404756 TO 1.0011188543037524 z=0.0 TO 0.9977622923536126);
>> Shape relationship = OVERLAPS; Quantized point within cell = true;
>> Unquantized point within cell = true, wrapped visitor returned
>> CELL_CROSSES_QUERY
>>     on cell Cell(x=-0.36164092093242806 TO 7.390138260796596E-4
>> y=-1.0011188510404756 TO 1.0011188543037524 z=0.0 TO 0.9977622923536126);
>> Shape relationship = OVERLAPS; Quantized point within cell = true;
>> Unquantized point within cell = true, wrapped visitor returned
>> CELL_CROSSES_QUERY
>>     on cell Cell(x=-0.36164092093242806 TO 7.390138260796596E-4
>> y=-1.0011188510404756 TO 1.0011188543037524 z=0.0 TO 0.9913910577870918);
>> Shape relationship = OVERLAPS; Quantized point within cell = true;
>> Unquantized point within cell = true, wrapped visitor returned
>> CELL_CROSSES_QUERY
>>     on cell Cell(x=-0.36164092093242806 TO 7.390138260796596E-4
>> y=-1.0011188510404756 TO 1.0011188543037524 z=0.0 TO 0.8703133879741732);
>> Shape relationship = OVERLAPS; Quantized point within cell = true;
>> Unquantized point within cell = true, wrapped visitor returned
>> CELL_CROSSES_QUERY
>>     on cell Cell(x=-0.36164092093242806 TO 7.390138260796596E-4
>> y=-1.0011188510404756 TO 1.0011188543037524 z=0.4397491496027799 TO
>> 0.8703133879741732); Shape relationship = OVERLAPS; Quantized point within
>> cell = true; Unquantized point within cell = true, wrapped visitor returned
>> CELL_CROSSES_QUERY
>>     on cell Cell(x=-0.36164092093242806 TO 7.390138260796596E-4
>> y=-1.0011188510404756 TO 1.0011188543037524 z=0.4397491496027799 TO
>> 0.7233329727533392); Shape relationship = OVERLAPS; Quantized point within
>> cell = true; Unquantized point within cell = true, wrapped visitor returned
>> CELL_CROSSES_QUERY
>>     on cell Cell(x=-0.2013357411633494 TO 7.390138260796596E-4
>> y=-1.0011188510404756 TO 1.0011188543037524 z=0.4397491496027799 TO
>> 0.7233329727533392); Shape relationship = OVERLAPS; Quantized point within
>> cell = true; Unquantized point within cell = true, wrapped visitor returned
>> CELL_CROSSES_QUERY
>>   leaf visit docID=20241 x=-0.017929931093965013 y=0.6974607560008638
>> z=0.7155524064776803
>>
>>         at __randomizedtesting.SeedInfo.seed([9B3B01520448F054:26E536FA
>> 452D9332]:0)
>>         at org.junit.Assert.fail(Assert.java:93)
>>         at org.apache.lucene.spatial3d.TestGeo3DPoint.verify(TestGeo3DP
>> oint.java:867)
>>         at org.apache.lucene.spatial3d.TestGeo3DPoint.doTestRandom(Test
>> Geo3DPoint.java:548)
>>         at org.apache.lucene.spatial3d.TestGeo3DPoint.testRandomMedium(
>> TestGeo3DPoint.java:475)
>>         at sun.reflect.NativeMethodAccessorImpl.invoke0(Native Method)
>>         at sun.reflect.NativeMethodAccessorImpl.invoke(NativeMethodAcce
>> ssorImpl.java:62)
>>         at sun.reflect.DelegatingMethodAccessorImpl.invoke(DelegatingMe
>> thodAccessorImpl.java:43)
>>         at java.lang.reflect.Method.invoke(Method.java:498)
>>         at com.carrotsearch.randomizedtesting.RandomizedRunner.invoke(R
>> andomizedRunner.java:1764)
>>         at com.carrotsearch.randomizedtesting.RandomizedRunner$8.
>> evaluate(RandomizedRunner.java:871)
>>         at com.carrotsearch.randomizedtesting.RandomizedRunner$9.
>> evaluate(RandomizedRunner.java:907)
>>         at com.carrotsearch.randomizedtesting.RandomizedRunner$10.
>> evaluate(RandomizedRunner.java:921)
>>         at org.apache.lucene.util.TestRuleSetupTeardownChained$1.
>> evaluate(TestRuleSetupTeardownChained.java:49)
>>         at org.apache.lucene.util.AbstractBeforeAfterRule$1.evaluate(Ab
>> stractBeforeAfterRule.java:45)
>>         at org.apache.lucene.util.TestRuleThreadAndTestName$1.evaluate(
>> TestRuleThreadAndTestName.java:48)
>>         at org.apache.lucene.util.TestRuleIgnoreAfterMaxFailures$1.
>> evaluate(TestRuleIgnoreAfterMaxFailures.java:64)
>>         at org.apache.lucene.util.TestRuleMarkFailure$1.evaluate(
>> TestRuleMarkFailure.java:47)
>>         at com.carrotsearch.randomizedtesting.rules.StatementAdapter.
>> evaluate(StatementAdapter.java:36)
>>         at com.carrotsearch.randomizedtesting.ThreadLeakControl$Stateme
>> ntRunner.run(ThreadLeakControl.java:367)
>>         at com.carrotsearch.randomizedtesting.ThreadLeakControl.forkTim
>> eoutingTask(ThreadLeakControl.java:809)
>>         at com.carrotsearch.randomizedtesting.ThreadLeakControl$3.
>> evaluate(ThreadLeakControl.java:460)
>>         at com.carrotsearch.randomizedtesting.RandomizedRunner.runSingl
>> eTest(RandomizedRunner.java:880)
>>         at com.carrotsearch.randomizedtesting.RandomizedRunner$5.
>> evaluate(RandomizedRunner.java:781)
>>         at com.carrotsearch.randomizedtesting.RandomizedRunner$6.
>> evaluate(RandomizedRunner.java:816)
>>         at com.carrotsearch.randomizedtesting.RandomizedRunner$7.
>> evaluate(RandomizedRunner.java:827)
>>         at org.apache.lucene.util.AbstractBeforeAfterRule$1.evaluate(Ab
>> stractBeforeAfterRule.java:45)
>>         at com.carrotsearch.randomizedtesting.rules.StatementAdapter.
>> evaluate(StatementAdapter.java:36)
>>         at org.apache.lucene.util.TestRuleStoreClassName$1.evaluate(Tes
>> tRuleStoreClassName.java:41)
>>         at com.carrotsearch.randomizedtesting.rules.NoShadowingOrOverri
>> desOnMethodsRule$1.evaluate(NoShadowingOrOverridesOnMethodsRule.java:40)
>>         at com.carrotsearch.randomizedtesting.rules.NoShadowingOrOverri
>> desOnMethodsRule$1.evaluate(NoShadowingOrOverridesOnMethodsRule.java:40)
>>         at com.carrotsearch.randomizedtesting.rules.StatementAdapter.
>> evaluate(StatementAdapter.java:36)
>>         at com.carrotsearch.randomizedtesting.rules.StatementAdapter.
>> evaluate(StatementAdapter.java:36)
>>         at com.carrotsearch.randomizedtesting.rules.StatementAdapter.
>> evaluate(StatementAdapter.java:36)
>>         at org.apache.lucene.util.TestRuleAssertionsRequired$1.evaluate
>> (TestRuleAssertionsRequired.java:53)
>>         at org.apache.lucene.util.TestRuleMarkFailure$1.evaluate(
>> TestRuleMarkFailure.java:47)
>>         at org.apache.lucene.util.TestRuleIgnoreAfterMaxFailures$1.
>> evaluate(TestRuleIgnoreAfterMaxFailures.java:64)
>>         at org.apache.lucene.util.TestRuleIgnoreTestSuites$1.evaluate(T
>> estRuleIgnoreTestSuites.java:54)
>>         at com.carrotsearch.randomizedtesting.rules.StatementAdapter.
>> evaluate(StatementAdapter.java:36)
>>         at com.carrotsearch.randomizedtesting.ThreadLeakControl$Stateme
>> ntRunner.run(ThreadLeakControl.java:367)
>>         at java.lang.Thread.run(Thread.java:745)
>>
>>
>> FAILED:  org.apache.solr.cloud.ForceLeaderTest.testReplicasInLIRNoLeader
>>
>> Error Message:
>> org.apache.solr.client.solrj.SolrServerException: No live SolrServers
>> available to handle this request:[http://127.0.0.1:4477
>> 8/ynzn/forceleader_test_collection_shard1_replica3]
>>
>> Stack Trace:
>> org.apache.solr.client.solrj.SolrServerException:
>> org.apache.solr.client.solrj.SolrServerException: No live SolrServers
>> available to handle this request:[http://127.0.0.1:4477
>> 8/ynzn/forceleader_test_collection_shard1_replica3]
>>         at __randomizedtesting.SeedInfo.seed([5238F5C5BF63D7C5:B4AFC105
>> 86E12EA4]:0)
>>         at org.apache.solr.client.solrj.impl.CloudSolrClient.directUpda
>> te(CloudSolrClient.java:774)
>>         at org.apache.solr.client.solrj.impl.CloudSolrClient.sendReques
>> t(CloudSolrClient.java:1172)
>>         at org.apache.solr.client.solrj.impl.CloudSolrClient.requestWit
>> hRetryOnStaleState(CloudSolrClient.java:1061)
>>         at org.apache.solr.client.solrj.impl.CloudSolrClient.request(Cl
>> oudSolrClient.java:997)
>>         at org.apache.solr.cloud.AbstractFullDistribZkTestBase.sendDocs
>> WithRetry(AbstractFullDistribZkTestBase.java:753)
>>         at org.apache.solr.cloud.AbstractFullDistribZkTestBase.sendDocs
>> WithRetry(AbstractFullDistribZkTestBase.java:741)
>>         at org.apache.solr.cloud.ForceLeaderTest.sendDoc(ForceLeaderTes
>> t.java:424)
>>         at org.apache.solr.cloud.ForceLeaderTest.assertSendDocFails(For
>> ceLeaderTest.java:315)
>>         at org.apache.solr.cloud.ForceLeaderTest.testReplicasInLIRNoLea
>> der(ForceLeaderTest.java:110)
>>         at sun.reflect.NativeMethodAccessorImpl.invoke0(Native Method)
>>         at sun.reflect.NativeMethodAccessorImpl.invoke(NativeMethodAcce
>> ssorImpl.java:62)
>>         at sun.reflect.DelegatingMethodAccessorImpl.invoke(DelegatingMe
>> thodAccessorImpl.java:43)
>>         at java.lang.reflect.Method.invoke(Method.java:498)
>>         at com.carrotsearch.randomizedtesting.RandomizedRunner.invoke(R
>> andomizedRunner.java:1764)
>>         at com.carrotsearch.randomizedtesting.RandomizedRunner$8.
>> evaluate(RandomizedRunner.java:871)
>>         at com.carrotsearch.randomizedtesting.RandomizedRunner$9.
>> evaluate(RandomizedRunner.java:907)
>>         at com.carrotsearch.randomizedtesting.RandomizedRunner$10.
>> evaluate(RandomizedRunner.java:921)
>>         at org.apache.solr.BaseDistributedSearchTestCase$ShardsRepeatRu
>> le$ShardsFixedStatement.callStatement(BaseDistributedSearchT
>> estCase.java:992)
>>         at org.apache.solr.BaseDistributedSearchTestCase$ShardsRepeatRu
>> le$ShardsStatement.evaluate(BaseDistributedSearchTestCase.java:967)
>>         at com.carrotsearch.randomizedtesting.rules.SystemPropertiesRes
>> toreRule$1.evaluate(SystemPropertiesRestoreRule.java:57)
>>         at org.apache.lucene.util.TestRuleSetupTeardownChained$1.
>> evaluate(TestRuleSetupTeardownChained.java:49)
>>         at org.apache.lucene.util.AbstractBeforeAfterRule$1.evaluate(Ab
>> stractBeforeAfterRule.java:45)
>>         at org.apache.lucene.util.TestRuleThreadAndTestName$1.evaluate(
>> TestRuleThreadAndTestName.java:48)
>>         at org.apache.lucene.util.TestRuleIgnoreAfterMaxFailures$1.
>> evaluate(TestRuleIgnoreAfterMaxFailures.java:64)
>>         at org.apache.lucene.util.TestRuleMarkFailure$1.evaluate(
>> TestRuleMarkFailure.java:47)
>>         at com.carrotsearch.randomizedtesting.rules.StatementAdapter.
>> evaluate(StatementAdapter.java:36)
>>         at com.carrotsearch.randomizedtesting.ThreadLeakControl$Stateme
>> ntRunner.run(ThreadLeakControl.java:367)
>>         at com.carrotsearch.randomizedtesting.ThreadLeakControl.forkTim
>> eoutingTask(ThreadLeakControl.java:809)
>>         at com.carrotsearch.randomizedtesting.ThreadLeakControl$3.
>> evaluate(ThreadLeakControl.java:460)
>>         at com.carrotsearch.randomizedtesting.RandomizedRunner.runSingl
>> eTest(RandomizedRunner.java:880)
>>         at com.carrotsearch.randomizedtesting.RandomizedRunner$5.
>> evaluate(RandomizedRunner.java:781)
>>         at com.carrotsearch.randomizedtesting.RandomizedRunner$6.
>> evaluate(RandomizedRunner.java:816)
>>         at com.carrotsearch.randomizedtesting.RandomizedRunner$7.
>> evaluate(RandomizedRunner.java:827)
>>         at com.carrotsearch.randomizedtesting.rules.StatementAdapter.
>> evaluate(StatementAdapter.java:36)
>>         at com.carrotsearch.randomizedtesting.rules.SystemPropertiesRes
>> toreRule$1.evaluate(SystemPropertiesRestoreRule.java:57)
>>         at org.apache.lucene.util.AbstractBeforeAfterRule$1.evaluate(Ab
>> stractBeforeAfterRule.java:45)
>>         at com.carrotsearch.randomizedtesting.rules.StatementAdapter.
>> evaluate(StatementAdapter.java:36)
>>         at org.apache.lucene.util.TestRuleStoreClassName$1.evaluate(Tes
>> tRuleStoreClassName.java:41)
>>         at com.carrotsearch.randomizedtesting.rules.NoShadowingOrOverri
>> desOnMethodsRule$1.evaluate(NoShadowingOrOverridesOnMethodsRule.java:40)
>>         at com.carrotsearch.randomizedtesting.rules.NoShadowingOrOverri
>> desOnMethodsRule$1.evaluate(NoShadowingOrOverridesOnMethodsRule.java:40)
>>         at com.carrotsearch.randomizedtesting.rules.StatementAdapter.
>> evaluate(StatementAdapter.java:36)
>>         at com.carrotsearch.randomizedtesting.rules.StatementAdapter.
>> evaluate(StatementAdapter.java:36)
>>         at com.carrotsearch.randomizedtesting.rules.StatementAdapter.
>> evaluate(StatementAdapter.java:36)
>>         at org.apache.lucene.util.TestRuleAssertionsRequired$1.evaluate
>> (TestRuleAssertionsRequired.java:53)
>>         at org.apache.lucene.util.TestRuleMarkFailure$1.evaluate(
>> TestRuleMarkFailure.java:47)
>>         at org.apache.lucene.util.TestRuleIgnoreAfterMaxFailures$1.
>> evaluate(TestRuleIgnoreAfterMaxFailures.java:64)
>>         at org.apache.lucene.util.TestRuleIgnoreTestSuites$1.evaluate(T
>> estRuleIgnoreTestSuites.java:54)
>>         at com.carrotsearch.randomizedtesting.rules.StatementAdapter.
>> evaluate(StatementAdapter.java:36)
>>         at com.carrotsearch.randomizedtesting.ThreadLeakControl$Stateme
>> ntRunner.run(ThreadLeakControl.java:367)
>>         at java.lang.Thread.run(Thread.java:745)
>> Caused by: org.apache.solr.client.solrj.SolrServerException: No live
>> SolrServers available to handle this request:[http://127.0.0.1:4477
>> 8/ynzn/forceleader_test_collection_shard1_replica3]
>>         at org.apache.solr.client.solrj.impl.LBHttpSolrClient.request(L
>> BHttpSolrClient.java:383)
>>         at org.apache.solr.client.solrj.impl.CloudSolrClient.directUpda
>> te(CloudSolrClient.java:768)
>>         ... 49 more
>> Caused by: org.apache.solr.client.solrj.SolrServerException: Server
>> refused connection at: http://127.0.0.1:44778/ynzn/fo
>> rceleader_test_collection_shard1_replica3
>>         at org.apache.solr.client.solrj.impl.HttpSolrClient.executeMeth
>> od(HttpSolrClient.java:599)
>>         at org.apache.solr.client.solrj.impl.HttpSolrClient.request(Htt
>> pSolrClient.java:261)
>>         at org.apache.solr.client.solrj.impl.HttpSolrClient.request(Htt
>> pSolrClient.java:250)
>>         at org.apache.solr.client.solrj.impl.LBHttpSolrClient.doRequest
>> (LBHttpSolrClient.java:403)
>>         at org.apache.solr.client.solrj.impl.LBHttpSolrClient.request(L
>> BHttpSolrClient.java:372)
>>         ... 50 more
>> Caused by: java.net.ConnectException: Connection refused
>>         at java.net.PlainSocketImpl.socketConnect(Native Method)
>>         at java.net.AbstractPlainSocketImpl.doConnect(AbstractPlainSock
>> etImpl.java:350)
>>         at java.net.AbstractPlainSocketImpl.connectToAddress(AbstractPl
>> ainSocketImpl.java:206)
>>         at java.net.AbstractPlainSocketImpl.connect(AbstractPlainSocket
>> Impl.java:188)
>>         at java.net.SocksSocketImpl.connect(SocksSocketImpl.java:392)
>>         at java.net.Socket.connect(Socket.java:589)
>>         at org.apache.http.conn.scheme.PlainSocketFactory.connectSocket
>> (PlainSocketFactory.java:117)
>>         at org.apache.http.impl.conn.DefaultClientConnectionOperator.
>> openConnection(DefaultClientConnectionOperator.java:177)
>>         at org.apache.http.impl.conn.ManagedClientConnectionImpl.open(M
>> anagedClientConnectionImpl.java:304)
>>         at org.apache.http.impl.client.DefaultRequestDirector.tryConnec
>> t(DefaultRequestDirector.java:611)
>>         at org.apache.http.impl.client.DefaultRequestDirector.execute(D
>> efaultRequestDirector.java:446)
>>         at org.apache.http.impl.client.AbstractHttpClient.doExecute(Abs
>> tractHttpClient.java:882)
>>         at org.apache.http.impl.client.CloseableHttpClient.execute(Clos
>> eableHttpClient.java:82)
>>         at org.apache.http.impl.client.CloseableHttpClient.execute(Clos
>> eableHttpClient.java:107)
>>         at org.apache.http.impl.client.CloseableHttpClient.execute(Clos
>> eableHttpClient.java:55)
>>         at org.apache.solr.client.solrj.impl.HttpSolrClient.executeMeth
>> od(HttpSolrClient.java:497)
>>         ... 54 more
>>
>>
>>
>>
>> Build Log:
>> [...truncated 9009 lines...]
>>    [junit4] Suite: org.apache.lucene.spatial3d.TestGeo3DPoint
>>    [junit4] IGNOR/A 0.01s J0 | TestGeo3DPoint.testRandomBig
>>    [junit4]    > Assumption #1: 'nightly' test group is disabled
>> (@Nightly())
>>    [junit4]   2> NOTE: reproduce with: ant test
>> -Dtestcase=TestGeo3DPoint -Dtests.method=testRandomMedium
>> -Dtests.seed=9B3B01520448F054 -Dtests.multiplier=3 -Dtests.slow=true
>> -Dtests.locale=ar-QA -Dtests.timezone=CST6CDT -Dtests.asserts=true
>> -Dtests.file.encoding=UTF-8
>>    [junit4] FAILURE 4.54s J0 | TestGeo3DPoint.testRandomMedium <<<
>>    [junit4]    > Throwable #1: java.lang.AssertionError: FAIL: id=20600
>> should have matched but did not
>>    [junit4]    >   shape=GeoStandardCircle: {planetmodel=PlanetModel.WGS84,
>> center=[lat=-2.7574435614238194E-13, lon=0.0([X=1.0011188539924791,
>> Y=0.0, Z=-2.760528738161554E-13])], radius=1.5887859182593391(91.0
>> 3072766607713)}
>>    [junit4]    >   bounds=XYZBounds: [xmin=-0.01779006715405413
>> xmax=1.0011188549924792 ymin=-1.0011188549924792 ymax=1.0011188549924792
>> zmin=-0.9977622930221051 zmax=0.9977622930221051]
>>    [junit4]    >   world bounds=( minX=-1.0011188539924791
>> maxX=1.0011188539924791 minY=-1.0011188539924791 maxY=1.0011188539924791
>> minZ=-0.9977622920221051 maxZ=0.9977622920221051
>>    [junit4]    >   quantized point=[X=-0.017929931093965013,
>> Y=0.6974607560008638, Z=0.7155524064776803] within shape? true within
>> bounds? false
>>    [junit4]    >   unquantized point=[lat=0.7980359504429014,
>> lon=1.5964981068121482([X=-0.017929931150094086, Y=0.6974607557894967,
>> Z=0.7155524064918857])] within shape? true within bounds? false
>>    [junit4]    >   docID=20241 deleted?=false
>>    [junit4]    >   query=PointInGeo3DShapeQuery: field=point: Shape:
>> GeoStandardCircle: {planetmodel=PlanetModel.WGS84,
>> center=[lat=-2.7574435614238194E-13, lon=0.0([X=1.0011188539924791,
>> Y=0.0, Z=-2.760528738161554E-13])], radius=1.5887859182593391(91.0
>> 3072766607713)}
>>    [junit4]    >   explanation:
>>    [junit4]    >     target is in leaf _1(6.2.0):C40793 of full reader
>> StandardDirectoryReader(segments:5:nrt _1(6.2.0):C40793)
>>    [junit4]    >     full BKD path to target doc:
>>    [junit4]    >       Cell(x=-1.0011188543037526 TO 1.0011188543037524
>> y=-1.0011188510404756 TO 1.0011188543037524 z=-0.9977622923536127 TO
>> 0.9977622923536126); Shape relationship = OVERLAPS; Quantized point within
>> cell = true; Unquantized point within cell = true
>>    [junit4]    >       Cell(x=-1.0011188543037526 TO 7.390138260796596E-4
>> y=-1.0011188510404756 TO 1.0011188543037524 z=-0.9977622923536127 TO
>> 0.9977622923536126); Shape relationship = OVERLAPS; Quantized point within
>> cell = true; Unquantized point within cell = true
>>    [junit4]    >       Cell(x=-1.0011188543037526 TO 7.390138260796596E-4
>> y=-1.0011188510404756 TO 1.0011188543037524 z=0.0 TO 0.9977622923536126);
>> Shape relationship = OVERLAPS; Quantized point within cell = true;
>> Unquantized point within cell = true
>>    [junit4]    >       Cell(x=-0.36164092093242806 TO
>> 7.390138260796596E-4 y=-1.0011188510404756 TO 1.0011188543037524 z=0.0 TO
>> 0.9977622923536126); Shape relationship = OVERLAPS; Quantized point within
>> cell = true; Unquantized point within cell = true
>>    [junit4]    >       Cell(x=-0.36164092093242806 TO
>> 7.390138260796596E-4 y=-1.0011188510404756 TO 1.0011188543037524 z=0.0 TO
>> 0.9913910577870918); Shape relationship = OVERLAPS; Quantized point within
>> cell = true; Unquantized point within cell = true
>>    [junit4]    >       Cell(x=-0.36164092093242806 TO
>> 7.390138260796596E-4 y=-1.0011188510404756 TO 1.0011188543037524 z=0.0 TO
>> 0.8703133879741732); Shape relationship = OVERLAPS; Quantized point within
>> cell = true; Unquantized point within cell = true
>>    [junit4]    >       Cell(x=-0.36164092093242806 TO
>> 7.390138260796596E-4 y=-1.0011188510404756 TO 1.0011188543037524
>> z=0.4397491496027799 TO 0.8703133879741732); Shape relationship = OVERLAPS;
>> Quantized point within cell = true; Unquantized point within cell = true
>>    [junit4]    >       Cell(x=-0.36164092093242806 TO
>> 7.390138260796596E-4 y=-1.0011188510404756 TO 1.0011188543037524
>> z=0.4397491496027799 TO 0.7233329727533392); Shape relationship = OVERLAPS;
>> Quantized point within cell = true; Unquantized point within cell = true
>>    [junit4]    >       Cell(x=-0.2013357411633494 TO 7.390138260796596E-4
>> y=-1.0011188510404756 TO 1.0011188543037524 z=0.4397491496027799 TO
>> 0.7233329727533392); Shape relationship = OVERLAPS; Quantized point within
>> cell = true; Unquantized point within cell = true
>>    [junit4]    >     on cell Cell(x=-1.0011188543037526 TO
>> 1.0011188543037524 y=-1.0011188510404756 TO 1.0011188543037524
>> z=-0.9977622923536127 TO 0.9977622923536126); Shape relationship =
>> OVERLAPS; Quantized point within cell = true; Unquantized point within cell
>> = true, wrapped visitor returned CELL_CROSSES_QUERY
>>    [junit4]    >     on cell Cell(x=-1.0011188543037526 TO
>> 7.390138260796596E-4 y=-1.0011188510404756 TO 1.0011188543037524
>> z=-0.9977622923536127 TO 0.9977622923536126); Shape relationship =
>> OVERLAPS; Quantized point within cell = true; Unquantized point within cell
>> = true, wrapped visitor returned CELL_CROSSES_QUERY
>>    [junit4]    >     on cell Cell(x=-1.0011188543037526 TO
>> 7.390138260796596E-4 y=-1.0011188510404756 TO 1.0011188543037524 z=0.0 TO
>> 0.9977622923536126); Shape relationship = OVERLAPS; Quantized point within
>> cell = true; Unquantized point within cell = true, wrapped visitor returned
>> CELL_CROSSES_QUERY
>>    [junit4]    >     on cell Cell(x=-0.36164092093242806 TO
>> 7.390138260796596E-4 y=-1.0011188510404756 TO 1.0011188543037524 z=0.0 TO
>> 0.9977622923536126); Shape relationship = OVERLAPS; Quantized point within
>> cell = true; Unquantized point within cell = true, wrapped visitor returned
>> CELL_CROSSES_QUERY
>>    [junit4]    >     on cell Cell(x=-0.36164092093242806 TO
>> 7.390138260796596E-4 y=-1.0011188510404756 TO 1.0011188543037524 z=0.0 TO
>> 0.9913910577870918); Shape relationship = OVERLAPS; Quantized point within
>> cell = true; Unquantized point within cell = true, wrapped visitor returned
>> CELL_CROSSES_QUERY
>>    [junit4]    >     on cell Cell(x=-0.36164092093242806 TO
>> 7.390138260796596E-4 y=-1.0011188510404756 TO 1.0011188543037524 z=0.0 TO
>> 0.8703133879741732); Shape relationship = OVERLAPS; Quantized point within
>> cell = true; Unquantized point within cell = true, wrapped visitor returned
>> CELL_CROSSES_QUERY
>>    [junit4]    >     on cell Cell(x=-0.36164092093242806 TO
>> 7.390138260796596E-4 y=-1.0011188510404756 TO 1.0011188543037524
>> z=0.4397491496027799 TO 0.8703133879741732); Shape relationship = OVERLAPS;
>> Quantized point within cell = true; Unquantized point within cell = true,
>> wrapped visitor returned CELL_CROSSES_QUERY
>>    [junit4]    >     on cell Cell(x=-0.36164092093242806 TO
>> 7.390138260796596E-4 y=-1.0011188510404756 TO 1.0011188543037524
>> z=0.4397491496027799 TO 0.7233329727533392); Shape relationship = OVERLAPS;
>> Quantized point within cell = true; Unquantized point within cell = true,
>> wrapped visitor returned CELL_CROSSES_QUERY
>>    [junit4]    >     on cell Cell(x=-0.2013357411633494 TO
>> 7.390138260796596E-4 y=-1.0011188510404756 TO 1.0011188543037524
>> z=0.4397491496027799 TO 0.7233329727533392); Shape relationship = OVERLAPS;
>> Quantized point within cell = true; Unquantized point within cell = true,
>> wrapped visitor returned CELL_CROSSES_QUERY
>>    [junit4]    >   leaf visit docID=20241 x=-0.017929931093965013
>> y=0.6974607560008638 z=0.7155524064776803
>>    [junit4]    >
>>    [junit4]    >        at __randomizedtesting.SeedInfo.s
>> eed([9B3B01520448F054:26E536FA452D9332]:0)
>>    [junit4]    >        at org.apache.lucene.spatial3d.Te
>> stGeo3DPoint.verify(TestGeo3DPoint.java:867)
>>    [junit4]    >        at org.apache.lucene.spatial3d.Te
>> stGeo3DPoint.doTestRandom(TestGeo3DPoint.java:548)
>>    [junit4]    >        at org.apache.lucene.spatial3d.Te
>> stGeo3DPoint.testRandomMedium(TestGeo3DPoint.java:475)
>>    [junit4]    >        at java.lang.Thread.run(Thread.java:745)
>>    [junit4]   2> NOTE: test params are: codec=Asserting(Lucene62):
>> {id=PostingsFormat(name=Memory doPackFST= true)},
>> docValues:{id=DocValuesFormat(name=Asserting)}, maxPointsInLeafNode=193,
>> maxMBSortInHeap=6.432894666295765, sim=RandomSimilarity(queryNorm=true,coord=no):
>> {}, locale=ar-QA, timezone=CST6CDT
>>    [junit4]   2> NOTE: Linux 4.4.0-31-generic amd64/Oracle Corporation
>> 1.8.0_102 (64-bit)/cpus=12,threads=1,free=496682264,total=526385152
>>    [junit4]   2> NOTE: All tests run in this JVM: [GeoCircleTest,
>> TestGeo3DPoint]
>>    [junit4] Completed [11/11 (1!)] on J0 in 20.66s, 14 tests, 1 failure,
>> 1 skipped <<< FAILURES!
>>
>> [...truncated 2594 lines...]
>>    [junit4] Suite: org.apache.solr.cloud.ForceLeaderTest
>>    [junit4]   2> Creating dataDir: /home/jenkins/workspace/Lucene
>> -Solr-6.x-Linux/solr/build/solr-core/test/J0/temp/solr.
>> cloud.ForceLeaderTest_5238F5C5BF63D7C5-001/init-core-data-001
>>    [junit4]   2> 854164 INFO  (SUITE-ForceLeaderTest-seed#[5238F5C5BF63D7C5]-worker)
>> [    ] o.a.s.SolrTestCaseJ4 Randomized ssl (false) and clientAuth (false)
>> via: @org.apache.solr.SolrTestCaseJ4$SuppressSSL(bugUrl=https://
>> issues.apache.org/jira/browse/SOLR-5776)
>>    [junit4]   2> 854164 INFO  (SUITE-ForceLeaderTest-seed#[5238F5C5BF63D7C5]-worker)
>> [    ] o.a.s.BaseDistributedSearchTestCase Setting hostContext system
>> property: /ynzn/
>>    [junit4]   2> 854165 INFO  (TEST-ForceLeaderTest.testRepl
>> icasInLIRNoLeader-seed#[5238F5C5BF63D7C5]) [    ] o.a.s.c.ZkTestServer
>> STARTING ZK TEST SERVER
>>    [junit4]   2> 854165 INFO  (Thread-1895) [    ] o.a.s.c.ZkTestServer
>> client port:0.0.0.0/0.0.0.0:0
>>    [junit4]   2> 854165 INFO  (Thread-1895) [    ] o.a.s.c.ZkTestServer
>> Starting server
>>    [junit4]   2> 854265 INFO  (TEST-ForceLeaderTest.testRepl
>> icasInLIRNoLeader-seed#[5238F5C5BF63D7C5]) [    ] o.a.s.c.ZkTestServer
>> start zk server on port:36862
>>    [junit4]   2> 854265 INFO  (TEST-ForceLeaderTest.testRepl
>> icasInLIRNoLeader-seed#[5238F5C5BF63D7C5]) [    ] o.a.s.c.c.SolrZkClient
>> Using default ZkCredentialsProvider
>>    [junit4]   2> 854266 INFO  (TEST-ForceLeaderTest.testRepl
>> icasInLIRNoLeader-seed#[5238F5C5BF63D7C5]) [    ]
>> o.a.s.c.c.ConnectionManager Waiting for client to connect to ZooKeeper
>>    [junit4]   2> 854268 INFO  (zkCallback-25463-thread-1) [    ]
>> o.a.s.c.c.ConnectionManager Watcher org.apache.solr.common.cloud.C
>> onnectionManager@2374f718 name:ZooKeeperConnection Watcher:
>> 127.0.0.1:36862 got event WatchedEvent state:SyncConnected type:None
>> path:null path:null type:None
>>    [junit4]   2> 854268 INFO  (TEST-ForceLeaderTest.testRepl
>> icasInLIRNoLeader-seed#[5238F5C5BF63D7C5]) [    ]
>> o.a.s.c.c.ConnectionManager Client is connected to ZooKeeper
>>    [junit4]   2> 854268 INFO  (TEST-ForceLeaderTest.testRepl
>> icasInLIRNoLeader-seed#[5238F5C5BF63D7C5]) [    ] o.a.s.c.c.SolrZkClient
>> Using default ZkACLProvider
>>    [junit4]   2> 854268 INFO  (TEST-ForceLeaderTest.testRepl
>> icasInLIRNoLeader-seed#[5238F5C5BF63D7C5]) [    ] o.a.s.c.c.SolrZkClient
>> makePath: /solr
>>    [junit4]   2> 854269 INFO  (TEST-ForceLeaderTest.testRepl
>> icasInLIRNoLeader-seed#[5238F5C5BF63D7C5]) [    ] o.a.s.c.c.SolrZkClient
>> Using default ZkCredentialsProvider
>>    [junit4]   2> 854270 INFO  (TEST-ForceLeaderTest.testRepl
>> icasInLIRNoLeader-seed#[5238F5C5BF63D7C5]) [    ]
>> o.a.s.c.c.ConnectionManager Waiting for client to connect to ZooKeeper
>>    [junit4]   2> 854271 INFO  (zkCallback-25464-thread-1) [    ]
>> o.a.s.c.c.ConnectionManager Watcher org.apache.solr.common.cloud.C
>> onnectionManager@1fd7649f name:ZooKeeperConnection Watcher:
>> 127.0.0.1:36862/solr got event WatchedEvent state:SyncConnected
>> type:None path:null path:null type:None
>>    [junit4]   2> 854271 INFO  (TEST-ForceLeaderTest.testRepl
>> icasInLIRNoLeader-seed#[5238F5C5BF63D7C5]) [    ]
>> o.a.s.c.c.ConnectionManager Client is connected to ZooKeeper
>>    [junit4]   2> 854271 INFO  (TEST-ForceLeaderTest.testRepl
>> icasInLIRNoLeader-seed#[5238F5C5BF63D7C5]) [    ] o.a.s.c.c.SolrZkClient
>> Using default ZkACLProvider
>>    [junit4]   2> 854271 INFO  (TEST-ForceLeaderTest.testRepl
>> icasInLIRNoLeader-seed#[5238F5C5BF63D7C5]) [    ] o.a.s.c.c.SolrZkClient
>> makePath: /collections/collection1
>>    [junit4]   2> 854272 INFO  (TEST-ForceLeaderTest.testRepl
>> icasInLIRNoLeader-seed#[5238F5C5BF63D7C5]) [    ] o.a.s.c.c.SolrZkClient
>> makePath: /collections/collection1/shards
>>    [junit4]   2> 854272 INFO  (TEST-ForceLeaderTest.testRepl
>> icasInLIRNoLeader-seed#[5238F5C5BF63D7C5]) [    ] o.a.s.c.c.SolrZkClient
>> makePath: /collections/control_collection
>>    [junit4]   2> 854272 INFO  (TEST-ForceLeaderTest.testRepl
>> icasInLIRNoLeader-seed#[5238F5C5BF63D7C5]) [    ] o.a.s.c.c.SolrZkClient
>> makePath: /collections/control_collection/shards
>>    [junit4]   2> 854273 INFO  (TEST-ForceLeaderTest.testRepl
>> icasInLIRNoLeader-seed#[5238F5C5BF63D7C5]) [    ]
>> o.a.s.c.AbstractZkTestCase put /home/jenkins/workspace/Lucene
>> -Solr-6.x-Linux/solr/core/src/test-files/solr/collection1/conf/solrconfig-tlog.xml
>> to /configs/conf1/solrconfig.xml
>>    [junit4]   2> 854273 INFO  (TEST-ForceLeaderTest.testRepl
>> icasInLIRNoLeader-seed#[5238F5C5BF63D7C5]) [    ] o.a.s.c.c.SolrZkClient
>> makePath: /configs/conf1/solrconfig.xml
>>    [junit4]   2> 854273 INFO  (TEST-ForceLeaderTest.testRepl
>> icasInLIRNoLeader-seed#[5238F5C5BF63D7C5]) [    ]
>> o.a.s.c.AbstractZkTestCase put /home/jenkins/workspace/Lucene
>> -Solr-6.x-Linux/solr/core/src/test-files/solr/collection1/conf/schema.xml
>> to /configs/conf1/schema.xml
>>    [junit4]   2> 854274 INFO  (TEST-ForceLeaderTest.testRepl
>> icasInLIRNoLeader-seed#[5238F5C5BF63D7C5]) [    ] o.a.s.c.c.SolrZkClient
>> makePath: /configs/conf1/schema.xml
>>    [junit4]   2> 854274 INFO  (TEST-ForceLeaderTest.testRepl
>> icasInLIRNoLeader-seed#[5238F5C5BF63D7C5]) [    ]
>> o.a.s.c.AbstractZkTestCase put /home/jenkins/workspace/Lucene
>> -Solr-6.x-Linux/solr/core/src/test-files/solr/collection1/
>> conf/solrconfig.snippet.randomindexconfig.xml to
>> /configs/conf1/solrconfig.snippet.randomindexconfig.xml
>>    [junit4]   2> 854274 INFO  (TEST-ForceLeaderTest.testRepl
>> icasInLIRNoLeader-seed#[5238F5C5BF63D7C5]) [    ] o.a.s.c.c.SolrZkClient
>> makePath: /configs/conf1/solrconfig.snippet.randomindexconfig.xml
>>    [junit4]   2> 854275 INFO  (TEST-ForceLeaderTest.testRepl
>> icasInLIRNoLeader-seed#[5238F5C5BF63D7C5]) [    ]
>> o.a.s.c.AbstractZkTestCase put /home/jenkins/workspace/Lucene
>> -Solr-6.x-Linux/solr/core/src/test-files/solr/collection1/conf/stopwords.txt
>> to /configs/conf1/stopwords.txt
>>    [junit4]   2> 854275 INFO  (TEST-ForceLeaderTest.testRepl
>> icasInLIRNoLeader-seed#[5238F5C5BF63D7C5]) [    ] o.a.s.c.c.SolrZkClient
>> makePath: /configs/conf1/stopwords.txt
>>    [junit4]   2> 854275 INFO  (TEST-ForceLeaderTest.testRepl
>> icasInLIRNoLeader-seed#[5238F5C5BF63D7C5]) [    ]
>> o.a.s.c.AbstractZkTestCase put /home/jenkins/workspace/Lucene
>> -Solr-6.x-Linux/solr/core/src/test-files/solr/collection1/conf/protwords.txt
>> to /configs/conf1/protwords.txt
>>    [junit4]   2> 854275 INFO  (TEST-ForceLeaderTest.testRepl
>> icasInLIRNoLeader-seed#[5238F5C5BF63D7C5]) [    ] o.a.s.c.c.SolrZkClient
>> makePath: /configs/conf1/protwords.txt
>>    [junit4]   2> 854276 INFO  (TEST-ForceLeaderTest.testRepl
>> icasInLIRNoLeader-seed#[5238F5C5BF63D7C5]) [    ]
>> o.a.s.c.AbstractZkTestCase put /home/jenkins/workspace/Lucene
>> -Solr-6.x-Linux/solr/core/src/test-files/solr/collection1/conf/currency.xml
>> to /configs/conf1/currency.xml
>>    [junit4]   2> 854276 INFO  (TEST-ForceLeaderTest.testRepl
>> icasInLIRNoLeader-seed#[5238F5C5BF63D7C5]) [    ] o.a.s.c.c.SolrZkClient
>> makePath: /configs/conf1/currency.xml
>>    [junit4]   2> 854276 INFO  (TEST-ForceLeaderTest.testRepl
>> icasInLIRNoLeader-seed#[5238F5C5BF63D7C5]) [    ]
>> o.a.s.c.AbstractZkTestCase put /home/jenkins/workspace/Lucene
>> -Solr-6.x-Linux/solr/core/src/test-files/solr/collection1/conf/enumsConfig.xml
>> to /configs/conf1/enumsConfig.xml
>>    [junit4]   2> 854276 INFO  (TEST-ForceLeaderTest.testRepl
>> icasInLIRNoLeader-seed#[5238F5C5BF63D7C5]) [    ] o.a.s.c.c.SolrZkClient
>> makePath: /configs/conf1/enumsConfig.xml
>>    [junit4]   2> 854277 INFO  (TEST-ForceLeaderTest.testRepl
>> icasInLIRNoLeader-seed#[5238F5C5BF63D7C5]) [    ]
>> o.a.s.c.AbstractZkTestCase put /home/jenkins/workspace/Lucene
>> -Solr-6.x-Linux/solr/core/src/test-files/solr/collection1/conf/open-exchange-rates.json
>> to /configs/conf1/open-exchange-rates.json
>>    [junit4]   2> 854277 INFO  (TEST-ForceLeaderTest.testRepl
>> icasInLIRNoLeader-seed#[5238F5C5BF63D7C5]) [    ] o.a.s.c.c.SolrZkClient
>> makePath: /configs/conf1/open-exchange-rates.json
>>    [junit4]   2> 854277 INFO  (TEST-ForceLeaderTest.testRepl
>> icasInLIRNoLeader-seed#[5238F5C5BF63D7C5]) [    ]
>> o.a.s.c.AbstractZkTestCase put /home/jenkins/workspace/Lucene
>> -Solr-6.x-Linux/solr/core/src/test-files/solr/collection1/
>> conf/mapping-ISOLatin1Accent.txt to /configs/conf1/mapping-ISOLati
>> n1Accent.txt
>>    [junit4]   2> 854277 INFO  (TEST-ForceLeaderTest.testRepl
>> icasInLIRNoLeader-seed#[5238F5C5BF63D7C5]) [    ] o.a.s.c.c.SolrZkClient
>> makePath: /configs/conf1/mapping-ISOLatin1Accent.txt
>>    [junit4]   2> 854278 INFO  (TEST-ForceLeaderTest.testRepl
>> icasInLIRNoLeader-seed#[5238F5C5BF63D7C5]) [    ]
>> o.a.s.c.AbstractZkTestCase put /home/jenkins/workspace/Lucene
>> -Solr-6.x-Linux/solr/core/src/test-files/solr/collection1/conf/old_synonyms.txt
>> to /configs/conf1/old_synonyms.txt
>>    [junit4]   2> 854278 INFO  (TEST-ForceLeaderTest.testRepl
>> icasInLIRNoLeader-seed#[5238F5C5BF63D7C5]) [    ] o.a.s.c.c.SolrZkClient
>> makePath: /configs/conf1/old_synonyms.txt
>>    [junit4]   2> 854278 INFO  (TEST-ForceLeaderTest.testRepl
>> icasInLIRNoLeader-seed#[5238F5C5BF63D7C5]) [    ]
>> o.a.s.c.AbstractZkTestCase put /home/jenkins/workspace/Lucene
>> -Solr-6.x-Linux/solr/core/src/test-files/solr/collection1/conf/synonyms.txt
>> to /configs/conf1/synonyms.txt
>>    [junit4]   2> 854278 INFO  (TEST-ForceLeaderTest.testRepl
>> icasInLIRNoLeader-seed#[5238F5C5BF63D7C5]) [    ] o.a.s.c.c.SolrZkClient
>> makePath: /configs/conf1/synonyms.txt
>>    [junit4]   2> 854337 INFO  (TEST-ForceLeaderTest.testRepl
>> icasInLIRNoLeader-seed#[5238F5C5BF63D7C5]) [    ] o.a.s.SolrTestCaseJ4
>> Writing core.properties file to /home/jenkins/workspace/Lucene
>> -Solr-6.x-Linux/solr/build/solr-core/test/J0/temp/solr.
>> cloud.ForceLeaderTest_5238F5C5BF63D7C5-001/control-001/cores/collection1
>>    [junit4]   2> 854338 INFO  (TEST-ForceLeaderTest.testRepl
>> icasInLIRNoLeader-seed#[5238F5C5BF63D7C5]) [    ] o.e.j.s.Server
>> jetty-9.3.8.v20160314
>>    [junit4]   2> 854338 INFO  (TEST-ForceLeaderTest.testRepl
>> icasInLIRNoLeader-seed#[5238F5C5BF63D7C5]) [    ]
>> o.e.j.s.h.ContextHandler Started o.e.j.s.ServletContextHandler@
>> 1193b76{/ynzn,null,AVAILABLE}
>>    [junit4]   2> 854339 INFO  (TEST-ForceLeaderTest.testRepl
>> icasInLIRNoLeader-seed#[5238F5C5BF63D7C5]) [    ]
>> o.e.j.s.ServerConnector Started ServerConnector@284071dd{HTTP/
>> 1.1,[http/1.1]}{127.0.0.1:43001}
>>    [junit4]   2> 854339 INFO  (TEST-ForceLeaderTest.testRepl
>> icasInLIRNoLeader-seed#[5238F5C5BF63D7C5]) [    ] o.e.j.s.Server Started
>> @856114ms
>>    [junit4]   2> 854339 INFO  (TEST-ForceLeaderTest.testRepl
>> icasInLIRNoLeader-seed#[5238F5C5BF63D7C5]) [    ]
>> o.a.s.c.s.e.JettySolrRunner Jetty properties: {solr.data.dir=/home/jenkins/w
>> orkspace/Lucene-Solr-6.x-Linux/solr/build/solr-core/test/J0/
>> temp/solr.cloud.ForceLeaderTest_5238F5C5BF63D7C5-001/tempDir-001/control/data,
>> hostContext=/ynzn, hostPort=45763, coreRootDirectory=/home/jenkin
>> s/workspace/Lucene-Solr-6.x-Linux/solr/build/solr-core/
>> test/J0/temp/solr.cloud.ForceLeaderTest_5238F5C5BF63D7C5-
>> 001/control-001/cores}
>>    [junit4]   2> 854339 INFO  (TEST-ForceLeaderTest.testRepl
>> icasInLIRNoLeader-seed#[5238F5C5BF63D7C5]) [    ]
>> o.a.s.s.SolrDispatchFilter SolrDispatchFilter.init():
>> sun.misc.Launcher$AppClassLoader@73d16e93
>>    [junit4]   2> 854339 INFO  (TEST-ForceLeaderTest.testRepl
>> icasInLIRNoLeader-seed#[5238F5C5BF63D7C5]) [    ]
>> o.a.s.c.SolrResourceLoader new SolrResourceLoader for directory:
>> '/home/jenkins/workspace/Lucene-Solr-6.x-Linux/solr/build/
>> solr-core/test/J0/temp/solr.cloud.ForceLeaderTest_5238F5C5
>> BF63D7C5-001/control-001'
>>    [junit4]   2> 854339 INFO  (TEST-ForceLeaderTest.testRepl
>> icasInLIRNoLeader-seed#[5238F5C5BF63D7C5]) [    ]
>> o.a.s.c.SolrResourceLoader JNDI not configured for solr (NoInitialContextEx)
>>    [junit4]   2> 854339 INFO  (TEST-ForceLeaderTest.testRepl
>> icasInLIRNoLeader-seed#[5238F5C5BF63D7C5]) [    ]
>> o.a.s.c.SolrResourceLoader solr home defaulted to 'solr/' (could not find
>> system property or JNDI)
>>    [junit4]   2> 854339 INFO  (TEST-ForceLeaderTest.testRepl
>> icasInLIRNoLeader-seed#[5238F5C5BF63D7C5]) [    ] o.a.s.c.c.SolrZkClient
>> Using default ZkCredentialsProvider
>>    [junit4]   2> 854340 INFO  (TEST-ForceLeaderTest.testRepl
>> icasInLIRNoLeader-seed#[5238F5C5BF63D7C5]) [    ]
>> o.a.s.c.c.ConnectionManager Waiting for client to connect to ZooKeeper
>>    [junit4]   2> 854340 INFO  (zkCallback-25465-thread-1) [    ]
>> o.a.s.c.c.ConnectionManager Watcher org.apache.solr.common.cloud.C
>> onnectionManager@47b10fb6 name:ZooKeeperConnection Watcher:
>> 127.0.0.1:36862/solr got event WatchedEvent state:SyncConnected
>> type:None path:null path:null type:None
>>    [junit4]   2> 854340 INFO  (TEST-ForceLeaderTest.testRepl
>> icasInLIRNoLeader-seed#[5238F5C5BF63D7C5]) [    ]
>> o.a.s.c.c.ConnectionManager Client is connected to ZooKeeper
>>    [junit4]   2> 854340 INFO  (TEST-ForceLeaderTest.testRepl
>> icasInLIRNoLeader-seed#[5238F5C5BF63D7C5]) [    ] o.a.s.c.c.SolrZkClient
>> Using default ZkACLProvider
>>    [junit4]   2> 854341 INFO  (TEST-ForceLeaderTest.testRepl
>> icasInLIRNoLeader-seed#[5238F5C5BF63D7C5]) [    ]
>> o.a.s.s.SolrDispatchFilter Loading solr.xml from SolrHome (not found in
>> ZooKeeper)
>>    [junit4]   2> 854341 INFO  (TEST-ForceLeaderTest.testRepl
>> icasInLIRNoLeader-seed#[5238F5C5BF63D7C5]) [    ] o.a.s.c.SolrXmlConfig
>> Loading container configuration from /home/jenkins/workspace/Lucene
>> -Solr-6.x-Linux/solr/build/solr-core/test/J0/temp/solr.
>> cloud.ForceLeaderTest_5238F5C5BF63D7C5-001/control-001/solr.xml
>>    [junit4]   2> 854345 INFO  (TEST-ForceLeaderTest.testRepl
>> icasInLIRNoLeader-seed#[5238F5C5BF63D7C5]) [    ]
>> o.a.s.c.CorePropertiesLocator Config-defined core root directory:
>> /home/jenkins/workspace/Lucene-Solr-6.x-Linux/solr/build/
>> solr-core/test/J0/temp/solr.cloud.ForceLeaderTest_5238F5C5
>> BF63D7C5-001/control-001/cores
>>    [junit4]   2> 854345 INFO  (TEST-ForceLeaderTest.testRepl
>> icasInLIRNoLeader-seed#[5238F5C5BF63D7C5]) [    ] o.a.s.c.CoreContainer
>> New CoreContainer 1625996469
>>    [junit4]   2> 854345 INFO  (TEST-ForceLeaderTest.testRepl
>> icasInLIRNoLeader-seed#[5238F5C5BF63D7C5]) [    ] o.a.s.c.CoreContainer
>> Loading cores into CoreContainer [instanceDir=/home/jenkins/wor
>> kspace/Lucene-Solr-6.x-Linux/solr/build/solr-core/test/J0/
>> temp/solr.cloud.ForceLeaderTest_5238F5C5BF63D7C5-001/control-001]
>>    [junit4]   2> 854345 WARN  (TEST-ForceLeaderTest.testRepl
>> icasInLIRNoLeader-seed#[5238F5C5BF63D7C5]) [    ] o.a.s.c.CoreContainer
>> Couldn't add files from /home/jenkins/workspace/Lucene
>> -Solr-6.x-Linux/solr/build/solr-core/test/J0/temp/solr.
>> cloud.ForceLeaderTest_5238F5C5BF63D7C5-001/control-001/lib to classpath:
>> /home/jenkins/workspace/Lucene-Solr-6.x-Linux/solr/build/
>> solr-core/test/J0/temp/solr.cloud.ForceLeaderTest_5238F5C5
>> BF63D7C5-001/control-001/lib
>>    [junit4]   2> 854345 INFO  (TEST-ForceLeaderTest.testRepl
>> icasInLIRNoLeader-seed#[5238F5C5BF63D7C5]) [    ]
>> o.a.s.h.c.HttpShardHandlerFactory created with socketTimeout :
>> 90000,urlScheme : ,connTimeout : 15000,maxConnectionsPerHost :
>> 20,maxConnections : 10000,corePoolSize : 0,maximumPoolSize : 2147483647,maxThreadIdleTime
>> : 5,sizeOfQueue : -1,fairnessPolicy : false,useRetries :
>> false,connectionsEvictorSleepDelay : 5000,maxConnectionIdleTime : 40000,
>>    [junit4]   2> 854346 INFO  (TEST-ForceLeaderTest.testRepl
>> icasInLIRNoLeader-seed#[5238F5C5BF63D7C5]) [    ]
>> o.a.s.u.UpdateShardHandler Creating UpdateShardHandler HTTP client with
>> params: socketTimeout=340000&connTimeout=45000&retry=true
>>    [junit4]   2> 854347 INFO  (TEST-ForceLeaderTest.testRepl
>> icasInLIRNoLeader-seed#[5238F5C5BF63D7C5]) [    ] o.a.s.l.LogWatcher
>> SLF4J impl is org.slf4j.impl.Log4jLoggerFactory
>>    [junit4]   2> 854347 INFO  (TEST-ForceLeaderTest.testRepl
>> icasInLIRNoLeader-seed#[5238F5C5BF63D7C5]) [    ] o.a.s.l.LogWatcher
>> Registering Log Listener [Log4j (org.slf4j.impl.Log4jLoggerFactory)]
>>    [junit4]   2> 854347 INFO  (TEST-ForceLeaderTest.testRepl
>> icasInLIRNoLeader-seed#[5238F5C5BF63D7C5]) [    ] o.a.s.c.ZkContainer
>> Zookeeper client=127.0.0.1:36862/solr
>>    [junit4]   2> 854347 INFO  (TEST-ForceLeaderTest.testRepl
>> icasInLIRNoLeader-seed#[5238F5C5BF63D7C5]) [    ] o.a.s.c.ZkController
>> zkHost includes chroot
>>    [junit4]   2> 854347 INFO  (TEST-ForceLeaderTest.testRepl
>> icasInLIRNoLeader-seed#[5238F5C5BF63D7C5]) [    ] o.a.s.c.c.SolrZkClient
>> Using default ZkCredentialsProvider
>>    [junit4]   2> 854347 INFO  (TEST-ForceLeaderTest.testRepl
>> icasInLIRNoLeader-seed#[5238F5C5BF63D7C5]) [    ]
>> o.a.s.c.c.ConnectionManager Waiting for client to connect to ZooKeeper
>>    [junit4]   2> 854348 INFO  (zkCallback-25468-thread-1) [    ]
>> o.a.s.c.c.ConnectionManager Watcher org.apache.solr.common.cloud.C
>> onnectionManager@426b14fa name:ZooKeeperConnection Watcher:
>> 127.0.0.1:36862 got event WatchedEvent state:SyncConnected type:None
>> path:null path:null type:None
>>    [junit4]   2> 854348 INFO  (TEST-ForceLeaderTest.testRepl
>> icasInLIRNoLeader-seed#[5238F5C5BF63D7C5]) [    ]
>> o.a.s.c.c.ConnectionManager Client is connected to ZooKeeper
>>    [junit4]   2> 854348 INFO  (TEST-ForceLeaderTest.testRepl
>> icasInLIRNoLeader-seed#[5238F5C5BF63D7C5]) [    ] o.a.s.c.c.SolrZkClient
>> Using default ZkACLProvider
>>    [junit4]   2> 854348 INFO  (TEST-ForceLeaderTest.testRepl
>> icasInLIRNoLeader-seed#[5238F5C5BF63D7C5]) [n:127.0.0.1:45763_ynzn    ]
>> o.a.s.c.ZkController Added new OnReconnect listener
>> org.apache.solr.cloud.ZkController$$Lambda$69/1954692189@739339a6
>>    [junit4]   2> 854348 INFO  (TEST-ForceLeaderTest.testRepl
>> icasInLIRNoLeader-seed#[5238F5C5BF63D7C5]) [n:127.0.0.1:45763_ynzn    ]
>> o.a.s.c.c.ConnectionManager Waiting for client to connect to ZooKeeper
>>    [junit4]   2> 854349 INFO  (zkCallback-25469-thread-1-pro
>> cessing-n:127.0.0.1:45763_ynzn) [n:127.0.0.1:45763_ynzn    ]
>> o.a.s.c.c.ConnectionManager Watcher org.apache.solr.common.cloud.C
>> onnectionManager@e7819d2 name:ZooKeeperConnection Watcher:
>> 127.0.0.1:36862/solr got event WatchedEvent state:SyncConnected
>> type:None path:null path:null type:None
>>    [junit4]   2> 854349 INFO  (TEST-ForceLeaderTest.testRepl
>> icasInLIRNoLeader-seed#[5238F5C5BF63D7C5]) [n:127.0.0.1:45763_ynzn    ]
>> o.a.s.c.c.ConnectionManager Client is connected to ZooKeeper
>>    [junit4]   2> 854349 INFO  (TEST-ForceLeaderTest.testRepl
>> icasInLIRNoLeader-seed#[5238F5C5BF63D7C5]) [n:127.0.0.1:45763_ynzn    ]
>> o.a.s.c.c.SolrZkClient makePath: /overseer/queue
>>    [junit4]   2> 854350 INFO  (TEST-ForceLeaderTest.testRepl
>> icasInLIRNoLeader-seed#[5238F5C5BF63D7C5]) [n:127.0.0.1:45763_ynzn    ]
>> o.a.s.c.c.SolrZkClient makePath: /overseer/collection-queue-work
>>    [junit4]   2> 854351 INFO  (TEST-ForceLeaderTest.testRepl
>> icasInLIRNoLeader-seed#[5238F5C5BF63D7C5]) [n:127.0.0.1:45763_ynzn    ]
>> o.a.s.c.c.SolrZkClient makePath: /overseer/collection-map-running
>>    [junit4]   2> 854351 INFO  (TEST-ForceLeaderTest.testRepl
>> icasInLIRNoLeader-seed#[5238F5C5BF63D7C5]) [n:127.0.0.1:45763_ynzn    ]
>> o.a.s.c.c.SolrZkClient makePath: /overseer/collection-map-completed
>>    [junit4]   2> 854352 INFO  (TEST-ForceLeaderTest.testRepl
>> icasInLIRNoLeader-seed#[5238F5C5BF63D7C5]) [n:127.0.0.1:45763_ynzn    ]
>> o.a.s.c.c.SolrZkClient makePath: /overseer/collection-map-failure
>>    [junit4]   2> 854352 INFO  (TEST-ForceLeaderTest.testRepl
>> icasInLIRNoLeader-seed#[5238F5C5BF63D7C5]) [n:127.0.0.1:45763_ynzn    ]
>> o.a.s.c.c.SolrZkClient makePath: /live_nodes
>>    [junit4]   2> 854353 INFO  (TEST-ForceLeaderTest.testRepl
>> icasInLIRNoLeader-seed#[5238F5C5BF63D7C5]) [n:127.0.0.1:45763_ynzn    ]
>> o.a.s.c.c.SolrZkClient makePath: /aliases.json
>>    [junit4]   2> 854353 INFO  (TEST-ForceLeaderTest.testRepl
>> icasInLIRNoLeader-seed#[5238F5C5BF63D7C5]) [n:127.0.0.1:45763_ynzn    ]
>> o.a.s.c.c.SolrZkClient makePath: /clusterstate.json
>>    [junit4]   2> 854353 INFO  (TEST-ForceLeaderTest.testRepl
>> icasInLIRNoLeader-seed#[5238F5C5BF63D7C5]) [n:127.0.0.1:45763_ynzn    ]
>> o.a.s.c.c.SolrZkClient makePath: /security.json
>>    [junit4]   2> 854354 INFO  (TEST-ForceLeaderTest.testRepl
>> icasInLIRNoLeader-seed#[5238F5C5BF63D7C5]) [n:127.0.0.1:45763_ynzn    ]
>> o.a.s.c.c.ZkStateReader Updating cluster state from ZooKeeper...
>>    [junit4]   2> 854355 INFO  (TEST-ForceLeaderTest.testRepl
>> icasInLIRNoLeader-seed#[5238F5C5BF63D7C5]) [n:127.0.0.1:45763_ynzn    ]
>> o.a.s.c.c.ZkStateReader Loaded empty cluster properties
>>    [junit4]   2> 854355 INFO  (TEST-ForceLeaderTest.testRepl
>> icasInLIRNoLeader-seed#[5238F5C5BF63D7C5]) [n:127.0.0.1:45763_ynzn    ]
>> o.a.s.c.c.ZkStateReader Updated live nodes from ZooKeeper... (0) -> (0)
>>    [junit4]   2> 854356 INFO  (TEST-ForceLeaderTest.testRepl
>> icasInLIRNoLeader-seed#[5238F5C5BF63D7C5]) [n:127.0.0.1:45763_ynzn    ]
>> o.a.s.c.c.SolrZkClient makePath: /overseer_elect
>>    [junit4]   2> 854356 INFO  (TEST-ForceLeaderTest.testRepl
>> icasInLIRNoLeader-seed#[5238F5C5BF63D7C5]) [n:127.0.0.1:45763_ynzn    ]
>> o.a.s.c.c.SolrZkClient makePath: /overseer_elect/election
>>    [junit4]   2> 854357 INFO  (TEST-ForceLeaderTest.testRepl
>> icasInLIRNoLeader-seed#[5238F5C5BF63D7C5]) [n:127.0.0.1:45763_ynzn    ]
>> o.a.s.c.Overseer Overseer (id=null) closing
>>    [junit4]   2> 854357 INFO  (TEST-ForceLeaderTest.testRepl
>> icasInLIRNoLeader-seed#[5238F5C5BF63D7C5]) [n:127.0.0.1:45763_ynzn    ]
>> o.a.s.c.LeaderElector Joined leadership election with path:
>> /overseer_elect/election/96375369892626436-127.0.0.1:45763_
>> ynzn-n_0000000000
>>    [junit4]   2> 854357 INFO  (TEST-ForceLeaderTest.testRepl
>> icasInLIRNoLeader-seed#[5238F5C5BF63D7C5]) [n:127.0.0.1:45763_ynzn    ]
>> o.a.s.c.OverseerElectionContext I am going to be the leader
>> 127.0.0.1:45763_ynzn
>>    [junit4]   2> 854357 INFO  (TEST-ForceLeaderTest.testRepl
>> icasInLIRNoLeader-seed#[5238F5C5BF63D7C5]) [n:127.0.0.1:45763_ynzn    ]
>> o.a.s.c.c.SolrZkClient makePath: /overseer_elect/leader
>>    [junit4]   2> 854357 INFO  (TEST-ForceLeaderTest.testRepl
>> icasInLIRNoLeader-seed#[5238F5C5BF63D7C5]) [n:127.0.0.1:45763_ynzn    ]
>> o.a.s.c.Overseer Overseer (id=96375369892626436-127.0.0.1:45763_ynzn-n_0000000000)
>> starting
>>    [junit4]   2> 854358 INFO  (TEST-ForceLeaderTest.testRepl
>> icasInLIRNoLeader-seed#[5238F5C5BF63D7C5]) [n:127.0.0.1:45763_ynzn    ]
>> o.a.s.c.c.SolrZkClient makePath: /overseer/queue-work
>>    [junit4]   2> 854359 INFO  (TEST-ForceLeaderTest.testRepl
>> icasInLIRNoLeader-seed#[5238F5C5BF63D7C5]) [n:127.0.0.1:45763_ynzn    ]
>> o.a.s.c.OverseerAutoReplicaFailoverThread Starting
>> OverseerAutoReplicaFailoverThread autoReplicaFailoverWorkLoopDelay=10000
>> autoReplicaFailoverWaitAfterExpiration=10000
>> autoReplicaFailoverBadNodeExpiration=60000
>>    [junit4]   2> 854360 INFO  (OverseerCollectionConfigSetPr
>> ocessor-96375369892626436-127.0.0.1:45763_ynzn-n_0000000000)
>> [n:127.0.0.1:45763_ynzn    ] o.a.s.c.OverseerTaskProcessor Process
>> current queue of overseer operations
>>    [junit4]   2> 854360 INFO  (OverseerStateUpdate-963753698
>> 92626436-127.0.0.1:45763_ynzn-n_0000000000) [n:127.0.0.1:45763_ynzn    ]
>> o.a.s.c.Overseer Starting to work on the main queue
>>    [junit4]   2> 854360 INFO  (TEST-ForceLeaderTest.testRepl
>> icasInLIRNoLeader-seed#[5238F5C5BF63D7C5]) [n:127.0.0.1:45763_ynzn    ]
>> o.a.s.c.ZkController Register node as live in ZooKeeper:/live_nodes/
>> 127.0.0.1:45763_ynzn
>>    [junit4]   2> 854360 INFO  (TEST-ForceLeaderTest.testRepl
>> icasInLIRNoLeader-seed#[5238F5C5BF63D7C5]) [n:127.0.0.1:45763_ynzn    ]
>> o.a.s.c.c.SolrZkClient makePath: /live_nodes/127.0.0.1:45763_ynzn
>>    [junit4]   2> 854361 INFO  (OverseerStateUpdate-963753698
>> 92626436-127.0.0.1:45763_ynzn-n_0000000000) [n:127.0.0.1:45763_ynzn    ]
>> o.a.s.c.c.ZkStateReader Updated live nodes from ZooKeeper... (0) -> (0)
>>    [junit4]   2> 854361 INFO  (zkCallback-25469-thread-1-pro
>> cessing-n:127.0.0.1:45763_ynzn) [n:127.0.0.1:45763_ynzn    ]
>> o.a.s.c.c.ZkStateReader A live node change: [WatchedEvent
>> state:SyncConnected type:NodeChildrenChanged path:/live_nodes], has
>> occurred - updating... (live nodes size: [0])
>>    [junit4]   2> 854361 INFO  (zkCallback-25469-thread-1-pro
>> cessing-n:127.0.0.1:45763_ynzn) [n:127.0.0.1:45763_ynzn    ]
>> o.a.s.c.c.ZkStateReader Updated live nodes from ZooKeeper... (0) -> (1)
>>    [junit4]   2> 854374 INFO  (TEST-ForceLeaderTest.testRepl
>> icasInLIRNoLeader-seed#[5238F5C5BF63D7C5]) [n:127.0.0.1:45763_ynzn    ]
>> o.a.s.c.CoreContainer Security conf doesn't exist. Skipping setup for
>> authorization module.
>>    [junit4]   2> 854374 INFO  (TEST-ForceLeaderTest.testRepl
>> icasInLIRNoLeader-seed#[5238F5C5BF63D7C5]) [n:127.0.0.1:45763_ynzn    ]
>> o.a.s.c.CoreContainer No authentication plugin used.
>>    [junit4]   2> 854374 INFO  (TEST-ForceLeaderTest.testRepl
>> icasInLIRNoLeader-seed#[5238F5C5BF63D7C5]) [n:127.0.0.1:45763_ynzn    ]
>> o.a.s.c.CorePropertiesLocator Looking for core definitions underneath
>> /home/jenkins/workspace/Lucene-Solr-6.x-Linux/solr/build/
>> solr-core/test/J0/temp/solr.cloud.ForceLeaderTest_5238F5C5
>> BF63D7C5-001/control-001/cores
>>    [junit4]   2> 854375 INFO  (TEST-ForceLeaderTest.testRepl
>> icasInLIRNoLeader-seed#[5238F5C5BF63D7C5]) [n:127.0.0.1:45763_ynzn    ]
>> o.a.s.c.CoreDescriptor Created CoreDescriptor: {name=collection1,
>> config=solrconfig.xml, transient=false, schema=schema.xml,
>> loadOnStartup=true, configSetProperties=configsetprops.json,
>> collection=control_collection, coreNodeName=, dataDir=data/, shard=}
>>    [junit4]   2> 854375 INFO  (TEST-ForceLeaderTest.testRepl
>> icasInLIRNoLeader-seed#[5238F5C5BF63D7C5]) [n:127.0.0.1:45763_ynzn    ]
>> o.a.s.c.CorePropertiesLocator Found core collection1 in
>> /home/jenkins/workspace/Lucene-Solr-6.x-Linux/solr/build/
>> solr-core/test/J0/temp/solr.cloud.ForceLeaderTest_5238F5C5
>> BF63D7C5-001/control-001/cores/collection1
>>    [junit4]   2> 854375 INFO  (TEST-ForceLeaderTest.testRepl
>> icasInLIRNoLeader-seed#[5238F5C5BF63D7C5]) [n:127.0.0.1:45763_ynzn    ]
>> o.a.s.c.CorePropertiesLocator Found 1 core definitions
>>    [junit4]   2> 854375 INFO  (coreLoadExecutor-7779-thread-
>> 1-processing-n:127.0.0.1:45763_ynzn) [n:127.0.0.1:45763_ynzn
>> c:control_collection   x:collection1] o.a.s.c.ZkController publishing
>> state=down
>>    [junit4]   2> 854375 INFO  (TEST-ForceLeaderTest.testRepl
>> icasInLIRNoLeader-seed#[5238F5C5BF63D7C5]) [n:127.0.0.1:45763_ynzn    ]
>> o.a.s.s.SolrDispatchFilter user.dir=/home/jenkins/workspa
>> ce/Lucene-Solr-6.x-Linux/solr/build/solr-core/test/J0
>>    [junit4]   2> 854375 INFO  (coreLoadExecutor-7779-thread-
>> 1-processing-n:127.0.0.1:45763_ynzn) [n:127.0.0.1:45763_ynzn
>> c:control_collection   x:collection1] o.a.s.c.ZkController numShards not
>> found on descriptor - reading it from system property
>>    [junit4]   2> 854375 INFO  (TEST-ForceLeaderTest.testRepl
>> icasInLIRNoLeader-seed#[5238F5C5BF63D7C5]) [n:127.0.0.1:45763_ynzn    ]
>> o.a.s.s.SolrDispatchFilter SolrDispatchFilter.init() done
>>    [junit4]   2> 854376 INFO  (coreLoadExecutor-7779-thread-
>> 1-processing-n:127.0.0.1:45763_ynzn) [n:127.0.0.1:45763_ynzn
>> c:control_collection   x:collection1] o.a.s.c.ZkController Collection
>> control_collection not visible yet, but flagging it so a watch is
>> registered when it becomes visible
>>    [junit4]   2> 854376 INFO  (OverseerStateUpdate-963753698
>> 92626436-127.0.0.1:45763_ynzn-n_0000000000) [n:127.0.0.1:45763_ynzn    ]
>> o.a.s.c.Overseer processMessage: queueSize: 1, message = {
>>    [junit4]   2>   "core":"collection1",
>>    [junit4]   2>   "roles":null,
>>    [junit4]   2>   "base_url":"http://127.0.0.1:45763/ynzn",
>>    [junit4]   2>   "node_name":"127.0.0.1:45763_ynzn",
>>    [junit4]   2>   "numShards":"1",
>>    [junit4]   2>   "state":"down",
>>    [junit4]   2>   "shard":null,
>>    [junit4]   2>   "collection":"control_collection",
>>    [junit4]   2>   "operation":"state"} current state version: 0
>>    [junit4]   2> 854376 INFO  (OverseerStateUpdate-963753698
>> 92626436-127.0.0.1:45763_ynzn-n_0000000000) [n:127.0.0.1:45763_ynzn    ]
>> o.a.s.c.o.ReplicaMutator Update state numShards=1 message={
>>    [junit4]   2>   "core":"collection1",
>>    [junit4]   2>   "roles":null,
>>    [junit4]   2>   "base_url":"http://127.0.0.1:45763/ynzn",
>>    [junit4]   2>   "node_name":"127.0.0.1:45763_ynzn",
>>    [junit4]   2>   "numShards":"1",
>>    [junit4]   2>   "state":"down",
>>    [junit4]   2>   "shard":null,
>>    [junit4]   2>   "collection":"control_collection",
>>    [junit4]   2>   "operation":"state"}
>>    [junit4]   2> 854376 INFO  (coreLoadExecutor-7779-thread-
>> 1-processing-n:127.0.0.1:45763_ynzn) [n:127.0.0.1:45763_ynzn
>> c:control_collection   x:collection1] o.a.s.c.c.ZkStateReader Deleting data
>> for [control_collection]
>>    [junit4]   2> 854376 INFO  (OverseerStateUpdate-963753698
>> 92626436-127.0.0.1:45763_ynzn-n_0000000000) [n:127.0.0.1:45763_ynzn    ]
>> o.a.s.c.o.ClusterStateMutator building a new cName: control_collection
>>    [junit4]   2> 854377 INFO  (OverseerStateUpdate-963753698
>> 92626436-127.0.0.1:45763_ynzn-n_0000000000) [n:127.0.0.1:45763_ynzn    ]
>> o.a.s.c.o.ReplicaMutator Assigning new node to shard shard=shard1
>>    [junit4]   2> 854377 INFO  (coreLoadExecutor-7779-thread-
>> 1-processing-n:127.0.0.1:45763_ynzn) [n:127.0.0.1:45763_ynzn
>> c:control_collection   x:collection1] o.a.s.c.ZkController look for our
>> core node name
>>    [junit4]   2> 854377 INFO  (zkCallback-25469-thread-1-pro
>> cessing-n:127.0.0.1:45763_ynzn) [n:127.0.0.1:45763_ynzn    ]
>> o.a.s.c.c.ZkStateReader A cluster state change: [WatchedEvent
>> state:SyncConnected type:NodeDataChanged path:/clusterstate.json], has
>> occurred - updating... (live nodes size: [1])
>>    [junit4]   2> 855377 INFO  (coreLoadExecutor-7779-thread-
>> 1-processing-n:127.0.0.1:45763_ynzn) [n:127.0.0.1:45763_ynzn
>> c:control_collection   x:collection1] o.a.s.c.ZkController waiting to find
>> shard id in clusterstate for collection1
>>    [junit4]   2> 855377 INFO  (coreLoadExecutor-7779-thread-
>> 1-processing-n:127.0.0.1:45763_ynzn) [n:127.0.0.1:45763_ynzn
>> c:control_collection   x:collection1] o.a.s.c.ZkController Check for
>> collection zkNode:control_collection
>>    [junit4]   2> 855377 INFO  (coreLoadExecutor-7779-thread-
>> 1-processing-n:127.0.0.1:45763_ynzn) [n:127.0.0.1:45763_ynzn
>> c:control_collection   x:collection1] o.a.s.c.ZkController Collection
>> zkNode exists
>>    [junit4]   2> 855377 INFO  (coreLoadExecutor-7779-thread-
>> 1-processing-n:127.0.0.1:45763_ynzn) [n:127.0.0.1:45763_ynzn
>> c:control_collection   x:collection1] o.a.s.c.c.ZkStateReader Load
>> collection config from: [/collections/control_collection]
>>    [junit4]   2> 855378 INFO  (coreLoadExecutor-7779-thread-
>> 1-processing-n:127.0.0.1:45763_ynzn) [n:127.0.0.1:45763_ynzn
>> c:control_collection   x:collection1] o.a.s.c.c.ZkStateReader
>> path=[/collections/control_collection] [configName]=[conf1] specified
>> config exists in ZooKeeper
>>    [junit4]   2> 855378 INFO  (coreLoadExecutor-7779-thread-
>> 1-processing-n:127.0.0.1:45763_ynzn) [n:127.0.0.1:45763_ynzn
>> c:control_collection   x:collection1] o.a.s.c.SolrResourceLoader new
>> SolrResourceLoader for directory: '/home/jenkins/workspace/Lucen
>> e-Solr-6.x-Linux/solr/build/solr-core/test/J0/temp/solr.
>> cloud.ForceLeaderTest_5238F5C5BF63D7C5-001/control-001/cores/collection1'
>>    [junit4]   2> 855378 INFO  (coreLoadExecutor-7779-thread-
>> 1-processing-n:127.0.0.1:45763_ynzn) [n:127.0.0.1:45763_ynzn
>> c:control_collection   x:collection1] o.a.s.c.SolrResourceLoader JNDI not
>> configured for solr (NoInitialContextEx)
>>    [junit4]   2> 855378 INFO  (coreLoadExecutor-7779-thread-
>> 1-processing-n:127.0.0.1:45763_ynzn) [n:127.0.0.1:45763_ynzn
>> c:control_collection   x:collection1] o.a.s.c.SolrResourceLoader solr home
>> defaulted to 'solr/' (could not find system property or JNDI)
>>    [junit4]   2> 855379 INFO  (coreLoadExecutor-7779-thread-
>> 1-processing-n:127.0.0.1:45763_ynzn) [n:127.0.0.1:45763_ynzn
>> c:control_collection   x:collection1] o.a.s.c.Config loaded config
>> solrconfig.xml with version 0
>>    [junit4]   2> 855382 INFO  (coreLoadExecutor-7779-thread-
>> 1-processing-n:127.0.0.1:45763_ynzn) [n:127.0.0.1:45763_ynzn
>> c:control_collection   x:collection1] o.a.s.c.SolrConfig current version of
>> requestparams : -1
>>    [junit4]   2> 855385 INFO  (coreLoadExecutor-7779-thread-
>> 1-processing-n:127.0.0.1:45763_ynzn) [n:127.0.0.1:45763_ynzn
>> c:control_collection   x:collection1] o.a.s.c.SolrConfig Using Lucene
>> MatchVersion: 6.2.0
>>    [junit4]   2> 855391 INFO  (coreLoadExecutor-7779-thread-
>> 1-processing-n:127.0.0.1:45763_ynzn) [n:127.0.0.1:45763_ynzn
>> c:control_collection   x:collection1] o.a.s.c.SolrConfig Loaded SolrConfig:
>> solrconfig.xml
>>    [junit4]   2> 855395 INFO  (coreLoadExecutor-7779-thread-
>> 1-processing-n:127.0.0.1:45763_ynzn) [n:127.0.0.1:45763_ynzn
>> c:control_collection   x:collection1] o.a.s.s.IndexSchema [collection1]
>> Schema name=test
>>    [junit4]   2> 855458 INFO  (coreLoadExecutor-7779-thread-
>> 1-processing-n:127.0.0.1:45763_ynzn) [n:127.0.0.1:45763_ynzn
>> c:control_collection   x:collection1] o.a.s.s.OpenExchangeRatesOrgProvider
>> Initialized with rates=open-exchange-rates.json, refreshInterval=1440.
>>    [junit4]   2> 855462 INFO  (coreLoadExecutor-7779-thread-
>> 1-processing-n:127.0.0.1:45763_ynzn) [n:127.0.0.1:45763_ynzn
>> c:control_collection   x:collection1] o.a.s.s.IndexSchema default search
>> field in schema is text
>>    [junit4]   2> 855463 INFO  (coreLoadExecutor-7779-thread-
>> 1-processing-n:127.0.0.1:45763_ynzn) [n:127.0.0.1:45763_ynzn
>> c:control_collection   x:collection1] o.a.s.s.IndexSchema unique key field:
>> id
>>    [junit4]   2> 855466 INFO  (coreLoadExecutor-7779-thread-
>> 1-processing-n:127.0.0.1:45763_ynzn) [n:127.0.0.1:45763_ynzn
>> c:control_collection   x:collection1] o.a.s.s.FileExchangeRateProvider
>> Reloading exchange rates from file currency.xml
>>    [junit4]   2> 855467 INFO  (coreLoadExecutor-7779-thread-
>> 1-processing-n:127.0.0.1:45763_ynzn) [n:127.0.0.1:45763_ynzn
>> c:control_collection   x:collection1] o.a.s.s.FileExchangeRateProvider
>> Reloading exchange rates from file currency.xml
>>    [junit4]   2> 855468 INFO  (coreLoadExecutor-7779-thread-
>> 1-processing-n:127.0.0.1:45763_ynzn) [n:127.0.0.1:45763_ynzn
>> c:control_collection   x:collection1] o.a.s.s.OpenExchangeRatesOrgProvider
>> Reloading exchange rates from open-exchange-rates.json
>>    [junit4]   2> 855468 INFO  (coreLoadExecutor-7779-thread-
>> 1-processing-n:127.0.0.1:45763_ynzn) [n:127.0.0.1:45763_ynzn
>> c:control_collection   x:collection1] o.a.s.s.OpenExchangeRatesOrgProvider
>> Reloading exchange rates from open-exchange-rates.json
>>    [junit4]   2> 855469 INFO  (coreLoadExecutor-7779-thread-
>> 1-processing-n:127.0.0.1:45763_ynzn) [n:127.0.0.1:45763_ynzn
>> c:control_collection   x:collection1] o.a.s.c.ConfigSetProperties Did not
>> find ConfigSet properties, assuming default properties: Can't find resource
>> 'configsetprops.json' in classpath or '/configs/conf1',
>> cwd=/home/jenkins/workspace/Lucene-Solr-6.x-Linux/solr/build
>> /solr-core/test/J0
>>    [junit4]   2> 855469 INFO  (coreLoadExecutor-7779-thread-
>> 1-processing-n:127.0.0.1:45763_ynzn) [n:127.0.0.1:45763_ynzn
>> c:control_collection   x:collection1] o.a.s.c.CoreContainer Creating
>> SolrCore 'collection1' using configuration from collection
>> control_collection
>>    [junit4]   2> 855469 INFO  (coreLoadExecutor-7779-thread-
>> 1-processing-n:127.0.0.1:45763_ynzn) [n:127.0.0.1:45763_ynzn
>> c:control_collection s:shard1 r:core_node1 x:collection1] o.a.s.c.SolrCore
>> org.apache.solr.core.MockDirectoryFactory
>>    [junit4]   2> 855469 INFO  (coreLoadExecutor-7779-thread-
>> 1-processing-n:127.0.0.1:45763_ynzn) [n:127.0.0.1:45763_ynzn
>> c:control_collection s:shard1 r:core_node1 x:collection1] o.a.s.c.SolrCore
>> [[collection1] ] Opening new SolrCore at [/home/jenkins/workspace/Lucen
>> e-Solr-6.x-Linux/solr/build/solr-core/test/J0/temp/solr.
>> cloud.ForceLeaderTest_5238F5C5BF63D7C5-001/control-001/cores/collection1],
>> dataDir=[/home/jenkins/workspace/Lucene-Solr-6.x-Linux/solr/
>> build/solr-core/test/J0/temp/solr.cloud.ForceLeaderTest_523
>> 8F5C5BF63D7C5-001/control-001/cores/collection1/data/]
>>    [junit4]   2> 855469 INFO  (coreLoadExecutor-7779-thread-
>> 1-processing-n:127.0.0.1:45763_ynzn) [n:127.0.0.1:45763_ynzn
>> c:control_collection s:shard1 r:core_node1 x:collection1]
>> o.a.s.c.JmxMonitoredMap JMX monitoring is enabled. Adding Solr mbeans to
>> JMX Server: com.sun.jmx.mbeanserver.JmxMBeanServer@6b7579a3
>>    [junit4]   2> 855470 INFO  (coreLoadExecutor-7779-thread-
>> 1-processing-n:127.0.0.1:45763_ynzn) [n:127.0.0.1:45763_ynzn
>> c:control_collection s:shard1 r:core_node1 x:collection1]
>> o.a.s.c.CachingDirectoryFactory return new directory for
>> /home/jenkins/workspace/Lucene-Solr-6.x-Linux/solr/build/
>> solr-core/test/J0/temp/solr.cloud.ForceLeaderTest_5238F5C5
>> BF63D7C5-001/control-001/cores/collection1/data/snapshot_metadata
>>    [junit4]   2> 855470 INFO  (coreLoadExecutor-7779-thread-
>> 1-processing-n:127.0.0.1:45763_ynzn) [n:127.0.0.1:45763_ynzn
>> c:control_collection s:shard1 r:core_node1 x:collection1]
>> o.a.s.c.s.SolrSnapshotMetaDataManager Loading from snapshot metadata
>> file...
>>    [junit4]   2> 855470 INFO  (coreLoadExecutor-7779-thread-
>> 1-processing-n:127.0.0.1:45763_ynzn) [n:127.0.0.1:45763_ynzn
>> c:control_collection s:shard1 r:core_node1 x:collection1]
>> o.a.s.c.CachingDirectoryFactory return new directory for
>> /home/jenkins/workspace/Lucene-Solr-6.x-Linux/solr/build/
>> solr-core/test/J0/temp/solr.cloud.ForceLeaderTest_5238F5C5
>> BF63D7C5-001/control-001/cores/collection1/data
>>    [junit4]   2> 855470 INFO  (coreLoadExecutor-7779-thread-
>> 1-processing-n:127.0.0.1:45763_ynzn) [n:127.0.0.1:45763_ynzn
>> c:control_collection s:shard1 r:core_node1 x:collection1] o.a.s.c.SolrCore
>> New index directory detected: old=null new=/home/jenkins/workspace/Lu
>> cene-Solr-6.x-Linux/solr/build/solr-core/test/J0/temp/solr.
>> cloud.ForceLeaderTest_5238F5C5BF63D7C5-001/control-001/
>> cores/collection1/data/index/
>>    [junit4]   2> 855470 WARN  (coreLoadExecutor-7779-thread-
>> 1-processing-n:127.0.0.1:45763_ynzn) [n:127.0.0.1:45763_ynzn
>> c:control_collection s:shard1 r:core_node1 x:collection1] o.a.s.c.SolrCore
>> [collection1] Solr index directory '/home/jenkins/workspace/Lucen
>> e-Solr-6.x-Linux/solr/build/solr-core/test/J0/temp/solr.
>> cloud.ForceLeaderTest_5238F5C5BF63D7C5-001/control-001/cores/collection1/data/index'
>> doesn't exist. Creating new index...
>>    [junit4]   2> 855470 INFO  (coreLoadExecutor-7779-thread-
>> 1-processing-n:127.0.0.1:45763_ynzn) [n:127.0.0.1:45763_ynzn
>> c:control_collection s:shard1 r:core_node1 x:collection1]
>> o.a.s.c.CachingDirectoryFactory return new directory for
>> /home/jenkins/workspace/Lucene-Solr-6.x-Linux/solr/build/
>> solr-core/test/J0/temp/solr.cloud.ForceLeaderTest_5238F5C5
>> BF63D7C5-001/control-001/cores/collection1/data/index
>>    [junit4]   2> 855471 INFO  (coreLoadExecutor-7779-thread-
>> 1-processing-n:127.0.0.1:45763_ynzn) [n:127.0.0.1:45763_ynzn
>> c:control_collection s:shard1 r:core_node1 x:collection1]
>> o.a.s.u.RandomMergePolicy RandomMergePolicy wrapping class
>> org.apache.lucene.index.TieredMergePolicy: [TieredMergePolicy:
>> maxMergeAtOnce=13, maxMergeAtOnceExplicit=19, maxMergedSegmentMB=33.3974609375,
>> floorSegmentMB=0.3984375, forceMergeDeletesPctAllowed=4.157606928530562,
>> segmentsPerTier=44.0, maxCFSSegmentSizeMB=8.796093022207999E12,
>> noCFSRatio=0.0
>>    [junit4]   2> 855471 INFO  (coreLoadExecutor-7779-thread-
>> 1-processing-n:127.0.0.1:45763_ynzn) [n:127.0.0.1:45763_ynzn
>> c:control_collection s:shard1 r:core_node1 x:collection1]
>> o.a.s.c.SolrDeletionPolicy SolrDeletionPolicy.onCommit: commits: num=1
>>    [junit4]   2>        commit{dir=MockDirectoryWrappe
>> r(RAMDirectory@140bfd lockFactory=org.apache.lucene.
>> store.SingleInstanceLockFactory@6881f131),segFN=segments_1,generation=1}
>>    [junit4]   2> 855471 INFO  (coreLoadExecutor-7779-thread-
>> 1-processing-n:127.0.0.1:45763_ynzn) [n:127.0.0.1:45763_ynzn
>> c:control_collection s:shard1 r:core_node1 x:collection1]
>> o.a.s.c.SolrDeletionPolicy newest commit generation = 1
>>    [junit4]   2> 855471 INFO  (OldIndexDirectoryCleanupThreadForCore-collection1)
>> [n:127.0.0.1:45763_ynzn c:control_collection s:shard1 r:core_node1
>> x:collection1] o.a.s.c.SolrCore Looking for old index directories to
>> cleanup for core collection1 in /home/jenkins/workspace/Lucene
>> -Solr-6.x-Linux/solr/build/solr-core/test/J0/temp/solr.
>> cloud.ForceLeaderTest_5238F5C5BF63D7C5-001/control-001/
>> cores/collection1/data/
>>    [junit4]   2> 855471 WARN  (OldIndexDirectoryCleanupThreadForCore-collection1)
>> [n:127.0.0.1:45763_ynzn c:control_collection s:shard1 r:core_node1
>> x:collection1] o.a.s.c.DirectoryFactory /home/jenkins/workspace/Lucene
>> -Solr-6.x-Linux/solr/build/solr-core/test/J0/temp/solr.
>> cloud.ForceLeaderTest_5238F5C5BF63D7C5-001/control-001/cores/collection1/data/
>> does not point to a valid data directory; skipping clean-up of old index
>> directories.
>>    [junit4]   2> 855473 INFO  (coreLoadExecutor-7779-thread-
>> 1-processing-n:127.0.0.1:45763_ynzn) [n:127.0.0.1:45763_ynzn
>> c:control_collection s:shard1 r:core_node1 x:collection1]
>> o.a.s.u.p.UpdateRequestProcessorChain creating
>> updateRequestProcessorChain "nodistrib"
>>    [junit4]   2> 855473 INFO  (coreLoadExecutor-7779-thread-
>> 1-processing-n:127.0.0.1:45763_ynzn) [n:127.0.0.1:45763_ynzn
>> c:control_collection s:shard1 r:core_node1 x:collection1]
>> o.a.s.u.p.UpdateRequestProcessorChain creating
>> updateRequestProcessorChain "dedupe"
>>    [junit4]   2> 855473 INFO  (coreLoadExecutor-7779-thread-
>> 1-processing-n:127.0.0.1:45763_ynzn) [n:127.0.0.1:45763_ynzn
>> c:control_collection s:shard1 r:core_node1 x:collection1]
>> o.a.s.u.p.UpdateRequestProcessorChain inserting
>> DistributedUpdateProcessorFactory into updateRequestProcessorChain
>> "dedupe"
>>    [junit4]   2> 855473 INFO  (coreLoadExecutor-7779-thread-
>> 1-processing-n:127.0.0.1:45763_ynzn) [n:127.0.0.1:45763_ynzn
>> c:control_collection s:shard1 r:core_node1 x:collection1]
>> o.a.s.u.p.UpdateRequestProcessorChain creating
>> updateRequestProcessorChain "stored_sig"
>>    [junit4]   2> 855473 INFO  (coreLoadExecutor-7779-thread-
>> 1-processing-n:127.0.0.1:45763_ynzn) [n:127.0.0.1:45763_ynzn
>> c:control_collection s:shard1 r:core_node1 x:collection1]
>> o.a.s.u.p.UpdateRequestProcessorChain inserting
>> DistributedUpdateProcessorFactory into updateRequestProcessorChain
>> "stored_sig"
>>    [junit4]   2> 855473 INFO  (coreLoadExecutor-7779-thread-
>> 1-processing-n:127.0.0.1:45763_ynzn) [n:127.0.0.1:45763_ynzn
>> c:control_collection s:shard1 r:core_node1 x:collection1]
>> o.a.s.u.p.UpdateRequestProcessorChain creating
>> updateRequestProcessorChain "distrib-dup-test-chain-explicit"
>>    [junit4]   2> 855473 INFO  (coreLoadExecutor-7779-thread-
>> 1-processing-n:127.0.0.1:45763_ynzn) [n:127.0.0.1:45763_ynzn
>> c:control_collection s:shard1 r:core_node1 x:collection1]
>> o.a.s.u.p.UpdateRequestProcessorChain creating
>> updateRequestProcessorChain "distrib-dup-test-chain-implicit"
>>    [junit4]   2> 855473 INFO  (coreLoadExecutor-7779-thread-
>> 1-processing-n:127.0.0.1:45763_ynzn) [n:127.0.0.1:45763_ynzn
>> c:control_collection s:shard1 r:core_node1 x:collection1]
>> o.a.s.u.p.UpdateRequestProcessorChain inserting
>> DistributedUpdateProcessorFactory into updateRequestProcessorChain
>> "distrib-dup-test-chain-implicit"
>>    [junit4]   2> 855473 INFO  (coreLoadExecutor-7779-thread-
>> 1-processing-n:127.0.0.1:45763_ynzn) [n:127.0.0.1:45763_ynzn
>> c:control_collection s:shard1 r:core_node1 x:collection1] o.a.s.c.SolrCore
>> no updateRequestProcessorChain defined as default, creating implicit default
>>    [junit4]   2> 855473 WARN  (coreLoadExecutor-7779-thread-
>> 1-processing-n:127.0.0.1:45763_ynzn) [n:127.0.0.1:45763_ynzn
>> c:control_collection s:shard1 r:core_node1 x:collection1]
>> o.a.s.c.RequestHandlers INVALID paramSet a in requestHandler {type =
>> requestHandler,name = /dump,class = DumpRequestHandler,args =
>> {defaults={a=A,b=B}}}
>>    [junit4]   2> 855475 INFO  (coreLoadExecutor-7779-thread-
>> 1-processing-n:127.0.0.1:45763_ynzn) [n:127.0.0.1:45763_ynzn
>> c:control_collection s:shard1 r:core_node1 x:collection1]
>> o.a.s.h.l.XMLLoader xsltCacheLifetimeSeconds=60
>>    [junit4]   2> 855475 INFO  (coreLoadExecutor-7779-thread-
>> 1-processing-n:127.0.0.1:45763_ynzn) [n:127.0.0.1:45763_ynzn
>> c:control_collection s:shard1 r:core_node1 x:collection1]
>> o.a.s.h.l.XMLLoader xsltCacheLifetimeSeconds=60
>>    [junit4]   2> 855475 INFO  (coreLoadExecutor-7779-thread-
>> 1-processing-n:127.0.0.1:45763_ynzn) [n:127.0.0.1:45763_ynzn
>> c:control_collection s:shard1 r:core_node1 x:collection1]
>> o.a.s.h.l.XMLLoader xsltCacheLifetimeSeconds=60
>>    [junit4]   2> 855476 INFO  (coreLoadExecutor-7779-thread-
>> 1-processing-n:127.0.0.1:45763_ynzn) [n:127.0.0.1:45763_ynzn
>> c:control_collection s:shard1 r:core_node1 x:collection1]
>> o.a.s.h.l.XMLLoader xsltCacheLifetimeSeconds=60
>>    [junit4]   2> 855478 INFO  (coreLoadExecutor-7779-thread-
>> 1-processing-n:127.0.0.1:45763_ynzn) [n:127.0.0.1:45763_ynzn
>> c:control_collection s:shard1 r:core_node1 x:collection1]
>> o.a.s.c.RequestHandlers Registered paths: /admin/mbeans,standard,/update
>> /json/docs,/admin/luke,/export,/get,/admin/properties,/
>> update/json,/admin/threads,/dump,/update/csv,/sql,/graph,/ad
>> min/segments,/admin/system,/replication,/config,/stream,/sch
>> ema,/admin/plugins,/admin/logging,/admin/ping,/update,/admin/file,/terms
>>    [junit4]   2> 855478 INFO  (coreLoadExecutor-7779-thread-
>> 1-processing-n:127.0.0.1:45763_ynzn) [n:127.0.0.1:45763_ynzn
>> c:control_collection s:shard1 r:core_node1 x:collection1] o.a.s.c.SolrCore
>> Using default statsCache cache: org.apache.solr.search.stats.L
>> ocalStatsCache
>>    [junit4]   2> 855478 INFO  (coreLoadExecutor-7779-thread-
>> 1-processing-n:127.0.0.1:45763_ynzn) [n:127.0.0.1:45763_ynzn
>> c:control_collection s:shard1 r:core_node1 x:collection1]
>> o.a.s.u.UpdateHandler Using UpdateLog implementation:
>> org.apache.solr.update.UpdateLog
>>    [junit4]   2> 855478 INFO  (coreLoadExecutor-7779-thread-
>> 1-processing-n:127.0.0.1:45763_ynzn) [n:127.0.0.1:45763_ynzn
>> c:control_collection s:shard1 r:core_node1 x:collection1] o.a.s.u.UpdateLog
>> Initializing UpdateLog: dataDir= defaultSyncLevel=FLUSH
>> numRecordsToKeep=100 maxNumLogsToKeep=10 numVersionBuckets=65536
>>    [junit4]   2> 855480 INFO  (coreLoadExecutor-7779-thread-
>> 1-processing-n:127.0.0.1:45763_ynzn) [n:127.0.0.1:45763_ynzn
>> c:control_collection s:shard1 r:core_node1 x:collection1]
>> o.a.s.u.CommitTracker Hard AutoCommit: disabled
>>    [junit4]   2> 855480 INFO  (coreLoadExecutor-7779-thread-
>> 1-processing-n:127.0.0.1:45763_ynzn) [n:127.0.0.1:45763_ynzn
>> c:control_collection s:shard1 r:core_node1 x:collection1]
>> o.a.s.u.CommitTracker Soft AutoCommit: disabled
>>    [junit4]   2> 855480 INFO  (coreLoadExecutor-7779-thread-
>> 1-processing-n:127.0.0.1:45763_ynzn) [n:127.0.0.1:45763_ynzn
>> c:control_collection s:shard1 r:core_node1 x:collection1]
>> o.a.s.u.RandomMergePolicy RandomMergePolicy wrapping class
>> org.apache.lucene.index.TieredMergePolicy: [TieredMergePolicy:
>> maxMergeAtOnce=33, maxMergeAtOnceExplicit=38, maxMergedSegmentMB=4.548828125,
>> floorSegmentMB=0.65234375, forceMergeDeletesPctAllowed=14.255936029725488,
>> segmentsPerTier=13.0, maxCFSSegmentSizeMB=8.796093022207999E12,
>> noCFSRatio=0.827607043788574
>>    [junit4]   2> 855480 INFO  (coreLoadExecutor-7779-thread-
>> 1-processing-n:127.0.0.1:45763_ynzn) [n:127.0.0.1:45763_ynzn
>> c:control_collection s:shard1 r:core_node1 x:collection1]
>> o.a.s.c.SolrDeletionPolicy SolrDeletionPolicy.onInit: commits: num=1
>>    [junit4]   2>        commit{dir=MockDirectoryWrappe
>> r(RAMDirectory@140bfd lockFactory=org.apache.lucene.
>> store.SingleInstanceLockFactory@6881f131),segFN=segments_1,generation=1}
>>    [junit4]   2> 855480 INFO  (coreLoadExecutor-7779-thread-
>> 1-processing-n:127.0.0.1:45763_ynzn) [n:127.0.0.1:45763_ynzn
>> c:control_collection s:shard1 r:core_node1 x:collection1]
>> o.a.s.c.SolrDeletionPolicy newest commit generation = 1
>>    [junit4]   2> 855480 INFO  (coreLoadExecutor-7779-thread-
>> 1-processing-n:127.0.0.1:45763_ynzn) [n:127.0.0.1:45763_ynzn
>> c:control_collection s:shard1 r:core_node1 x:collection1]
>> o.a.s.s.SolrIndexSearcher Opening [Searcher@1b818d67[collection1] main]
>>    [junit4]   2> 855480 INFO  (coreLoadExecutor-7779-thread-
>> 1-processing-n:127.0.0.1:45763_ynzn) [n:127.0.0.1:45763_ynzn
>> c:control_collection s:shard1 r:core_node1 x:collection1]
>> o.a.s.c.c.ZkStateReader Load collection config from:
>> [/collections/control_collection]
>>    [junit4]   2> 855481 INFO  (coreLoadExecutor-7779-thread-
>> 1-processing-n:127.0.0.1:45763_ynzn) [n:127.0.0.1:45763_ynzn
>> c:control_collection s:shard1 r:core_node1 x:collection1]
>> o.a.s.c.c.ZkStateReader path=[/collections/control_collection]
>> [configName]=[conf1] specified config exists in ZooKeeper
>>    [junit4]   2> 855481 INFO  (coreLoadExecutor-7779-thread-
>> 1-processing-n:127.0.0.1:45763_ynzn) [n:127.0.0.1:45763_ynzn
>> c:control_collection s:shard1 r:core_node1 x:collection1]
>> o.a.s.r.ManagedResourceStorage Setting up ZooKeeper-based storage for the
>> RestManager with znodeBase: /configs/conf1
>>    [junit4]   2> 855481 INFO  (coreLoadExecutor-7779-thread-
>> 1-processing-n:127.0.0.1:45763_ynzn) [n:127.0.0.1:45763_ynzn
>> c:control_collection s:shard1 r:core_node1 x:collection1]
>> o.a.s.r.ManagedResourceStorage Configured ZooKeeperStorageIO with
>> znodeBase: /configs/conf1
>>    [junit4]   2> 855481 INFO  (coreLoadExecutor-7779-thread-
>> 1-processing-n:127.0.0.1:45763_ynzn) [n:127.0.0.1:45763_ynzn
>> c:control_collection s:shard1 r:core_node1 x:collection1]
>> o.a.s.r.RestManager Initializing RestManager with initArgs: {}
>>    [junit4]   2> 855481 INFO  (coreLoadExecutor-7779-thread-
>> 1-processing-n:127.0.0.1:45763_ynzn) [n:127.0.0.1:45763_ynzn
>> c:control_collection s:shard1 r:core_node1 x:collection1]
>> o.a.s.r.ManagedResourceStorage Reading _rest_managed.json using
>> ZooKeeperStorageIO:path=/configs/conf1
>>    [junit4]   2> 855481 INFO  (coreLoadExecutor-7779-thread-
>> 1-processing-n:127.0.0.1:45763_ynzn) [n:127.0.0.1:45763_ynzn
>> c:control_collection s:shard1 r:core_node1 x:collection1]
>> o.a.s.r.ManagedResourceStorage No data found for znode
>> /configs/conf1/_rest_managed.json
>>    [junit4]   2> 855481 INFO  (coreLoadExecutor-7779-thread-
>> 1-processing-n:127.0.0.1:45763_ynzn) [n:127.0.0.1:45763_ynzn
>> c:control_collection s:shard1 r:core_node1 x:collection1]
>> o.a.s.r.ManagedResourceStorage Loaded null at path _rest_managed.json using
>> ZooKeeperStorageIO:path=/configs/conf1
>>    [junit4]   2> 855481 INFO  (coreLoadExecutor-7779-thread-
>> 1-processing-n:127.0.0.1:45763_ynzn) [n:127.0.0.1:45763_ynzn
>> c:control_collection s:shard1 r:core_node1 x:collection1]
>> o.a.s.r.RestManager Initializing 0 registered ManagedResources
>>    [junit4]   2> 855481 INFO  (coreLoadExecutor-7779-thread-
>> 1-processing-n:127.0.0.1:45763_ynzn) [n:127.0.0.1:45763_ynzn
>> c:control_collection s:shard1 r:core_node1 x:collection1]
>> o.a.s.h.ReplicationHandler Commits will be reserved for  10000
>>    [junit4]   2> 855482 INFO  (searcherExecutor-7780-thread-
>> 1-processing-n:127.0.0.1:45763_ynzn x:collection1 s:shard1
>> c:control_collection r:core_node1) [n:127.0.0.1:45763_ynzn
>> c:control_collection s:shard1 r:core_node1 x:collection1] o.a.s.c.SolrCore
>> [collection1] Registered new searcher Searcher@1b818d67[collection1]
>> main{ExitableDirectoryReader(UninvertingDirectoryReader())}
>>    [junit4]   2> 855482 INFO  (coreLoadExecutor-7779-thread-
>> 1-processing-n:127.0.0.1:45763_ynzn) [n:127.0.0.1:45763_ynzn
>> c:control_collection s:shard1 r:core_node1 x:collection1] o.a.s.u.UpdateLog
>> Looking up max value of version field to seed version buckets
>>    [junit4]   2> 855482 INFO  (coreLoadExecutor-7779-thread-
>> 1-processing-n:127.0.0.1:45763_ynzn) [n:127.0.0.1:45763_ynzn
>> c:control_collection s:shard1 r:core_node1 x:collection1]
>> o.a.s.u.VersionInfo Refreshing highest value of _version_ for 65536 version
>> buckets from index
>>    [junit4]   2> 855482 INFO  (coreLoadExecutor-7779-thread-
>> 1-processing-n:127.0.0.1:45763_ynzn) [n:127.0.0.1:45763_ynzn
>> c:control_collection s:shard1 r:core_node1 x:collection1]
>> o.a.s.u.VersionInfo No terms found for _version_, cannot seed version
>> bucket highest value from index
>>    [junit4]   2> 855482 INFO  (coreLoadExecutor-7779-thread-
>> 1-processing-n:127.0.0.1:45763_ynzn) [n:127.0.0.1:45763_ynzn
>> c:control_collection s:shard1 r:core_node1 x:collection1] o.a.s.u.UpdateLog
>> Could not find max version in index or recent updates, using new clock
>> 1542005919661948928
>>    [junit4]   2> 855484 INFO  (coreLoadExecutor-7779-thread-
>> 1-processing-n:127.0.0.1:45763_ynzn) [n:127.0.0.1:45763_ynzn
>> c:control_collection s:shard1 r:core_node1 x:collection1] o.a.s.u.UpdateLog
>> Took 1.0ms to seed version buckets with highest version 1542005919661948928
>>    [junit4]   2> 855484 INFO  (coreLoadExecutor-7779-thread-
>> 1-processing-n:127.0.0.1:45763_ynzn) [n:127.0.0.1:45763_ynzn
>> c:control_collection s:shard1 r:core_node1 x:collection1]
>> o.a.s.c.ZkController watch zkdir /configs/conf1
>>    [junit4]   2> 855484 INFO  (coreLoadExecutor-7779-thread-
>> 1-processing-n:127.0.0.1:45763_ynzn) [n:127.0.0.1:45763_ynzn
>> c:control_collection s:shard1 r:core_node1 x:collection1]
>> o.a.s.c.CoreContainer registering core: collection1
>>    [junit4]   2> 855484 INFO  (coreZkRegister-7773-thread-1-
>> processing-n:127.0.0.1:45763_ynzn x:collection1 s:shard1
>> c:control_collection r:core_node1) [n:127.0.0.1:45763_ynzn
>> c:control_collection s:shard1 r:core_node1 x:collection1]
>> o.a.s.c.ZkController Register replica - core:collection1 address:
>> http://127.0.0.1:45763/ynzn collection:control_collection shard:shard1
>>    [junit4]   2> 855485 INFO  (coreZkRegister-7773-thread-1-
>> processing-n:127.0.0.1:45763_ynzn x:collection1 s:shard1
>> c:control_collection r:core_node1) [n:127.0.0.1:45763_ynzn
>> c:control_collection s:shard1 r:core_node1 x:collection1]
>> o.a.s.c.c.SolrZkClient makePath: /collections/control_collectio
>> n/leader_elect/shard1/election
>>    [junit4]   2> 855486 INFO  (coreZkRegister-7773-thread-1-
>> processing-n:127.0.0.1:45763_ynzn x:collection1 s:shard1
>> c:control_collection r:core_node1) [n:127.0.0.1:45763_ynzn
>> c:control_collection s:shard1 r:core_node1 x:collection1]
>> o.a.s.c.LeaderElector Joined leadership election with path:
>> /collections/control_collection/leader_elect/shard1/
>> election/96375369892626436-core_node1-n_0000000000
>>    [junit4]   2> 855486 INFO  (coreZkRegister-7773-thread-1-
>> processing-n:127.0.0.1:45763_ynzn x:collection1 s:shard1
>> c:control_collection r:core_node1) [n:127.0.0.1:45763_ynzn
>> c:control_collection s:shard1 r:core_node1 x:collection1]
>> o.a.s.c.ShardLeaderElectionContext Running the leader process for
>> shard=shard1 and weAreReplacement=false and leaderVoteWait=10000
>>    [junit4]   2> 855486 INFO  (coreZkRegister-7773-thread-1-
>> processing-n:127.0.0.1:45763_ynzn x:collection1 s:shard1
>> c:control_collection r:core_node1) [n:127.0.0.1:45763_ynzn
>> c:control_collection s:shard1 r:core_node1 x:collection1]
>> o.a.s.c.ShardLeaderElectionContext Enough replicas found to continue.
>>    [junit4]   2> 855486 INFO  (coreZkRegister-7773-thread-1-
>> processing-n:127.0.0.1:45763_ynzn x:collection1 s:shard1
>> c:control_collection r:core_node1) [n:127.0.0.1:45763_ynzn
>> c:control_collection s:shard1 r:core_node1 x:collection1]
>> o.a.s.c.ShardLeaderElectionContext I may be the new leader - try and sync
>>    [junit4]   2> 855486 INFO  (coreZkRegister-7773-thread-1-
>> processing-n:127.0.0.1:45763_ynzn x:collection1 s:shard1
>> c:control_collection r:core_node1) [n:127.0.0.1:45763_ynzn
>> c:control_collection s:shard1 r:core_node1 x:collection1]
>> o.a.s.c.SyncStrategy Sync replicas to http://127.0.0.1:45763/ynzn/co
>> llection1/
>>    [junit4]   2> 855486 INFO  (OverseerStateUpdate-963753698
>> 92626436-127.0.0.1:45763_ynzn-n_0000000000) [n:127.0.0.1:45763_ynzn    ]
>> o.a.s.c.Overseer processMessage: queueSize: 1, message = {
>>    [junit4]   2>   "operation":"leader",
>>    [junit4]   2>   "shard":"shard1",
>>    [junit4]   2>   "collection":"control_collection"} current state
>> version: 1
>>    [junit4]   2> 855486 INFO  (coreZkRegister-7773-thread-1-
>> processing-n:127.0.0.1:45763_ynzn x:collection1 s:shard1
>> c:control_collection r:core_node1) [n:127.0.0.1:45763_ynzn
>> c:control_collection s:shard1 r:core_node1 x:collection1]
>> o.a.s.c.SyncStrategy Sync Success - now sync replicas to me
>>    [junit4]   2> 855487 INFO  (coreZkRegister-7773-thread-1-
>> processing-n:127.0.0.1:45763_ynzn x:collection1 s:shard1
>> c:control_collection r:core_node1) [n:127.0.0.1:45763_ynzn
>> c:control_collection s:shard1 r:core_node1 x:collection1]
>> o.a.s.c.SyncStrategy http://127.0.0.1:45763/ynzn/collection1/ has no
>> replicas
>>    [junit4]   2> 855487 INFO  (coreZkRegister-7773-thread-1-
>> processing-n:127.0.0.1:45763_ynzn x:collection1 s:shard1
>> c:control_collection r:core_node1) [n:127.0.0.1:45763_ynzn
>> c:control_collection s:shard1 r:core_node1 x:collection1]
>> o.a.s.c.c.SolrZkClient makePath: /collections/control_collectio
>> n/leaders/shard1
>>    [junit4]   2> 855487 INFO  (coreZkRegister-7773-thread-1-
>> processing-n:127.0.0.1:45763_ynzn x:collection1 s:shard1
>> c:control_collection r:core_node1) [n:127.0.0.1:45763_ynzn
>> c:control_collection s:shard1 r:core_node1 x:collection1]
>> o.a.s.c.ShardLeaderElectionContextBase Creating leader registration node
>> /collections/control_collection/leaders/shard1/leader after winning as
>> /collections/control_collection/leader_elect/shard1/
>> election/96375369892626436-core_node1-n_0000000000
>>    [junit4]   2> 855488 INFO  (coreZkRegister-7773-thread-1-
>> processing-n:127.0.0.1:45763_ynzn x:collection1 s:shard1
>> c:control_collection r:core_node1) [n:127.0.0.1:45763_ynzn
>> c:control_collection s:shard1 r:core_node1 x:collection1]
>> o.a.s.c.ShardLeaderElectionContext I am the new leader:
>> http://127.0.0.1:45763/ynzn/collection1/ shard1
>>    [junit4]   2> 855488 INFO  (OverseerStateUpdate-963753698
>> 92626436-127.0.0.1:45763_ynzn-n_0000000000) [n:127.0.0.1:45763_ynzn    ]
>> o.a.s.c.Overseer processMessage: queueSize: 1, message = {
>>    [junit4]   2>   "operation":"leader",
>>    [junit4]   2>   "shard":"shard1",
>>    [junit4]   2>   "collection":"control_collection",
>>    [junit4]   2>   "base_url":"http://127.0.0.1:45763/ynzn",
>>    [junit4]   2>   "core":"collection1",
>>    [junit4]   2>   "state":"active"} current state version: 1
>>    [junit4]   2> 855589 INFO  (zkCallback-25469-thread-1-pro
>> cessing-n:127.0.0.1:45763_ynzn) [n:127.0.0.1:45763_ynzn    ]
>> o.a.s.c.c.ZkStateReader A cluster state change: [WatchedEvent
>> state:SyncConnected type:NodeDataChanged path:/clusterstate.json], has
>> occurred - updating... (live nodes size: [1])
>>    [juni
>>
>> [...truncated too long message...]
>>
>> ex;done=false>>]
>>    [junit4]   2> 954225 INFO  (zkCallback-25525-thread-3-pro
>> cessing-n:127.0.0.1:45407_ynzn) [n:127.0.0.1:45407_ynzn c:collection1
>> s:shard2 r:core_node3 x:collection1] o.a.s.c.CachingDirectoryFactory
>> Closing directory, CoreContainer#isShutdown=true
>>    [junit4]   2> 954225 INFO  (zkCallback-25525-thread-3-pro
>> cessing-n:127.0.0.1:45407_ynzn) [n:127.0.0.1:45407_ynzn c:collection1
>> s:shard2 r:core_node3 x:collection1] o.a.s.c.CachingDirectoryFactory
>> Closing directory: /home/jenkins/workspace/Lucene
>> -Solr-6.x-Linux/solr/build/solr-core/test/J0/temp/solr.
>> cloud.ForceLeaderTest_5238F5C5BF63D7C5-001/shard-3-002/
>> cores/collection1/data/index
>>    [junit4]   2> 954225 INFO  (zkCallback-25525-thread-3-pro
>> cessing-n:127.0.0.1:45407_ynzn) [n:127.0.0.1:45407_ynzn c:collection1
>> s:shard2 r:core_node3 x:collection1] o.a.s.c.ElectionContext Canceling
>> election /collections/collection1/leader_elect/shard2/election/963753
>> 71917950991-core_node3-n_0000000001
>>    [junit4]   2> 954225 WARN  (zkCallback-25525-thread-3-pro
>> cessing-n:127.0.0.1:45407_ynzn) [n:127.0.0.1:45407_ynzn c:collection1
>> s:shard2 r:core_node3 x:collection1] o.a.s.c.LeaderElector
>>    [junit4]   2> org.apache.zookeeper.KeeperExc
>> eption$SessionExpiredException: KeeperErrorCode = Session expired for
>> /collections/collection1/leader_elect/shard2/election/963753
>> 71917950991-core_node3-n_0000000001
>>    [junit4]   2>        at org.apache.zookeeper.KeeperExc
>> eption.create(KeeperException.java:127)
>>    [junit4]   2>        at org.apache.zookeeper.KeeperExc
>> eption.create(KeeperException.java:51)
>>    [junit4]   2>        at org.apache.zookeeper.ZooKeeper
>> .delete(ZooKeeper.java:873)
>>    [junit4]   2>        at org.apache.solr.common.cloud.S
>> olrZkClient$2.execute(SolrZkClient.java:244)
>>    [junit4]   2>        at org.apache.solr.common.cloud.S
>> olrZkClient$2.execute(SolrZkClient.java:241)
>>    [junit4]   2>        at org.apache.solr.common.cloud.Z
>> kCmdExecutor.retryOperation(ZkCmdExecutor.java:60)
>>    [junit4]   2>        at org.apache.solr.common.cloud.S
>> olrZkClient.delete(SolrZkClient.java:241)
>>    [junit4]   2>        at org.apache.solr.cloud.Election
>> Context.cancelElection(ElectionContext.java:85)
>>    [junit4]   2>        at org.apache.solr.cloud.ShardLea
>> derElectionContextBase.cancelElection(ElectionContext.java:142)
>>    [junit4]   2>        at org.apache.solr.cloud.ShardLea
>> derElectionContext.cancelElection(ElectionContext.java:274)
>>    [junit4]   2>        at org.apache.solr.cloud.ShardLea
>> derElectionContext.runLeaderProcess(ElectionContext.java:450)
>>    [junit4]   2>        at org.apache.solr.cloud.LeaderEl
>> ector.runIamLeaderProcess(LeaderElector.java:170)
>>    [junit4]   2>        at org.apache.solr.cloud.LeaderEl
>> ector.checkIfIamLeader(LeaderElector.java:135)
>>    [junit4]   2>        at org.apache.solr.cloud.LeaderEl
>> ector.access$200(LeaderElector.java:56)
>>    [junit4]   2>        at org.apache.solr.cloud.LeaderEl
>> ector$ElectionWatcher.process(LeaderElector.java:348)
>>    [junit4]   2>        at org.apache.solr.common.cloud.S
>> olrZkClient$3.lambda$process$0(SolrZkClient.java:266)
>>    [junit4]   2>        at java.util.concurrent.Executors
>> $RunnableAdapter.call(Executors.java:511)
>>    [junit4]   2>        at java.util.concurrent.FutureTas
>> k.run(FutureTask.java:266)
>>    [junit4]   2>        at org.apache.solr.common.util.Ex
>> ecutorUtil$MDCAwareThreadPoolExecutor.lambda$execute$0(
>> ExecutorUtil.java:229)
>>    [junit4]   2>        at java.util.concurrent.ThreadPoo
>> lExecutor.runWorker(ThreadPoolExecutor.java:1142)
>>    [junit4]   2>        at java.util.concurrent.ThreadPoo
>> lExecutor$Worker.run(ThreadPoolExecutor.java:617)
>>    [junit4]   2>        at java.lang.Thread.run(Thread.java:745)
>>    [junit4]   2> 954227 INFO  (TEST-ForceLeaderTest.testLast
>> PublishedStateIsActive-seed#[5238F5C5BF63D7C5]) [    ]
>> o.e.j.s.ServerConnector Stopped ServerConnector@15a8bbd7{HTTP/
>> 1.1,[http/1.1]}{127.0.0.1:0}
>>    [junit4]   2> 954227 INFO  (TEST-ForceLeaderTest.testLast
>> PublishedStateIsActive-seed#[5238F5C5BF63D7C5]) [    ]
>> o.e.j.s.h.ContextHandler Stopped o.e.j.s.ServletContextHandler@
>> e7733da{/ynzn,null,UNAVAILABLE}
>>    [junit4]   2> 954227 INFO  (TEST-ForceLeaderTest.testLast
>> PublishedStateIsActive-seed#[5238F5C5BF63D7C5]) [    ]
>> o.a.s.c.ChaosMonkey monkey: stop shard! 46280
>>    [junit4]   2> 954228 INFO  (TEST-ForceLeaderTest.testLast
>> PublishedStateIsActive-seed#[5238F5C5BF63D7C5]) [    ]
>> o.a.s.c.ZkTestServer connecting to 127.0.0.1:35857 35857
>>    [junit4]   2> 954247 INFO  (Thread-1945) [    ] o.a.s.c.ZkTestServer
>> connecting to 127.0.0.1:35857 35857
>>    [junit4]   2> 954248 WARN  (Thread-1945) [    ] o.a.s.c.ZkTestServer
>> Watch limit violations:
>>    [junit4]   2> Maximum concurrent create/delete watches above limit:
>>    [junit4]   2>
>>    [junit4]   2>        5       /solr/aliases.json
>>    [junit4]   2>        5       /solr/clusterprops.json
>>    [junit4]   2>        4       /solr/security.json
>>    [junit4]   2>        4       /solr/configs/conf1
>>    [junit4]   2>
>>    [junit4]   2> Maximum concurrent data watches above limit:
>>    [junit4]   2>
>>    [junit4]   2>        5       /solr/clusterstate.json
>>    [junit4]   2>        3       /solr/collections/
>> forceleader_last_published/state.json
>>    [junit4]   2>        3       /solr/collections/collection1/state.json
>>    [junit4]   2>
>>    [junit4]   2> Maximum concurrent children watches above limit:
>>    [junit4]   2>
>>    [junit4]   2>        65      /solr/overseer/collection-queue-work
>>    [junit4]   2>        28      /solr/overseer/queue
>>    [junit4]   2>        13      /solr/overseer/queue-work
>>    [junit4]   2>        5       /solr/live_nodes
>>    [junit4]   2>        5       /solr/collections
>>    [junit4]   2>
>>    [junit4]   2> 954248 WARN  (TEST-ForceLeaderTest.testLast
>> PublishedStateIsActive-seed#[5238F5C5BF63D7C5]) [    ]
>> o.a.s.c.SocketProxy Closing 0 connections to: http://127.0.0.1:46280/ynzn,
>> target: http://127.0.0.1:34193/ynzn
>>    [junit4]   2> 954248 WARN  (TEST-ForceLeaderTest.testLast
>> PublishedStateIsActive-seed#[5238F5C5BF63D7C5]) [    ]
>> o.a.s.c.SocketProxy Closing 6 connections to: http://127.0.0.1:38837/ynzn,
>> target: http://127.0.0.1:37204/ynzn
>>    [junit4]   2> 954248 WARN  (TEST-ForceLeaderTest.testLast
>> PublishedStateIsActive-seed#[5238F5C5BF63D7C5]) [    ]
>> o.a.s.c.SocketProxy Closing 11 connections to:
>> http://127.0.0.1:46154/ynzn, target: http://127.0.0.1:43927/ynzn
>>    [junit4]   2> 954248 WARN  (TEST-ForceLeaderTest.testLast
>> PublishedStateIsActive-seed#[5238F5C5BF63D7C5]) [    ]
>> o.a.s.c.SocketProxy Closing 5 connections to: http://127.0.0.1:45407/ynzn,
>> target: http://127.0.0.1:35716/ynzn
>>    [junit4]   2> 954249 INFO  (SUITE-ForceLeaderTest-seed#[5238F5C5BF63D7C5]-worker)
>> [    ] o.a.s.SolrTestCaseJ4 ###deleteCore
>>    [junit4]   2> NOTE: leaving temporary files on disk at:
>> /home/jenkins/workspace/Lucene-Solr-6.x-Linux/solr/build/
>> solr-core/test/J0/temp/solr.cloud.ForceLeaderTest_5238F5C5BF63D7C5-001
>>    [junit4]   2> Aug 07, 2016 12:05:40 PM com.carrotsearch.randomizedtesting.ThreadLeakControl
>> checkThreadLeaks
>>    [junit4]   2> WARNING: Will linger awaiting termination of 2 leaked
>> thread(s).
>>    [junit4]   2> NOTE: test params are: codec=Asserting(Lucene62):
>> {range_facet_l_dv=PostingsFormat(name=LuceneFixedGap),
>> _version_=PostingsFormat(name=MockRandom), multiDefault=PostingsFormat(name=Memory
>> doPackFST= false), a_t=PostingsFormat(name=MockRandom),
>> intDefault=PostingsFormat(name=MockRandom),
>> id=PostingsFormat(name=LuceneFixedGap), range_facet_i_dv=PostingsFormat(name=MockRandom),
>> text=BlockTreeOrds(blocksize=128), range_facet_l=PostingsFormat(name=MockRandom),
>> timestamp=PostingsFormat(name=MockRandom)},
>> docValues:{range_facet_l_dv=DocValuesFormat(name=Memory),
>> range_facet_i_dv=DocValuesFormat(name=Direct),
>> timestamp=DocValuesFormat(name=Direct)}, maxPointsInLeafNode=180,
>> maxMBSortInHeap=6.775933836919576, sim=ClassicSimilarity, locale=de,
>> timezone=Europe/Berlin
>>    [junit4]   2> NOTE: Linux 4.4.0-31-generic amd64/Oracle Corporation
>> 1.8.0_102 (64-bit)/cpus=12,threads=1,free=262186008,total=536870912
>>    [junit4]   2> NOTE: All tests run in this JVM: [SimpleMLTQParserTest,
>> ActionThrottleTest, TestReloadDeadlock, TestFieldCacheVsDocValues,
>> TestFieldCacheSanityChecker, TestRTGBase, CdcrVersionReplicationTest,
>> TestRTimerTree, TestLockTree, PathHierarchyTokenizerFactoryTest,
>> SystemInfoHandlerTest, TestLuceneMatchVersion, TestFoldingMultitermQuery,
>> OverseerStatusTest, TestReloadAndDeleteDocs, CopyFieldTest,
>> CursorPagingTest, JSONWriterTest, TestRangeQuery, RollingRestartTest,
>> JsonLoaderTest, DistributedQueryElevationComponentTest,
>> TestMaxScoreQueryParser, BasicDistributedZkTest,
>> CurrencyFieldOpenExchangeTest, TestIBSimilarityFactory,
>> FileBasedSpellCheckerTest, BlockJoinFacetSimpleTest,
>> TestOverriddenPrefixQueryForCustomFieldType, BadCopyFieldTest,
>> ResourceLoaderTest, TestXmlQParser, TlogReplayBufferedWhileIndexingTest,
>> HdfsChaosMonkeySafeLeaderTest, QueryEqualityTest, DateFieldTest,
>> AtomicUpdatesTest, SpatialRPTFieldTypeTest, TestNumericTerms32,
>> PeerSyncTest, DeleteLastCustomShardedReplicaTest,
>> CoreMergeIndexesAdminHandlerTest, TestComponentsName, TestCSVLoader,
>> SolrRequestParserTest, TestUniqueKeyFieldResource, CoreSorterTest,
>> ResponseHeaderTest, LeaderInitiatedRecoveryOnCommitTest, TestCustomSort,
>> DateRangeFieldTest, TestStandardQParsers, TestBlendedInfixSuggestions,
>> TestStressLiveNodes, SegmentsInfoRequestHandlerTest, TestSchemaResource,
>> UUIDFieldTest, TestSmileRequest, TestPhraseSuggestions, AddBlockUpdateTest,
>> SolrXmlInZkTest, CreateCollectionCleanupTest, CloudExitableDirectoryReaderTest,
>> TestConfigSets, URLClassifyProcessorTest, TestTrackingShardHandlerFactory,
>> TestLRUCache, TestDistributedSearch, TestCollectionAPI,
>> RAMDirectoryFactoryTest, SpatialHeatmapFacetsTest,
>> TestAtomicUpdateErrorCases, BufferStoreTest, AsyncCallRequestStatusResponseTest,
>> TestConfigOverlay, TestFastOutputStream, TestRawTransformer,
>> TestSolrConfigHandlerConcurrent, RequestLoggingTest,
>> TestReplicationHandler, TestSubQueryTransformerDistrib, SOLR749Test,
>> HdfsRecoverLeaseTest, TestDistributedStatsComponentCardinality,
>> DistributedFacetPivotLargeTest, TestHighFrequencyDictionaryFactory,
>> TestRestoreCore, DisMaxRequestHandlerTest, TestStressLucene, PrimUtilsTest,
>> TestFaceting, ForceLeaderTest]
>>    [junit4] Completed [311/626 (1!)] on J0 in 101.11s, 3 tests, 1 error,
>> 1 skipped <<< FAILURES!
>>
>> [...truncated 61138 lines...]
>>
>>
>>
>> ---------------------------------------------------------------------
>> To unsubscribe, e-mail: dev-unsubscribe@lucene.apache.org
>> For additional commands, e-mail: dev-help@lucene.apache.org
>>
>
>

Mime
View raw message