lucene-dev mailing list archives

Site index · List index
Message view « Date » · « Thread »
Top « Date » · « Thread »
From Policeman Jenkins Server <jenk...@thetaphi.de>
Subject [JENKINS] Lucene-Solr-master-Solaris (64bit/jdk1.8.0) - Build # 818 - Still Unstable!
Date Tue, 30 Aug 2016 12:59:34 GMT
Build: http://jenkins.thetaphi.de/job/Lucene-Solr-master-Solaris/818/
Java: 64bit/jdk1.8.0 -XX:-UseCompressedOops -XX:+UseG1GC

4 tests failed.
FAILED:  junit.framework.TestSuite.org.apache.solr.client.solrj.embedded.LargeVolumeEmbeddedTest

Error Message:
ObjectTracker found 1 object(s) that were not released!!! [TransactionLog]

Stack Trace:
java.lang.AssertionError: ObjectTracker found 1 object(s) that were not released!!! [TransactionLog]
	at __randomizedtesting.SeedInfo.seed([CCB29B6C0452746]:0)
	at org.junit.Assert.fail(Assert.java:93)
	at org.junit.Assert.assertTrue(Assert.java:43)
	at org.junit.Assert.assertNull(Assert.java:551)
	at org.apache.solr.SolrTestCaseJ4.teardownTestCases(SolrTestCaseJ4.java:257)
	at sun.reflect.NativeMethodAccessorImpl.invoke0(Native Method)
	at sun.reflect.NativeMethodAccessorImpl.invoke(NativeMethodAccessorImpl.java:62)
	at sun.reflect.DelegatingMethodAccessorImpl.invoke(DelegatingMethodAccessorImpl.java:43)
	at java.lang.reflect.Method.invoke(Method.java:498)
	at com.carrotsearch.randomizedtesting.RandomizedRunner.invoke(RandomizedRunner.java:1764)
	at com.carrotsearch.randomizedtesting.RandomizedRunner$7.evaluate(RandomizedRunner.java:834)
	at com.carrotsearch.randomizedtesting.rules.StatementAdapter.evaluate(StatementAdapter.java:36)
	at com.carrotsearch.randomizedtesting.rules.SystemPropertiesRestoreRule$1.evaluate(SystemPropertiesRestoreRule.java:57)
	at org.apache.lucene.util.AbstractBeforeAfterRule$1.evaluate(AbstractBeforeAfterRule.java:45)
	at com.carrotsearch.randomizedtesting.rules.StatementAdapter.evaluate(StatementAdapter.java:36)
	at org.apache.lucene.util.TestRuleStoreClassName$1.evaluate(TestRuleStoreClassName.java:41)
	at com.carrotsearch.randomizedtesting.rules.NoShadowingOrOverridesOnMethodsRule$1.evaluate(NoShadowingOrOverridesOnMethodsRule.java:40)
	at com.carrotsearch.randomizedtesting.rules.NoShadowingOrOverridesOnMethodsRule$1.evaluate(NoShadowingOrOverridesOnMethodsRule.java:40)
	at com.carrotsearch.randomizedtesting.rules.StatementAdapter.evaluate(StatementAdapter.java:36)
	at com.carrotsearch.randomizedtesting.rules.StatementAdapter.evaluate(StatementAdapter.java:36)
	at com.carrotsearch.randomizedtesting.rules.StatementAdapter.evaluate(StatementAdapter.java:36)
	at org.apache.lucene.util.TestRuleAssertionsRequired$1.evaluate(TestRuleAssertionsRequired.java:53)
	at org.apache.lucene.util.TestRuleMarkFailure$1.evaluate(TestRuleMarkFailure.java:47)
	at org.apache.lucene.util.TestRuleIgnoreAfterMaxFailures$1.evaluate(TestRuleIgnoreAfterMaxFailures.java:64)
	at org.apache.lucene.util.TestRuleIgnoreTestSuites$1.evaluate(TestRuleIgnoreTestSuites.java:54)
	at com.carrotsearch.randomizedtesting.rules.StatementAdapter.evaluate(StatementAdapter.java:36)
	at com.carrotsearch.randomizedtesting.ThreadLeakControl$StatementRunner.run(ThreadLeakControl.java:367)
	at java.lang.Thread.run(Thread.java:745)


FAILED:  org.apache.solr.common.cloud.TestCollectionStateWatchers.testCanWaitForNonexistantCollection

Error Message:
waitForState was not triggered by collection creation

Stack Trace:
java.lang.AssertionError: waitForState was not triggered by collection creation
	at __randomizedtesting.SeedInfo.seed([CCB29B6C0452746:A7EBB200AD1BE36D]:0)
	at org.junit.Assert.fail(Assert.java:93)
	at org.junit.Assert.assertTrue(Assert.java:43)
	at org.apache.solr.common.cloud.TestCollectionStateWatchers.testCanWaitForNonexistantCollection(TestCollectionStateWatchers.java:207)
	at sun.reflect.NativeMethodAccessorImpl.invoke0(Native Method)
	at sun.reflect.NativeMethodAccessorImpl.invoke(NativeMethodAccessorImpl.java:62)
	at sun.reflect.DelegatingMethodAccessorImpl.invoke(DelegatingMethodAccessorImpl.java:43)
	at java.lang.reflect.Method.invoke(Method.java:498)
	at com.carrotsearch.randomizedtesting.RandomizedRunner.invoke(RandomizedRunner.java:1764)
	at com.carrotsearch.randomizedtesting.RandomizedRunner$8.evaluate(RandomizedRunner.java:871)
	at com.carrotsearch.randomizedtesting.RandomizedRunner$9.evaluate(RandomizedRunner.java:907)
	at com.carrotsearch.randomizedtesting.RandomizedRunner$10.evaluate(RandomizedRunner.java:921)
	at com.carrotsearch.randomizedtesting.rules.SystemPropertiesRestoreRule$1.evaluate(SystemPropertiesRestoreRule.java:57)
	at org.apache.lucene.util.TestRuleSetupTeardownChained$1.evaluate(TestRuleSetupTeardownChained.java:49)
	at org.apache.lucene.util.AbstractBeforeAfterRule$1.evaluate(AbstractBeforeAfterRule.java:45)
	at org.apache.lucene.util.TestRuleThreadAndTestName$1.evaluate(TestRuleThreadAndTestName.java:48)
	at org.apache.lucene.util.TestRuleIgnoreAfterMaxFailures$1.evaluate(TestRuleIgnoreAfterMaxFailures.java:64)
	at org.apache.lucene.util.TestRuleMarkFailure$1.evaluate(TestRuleMarkFailure.java:47)
	at com.carrotsearch.randomizedtesting.rules.StatementAdapter.evaluate(StatementAdapter.java:36)
	at com.carrotsearch.randomizedtesting.ThreadLeakControl$StatementRunner.run(ThreadLeakControl.java:367)
	at com.carrotsearch.randomizedtesting.ThreadLeakControl.forkTimeoutingTask(ThreadLeakControl.java:809)
	at com.carrotsearch.randomizedtesting.ThreadLeakControl$3.evaluate(ThreadLeakControl.java:460)
	at com.carrotsearch.randomizedtesting.RandomizedRunner.runSingleTest(RandomizedRunner.java:880)
	at com.carrotsearch.randomizedtesting.RandomizedRunner$5.evaluate(RandomizedRunner.java:781)
	at com.carrotsearch.randomizedtesting.RandomizedRunner$6.evaluate(RandomizedRunner.java:816)
	at com.carrotsearch.randomizedtesting.RandomizedRunner$7.evaluate(RandomizedRunner.java:827)
	at com.carrotsearch.randomizedtesting.rules.StatementAdapter.evaluate(StatementAdapter.java:36)
	at com.carrotsearch.randomizedtesting.rules.SystemPropertiesRestoreRule$1.evaluate(SystemPropertiesRestoreRule.java:57)
	at org.apache.lucene.util.AbstractBeforeAfterRule$1.evaluate(AbstractBeforeAfterRule.java:45)
	at com.carrotsearch.randomizedtesting.rules.StatementAdapter.evaluate(StatementAdapter.java:36)
	at org.apache.lucene.util.TestRuleStoreClassName$1.evaluate(TestRuleStoreClassName.java:41)
	at com.carrotsearch.randomizedtesting.rules.NoShadowingOrOverridesOnMethodsRule$1.evaluate(NoShadowingOrOverridesOnMethodsRule.java:40)
	at com.carrotsearch.randomizedtesting.rules.NoShadowingOrOverridesOnMethodsRule$1.evaluate(NoShadowingOrOverridesOnMethodsRule.java:40)
	at com.carrotsearch.randomizedtesting.rules.StatementAdapter.evaluate(StatementAdapter.java:36)
	at com.carrotsearch.randomizedtesting.rules.StatementAdapter.evaluate(StatementAdapter.java:36)
	at com.carrotsearch.randomizedtesting.rules.StatementAdapter.evaluate(StatementAdapter.java:36)
	at org.apache.lucene.util.TestRuleAssertionsRequired$1.evaluate(TestRuleAssertionsRequired.java:53)
	at org.apache.lucene.util.TestRuleMarkFailure$1.evaluate(TestRuleMarkFailure.java:47)
	at org.apache.lucene.util.TestRuleIgnoreAfterMaxFailures$1.evaluate(TestRuleIgnoreAfterMaxFailures.java:64)
	at org.apache.lucene.util.TestRuleIgnoreTestSuites$1.evaluate(TestRuleIgnoreTestSuites.java:54)
	at com.carrotsearch.randomizedtesting.rules.StatementAdapter.evaluate(StatementAdapter.java:36)
	at com.carrotsearch.randomizedtesting.ThreadLeakControl$StatementRunner.run(ThreadLeakControl.java:367)
	at java.lang.Thread.run(Thread.java:745)


FAILED:  org.apache.solr.cloud.CollectionTooManyReplicasTest.testDownedShards

Error Message:
IOException occured when talking to server at: http://127.0.0.1:55588

Stack Trace:
org.apache.solr.client.solrj.SolrServerException: IOException occured when talking to server at: http://127.0.0.1:55588
	at __randomizedtesting.SeedInfo.seed([9FC6A8FB1F9044DD:FDEE00AE946B0999]:0)
	at org.apache.solr.client.solrj.impl.HttpSolrClient.executeMethod(HttpSolrClient.java:622)
	at org.apache.solr.client.solrj.impl.HttpSolrClient.request(HttpSolrClient.java:261)
	at org.apache.solr.client.solrj.impl.HttpSolrClient.request(HttpSolrClient.java:250)
	at org.apache.solr.client.solrj.impl.LBHttpSolrClient.doRequest(LBHttpSolrClient.java:415)
	at org.apache.solr.client.solrj.impl.LBHttpSolrClient.request(LBHttpSolrClient.java:367)
	at org.apache.solr.client.solrj.impl.CloudSolrClient.sendRequest(CloudSolrClient.java:1280)
	at org.apache.solr.client.solrj.impl.CloudSolrClient.requestWithRetryOnStaleState(CloudSolrClient.java:1050)
	at org.apache.solr.client.solrj.impl.CloudSolrClient.request(CloudSolrClient.java:992)
	at org.apache.solr.client.solrj.SolrRequest.process(SolrRequest.java:149)
	at org.apache.solr.client.solrj.SolrRequest.process(SolrRequest.java:166)
	at org.apache.solr.cloud.CollectionTooManyReplicasTest.testDownedShards(CollectionTooManyReplicasTest.java:253)
	at sun.reflect.NativeMethodAccessorImpl.invoke0(Native Method)
	at sun.reflect.NativeMethodAccessorImpl.invoke(NativeMethodAccessorImpl.java:62)
	at sun.reflect.DelegatingMethodAccessorImpl.invoke(DelegatingMethodAccessorImpl.java:43)
	at java.lang.reflect.Method.invoke(Method.java:498)
	at com.carrotsearch.randomizedtesting.RandomizedRunner.invoke(RandomizedRunner.java:1764)
	at com.carrotsearch.randomizedtesting.RandomizedRunner$8.evaluate(RandomizedRunner.java:871)
	at com.carrotsearch.randomizedtesting.RandomizedRunner$9.evaluate(RandomizedRunner.java:907)
	at com.carrotsearch.randomizedtesting.RandomizedRunner$10.evaluate(RandomizedRunner.java:921)
	at org.apache.solr.BaseDistributedSearchTestCase$ShardsRepeatRule$ShardsFixedStatement.callStatement(BaseDistributedSearchTestCase.java:985)
	at org.apache.solr.BaseDistributedSearchTestCase$ShardsRepeatRule$ShardsStatement.evaluate(BaseDistributedSearchTestCase.java:960)
	at com.carrotsearch.randomizedtesting.rules.SystemPropertiesRestoreRule$1.evaluate(SystemPropertiesRestoreRule.java:57)
	at org.apache.lucene.util.TestRuleSetupTeardownChained$1.evaluate(TestRuleSetupTeardownChained.java:49)
	at org.apache.lucene.util.AbstractBeforeAfterRule$1.evaluate(AbstractBeforeAfterRule.java:45)
	at org.apache.lucene.util.TestRuleThreadAndTestName$1.evaluate(TestRuleThreadAndTestName.java:48)
	at org.apache.lucene.util.TestRuleIgnoreAfterMaxFailures$1.evaluate(TestRuleIgnoreAfterMaxFailures.java:64)
	at org.apache.lucene.util.TestRuleMarkFailure$1.evaluate(TestRuleMarkFailure.java:47)
	at com.carrotsearch.randomizedtesting.rules.StatementAdapter.evaluate(StatementAdapter.java:36)
	at com.carrotsearch.randomizedtesting.ThreadLeakControl$StatementRunner.run(ThreadLeakControl.java:367)
	at com.carrotsearch.randomizedtesting.ThreadLeakControl.forkTimeoutingTask(ThreadLeakControl.java:809)
	at com.carrotsearch.randomizedtesting.ThreadLeakControl$3.evaluate(ThreadLeakControl.java:460)
	at com.carrotsearch.randomizedtesting.RandomizedRunner.runSingleTest(RandomizedRunner.java:880)
	at com.carrotsearch.randomizedtesting.RandomizedRunner$5.evaluate(RandomizedRunner.java:781)
	at com.carrotsearch.randomizedtesting.RandomizedRunner$6.evaluate(RandomizedRunner.java:816)
	at com.carrotsearch.randomizedtesting.RandomizedRunner$7.evaluate(RandomizedRunner.java:827)
	at com.carrotsearch.randomizedtesting.rules.StatementAdapter.evaluate(StatementAdapter.java:36)
	at com.carrotsearch.randomizedtesting.rules.SystemPropertiesRestoreRule$1.evaluate(SystemPropertiesRestoreRule.java:57)
	at org.apache.lucene.util.AbstractBeforeAfterRule$1.evaluate(AbstractBeforeAfterRule.java:45)
	at com.carrotsearch.randomizedtesting.rules.StatementAdapter.evaluate(StatementAdapter.java:36)
	at org.apache.lucene.util.TestRuleStoreClassName$1.evaluate(TestRuleStoreClassName.java:41)
	at com.carrotsearch.randomizedtesting.rules.NoShadowingOrOverridesOnMethodsRule$1.evaluate(NoShadowingOrOverridesOnMethodsRule.java:40)
	at com.carrotsearch.randomizedtesting.rules.NoShadowingOrOverridesOnMethodsRule$1.evaluate(NoShadowingOrOverridesOnMethodsRule.java:40)
	at com.carrotsearch.randomizedtesting.rules.StatementAdapter.evaluate(StatementAdapter.java:36)
	at com.carrotsearch.randomizedtesting.rules.StatementAdapter.evaluate(StatementAdapter.java:36)
	at com.carrotsearch.randomizedtesting.rules.StatementAdapter.evaluate(StatementAdapter.java:36)
	at org.apache.lucene.util.TestRuleAssertionsRequired$1.evaluate(TestRuleAssertionsRequired.java:53)
	at org.apache.lucene.util.TestRuleMarkFailure$1.evaluate(TestRuleMarkFailure.java:47)
	at org.apache.lucene.util.TestRuleIgnoreAfterMaxFailures$1.evaluate(TestRuleIgnoreAfterMaxFailures.java:64)
	at org.apache.lucene.util.TestRuleIgnoreTestSuites$1.evaluate(TestRuleIgnoreTestSuites.java:54)
	at com.carrotsearch.randomizedtesting.rules.StatementAdapter.evaluate(StatementAdapter.java:36)
	at com.carrotsearch.randomizedtesting.ThreadLeakControl$StatementRunner.run(ThreadLeakControl.java:367)
	at java.lang.Thread.run(Thread.java:745)
Caused by: java.net.SocketException: Connection reset
	at java.net.SocketInputStream.read(SocketInputStream.java:209)
	at java.net.SocketInputStream.read(SocketInputStream.java:141)
	at org.apache.http.impl.io.SessionInputBufferImpl.streamRead(SessionInputBufferImpl.java:139)
	at org.apache.http.impl.io.SessionInputBufferImpl.fillBuffer(SessionInputBufferImpl.java:155)
	at org.apache.http.impl.io.SessionInputBufferImpl.readLine(SessionInputBufferImpl.java:284)
	at org.apache.http.impl.conn.DefaultHttpResponseParser.parseHead(DefaultHttpResponseParser.java:140)
	at org.apache.http.impl.conn.DefaultHttpResponseParser.parseHead(DefaultHttpResponseParser.java:57)
	at org.apache.http.impl.io.AbstractMessageParser.parse(AbstractMessageParser.java:261)
	at org.apache.http.impl.DefaultBHttpClientConnection.receiveResponseHeader(DefaultBHttpClientConnection.java:165)
	at org.apache.http.impl.conn.CPoolProxy.receiveResponseHeader(CPoolProxy.java:167)
	at org.apache.http.protocol.HttpRequestExecutor.doReceiveResponse(HttpRequestExecutor.java:272)
	at org.apache.http.protocol.HttpRequestExecutor.execute(HttpRequestExecutor.java:124)
	at org.apache.http.impl.execchain.MainClientExec.execute(MainClientExec.java:271)
	at org.apache.http.impl.execchain.ProtocolExec.execute(ProtocolExec.java:184)
	at org.apache.http.impl.execchain.RetryExec.execute(RetryExec.java:88)
	at org.apache.http.impl.execchain.RedirectExec.execute(RedirectExec.java:110)
	at org.apache.http.impl.client.InternalHttpClient.doExecute(InternalHttpClient.java:184)
	at org.apache.http.impl.client.CloseableHttpClient.execute(CloseableHttpClient.java:82)
	at org.apache.http.impl.client.CloseableHttpClient.execute(CloseableHttpClient.java:55)
	at org.apache.solr.client.solrj.impl.HttpSolrClient.executeMethod(HttpSolrClient.java:513)
	... 51 more


FAILED:  org.apache.solr.security.BasicAuthIntegrationTest.testBasics

Error Message:
IOException occured when talking to server at: http://127.0.0.1:34719/solr/testSolrCloudCollection_shard1_replica1

Stack Trace:
org.apache.solr.client.solrj.impl.CloudSolrClient$RouteException: IOException occured when talking to server at: http://127.0.0.1:34719/solr/testSolrCloudCollection_shard1_replica1
	at __randomizedtesting.SeedInfo.seed([9FC6A8FB1F9044DD:A21E06D7277E1AAD]:0)
	at org.apache.solr.client.solrj.impl.CloudSolrClient.directUpdate(CloudSolrClient.java:755)
	at org.apache.solr.client.solrj.impl.CloudSolrClient.sendRequest(CloudSolrClient.java:1161)
	at org.apache.solr.client.solrj.impl.CloudSolrClient.requestWithRetryOnStaleState(CloudSolrClient.java:1050)
	at org.apache.solr.client.solrj.impl.CloudSolrClient.request(CloudSolrClient.java:992)
	at org.apache.solr.client.solrj.SolrClient.request(SolrClient.java:1219)
	at org.apache.solr.security.BasicAuthIntegrationTest.doExtraTests(BasicAuthIntegrationTest.java:193)
	at org.apache.solr.cloud.TestMiniSolrCloudClusterBase.testCollectionCreateSearchDelete(TestMiniSolrCloudClusterBase.java:196)
	at org.apache.solr.cloud.TestMiniSolrCloudClusterBase.testBasics(TestMiniSolrCloudClusterBase.java:79)
	at sun.reflect.NativeMethodAccessorImpl.invoke0(Native Method)
	at sun.reflect.NativeMethodAccessorImpl.invoke(NativeMethodAccessorImpl.java:62)
	at sun.reflect.DelegatingMethodAccessorImpl.invoke(DelegatingMethodAccessorImpl.java:43)
	at java.lang.reflect.Method.invoke(Method.java:498)
	at com.carrotsearch.randomizedtesting.RandomizedRunner.invoke(RandomizedRunner.java:1764)
	at com.carrotsearch.randomizedtesting.RandomizedRunner$8.evaluate(RandomizedRunner.java:871)
	at com.carrotsearch.randomizedtesting.RandomizedRunner$9.evaluate(RandomizedRunner.java:907)
	at com.carrotsearch.randomizedtesting.RandomizedRunner$10.evaluate(RandomizedRunner.java:921)
	at com.carrotsearch.randomizedtesting.rules.SystemPropertiesRestoreRule$1.evaluate(SystemPropertiesRestoreRule.java:57)
	at org.apache.lucene.util.TestRuleSetupTeardownChained$1.evaluate(TestRuleSetupTeardownChained.java:49)
	at org.apache.lucene.util.AbstractBeforeAfterRule$1.evaluate(AbstractBeforeAfterRule.java:45)
	at org.apache.lucene.util.TestRuleThreadAndTestName$1.evaluate(TestRuleThreadAndTestName.java:48)
	at org.apache.lucene.util.TestRuleIgnoreAfterMaxFailures$1.evaluate(TestRuleIgnoreAfterMaxFailures.java:64)
	at org.apache.lucene.util.TestRuleMarkFailure$1.evaluate(TestRuleMarkFailure.java:47)
	at com.carrotsearch.randomizedtesting.rules.StatementAdapter.evaluate(StatementAdapter.java:36)
	at com.carrotsearch.randomizedtesting.ThreadLeakControl$StatementRunner.run(ThreadLeakControl.java:367)
	at com.carrotsearch.randomizedtesting.ThreadLeakControl.forkTimeoutingTask(ThreadLeakControl.java:809)
	at com.carrotsearch.randomizedtesting.ThreadLeakControl$3.evaluate(ThreadLeakControl.java:460)
	at com.carrotsearch.randomizedtesting.RandomizedRunner.runSingleTest(RandomizedRunner.java:880)
	at com.carrotsearch.randomizedtesting.RandomizedRunner$5.evaluate(RandomizedRunner.java:781)
	at com.carrotsearch.randomizedtesting.RandomizedRunner$6.evaluate(RandomizedRunner.java:816)
	at com.carrotsearch.randomizedtesting.RandomizedRunner$7.evaluate(RandomizedRunner.java:827)
	at com.carrotsearch.randomizedtesting.rules.StatementAdapter.evaluate(StatementAdapter.java:36)
	at com.carrotsearch.randomizedtesting.rules.SystemPropertiesRestoreRule$1.evaluate(SystemPropertiesRestoreRule.java:57)
	at org.apache.lucene.util.AbstractBeforeAfterRule$1.evaluate(AbstractBeforeAfterRule.java:45)
	at com.carrotsearch.randomizedtesting.rules.StatementAdapter.evaluate(StatementAdapter.java:36)
	at org.apache.lucene.util.TestRuleStoreClassName$1.evaluate(TestRuleStoreClassName.java:41)
	at com.carrotsearch.randomizedtesting.rules.NoShadowingOrOverridesOnMethodsRule$1.evaluate(NoShadowingOrOverridesOnMethodsRule.java:40)
	at com.carrotsearch.randomizedtesting.rules.NoShadowingOrOverridesOnMethodsRule$1.evaluate(NoShadowingOrOverridesOnMethodsRule.java:40)
	at com.carrotsearch.randomizedtesting.rules.StatementAdapter.evaluate(StatementAdapter.java:36)
	at com.carrotsearch.randomizedtesting.rules.StatementAdapter.evaluate(StatementAdapter.java:36)
	at com.carrotsearch.randomizedtesting.rules.StatementAdapter.evaluate(StatementAdapter.java:36)
	at org.apache.lucene.util.TestRuleAssertionsRequired$1.evaluate(TestRuleAssertionsRequired.java:53)
	at org.apache.lucene.util.TestRuleMarkFailure$1.evaluate(TestRuleMarkFailure.java:47)
	at org.apache.lucene.util.TestRuleIgnoreAfterMaxFailures$1.evaluate(TestRuleIgnoreAfterMaxFailures.java:64)
	at org.apache.lucene.util.TestRuleIgnoreTestSuites$1.evaluate(TestRuleIgnoreTestSuites.java:54)
	at com.carrotsearch.randomizedtesting.rules.StatementAdapter.evaluate(StatementAdapter.java:36)
	at com.carrotsearch.randomizedtesting.ThreadLeakControl$StatementRunner.run(ThreadLeakControl.java:367)
	at java.lang.Thread.run(Thread.java:745)
Caused by: org.apache.solr.client.solrj.SolrServerException: IOException occured when talking to server at: http://127.0.0.1:34719/solr/testSolrCloudCollection_shard1_replica1
	at org.apache.solr.client.solrj.impl.HttpSolrClient.executeMethod(HttpSolrClient.java:622)
	at org.apache.solr.client.solrj.impl.HttpSolrClient.request(HttpSolrClient.java:261)
	at org.apache.solr.client.solrj.impl.HttpSolrClient.request(HttpSolrClient.java:250)
	at org.apache.solr.client.solrj.impl.LBHttpSolrClient.doRequest(LBHttpSolrClient.java:415)
	at org.apache.solr.client.solrj.impl.LBHttpSolrClient.request(LBHttpSolrClient.java:367)
	at org.apache.solr.client.solrj.impl.CloudSolrClient.lambda$directUpdate$0(CloudSolrClient.java:730)
	at java.util.concurrent.FutureTask.run(FutureTask.java:266)
	at org.apache.solr.common.util.ExecutorUtil$MDCAwareThreadPoolExecutor.lambda$execute$0(ExecutorUtil.java:229)
	at java.util.concurrent.ThreadPoolExecutor.runWorker(ThreadPoolExecutor.java:1142)
	at java.util.concurrent.ThreadPoolExecutor$Worker.run(ThreadPoolExecutor.java:617)
	... 1 more
Caused by: java.net.SocketException: Connection reset
	at java.net.SocketInputStream.read(SocketInputStream.java:209)
	at java.net.SocketInputStream.read(SocketInputStream.java:141)
	at org.apache.http.impl.io.SessionInputBufferImpl.streamRead(SessionInputBufferImpl.java:139)
	at org.apache.http.impl.io.SessionInputBufferImpl.fillBuffer(SessionInputBufferImpl.java:155)
	at org.apache.http.impl.io.SessionInputBufferImpl.readLine(SessionInputBufferImpl.java:284)
	at org.apache.http.impl.conn.DefaultHttpResponseParser.parseHead(DefaultHttpResponseParser.java:140)
	at org.apache.http.impl.conn.DefaultHttpResponseParser.parseHead(DefaultHttpResponseParser.java:57)
	at org.apache.http.impl.io.AbstractMessageParser.parse(AbstractMessageParser.java:261)
	at org.apache.http.impl.DefaultBHttpClientConnection.receiveResponseHeader(DefaultBHttpClientConnection.java:165)
	at org.apache.http.impl.conn.CPoolProxy.receiveResponseHeader(CPoolProxy.java:167)
	at org.apache.http.protocol.HttpRequestExecutor.doReceiveResponse(HttpRequestExecutor.java:272)
	at org.apache.http.protocol.HttpRequestExecutor.execute(HttpRequestExecutor.java:124)
	at org.apache.http.impl.execchain.MainClientExec.execute(MainClientExec.java:271)
	at org.apache.http.impl.execchain.ProtocolExec.execute(ProtocolExec.java:184)
	at org.apache.http.impl.execchain.RetryExec.execute(RetryExec.java:88)
	at org.apache.http.impl.execchain.RedirectExec.execute(RedirectExec.java:110)
	at org.apache.http.impl.client.InternalHttpClient.doExecute(InternalHttpClient.java:184)
	at org.apache.http.impl.client.CloseableHttpClient.execute(CloseableHttpClient.java:82)
	at org.apache.http.impl.client.CloseableHttpClient.execute(CloseableHttpClient.java:55)
	at org.apache.solr.client.solrj.impl.HttpSolrClient.executeMethod(HttpSolrClient.java:513)
	... 10 more




Build Log:
[...truncated 10855 lines...]
   [junit4] Suite: org.apache.solr.cloud.CollectionTooManyReplicasTest
   [junit4]   2> Creating dataDir: /export/home/jenkins/workspace/Lucene-Solr-master-Solaris/solr/build/solr-core/test/J0/temp/solr.cloud.CollectionTooManyReplicasTest_9FC6A8FB1F9044DD-001/init-core-data-001
   [junit4]   2> 479322 INFO  (SUITE-CollectionTooManyReplicasTest-seed#[9FC6A8FB1F9044DD]-worker) [    ] o.a.s.SolrTestCaseJ4 Randomized ssl (false) and clientAuth (true) via: @org.apache.solr.util.RandomizeSSL(reason=, value=NaN, ssl=NaN, clientAuth=NaN)
   [junit4]   2> 479322 INFO  (SUITE-CollectionTooManyReplicasTest-seed#[9FC6A8FB1F9044DD]-worker) [    ] o.a.s.BaseDistributedSearchTestCase Setting hostContext system property: /
   [junit4]   2> 479324 INFO  (TEST-CollectionTooManyReplicasTest.testDownedShards-seed#[9FC6A8FB1F9044DD]) [    ] o.a.s.c.ZkTestServer STARTING ZK TEST SERVER
   [junit4]   2> 479325 INFO  (Thread-701) [    ] o.a.s.c.ZkTestServer client port:0.0.0.0/0.0.0.0:0
   [junit4]   2> 479325 INFO  (Thread-701) [    ] o.a.s.c.ZkTestServer Starting server
   [junit4]   2> 479428 INFO  (TEST-CollectionTooManyReplicasTest.testDownedShards-seed#[9FC6A8FB1F9044DD]) [    ] o.a.s.c.ZkTestServer start zk server on port:53395
   [junit4]   2> 479428 INFO  (TEST-CollectionTooManyReplicasTest.testDownedShards-seed#[9FC6A8FB1F9044DD]) [    ] o.a.s.c.c.SolrZkClient Using default ZkCredentialsProvider
   [junit4]   2> 479429 INFO  (TEST-CollectionTooManyReplicasTest.testDownedShards-seed#[9FC6A8FB1F9044DD]) [    ] o.a.s.c.c.ConnectionManager Waiting for client to connect to ZooKeeper
   [junit4]   2> 479431 INFO  (zkCallback-719-thread-1) [    ] o.a.s.c.c.ConnectionManager Watcher org.apache.solr.common.cloud.ConnectionManager@4c8040f name:ZooKeeperConnection Watcher:127.0.0.1:53395 got event WatchedEvent state:SyncConnected type:None path:null path:null type:None
   [junit4]   2> 479431 INFO  (TEST-CollectionTooManyReplicasTest.testDownedShards-seed#[9FC6A8FB1F9044DD]) [    ] o.a.s.c.c.ConnectionManager Client is connected to ZooKeeper
   [junit4]   2> 479432 INFO  (TEST-CollectionTooManyReplicasTest.testDownedShards-seed#[9FC6A8FB1F9044DD]) [    ] o.a.s.c.c.SolrZkClient Using default ZkACLProvider
   [junit4]   2> 479432 INFO  (TEST-CollectionTooManyReplicasTest.testDownedShards-seed#[9FC6A8FB1F9044DD]) [    ] o.a.s.c.c.SolrZkClient makePath: /solr
   [junit4]   2> 479434 INFO  (TEST-CollectionTooManyReplicasTest.testDownedShards-seed#[9FC6A8FB1F9044DD]) [    ] o.a.s.c.c.SolrZkClient Using default ZkCredentialsProvider
   [junit4]   2> 479435 INFO  (TEST-CollectionTooManyReplicasTest.testDownedShards-seed#[9FC6A8FB1F9044DD]) [    ] o.a.s.c.c.ConnectionManager Waiting for client to connect to ZooKeeper
   [junit4]   2> 479436 INFO  (zkCallback-720-thread-1) [    ] o.a.s.c.c.ConnectionManager Watcher org.apache.solr.common.cloud.ConnectionManager@524d956c name:ZooKeeperConnection Watcher:127.0.0.1:53395/solr got event WatchedEvent state:SyncConnected type:None path:null path:null type:None
   [junit4]   2> 479436 INFO  (TEST-CollectionTooManyReplicasTest.testDownedShards-seed#[9FC6A8FB1F9044DD]) [    ] o.a.s.c.c.ConnectionManager Client is connected to ZooKeeper
   [junit4]   2> 479436 INFO  (TEST-CollectionTooManyReplicasTest.testDownedShards-seed#[9FC6A8FB1F9044DD]) [    ] o.a.s.c.c.SolrZkClient Using default ZkACLProvider
   [junit4]   2> 479436 INFO  (TEST-CollectionTooManyReplicasTest.testDownedShards-seed#[9FC6A8FB1F9044DD]) [    ] o.a.s.c.c.SolrZkClient makePath: /collections/collection1
   [junit4]   2> 479438 INFO  (TEST-CollectionTooManyReplicasTest.testDownedShards-seed#[9FC6A8FB1F9044DD]) [    ] o.a.s.c.c.SolrZkClient makePath: /collections/collection1/shards
   [junit4]   2> 479440 INFO  (TEST-CollectionTooManyReplicasTest.testDownedShards-seed#[9FC6A8FB1F9044DD]) [    ] o.a.s.c.c.SolrZkClient makePath: /collections/control_collection
   [junit4]   2> 479442 INFO  (TEST-CollectionTooManyReplicasTest.testDownedShards-seed#[9FC6A8FB1F9044DD]) [    ] o.a.s.c.c.SolrZkClient makePath: /collections/control_collection/shards
   [junit4]   2> 479449 INFO  (TEST-CollectionTooManyReplicasTest.testDownedShards-seed#[9FC6A8FB1F9044DD]) [    ] o.a.s.c.AbstractZkTestCase put /export/home/jenkins/workspace/Lucene-Solr-master-Solaris/solr/core/src/test-files/solr/collection1/conf/solrconfig-tlog.xml to /configs/conf1/solrconfig.xml
   [junit4]   2> 479449 INFO  (TEST-CollectionTooManyReplicasTest.testDownedShards-seed#[9FC6A8FB1F9044DD]) [    ] o.a.s.c.c.SolrZkClient makePath: /configs/conf1/solrconfig.xml
   [junit4]   2> 479452 INFO  (TEST-CollectionTooManyReplicasTest.testDownedShards-seed#[9FC6A8FB1F9044DD]) [    ] o.a.s.c.AbstractZkTestCase put /export/home/jenkins/workspace/Lucene-Solr-master-Solaris/solr/core/src/test-files/solr/collection1/conf/schema.xml to /configs/conf1/schema.xml
   [junit4]   2> 479453 INFO  (TEST-CollectionTooManyReplicasTest.testDownedShards-seed#[9FC6A8FB1F9044DD]) [    ] o.a.s.c.c.SolrZkClient makePath: /configs/conf1/schema.xml
   [junit4]   2> 479455 INFO  (TEST-CollectionTooManyReplicasTest.testDownedShards-seed#[9FC6A8FB1F9044DD]) [    ] o.a.s.c.AbstractZkTestCase put /export/home/jenkins/workspace/Lucene-Solr-master-Solaris/solr/core/src/test-files/solr/collection1/conf/solrconfig.snippet.randomindexconfig.xml to /configs/conf1/solrconfig.snippet.randomindexconfig.xml
   [junit4]   2> 479455 INFO  (TEST-CollectionTooManyReplicasTest.testDownedShards-seed#[9FC6A8FB1F9044DD]) [    ] o.a.s.c.c.SolrZkClient makePath: /configs/conf1/solrconfig.snippet.randomindexconfig.xml
   [junit4]   2> 479457 INFO  (TEST-CollectionTooManyReplicasTest.testDownedShards-seed#[9FC6A8FB1F9044DD]) [    ] o.a.s.c.AbstractZkTestCase put /export/home/jenkins/workspace/Lucene-Solr-master-Solaris/solr/core/src/test-files/solr/collection1/conf/stopwords.txt to /configs/conf1/stopwords.txt
   [junit4]   2> 479457 INFO  (TEST-CollectionTooManyReplicasTest.testDownedShards-seed#[9FC6A8FB1F9044DD]) [    ] o.a.s.c.c.SolrZkClient makePath: /configs/conf1/stopwords.txt
   [junit4]   2> 479459 INFO  (TEST-CollectionTooManyReplicasTest.testDownedShards-seed#[9FC6A8FB1F9044DD]) [    ] o.a.s.c.AbstractZkTestCase put /export/home/jenkins/workspace/Lucene-Solr-master-Solaris/solr/core/src/test-files/solr/collection1/conf/protwords.txt to /configs/conf1/protwords.txt
   [junit4]   2> 479460 INFO  (TEST-CollectionTooManyReplicasTest.testDownedShards-seed#[9FC6A8FB1F9044DD]) [    ] o.a.s.c.c.SolrZkClient makePath: /configs/conf1/protwords.txt
   [junit4]   2> 479471 INFO  (TEST-CollectionTooManyReplicasTest.testDownedShards-seed#[9FC6A8FB1F9044DD]) [    ] o.a.s.c.AbstractZkTestCase put /export/home/jenkins/workspace/Lucene-Solr-master-Solaris/solr/core/src/test-files/solr/collection1/conf/currency.xml to /configs/conf1/currency.xml
   [junit4]   2> 479472 INFO  (TEST-CollectionTooManyReplicasTest.testDownedShards-seed#[9FC6A8FB1F9044DD]) [    ] o.a.s.c.c.SolrZkClient makePath: /configs/conf1/currency.xml
   [junit4]   2> 479501 INFO  (TEST-CollectionTooManyReplicasTest.testDownedShards-seed#[9FC6A8FB1F9044DD]) [    ] o.a.s.c.AbstractZkTestCase put /export/home/jenkins/workspace/Lucene-Solr-master-Solaris/solr/core/src/test-files/solr/collection1/conf/enumsConfig.xml to /configs/conf1/enumsConfig.xml
   [junit4]   2> 479501 INFO  (TEST-CollectionTooManyReplicasTest.testDownedShards-seed#[9FC6A8FB1F9044DD]) [    ] o.a.s.c.c.SolrZkClient makePath: /configs/conf1/enumsConfig.xml
   [junit4]   2> 479523 INFO  (TEST-CollectionTooManyReplicasTest.testDownedShards-seed#[9FC6A8FB1F9044DD]) [    ] o.a.s.c.AbstractZkTestCase put /export/home/jenkins/workspace/Lucene-Solr-master-Solaris/solr/core/src/test-files/solr/collection1/conf/open-exchange-rates.json to /configs/conf1/open-exchange-rates.json
   [junit4]   2> 479523 INFO  (TEST-CollectionTooManyReplicasTest.testDownedShards-seed#[9FC6A8FB1F9044DD]) [    ] o.a.s.c.c.SolrZkClient makePath: /configs/conf1/open-exchange-rates.json
   [junit4]   2> 479527 INFO  (TEST-CollectionTooManyReplicasTest.testDownedShards-seed#[9FC6A8FB1F9044DD]) [    ] o.a.s.c.AbstractZkTestCase put /export/home/jenkins/workspace/Lucene-Solr-master-Solaris/solr/core/src/test-files/solr/collection1/conf/mapping-ISOLatin1Accent.txt to /configs/conf1/mapping-ISOLatin1Accent.txt
   [junit4]   2> 479527 INFO  (TEST-CollectionTooManyReplicasTest.testDownedShards-seed#[9FC6A8FB1F9044DD]) [    ] o.a.s.c.c.SolrZkClient makePath: /configs/conf1/mapping-ISOLatin1Accent.txt
   [junit4]   2> 479531 INFO  (TEST-CollectionTooManyReplicasTest.testDownedShards-seed#[9FC6A8FB1F9044DD]) [    ] o.a.s.c.AbstractZkTestCase put /export/home/jenkins/workspace/Lucene-Solr-master-Solaris/solr/core/src/test-files/solr/collection1/conf/old_synonyms.txt to /configs/conf1/old_synonyms.txt
   [junit4]   2> 479531 INFO  (TEST-CollectionTooManyReplicasTest.testDownedShards-seed#[9FC6A8FB1F9044DD]) [    ] o.a.s.c.c.SolrZkClient makePath: /configs/conf1/old_synonyms.txt
   [junit4]   2> 479535 INFO  (TEST-CollectionTooManyReplicasTest.testDownedShards-seed#[9FC6A8FB1F9044DD]) [    ] o.a.s.c.AbstractZkTestCase put /export/home/jenkins/workspace/Lucene-Solr-master-Solaris/solr/core/src/test-files/solr/collection1/conf/synonyms.txt to /configs/conf1/synonyms.txt
   [junit4]   2> 479535 INFO  (TEST-CollectionTooManyReplicasTest.testDownedShards-seed#[9FC6A8FB1F9044DD]) [    ] o.a.s.c.c.SolrZkClient makePath: /configs/conf1/synonyms.txt
   [junit4]   2> 479891 INFO  (TEST-CollectionTooManyReplicasTest.testDownedShards-seed#[9FC6A8FB1F9044DD]) [    ] o.a.s.SolrTestCaseJ4 Writing core.properties file to /export/home/jenkins/workspace/Lucene-Solr-master-Solaris/solr/build/solr-core/test/J0/temp/solr.cloud.CollectionTooManyReplicasTest_9FC6A8FB1F9044DD-001/control-001/cores/collection1
   [junit4]   2> 479893 INFO  (TEST-CollectionTooManyReplicasTest.testDownedShards-seed#[9FC6A8FB1F9044DD]) [    ] o.e.j.s.Server jetty-9.3.8.v20160314
   [junit4]   2> 479894 INFO  (TEST-CollectionTooManyReplicasTest.testDownedShards-seed#[9FC6A8FB1F9044DD]) [    ] o.e.j.s.h.ContextHandler Started o.e.j.s.ServletContextHandler@58d8d219{/,null,AVAILABLE}
   [junit4]   2> 479894 INFO  (TEST-CollectionTooManyReplicasTest.testDownedShards-seed#[9FC6A8FB1F9044DD]) [    ] o.e.j.s.ServerConnector Started ServerConnector@7f789b55{HTTP/1.1,[http/1.1]}{127.0.0.1:65173}
   [junit4]   2> 479894 INFO  (TEST-CollectionTooManyReplicasTest.testDownedShards-seed#[9FC6A8FB1F9044DD]) [    ] o.e.j.s.Server Started @482855ms
   [junit4]   2> 479894 INFO  (TEST-CollectionTooManyReplicasTest.testDownedShards-seed#[9FC6A8FB1F9044DD]) [    ] o.a.s.c.s.e.JettySolrRunner Jetty properties: {solr.data.dir=/export/home/jenkins/workspace/Lucene-Solr-master-Solaris/solr/build/solr-core/test/J0/temp/solr.cloud.CollectionTooManyReplicasTest_9FC6A8FB1F9044DD-001/tempDir-001/control/data, hostContext=/, hostPort=65173, coreRootDirectory=/export/home/jenkins/workspace/Lucene-Solr-master-Solaris/solr/build/solr-core/test/J0/temp/solr.cloud.CollectionTooManyReplicasTest_9FC6A8FB1F9044DD-001/control-001/cores}
   [junit4]   2> 479897 INFO  (TEST-CollectionTooManyReplicasTest.testDownedShards-seed#[9FC6A8FB1F9044DD]) [    ] o.a.s.s.SolrDispatchFilter SolrDispatchFilter.init(): sun.misc.Launcher$AppClassLoader@6d06d69c
   [junit4]   2> 479897 INFO  (TEST-CollectionTooManyReplicasTest.testDownedShards-seed#[9FC6A8FB1F9044DD]) [    ] o.a.s.c.SolrResourceLoader new SolrResourceLoader for directory: '/export/home/jenkins/workspace/Lucene-Solr-master-Solaris/solr/build/solr-core/test/J0/temp/solr.cloud.CollectionTooManyReplicasTest_9FC6A8FB1F9044DD-001/control-001'
   [junit4]   2> 479897 INFO  (TEST-CollectionTooManyReplicasTest.testDownedShards-seed#[9FC6A8FB1F9044DD]) [    ] o.a.s.c.SolrResourceLoader JNDI not configured for solr (NoInitialContextEx)
   [junit4]   2> 479897 INFO  (TEST-CollectionTooManyReplicasTest.testDownedShards-seed#[9FC6A8FB1F9044DD]) [    ] o.a.s.c.SolrResourceLoader solr home defaulted to 'solr/' (could not find system property or JNDI)
   [junit4]   2> 479898 INFO  (TEST-CollectionTooManyReplicasTest.testDownedShards-seed#[9FC6A8FB1F9044DD]) [    ] o.a.s.c.c.SolrZkClient Using default ZkCredentialsProvider
   [junit4]   2> 479898 INFO  (TEST-CollectionTooManyReplicasTest.testDownedShards-seed#[9FC6A8FB1F9044DD]) [    ] o.a.s.c.c.ConnectionManager Waiting for client to connect to ZooKeeper
   [junit4]   2> 479952 INFO  (zkCallback-721-thread-1) [    ] o.a.s.c.c.ConnectionManager Watcher org.apache.solr.common.cloud.ConnectionManager@1a48fc09 name:ZooKeeperConnection Watcher:127.0.0.1:53395/solr got event WatchedEvent state:SyncConnected type:None path:null path:null type:None
   [junit4]   2> 479952 INFO  (TEST-CollectionTooManyReplicasTest.testDownedShards-seed#[9FC6A8FB1F9044DD]) [    ] o.a.s.c.c.ConnectionManager Client is connected to ZooKeeper
   [junit4]   2> 479954 INFO  (TEST-CollectionTooManyReplicasTest.testDownedShards-seed#[9FC6A8FB1F9044DD]) [    ] o.a.s.c.c.SolrZkClient Using default ZkACLProvider
   [junit4]   2> 479990 INFO  (TEST-CollectionTooManyReplicasTest.testDownedShards-seed#[9FC6A8FB1F9044DD]) [    ] o.a.s.s.SolrDispatchFilter Loading solr.xml from SolrHome (not found in ZooKeeper)
   [junit4]   2> 479990 INFO  (TEST-CollectionTooManyReplicasTest.testDownedShards-seed#[9FC6A8FB1F9044DD]) [    ] o.a.s.c.SolrXmlConfig Loading container configuration from /export/home/jenkins/workspace/Lucene-Solr-master-Solaris/solr/build/solr-core/test/J0/temp/solr.cloud.CollectionTooManyReplicasTest_9FC6A8FB1F9044DD-001/control-001/solr.xml
   [junit4]   2> 479997 INFO  (TEST-CollectionTooManyReplicasTest.testDownedShards-seed#[9FC6A8FB1F9044DD]) [    ] o.a.s.c.CorePropertiesLocator Config-defined core root directory: /export/home/jenkins/workspace/Lucene-Solr-master-Solaris/solr/build/solr-core/test/J0/temp/solr.cloud.CollectionTooManyReplicasTest_9FC6A8FB1F9044DD-001/control-001/cores
   [junit4]   2> 479997 INFO  (TEST-CollectionTooManyReplicasTest.testDownedShards-seed#[9FC6A8FB1F9044DD]) [    ] o.a.s.c.CoreContainer New CoreContainer 1352980570
   [junit4]   2> 479997 INFO  (TEST-CollectionTooManyReplicasTest.testDownedShards-seed#[9FC6A8FB1F9044DD]) [    ] o.a.s.c.CoreContainer Loading cores into CoreContainer [instanceDir=/export/home/jenkins/workspace/Lucene-Solr-master-Solaris/solr/build/solr-core/test/J0/temp/solr.cloud.CollectionTooManyReplicasTest_9FC6A8FB1F9044DD-001/control-001]
   [junit4]   2> 479997 WARN  (TEST-CollectionTooManyReplicasTest.testDownedShards-seed#[9FC6A8FB1F9044DD]) [    ] o.a.s.c.CoreContainer Couldn't add files from /export/home/jenkins/workspace/Lucene-Solr-master-Solaris/solr/build/solr-core/test/J0/temp/solr.cloud.CollectionTooManyReplicasTest_9FC6A8FB1F9044DD-001/control-001/lib to classpath: /export/home/jenkins/workspace/Lucene-Solr-master-Solaris/solr/build/solr-core/test/J0/temp/solr.cloud.CollectionTooManyReplicasTest_9FC6A8FB1F9044DD-001/control-001/lib
   [junit4]   2> 479998 INFO  (TEST-CollectionTooManyReplicasTest.testDownedShards-seed#[9FC6A8FB1F9044DD]) [    ] o.a.s.h.c.HttpShardHandlerFactory created with socketTimeout : 90000,urlScheme : ,connTimeout : 15000,maxConnectionsPerHost : 20,maxConnections : 10000,corePoolSize : 0,maximumPoolSize : 2147483647,maxThreadIdleTime : 5,sizeOfQueue : -1,fairnessPolicy : false,
   [junit4]   2> 480000 INFO  (TEST-CollectionTooManyReplicasTest.testDownedShards-seed#[9FC6A8FB1F9044DD]) [    ] o.a.s.u.UpdateShardHandler Created UpdateShardHandler HTTP client with params: socketTimeout=340000&connTimeout=45000&maxConnections=100000&maxConnectionsPerHost=100000
   [junit4]   2> 480000 INFO  (TEST-CollectionTooManyReplicasTest.testDownedShards-seed#[9FC6A8FB1F9044DD]) [    ] o.a.s.l.LogWatcher SLF4J impl is org.slf4j.impl.Log4jLoggerFactory
   [junit4]   2> 480000 INFO  (TEST-CollectionTooManyReplicasTest.testDownedShards-seed#[9FC6A8FB1F9044DD]) [    ] o.a.s.l.LogWatcher Registering Log Listener [Log4j (org.slf4j.impl.Log4jLoggerFactory)]
   [junit4]   2> 480000 INFO  (TEST-CollectionTooManyReplicasTest.testDownedShards-seed#[9FC6A8FB1F9044DD]) [    ] o.a.s.c.ZkContainer Zookeeper client=127.0.0.1:53395/solr
   [junit4]   2> 480000 INFO  (TEST-CollectionTooManyReplicasTest.testDownedShards-seed#[9FC6A8FB1F9044DD]) [    ] o.a.s.c.ZkController zkHost includes chroot
   [junit4]   2> 480000 INFO  (TEST-CollectionTooManyReplicasTest.testDownedShards-seed#[9FC6A8FB1F9044DD]) [    ] o.a.s.c.c.SolrZkClient Using default ZkCredentialsProvider
   [junit4]   2> 480000 INFO  (TEST-CollectionTooManyReplicasTest.testDownedShards-seed#[9FC6A8FB1F9044DD]) [    ] o.a.s.c.c.ConnectionManager Waiting for client to connect to ZooKeeper
   [junit4]   2> 480011 INFO  (zkCallback-724-thread-1) [    ] o.a.s.c.c.ConnectionManager Watcher org.apache.solr.common.cloud.ConnectionManager@5a187aa1 name:ZooKeeperConnection Watcher:127.0.0.1:53395 got event WatchedEvent state:SyncConnected type:None path:null path:null type:None
   [junit4]   2> 480030 INFO  (TEST-CollectionTooManyReplicasTest.testDownedShards-seed#[9FC6A8FB1F9044DD]) [    ] o.a.s.c.c.ConnectionManager Client is connected to ZooKeeper
   [junit4]   2> 480030 INFO  (TEST-CollectionTooManyReplicasTest.testDownedShards-seed#[9FC6A8FB1F9044DD]) [    ] o.a.s.c.c.SolrZkClient Using default ZkACLProvider
   [junit4]   2> 480041 INFO  (TEST-CollectionTooManyReplicasTest.testDownedShards-seed#[9FC6A8FB1F9044DD]) [n:127.0.0.1:65173_    ] o.a.s.c.ZkController Added new OnReconnect listener org.apache.solr.cloud.ZkController$$Lambda$87/1964605784@342e6122
   [junit4]   2> 480101 INFO  (TEST-CollectionTooManyReplicasTest.testDownedShards-seed#[9FC6A8FB1F9044DD]) [n:127.0.0.1:65173_    ] o.a.s.c.c.ConnectionManager Waiting for client to connect to ZooKeeper
   [junit4]   2> 480104 INFO  (zkCallback-725-thread-1-processing-n:127.0.0.1:65173_) [n:127.0.0.1:65173_    ] o.a.s.c.c.ConnectionManager Watcher org.apache.solr.common.cloud.ConnectionManager@1526b8ed name:ZooKeeperConnection Watcher:127.0.0.1:53395/solr got event WatchedEvent state:SyncConnected type:None path:null path:null type:None
   [junit4]   2> 480104 INFO  (TEST-CollectionTooManyReplicasTest.testDownedShards-seed#[9FC6A8FB1F9044DD]) [n:127.0.0.1:65173_    ] o.a.s.c.c.ConnectionManager Client is connected to ZooKeeper
   [junit4]   2> 480105 INFO  (TEST-CollectionTooManyReplicasTest.testDownedShards-seed#[9FC6A8FB1F9044DD]) [n:127.0.0.1:65173_    ] o.a.s.c.c.SolrZkClient makePath: /overseer/queue
   [junit4]   2> 480108 INFO  (TEST-CollectionTooManyReplicasTest.testDownedShards-seed#[9FC6A8FB1F9044DD]) [n:127.0.0.1:65173_    ] o.a.s.c.c.SolrZkClient makePath: /overseer/collection-queue-work
   [junit4]   2> 480130 INFO  (TEST-CollectionTooManyReplicasTest.testDownedShards-seed#[9FC6A8FB1F9044DD]) [n:127.0.0.1:65173_    ] o.a.s.c.c.SolrZkClient makePath: /overseer/collection-map-running
   [junit4]   2> 480137 INFO  (TEST-CollectionTooManyReplicasTest.testDownedShards-seed#[9FC6A8FB1F9044DD]) [n:127.0.0.1:65173_    ] o.a.s.c.c.SolrZkClient makePath: /overseer/collection-map-completed
   [junit4]   2> 480155 INFO  (TEST-CollectionTooManyReplicasTest.testDownedShards-seed#[9FC6A8FB1F9044DD]) [n:127.0.0.1:65173_    ] o.a.s.c.c.SolrZkClient makePath: /overseer/collection-map-failure
   [junit4]   2> 480160 INFO  (TEST-CollectionTooManyReplicasTest.testDownedShards-seed#[9FC6A8FB1F9044DD]) [n:127.0.0.1:65173_    ] o.a.s.c.c.SolrZkClient makePath: /live_nodes
   [junit4]   2> 480167 INFO  (TEST-CollectionTooManyReplicasTest.testDownedShards-seed#[9FC6A8FB1F9044DD]) [n:127.0.0.1:65173_    ] o.a.s.c.c.SolrZkClient makePath: /aliases.json
   [junit4]   2> 480172 INFO  (TEST-CollectionTooManyReplicasTest.testDownedShards-seed#[9FC6A8FB1F9044DD]) [n:127.0.0.1:65173_    ] o.a.s.c.c.SolrZkClient makePath: /clusterstate.json
   [junit4]   2> 480179 INFO  (TEST-CollectionTooManyReplicasTest.testDownedShards-seed#[9FC6A8FB1F9044DD]) [n:127.0.0.1:65173_    ] o.a.s.c.c.SolrZkClient makePath: /security.json
   [junit4]   2> 480182 INFO  (TEST-CollectionTooManyReplicasTest.testDownedShards-seed#[9FC6A8FB1F9044DD]) [n:127.0.0.1:65173_    ] o.a.s.c.c.ZkStateReader Updating cluster state from ZooKeeper... 
   [junit4]   2> 480195 INFO  (TEST-CollectionTooManyReplicasTest.testDownedShards-seed#[9FC6A8FB1F9044DD]) [n:127.0.0.1:65173_    ] o.a.s.c.c.ZkStateReader Loaded empty cluster properties
   [junit4]   2> 480198 INFO  (TEST-CollectionTooManyReplicasTest.testDownedShards-seed#[9FC6A8FB1F9044DD]) [n:127.0.0.1:65173_    ] o.a.s.c.c.ZkStateReader Updated live nodes from ZooKeeper... (0) -> (0)
   [junit4]   2> 480202 INFO  (TEST-CollectionTooManyReplicasTest.testDownedShards-seed#[9FC6A8FB1F9044DD]) [n:127.0.0.1:65173_    ] o.a.s.c.c.SolrZkClient makePath: /overseer_elect
   [junit4]   2> 480206 INFO  (TEST-CollectionTooManyReplicasTest.testDownedShards-seed#[9FC6A8FB1F9044DD]) [n:127.0.0.1:65173_    ] o.a.s.c.c.SolrZkClient makePath: /overseer_elect/election
   [junit4]   2> 480215 INFO  (TEST-CollectionTooManyReplicasTest.testDownedShards-seed#[9FC6A8FB1F9044DD]) [n:127.0.0.1:65173_    ] o.a.s.c.Overseer Overseer (id=null) closing
   [junit4]   2> 480217 INFO  (TEST-CollectionTooManyReplicasTest.testDownedShards-seed#[9FC6A8FB1F9044DD]) [n:127.0.0.1:65173_    ] o.a.s.c.LeaderElector Joined leadership election with path: /overseer_elect/election/96505560969641988-127.0.0.1:65173_-n_0000000000
   [junit4]   2> 480218 INFO  (TEST-CollectionTooManyReplicasTest.testDownedShards-seed#[9FC6A8FB1F9044DD]) [n:127.0.0.1:65173_    ] o.a.s.c.OverseerElectionContext I am going to be the leader 127.0.0.1:65173_
   [junit4]   2> 480218 INFO  (TEST-CollectionTooManyReplicasTest.testDownedShards-seed#[9FC6A8FB1F9044DD]) [n:127.0.0.1:65173_    ] o.a.s.c.c.SolrZkClient makePath: /overseer_elect/leader
   [junit4]   2> 480226 INFO  (TEST-CollectionTooManyReplicasTest.testDownedShards-seed#[9FC6A8FB1F9044DD]) [n:127.0.0.1:65173_    ] o.a.s.c.Overseer Overseer (id=96505560969641988-127.0.0.1:65173_-n_0000000000) starting
   [junit4]   2> 480252 INFO  (TEST-CollectionTooManyReplicasTest.testDownedShards-seed#[9FC6A8FB1F9044DD]) [n:127.0.0.1:65173_    ] o.a.s.c.c.SolrZkClient makePath: /overseer/queue-work
   [junit4]   2> 480345 INFO  (TEST-CollectionTooManyReplicasTest.testDownedShards-seed#[9FC6A8FB1F9044DD]) [n:127.0.0.1:65173_    ] o.a.s.c.OverseerAutoReplicaFailoverThread Starting OverseerAutoReplicaFailoverThread autoReplicaFailoverWorkLoopDelay=10000 autoReplicaFailoverWaitAfterExpiration=10000 autoReplicaFailoverBadNodeExpiration=60000
   [junit4]   2> 480346 INFO  (TEST-CollectionTooManyReplicasTest.testDownedShards-seed#[9FC6A8FB1F9044DD]) [n:127.0.0.1:65173_    ] o.a.s.c.ZkController Register node as live in ZooKeeper:/live_nodes/127.0.0.1:65173_
   [junit4]   2> 480346 INFO  (TEST-CollectionTooManyReplicasTest.testDownedShards-seed#[9FC6A8FB1F9044DD]) [n:127.0.0.1:65173_    ] o.a.s.c.c.SolrZkClient makePath: /live_nodes/127.0.0.1:65173_
   [junit4]   2> 480348 INFO  (zkCallback-725-thread-1-processing-n:127.0.0.1:65173_) [n:127.0.0.1:65173_    ] o.a.s.c.c.ZkStateReader A live node change: [WatchedEvent state:SyncConnected type:NodeChildrenChanged path:/live_nodes], has occurred - updating... (live nodes size: [0])
   [junit4]   2> 480356 INFO  (zkCallback-725-thread-1-processing-n:127.0.0.1:65173_) [n:127.0.0.1:65173_    ] o.a.s.c.c.ZkStateReader Updated live nodes from ZooKeeper... (0) -> (1)
   [junit4]   2> 480379 INFO  (OverseerCollectionConfigSetProcessor-96505560969641988-127.0.0.1:65173_-n_0000000000) [n:127.0.0.1:65173_    ] o.a.s.c.OverseerTaskProcessor Process current queue of overseer operations
   [junit4]   2> 480384 INFO  (OverseerStateUpdate-96505560969641988-127.0.0.1:65173_-n_0000000000) [n:127.0.0.1:65173_    ] o.a.s.c.Overseer Starting to work on the main queue
   [junit4]   2> 480422 INFO  (TEST-CollectionTooManyReplicasTest.testDownedShards-seed#[9FC6A8FB1F9044DD]) [n:127.0.0.1:65173_    ] o.a.s.c.CoreContainer Security conf doesn't exist. Skipping setup for authorization module.
   [junit4]   2> 480422 INFO  (TEST-CollectionTooManyReplicasTest.testDownedShards-seed#[9FC6A8FB1F9044DD]) [n:127.0.0.1:65173_    ] o.a.s.c.CoreContainer No authentication plugin used.
   [junit4]   2> 480424 INFO  (TEST-CollectionTooManyReplicasTest.testDownedShards-seed#[9FC6A8FB1F9044DD]) [n:127.0.0.1:65173_    ] o.a.s.c.CorePropertiesLocator Looking for core definitions underneath /export/home/jenkins/workspace/Lucene-Solr-master-Solaris/solr/build/solr-core/test/J0/temp/solr.cloud.CollectionTooManyReplicasTest_9FC6A8FB1F9044DD-001/control-001/cores
   [junit4]   2> 480426 INFO  (TEST-CollectionTooManyReplicasTest.testDownedShards-seed#[9FC6A8FB1F9044DD]) [n:127.0.0.1:65173_    ] o.a.s.c.CoreDescriptor Created CoreDescriptor: {name=collection1, config=solrconfig.xml, transient=false, schema=schema.xml, loadOnStartup=true, configSetProperties=configsetprops.json, collection=control_collection, coreNodeName=, dataDir=data/, shard=}
   [junit4]   2> 480426 INFO  (TEST-CollectionTooManyReplicasTest.testDownedShards-seed#[9FC6A8FB1F9044DD]) [n:127.0.0.1:65173_    ] o.a.s.c.CorePropertiesLocator Found core collection1 in /export/home/jenkins/workspace/Lucene-Solr-master-Solaris/solr/build/solr-core/test/J0/temp/solr.cloud.CollectionTooManyReplicasTest_9FC6A8FB1F9044DD-001/control-001/cores/collection1
   [junit4]   2> 480426 INFO  (TEST-CollectionTooManyReplicasTest.testDownedShards-seed#[9FC6A8FB1F9044DD]) [n:127.0.0.1:65173_    ] o.a.s.c.CorePropertiesLocator Found 1 core definitions
   [junit4]   2> 480428 INFO  (TEST-CollectionTooManyReplicasTest.testDownedShards-seed#[9FC6A8FB1F9044DD]) [n:127.0.0.1:65173_    ] o.a.s.s.SolrDispatchFilter user.dir=/export/home/jenkins/workspace/Lucene-Solr-master-Solaris/solr/build/solr-core/test/J0
   [junit4]   2> 480428 INFO  (TEST-CollectionTooManyReplicasTest.testDownedShards-seed#[9FC6A8FB1F9044DD]) [n:127.0.0.1:65173_    ] o.a.s.s.SolrDispatchFilter SolrDispatchFilter.init() done
   [junit4]   2> 480429 INFO  (coreLoadExecutor-1824-thread-1-processing-n:127.0.0.1:65173_) [n:127.0.0.1:65173_ c:control_collection   x:collection1] o.a.s.c.ZkController publishing state=down
   [junit4]   2> 480429 INFO  (coreLoadExecutor-1824-thread-1-processing-n:127.0.0.1:65173_) [n:127.0.0.1:65173_ c:control_collection   x:collection1] o.a.s.c.ZkController numShards not found on descriptor - reading it from system property
   [junit4]   2> 480430 INFO  (coreLoadExecutor-1824-thread-1-processing-n:127.0.0.1:65173_) [n:127.0.0.1:65173_ c:control_collection   x:collection1] o.a.s.c.ZkController Collection control_collection not visible yet, but flagging it so a watch is registered when it becomes visible
   [junit4]   2> 480431 INFO  (OverseerStateUpdate-96505560969641988-127.0.0.1:65173_-n_0000000000) [n:127.0.0.1:65173_    ] o.a.s.c.c.ZkStateReader Updated live nodes from ZooKeeper... (1) -> (1)
   [junit4]   2> 480439 INFO  (coreLoadExecutor-1824-thread-1-processing-n:127.0.0.1:65173_) [n:127.0.0.1:65173_ c:control_collection   x:collection1] o.a.s.c.c.ZkStateReader Deleting data for [control_collection]
   [junit4]   2> 480463 INFO  (OverseerStateUpdate-96505560969641988-127.0.0.1:65173_-n_0000000000) [n:127.0.0.1:65173_    ] o.a.s.c.Overseer processMessage: queueSize: 1, message = {
   [junit4]   2>   "core":"collection1",
   [junit4]   2>   "roles":null,
   [junit4]   2>   "base_url":"http://127.0.0.1:65173",
   [junit4]   2>   "node_name":"127.0.0.1:65173_",
   [junit4]   2>   "numShards":"1",
   [junit4]   2>   "state":"down",
   [junit4]   2>   "shard":null,
   [junit4]   2>   "collection":"control_collection",
   [junit4]   2>   "operation":"state"} current state version: 0
   [junit4]   2> 480463 INFO  (OverseerStateUpdate-96505560969641988-127.0.0.1:65173_-n_0000000000) [n:127.0.0.1:65173_    ] o.a.s.c.o.ReplicaMutator Update state numShards=1 message={
   [junit4]   2>   "core":"collection1",
   [junit4]   2>   "roles":null,
   [junit4]   2>   "base_url":"http://127.0.0.1:65173",
   [junit4]   2>   "node_name":"127.0.0.1:65173_",
   [junit4]   2>   "numShards":"1",
   [junit4]   2>   "state":"down",
   [junit4]   2>   "shard":null,
   [junit4]   2>   "collection":"control_collection",
   [junit4]   2>   "operation":"state"}
   [junit4]   2> 480472 INFO  (OverseerStateUpdate-96505560969641988-127.0.0.1:65173_-n_0000000000) [n:127.0.0.1:65173_    ] o.a.s.c.o.ClusterStateMutator building a new cName: control_collection
   [junit4]   2> 480472 INFO  (coreLoadExecutor-1824-thread-1-processing-n:127.0.0.1:65173_) [n:127.0.0.1:65173_ c:control_collection   x:collection1] o.a.s.c.ZkController look for our core node name
   [junit4]   2> 480486 INFO  (OverseerStateUpdate-96505560969641988-127.0.0.1:65173_-n_0000000000) [n:127.0.0.1:65173_    ] o.a.s.c.o.ReplicaMutator Assigning new node to shard shard=shard1
   [junit4]   2> 480491 INFO  (zkCallback-725-thread-1-processing-n:127.0.0.1:65173_) [n:127.0.0.1:65173_    ] o.a.s.c.c.ZkStateReader A cluster state change: [WatchedEvent state:SyncConnected type:NodeDataChanged path:/clusterstate.json], has occurred - updating... (live nodes size: [1])
   [junit4]   2> 481490 INFO  (coreLoadExecutor-1824-thread-1-processing-n:127.0.0.1:65173_) [n:127.0.0.1:65173_ c:control_collection   x:collection1] o.a.s.c.ZkController waiting to find shard id in clusterstate for collection1
   [junit4]   2> 481490 INFO  (coreLoadExecutor-1824-thread-1-processing-n:127.0.0.1:65173_) [n:127.0.0.1:65173_ c:control_collection   x:collection1] o.a.s.c.ZkController Check for collection zkNode:control_collection
   [junit4]   2> 481490 INFO  (coreLoadExecutor-1824-thread-1-processing-n:127.0.0.1:65173_) [n:127.0.0.1:65173_ c:control_collection   x:collection1] o.a.s.c.ZkController Collection zkNode exists
   [junit4]   2> 481490 INFO  (coreLoadExecutor-1824-thread-1-processing-n:127.0.0.1:65173_) [n:127.0.0.1:65173_ c:control_collection   x:collection1] o.a.s.c.c.ZkStateReader Load collection config from: [/collections/control_collection]
   [junit4]   2> 481491 INFO  (coreLoadExecutor-1824-thread-1-processing-n:127.0.0.1:65173_) [n:127.0.0.1:65173_ c:control_collection   x:collection1] o.a.s.c.c.ZkStateReader path=[/collections/control_collection] [configName]=[conf1] specified config exists in ZooKeeper
   [junit4]   2> 481491 INFO  (coreLoadExecutor-1824-thread-1-processing-n:127.0.0.1:65173_) [n:127.0.0.1:65173_ c:control_collection   x:collection1] o.a.s.c.SolrResourceLoader new SolrResourceLoader for directory: '/export/home/jenkins/workspace/Lucene-Solr-master-Solaris/solr/build/solr-core/test/J0/temp/solr.cloud.CollectionTooManyReplicasTest_9FC6A8FB1F9044DD-001/control-001/cores/collection1'
   [junit4]   2> 481491 INFO  (coreLoadExecutor-1824-thread-1-processing-n:127.0.0.1:65173_) [n:127.0.0.1:65173_ c:control_collection   x:collection1] o.a.s.c.SolrResourceLoader JNDI not configured for solr (NoInitialContextEx)
   [junit4]   2> 481491 INFO  (coreLoadExecutor-1824-thread-1-processing-n:127.0.0.1:65173_) [n:127.0.0.1:65173_ c:control_collection   x:collection1] o.a.s.c.SolrResourceLoader solr home defaulted to 'solr/' (could not find system property or JNDI)
   [junit4]   2> 481492 INFO  (coreLoadExecutor-1824-thread-1-processing-n:127.0.0.1:65173_) [n:127.0.0.1:65173_ c:control_collection   x:collection1] o.a.s.c.Config loaded config solrconfig.xml with version 0 
   [junit4]   2> 481497 INFO  (coreLoadExecutor-1824-thread-1-processing-n:127.0.0.1:65173_) [n:127.0.0.1:65173_ c:control_collection   x:collection1] o.a.s.c.SolrConfig current version of requestparams : -1
   [junit4]   2> 481500 INFO  (coreLoadExecutor-1824-thread-1-processing-n:127.0.0.1:65173_) [n:127.0.0.1:65173_ c:control_collection   x:collection1] o.a.s.c.SolrConfig Using Lucene MatchVersion: 7.0.0
   [junit4]   2> 481508 INFO  (coreLoadExecutor-1824-thread-1-processing-n:127.0.0.1:65173_) [n:127.0.0.1:65173_ c:control_collection   x:collection1] o.a.s.c.SolrConfig Loaded SolrConfig: solrconfig.xml
   [junit4]   2> 481512 INFO  (coreLoadExecutor-1824-thread-1-processing-n:127.0.0.1:65173_) [n:127.0.0.1:65173_ c:control_collection   x:collection1] o.a.s.s.IndexSchema [collection1] Schema name=test
   [junit4]   2> 481762 INFO  (coreLoadExecutor-1824-thread-1-processing-n:127.0.0.1:65173_) [n:127.0.0.1:65173_ c:control_collection   x:collection1] o.a.s.s.OpenExchangeRatesOrgProvider Initialized with rates=open-exchange-rates.json, refreshInterval=1440.
   [junit4]   2> 481767 INFO  (coreLoadExecutor-1824-thread-1-processing-n:127.0.0.1:65173_) [n:127.0.0.1:65173_ c:control_collection   x:collection1] o.a.s.s.IndexSchema default search field in schema is text
   [junit4]   2> 481768 INFO  (coreLoadExecutor-1824-thread-1-processing-n:127.0.0.1:65173_) [n:127.0.0.1:65173_ c:control_collection   x:collection1] o.a.s.s.IndexSchema unique key field: id
   [junit4]   2> 481781 INFO  (coreLoadExecutor-1824-thread-1-processing-n:127.0.0.1:65173_) [n:127.0.0.1:65173_ c:control_collection   x:collection1] o.a.s.s.FileExchangeRateProvider Reloading exchange rates from file currency.xml
   [junit4]   2> 481797 INFO  (coreLoadExecutor-1824-thread-1-processing-n:127.0.0.1:65173_) [n:127.0.0.1:65173_ c:control_collection   x:collection1] o.a.s.s.FileExchangeRateProvider Reloading exchange rates from file currency.xml
   [junit4]   2> 481799 INFO  (coreLoadExecutor-1824-thread-1-processing-n:127.0.0.1:65173_) [n:127.0.0.1:65173_ c:control_collection   x:collection1] o.a.s.s.OpenExchangeRatesOrgProvider Reloading exchange rates from open-exchange-rates.json
   [junit4]   2> 481800 INFO  (coreLoadExecutor-1824-thread-1-processing-n:127.0.0.1:65173_) [n:127.0.0.1:65173_ c:control_collection   x:collection1] o.a.s.s.OpenExchangeRatesOrgProvider Reloading exchange rates from open-exchange-rates.json
   [junit4]   2> 481803 INFO  (coreLoadExecutor-1824-thread-1-processing-n:127.0.0.1:65173_) [n:127.0.0.1:65173_ c:control_collection   x:collection1] o.a.s.c.ConfigSetProperties Did not find ConfigSet properties, assuming default properties: Can't find resource 'configsetprops.json' in classpath or '/configs/conf1', cwd=/export/home/jenkins/workspace/Lucene-Solr-master-Solaris/solr/build/solr-core/test/J0
   [junit4]   2> 481803 INFO  (coreLoadExecutor-1824-thread-1-processing-n:127.0.0.1:65173_) [n:127.0.0.1:65173_ c:control_collection   x:collection1] o.a.s.c.CoreContainer Creating SolrCore 'collection1' using configuration from collection control_collection
   [junit4]   2> 481803 INFO  (coreLoadExecutor-1824-thread-1-processing-n:127.0.0.1:65173_) [n:127.0.0.1:65173_ c:control_collection s:shard1 r:core_node1 x:collection1] o.a.s.c.SolrCore org.apache.solr.core.MockDirectoryFactory
   [junit4]   2> 481803 INFO  (coreLoadExecutor-1824-thread-1-processing-n:127.0.0.1:65173_) [n:127.0.0.1:65173_ c:control_collection s:shard1 r:core_node1 x:collection1] o.a.s.c.SolrCore [[collection1] ] Opening new SolrCore at [/export/home/jenkins/workspace/Lucene-Solr-master-Solaris/solr/build/solr-core/test/J0/temp/solr.cloud.CollectionTooManyReplicasTest_9FC6A8FB1F9044DD-001/control-001/cores/collection1], dataDir=[/export/home/jenkins/workspace/Lucene-Solr-master-Solaris/solr/build/solr-core/test/J0/temp/solr.cloud.CollectionTooManyReplicasTest_9FC6A8FB1F9044DD-001/control-001/cores/collection1/data/]
   [junit4]   2> 481803 INFO  (coreLoadExecutor-1824-thread-1-processing-n:127.0.0.1:65173_) [n:127.0.0.1:65173_ c:control_collection s:shard1 r:core_node1 x:collection1] o.a.s.c.JmxMonitoredMap JMX monitoring is enabled. Adding Solr mbeans to JMX Server: com.sun.jmx.mbeanserver.JmxMBeanServer@4a85cee1
   [junit4]   2> 481804 INFO  (coreLoadExecutor-1824-thread-1-processing-n:127.0.0.1:65173_) [n:127.0.0.1:65173_ c:control_collection s:shard1 r:core_node1 x:collection1] o.a.s.c.CachingDirectoryFactory return new directory for /export/home/jenkins/workspace/Lucene-Solr-master-Solaris/solr/build/solr-core/test/J0/temp/solr.cloud.CollectionTooManyReplicasTest_9FC6A8FB1F9044DD-001/control-001/cores/collection1/data/snapshot_metadata
   [junit4]   2> 481804 INFO  (coreLoadExecutor-1824-thread-1-processing-n:127.0.0.1:65173_) [n:127.0.0.1:65173_ c:control_collection s:shard1 r:core_node1 x:collection1] o.a.s.c.s.SolrSnapshotMetaDataManager Loading from snapshot metadata file...
   [junit4]   2> 481804 INFO  (coreLoadExecutor-1824-thread-1-processing-n:127.0.0.1:65173_) [n:127.0.0.1:65173_ c:control_collection s:shard1 r:core_node1 x:collection1] o.a.s.c.CachingDirectoryFactory return new directory for /export/home/jenkins/workspace/Lucene-Solr-master-Solaris/solr/build/solr-core/test/J0/temp/solr.cloud.CollectionTooManyReplicasTest_9FC6A8FB1F9044DD-001/control-001/cores/collection1/data
   [junit4]   2> 481804 INFO  (coreLoadExecutor-1824-thread-1-processing-n:127.0.0.1:65173_) [n:127.0.0.1:65173_ c:control_collection s:shard1 r:core_node1 x:collection1] o.a.s.c.SolrCore New index directory detected: old=null new=/export/home/jenkins/workspace/Lucene-Solr-master-Solaris/solr/build/solr-core/test/J0/temp/solr.cloud.CollectionTooManyReplicasTest_9FC6A8FB1F9044DD-001/control-001/cores/collection1/data/index/
   [junit4]   2> 481804 WARN  (coreLoadExecutor-1824-thread-1-processing-n:127.0.0.1:65173_) [n:127.0.0.1:65173_ c:control_collection s:shard1 r:core_node1 x:collection1] o.a.s.c.SolrCore [collection1] Solr index directory '/export/home/jenkins/workspace/Lucene-Solr-master-Solaris/solr/build/solr-core/test/J0/temp/solr.cloud.CollectionTooManyReplicasTest_9FC6A8FB1F9044DD-001/control-001/cores/collection1/data/index' doesn't exist. Creating new index...
   [junit4]   2> 481804 INFO  (coreLoadExecutor-1824-thread-1-processing-n:127.0.0.1:65173_) [n:127.0.0.1:65173_ c:control_collection s:shard1 r:core_node1 x:collection1] o.a.s.c.CachingDirectoryFactory return new directory for /export/home/jenkins/workspace/Lucene-Solr-master-Solaris/solr/build/solr-core/test/J0/temp/solr.cloud.CollectionTooManyReplicasTest_9FC6A8FB1F9044DD-001/control-001/cores/collection1/data/index
   [junit4]   2> 481804 INFO  (coreLoadExecutor-1824-thread-1-processing-n:127.0.0.1:65173_) [n:127.0.0.1:65173_ c:control_collection s:shard1 r:core_node1 x:collection1] o.a.s.u.RandomMergePolicy RandomMergePolicy wrapping class org.apache.lucene.index.LogByteSizeMergePolicy: [LogByteSizeMergePolicy: minMergeSize=1677721, mergeFactor=31, maxMergeSize=2147483648, maxMergeSizeForForcedMerge=9223372036854775807, calibrateSizeByDeletes=false, maxMergeDocs=2147483647, maxCFSSegmentSizeMB=8.796093022207999E12, noCFSRatio=1.0]
   [junit4]   2> 481805 INFO  (coreLoadExecutor-1824-thread-1-processing-n:127.0.0.1:65173_) [n:127.0.0.1:65173_ c:control_collection s:shard1 r:core_node1 x:collection1] o.a.s.c.SolrDeletionPolicy SolrDeletionPolicy.onCommit: commits: num=1
   [junit4]   2> 	commit{dir=MockDirectoryWrapper(RAMDirectory@55002674 lockFactory=org.apache.lucene.store.SingleInstanceLockFactory@27a6586f),segFN=segments_1,generation=1}
   [junit4]   2> 481805 INFO  (coreLoadExecutor-1824-thread-1-processing-n:127.0.0.1:65173_) [n:127.0.0.1:65173_ c:control_collection s:shard1 r:core_node1 x:collection1] o.a.s.c.SolrDeletionPolicy newest commit generation = 1
   [junit4]   2> 481806 INFO  (OldIndexDirectoryCleanupThreadForCore-collection1) [n:127.0.0.1:65173_ c:control_collection s:shard1 r:core_node1 x:collection1] o.a.s.c.SolrCore Looking for old index directories to cleanup for core collection1 in /export/home/jenkins/workspace/Lucene-Solr-master-Solaris/solr/build/solr-core/test/J0/temp/solr.cloud.CollectionTooManyReplicasTest_9FC6A8FB1F9044DD-001/control-001/cores/collection1/data/
   [junit4]   2> 481806 WARN  (OldIndexDirectoryCleanupThreadForCore-collection1) [n:127.0.0.1:65173_ c:control_collection s:shard1 r:core_node1 x:collection1] o.a.s.c.DirectoryFactory /export/home/jenkins/workspace/Lucene-Solr-master-Solaris/solr/build/solr-core/test/J0/temp/solr.cloud.CollectionTooManyReplicasTest_9FC6A8FB1F9044DD-001/control-001/cores/collection1/data/ does not point to a valid data directory; skipping clean-up of old index directories.
   [junit4]   2> 481809 INFO  (coreLoadExecutor-1824-thread-1-processing-n:127.0.0.1:65173_) [n:127.0.0.1:65173_ c:control_collection s:shard1 r:core_node1 x:collection1] o.a.s.u.p.UpdateRequestProcessorChain creating updateRequestProcessorChain "nodistrib"
   [junit4]   2> 481809 INFO  (coreLoadExecutor-1824-thread-1-processing-n:127.0.0.1:65173_) [n:127.0.0.1:65173_ c:control_collection s:shard1 r:core_node1 x:collection1] o.a.s.u.p.UpdateRequestProcessorChain creating updateRequestProcessorChain "dedupe"
   [junit4]   2> 481809 INFO  (coreLoadExecutor-1824-thread-1-processing-n:127.0.0.1:65173_) [n:127.0.0.1:65173_ c:control_collection s:shard1 r:core_node1 x:collection1] o.a.s.u.p.UpdateRequestProcessorChain inserting DistributedUpdateProcessorFactory into updateRequestProcessorChain "dedupe"
   [junit4]   2> 481809 INFO  (coreLoadExecutor-1824-thread-1-processing-n:127.0.0.1:65173_) [n:127.0.0.1:65173_ c:control_collection s:shard1 r:core_node1 x:collection1] o.a.s.u.p.UpdateRequestProcessorChain creating updateRequestProcessorChain "stored_sig"
   [junit4]   2> 481809 INFO  (coreLoadExecutor-1824-thread-1-processing-n:127.0.0.1:65173_) [n:127.0.0.1:65173_ c:control_collection s:shard1 r:core_node1 x:collection1] o.a.s.u.p.UpdateRequestProcessorChain inserting DistributedUpdateProcessorFactory into updateRequestProcessorChain "stored_sig"
   [junit4]   2> 481809 INFO  (coreLoadExecutor-1824-thread-1-processing-n:127.0.0.1:65173_) [n:127.0.0.1:65173_ c:control_collection s:shard1 r:core_node1 x:collection1] o.a.s.u.p.UpdateRequestProcessorChain creating updateRequestProcessorChain "distrib-dup-test-chain-explicit"
   [junit4]   2> 481809 INFO  (coreLoadExecutor-1824-thread-1-processing-n:127.0.0.1:65173_) [n:127.0.0.1:65173_ c:control_collection s:shard1 r:core_node1 x:collection1] o.a.s.u.p.UpdateRequestProcessorChain creating updateRequestProcessorChain "distrib-dup-test-chain-implicit"
   [junit4]   2> 481809 INFO  (coreLoadExecutor-1824-thread-1-processing-n:127.0.0.1:65173_) [n:127.0.0.1:65173_ c:control_collection s:shard1 r:core_node1 x:collection1] o.a.s.u.p.UpdateRequestProcessorChain inserting DistributedUpdateProcessorFactory into updateRequestProcessorChain "distrib-dup-test-chain-implicit"
   [junit4]   2> 481809 INFO  (coreLoadExecutor-1824-thread-1-processing-n:127.0.0.1:65173_) [n:127.0.0.1:65173_ c:control_collection s:shard1 r:core_node1 x:collection1] o.a.s.c.SolrCore no updateRequestProcessorChain defined as default, creating implicit default
   [junit4]   2> 481809 WARN  (coreLoadExecutor-1824-thread-1-processing-n:127.0.0.1:65173_) [n:127.0.0.1:65173_ c:control_collection s:shard1 r:core_node1 x:collection1] o.a.s.c.RequestHandlers INVALID paramSet a in requestHandler {type = requestHandler,name = /dump,class = DumpRequestHandler,args = {defaults={a=A,b=B}}}
   [junit4]   2> 481811 INFO  (coreLoadExecutor-1824-thread-1-processing-n:127.0.0.1:65173_) [n:127.0.0.1:65173_ c:control_collection s:shard1 r:core_node1 x:collection1] o.a.s.h.l.XMLLoader xsltCacheLifetimeSeconds=60
   [junit4]   2> 481812 INFO  (coreLoadExecutor-1824-thread-1-processing-n:127.0.0.1:65173_) [n:127.0.0.1:65173_ c:control_collection s:shard1 r:core_node1 x:collection1] o.a.s.h.l.XMLLoader xsltCacheLifetimeSeconds=60
   [junit4]   2> 481813 INFO  (coreLoadExecutor-1824-thread-1-processing-n:127.0.0.1:65173_) [n:127.0.0.1:65173_ c:control_collection s:shard1 r:core_node1 x:collection1] o.a.s.h.l.XMLLoader xsltCacheLifetimeSeconds=60
   [junit4]   2> 481814 INFO  (coreLoadExecutor-1824-thread-1-processing-n:127.0.0.1:65173_) [n:127.0.0.1:65173_ c:control_collection s:shard1 r:core_node1 x:collection1] o.a.s.h.l.XMLLoader xsltCacheLifetimeSeconds=60
   [junit4]   2> 481817 INFO  (coreLoadExecutor-1824-thread-1-processing-n:127.0.0.1:65173_) [n:127.0.0.1:65173_ c:control_collection s:shard1 r:core_node1 x:collection1] o.a.s.c.RequestHandlers Registered paths: /admin/mbeans,standard,/update/json/docs,/admin/luke,/export,/get,/admin/properties,/update/json,/admin/threads,/dump,/update/csv,/sql,/graph,/admin/segments,/admin/system,/replication,/config,/stream,/schema,/admin/plugins,/admin/logging,/admin/ping,/update,/admin/file,/terms
   [junit4]   2> 481817 INFO  (coreLoadExecutor-1824-thread-1-processing-n:127.0.0.1:65173_) [n:127.0.0.1:65173_ c:control_collection s:shard1 r:core_node1 x:collection1] o.a.s.c.SolrCore Using default statsCache cache: org.apache.solr.search.stats.LocalStatsCache
   [junit4]   2> 481818 INFO  (coreLoadExecutor-1824-thread-1-processing-n:127.0.0.1:65173_) [n:127.0.0.1:65173_ c:control_collection s:shard1 r:core_node1 x:collection1] o.a.s.u.UpdateHandler Using UpdateLog implementation: org.apache.solr.update.UpdateLog
   [junit4]   2> 481818 INFO  (coreLoadExecutor-1824-thread-1-processing-n:127.0.0.1:65173_) [n:127.0.0.1:65173_ c:control_collection s:shard1 r:core_node1 x:collection1] o.a.s.u.UpdateLog Initializing UpdateLog: dataDir= defaultSyncLevel=FLUSH numRecordsToKeep=100 maxNumLogsToKeep=10 numVersionBuckets=65536
   [junit4]   2> 481820 INFO  (coreLoadExecutor-1824-thread-1-processing-n:127.0.0.1:65173_) [n:127.0.0.1:65173_ c:control_collection s:shard1 r:core_node1 x:collection1] o.a.s.u.CommitTracker Hard AutoCommit: disabled
   [junit4]   2> 481820 INFO  (coreLoadExecutor-1824-thread-1-processing-n:127.0.0.1:65173_) [n:127.0.0.1:65173_ c:control_collection s:shard1 r:core_node1 x:collection1] o.a.s.u.CommitTracker Soft AutoCommit: disabled
   [junit4]   2> 481821 INFO  (coreLoadExecutor-1824-thread-1-processing-n:127.0.0.1:65173_) [n:127.0.0.1:65173_ c:control_collection s:shard1 r:core_node1 x:collection1] o.a.s.u.RandomMergePolicy RandomMergePolicy wrapping class org.apache.lucene.index.TieredMergePolicy: [TieredMergePolicy: maxMergeAtOnce=26, maxMergeAtOnceExplicit=13, maxMergedSegmentMB=57.86328125, floorSegmentMB=1.6298828125, forceMergeDeletesPctAllowed=12.12239022342261, segmentsPerTier=13.0, maxCFSSegmentSizeMB=8.796093022207999E12, noCFSRatio=0.48158014939040006
   [junit4]   2> 481821 INFO  (coreLoadExecutor-1824-thread-1-processing-n:127.0.0.1:65173_) [n:127.0.0.1:65173_ c:control_collection s:shard1 r:core_node1 x:collection1] o.a.s.c.SolrDeletionPolicy SolrDeletionPolicy.onInit: commits: num=1
   [junit4]   2> 	commit{dir=MockDirectoryWrapper(RAMDirectory@55002674 lockFactory=org.apache.lucene.store.SingleInstanceLockFactory@27a6586f),segFN=segments_1,generation=1}
   [junit4]   2> 481821 INFO  (coreLoadExecutor-1824-thread-1-processing-n:127.0.0.1:65173_) [n:127.0.0.1:65173_ c:control_collection s:shard1 r:core_node1 x:collection1] o.a.s.c.SolrDeletionPolicy newest commit generation = 1
   [junit4]   2> 481821 INFO  (coreLoadExecutor-1824-thread-1-processing-n:127.0.0.1:65173_) [n:127.0.0.1:65173_ c:control_collection s:shard1 r:core_node1 x:collection1] o.a.s.s.SolrIndexSearcher Opening [Searcher@493b1c58[collection1] main]
   [junit4]   2> 481821 INFO  (coreLoadExecutor-1824-thread-1-processing-n:127.0.0.1:65173_) [n:127.0.0.1:65173_ c:control_collection s:shard1 r:core_node1 x:collection1] o.a.s.c.c.ZkStateReader Load collection config from: [/collections/control_collection]
   [junit4]   2> 481822 INFO  (coreLoadExecutor-1824-thread-1-processing-n:127.0.0.1:65173_) [n:127.0.0.1:65173_ c:control_collection s:shard1 r:core_node1 x:collection1] o.a.s.c.c.ZkStateReader path=[/collections/control_collection] [configName]=[conf1] specified config exists in ZooKeeper
   [junit4]   2> 481822 INFO  (coreLoadExecutor-1824-thread-1-processing-n:127.0.0.1:65173_) [n:127.0.0.1:65173_ c:control_collection s:shard1 r:core_node1 x:collection1] o.a.s.r.ManagedResourceStorage Setting up ZooKeeper-based storage for the RestManager with znodeBase: /configs/conf1
   [junit4]   2> 481823 INFO  (coreLoadExecutor-1824-thread-1-processing-n:127.0.0.1:65173_) [n:127.0.0.1:65173_ c:control_collection s:shard1 r:core_node1 x:collection1] o.a.s.r.ManagedResourceStorage Configured ZooKeeperStorageIO with znodeBase: /configs/conf1
   [junit4]   2> 481823 INFO  (coreLoadExecutor-1824-thread-1-processing-n:127.0.0.1:65173_) [n:127.0.0.1:65173_ c:control_collection s:shard1 r:core_node1 x:collection1] o.a.s.r.RestManager Initializing RestManager with initArgs: {}
   [junit4]   2> 481823 INFO  (coreLoadExecutor-1824-thread-1-processing-n:127.0.0.1:65173_) [n:127.0.0.1:65173_ c:control_collection s:shard1 r:core_node1 x:collection1] o.a.s.r.ManagedResourceStorage Reading _rest_managed.json using ZooKeeperStorageIO:path=/configs/conf1
   [junit4]   2> 481823 INFO  (coreLoadExecutor-1824-thread-1-processing-n:127.0.0.1:65173_) [n:127.0.0.1:65173_ c:control_collection s:shard1 r:core_node1 x:collection1] o.a.s.r.ManagedResourceStorage No data found for znode /configs/conf1/_rest_managed.json
   [junit4]   2> 481824 INFO  (coreLoadExecutor-1824-thread-1-processing-n:127.0.0.1:65173_) [n:127.0.0.1:65173_ c:control_collection s:shard1 r:core_node1 x:collection1] o.a.s.r.ManagedResourceStorage Loaded null at path _rest_managed.json using ZooKeeperStorageIO:path=/configs/conf1
   [junit4]   2> 481824 INFO  (coreLoadExecutor-1824-thread-1-processing-n:127.0.0.1:65173_) [n:127.0.0.1:65173_ c:control_collection s:shard1 r:core_node1 x:collection1] o.a.s.r.RestManager Initializing 0 registered ManagedResources
   [junit4]   2> 481824 INFO  (coreLoadExecutor-1824-thread-1-processing-n:127.0.0.1:65173_) [n:127.0.0.1:65173_ c:control_collection s:shard1 r:core_node1 x:collection1] o.a.s.h.ReplicationHandler Commits will be reserved for  10000
   [junit4]   2> 481824 INFO  (searcherExecutor-1825-thread-1-processing-n:127.0.0.1:65173_ x:collection1 s:shard1 c:control_collection r:core_node1) [n:127.0.0.1:65173_ c:control_collection s:shard1 r:core_node1 x:collection1] o.a.s.c.SolrCore [collection1] Registered new searcher Searcher@493b1c58[collection1] main{ExitableDirectoryReader(UninvertingDirectoryReader())}
   [junit4]   2> 481825 INFO  (coreLoadExecutor-1824-thread-1-processing-n:127.0.0.1:65173_) [n:127.0.0.1:65173_ c:control_collection s:shard1 r:core_node1 x:collection1] o.a.s.u.UpdateLog Looking up max value of version field to seed version buckets
   [junit4]   2> 481825 INFO  (coreLoadExecutor-1824-thread-1-processing-n:127.0.0.1:65173_) [n:127.0.0.1:65173_ c:control_collection s:shard1 r:core_node1 x:collection1] o.a.s.u.VersionInfo Refreshing highest value of _version_ for 65536 version buckets from index
   [junit4]   2> 481825 INFO  (coreLoadExecutor-1824-thread-1-processing-n:127.0.0.1:65173_) [n:127.0.0.1:65173_ c:control_collection s:shard1 r:core_node1 x:collection1] o.a.s.u.VersionInfo No terms found for _version_, cannot seed version bucket highest value from index
   [junit4]   2> 481825 INFO  (coreLoadExecutor-1824-thread-1-processing-n:127.0.0.1:65173_) [n:127.0.0.1:65173_ c:control_collection s:shard1 r:core_node1 x:collection1] o.a.s.u.UpdateLog Could not find max version in index or recent updates, using new clock 1544088978122080256
   [junit4]   2> 481826 INFO  (coreLoadExecutor-1824-thread-1-processing-n:127.0.0.1:65173_) [n:127.0.0.1:65173_ c:control_collection s:shard1 r:core_node1 x:collection1] o.a.s.u.UpdateLog Took 1.0ms to seed version buckets with highest version 1544088978122080256
   [junit4]   2> 481826 INFO  (coreLoadExecutor-1824-thread-1-processing-n:127.0.0.1:65173_) [n:127.0.0.1:65173_ c:control_collection s:shard1 r:core_node1 x:collection1] o.a.s.c.ZkController watch zkdir /configs/conf1
   [junit4]   2> 481833 INFO  (coreLoadExecutor-1824-thread-1-processing-n:127.0.0.1:65173_) [n:127.0.0.1:65173_ c:control_collection s:shard1 r:core_node1 x:collection1] o.a.s.c.CoreContainer registering core: collection1
   [junit4]   2> 481834 INFO  (coreZkRegister-1817-thread-1-processing-n:127.0.0.1:65173_ x:collection1 s:shard1 c:control_collection r:core_node1) [n:127.0.0.1:65173_ c:control_collection s:shard1 r:core_node1 x:collection1] o.a.s.c.ZkController Register replica - core:collection1 address:http://127.0.0.1:65173 collection:control_collection shard:shard1
   [junit4]   2> 481835 INFO  (coreZkRegister-1817-thread-1-processing-n:127.0.0.1:65173_ x:collection1 s:shard1 c:control_collection r:core_node1) [n:127.0.0.1:65173_ c:control_collection s:shard1 r:core_node1 x:collection1] o.a.s.c.c.SolrZkClient makePath: /collections/control_collection/leader_elect/shard1/election
   [junit4]   2> 481840 INFO  (coreZkRegister-1817-thread-1-processing-n:127.0.0.1:65173_ x:collection1 s:shard1 c:control_collection r:core_node1) [n:127.0.0.1:65173_ c:control_collection s:shard1 r:core_node1 x:collection1] o.a.s.c.LeaderElector Joined leadership election with path: /collections/control_collection/leader_elect/shard1/election/96505560969641988-core_node1-n_0000000000
   [junit4]   2> 481840 INFO  (coreZkRegister-1817-thread-1-processing-n:127.0.0.1:65173_ x:collection1 s:shard1 c:control_collection r:core_node1) [n:127.0.0.1:65173_ c:control_collection s:shard1 r:core_node1 x:collection1] o.a.s.c.ShardLeaderElectionContext Running the leader process for shard=shard1 and weAreReplacement=false and leaderVoteWait=10000
   [junit4]   2> 481843 INFO  (coreZkRegister-1817-thread-1-processing-n:127.0.0.1:65173_ x:collection1 s:shard1 c:control_collection r:core_node1) [n:127.0.0.1:65173_ c:control_collection s:shard1 r:core_node1 x:collection1] o.a.s.c.ShardLeaderElectionContext Enough replicas found to continue.
   [junit4]   2> 481844 INFO  (coreZkRegister-1817-thread-1-processing-n:127.0.0.1:65173_ x:collection1 s:shard1 c:control_collection r:core_node1) [n:127.0.0.1:65173_ c:control_collection s:shard1 r:core_node1 x:collection1] o.a.s.c.ShardLeaderElectionContext I may be the new leader - try and sync
   [junit4]   2> 481844 INFO  (coreZkRegister-1817-thread-1-processing-n:127.0.0.1:65173_ x:collection1 s:shard1 c:control_collection r:core_node1) [n:127.0.0.1:65173_ c:control_collection s:shard1 r:core_node1 x:collection1] o.a.s.c.SyncStrategy Sync replicas to http://127.0.0.1:65173/collection1/
   [junit4]   2> 481844 INFO  (OverseerStateUpdate-96505560969641988-127.0.0.1:65173_-n_0000000000) [n:127.0.0.1:65173_    ] o.a.s.c.Overseer processMessage: queueSize: 1, message = {
   [junit4]   2>   "operation":"leader",
   [junit4]   2>   "shard":"shard1",
   [junit4]   2>   "collection":"control_collection"} current state version: 1
   [junit4]   2> 481844 INFO  (coreZkRegister-1817-thread-1-processing-n:127.0.0.1:65173_ x:collection1 s:shard1 c:control_collection r:core_node1) [n:127.0.0.1:65173_ c:control_collection s:shard1 r:core_node1 x:collection1] o.a.s.c.SyncStrategy Sync Success - now sync replicas to me
   [junit4]   2> 481844 INFO  (coreZkRegister-1817-thread-1-processing-n:127.0.0.1:65173_ x:collection1 s:shard1 c:control_collection r:core_node1) [n:127.0.0.1:65173_ c:control_collection s:shard1 r:core_node1 x:collection1] o.a.s.c.SyncStrategy http://127.0.0.1:65173/collection1/ has no replicas
   [junit4]   2> 481846 INFO  (coreZkRegister-1817-thread-1-processing-n:127.0.0.1:65173_ x:collection1 s:shard1 c:control_collection r:core_node1) [n:127.0.0.1:65173_ c:control_collection s:shard1 r:core_node1 x:collection1] o.a.s.c.c.SolrZkClient makePath: /collections/control_collection/leaders/shard1
   [junit4]   2> 481849 INFO  (coreZkRegister-1817-thread-1-processing-n:127.0.0.1:65173_ x:collection1 s:shard1 c:control_collection r:core_node1) [n:127.0.0.1:65173_ c:control_collection s:shard1 r:core_node1 x:collection1] o.a.s.c.ShardLeaderElectionContextBase Creating leader registration node /collections/control_collection/leaders/shard1/leader after winning as /collections/control_collection/leader_elect/shard1/election/96505560969641988-core_node1-n_0000000000
   [junit4]   2> 481851 INFO  (coreZkRegister-1817-thread-1-processing-n:127.0.0.1:65173_ x:collection1 s:shard1 c:control_collection r:core_node1) [n:127.0.0.1:65173_ c:control_collection s:shard1 r:core_node1 x:collection1] o.a.s.c.ShardLeaderElectionContext I am the new leader: http://127.0.0.1:65173/collection1/ shard1
   [junit4]   2> 481852 INFO  (OverseerStateUpdate-96505560969641988-127.0.0.1:65173_-n_0000000000) [n:127.0.0.1:65173_    ] o.a.s.c.Overseer processMessage: queueSize: 1, message = {
   [junit4]   2>   "operation":"leader",
   [junit4]   2>   "shard":"shard1",
   [junit4]   2>   "collection":"control_collection",
   [junit4]   2>   "base_url":"http://127.0.0.1:65173",
   [junit4]   2>   "core":"collection1",
   [junit4]   2>   "state":"active"} current state version: 1
   [junit4]   2> 481934 INFO  (TEST-CollectionTooManyReplicasTest.testDownedShards-seed#[9FC6A8FB1F9044DD]) [    ] o.a.s.c.c.SolrZkClient Using default ZkCredentialsProvider
   [junit4]   2> 481935 INFO  (TEST-CollectionTooManyReplicasTest.testDownedShards-seed#[9FC6A8FB1F9044DD]) [    ] o.a.s.c.c.ConnectionManager Waiting for client to connect to ZooKeeper
   [junit4]   2> 481937 INFO  (zkCallback-729-thread-1) [    ] o.a.s.c.c.ConnectionManager Watcher org.apache.solr.common.cloud.ConnectionManager@4ca91925 name:ZooKeeperConnection Watcher:127.0.0.1:53395/solr got event WatchedEvent state:SyncConnected type:None path:null path:null type:None
   [junit4]   2> 481937 INFO  (TEST-CollectionTooManyReplicasTest.testDownedShards-seed#[9FC6A8FB1F9044DD]) [    ] o.a.s.c.c.ConnectionManager Client is connected to ZooKeeper
   [junit4]   2> 481937 INFO  (TEST-CollectionTooManyReplicasTest.testDownedShards-seed#[9FC6A8FB1F9044DD]) [    ] o.a.s.c.c.SolrZkClient Using default ZkACLProvider
   [junit4]   2> 481937 INFO  (TEST-CollectionTooManyReplicasTest.testDownedShards-seed#[9FC6A8FB1F9044DD]) [    ] o.a.s.c.c.ZkStateReader Updating cluster state from ZooKeeper... 
   [junit4]   2> 481938 INFO  (TEST-CollectionTooManyReplicasTest.testDownedShards-seed#[9FC6A8FB1F9044DD]) [    ] o.a.s.c.c.ZkStateReader Loaded empty cluster properties
   [junit4]   2> 481939 INFO  (TEST-CollectionTooManyReplicasTest.testDownedShards-seed#[9FC6A8FB1F9044DD]) [    ] o.a.s.c.c.ZkStateReader Updated live nodes from ZooKeeper... (0) -> (1)
   [junit4]   2> 481953 INFO  (TEST-CollectionTooManyReplicasTest.testDownedShards-seed#[9FC6A8FB1F9044DD]) [    ] o.a.s.c.ChaosMonkey monkey: init - expire sessions:false cause connection loss:false
   [junit4]   2> 481984 INFO  (zkCallback-729-thread-1) [    ] o.a.s.c.c.ZkStateReader A cluster state change: [WatchedEvent state:SyncConnected type:NodeDataChanged path:/clusterstate.json], has occurred - updating... (live nodes size: [1])
   [junit4]   2> 481985 INFO  (zkCallback-725-thread-1-processing-n:127.0.0.1:65173_) [n:127.0.0.1:65173_    ] o.a.s.c.c.ZkStateReader A cluster state change: [WatchedEvent state:SyncConnected type:NodeDataChanged path:/clusterstate.json], has occurred - updating... (live nodes size: [1])
   [junit4]   2> 481999 INFO  (coreZkRegister-1817-thread-1-processing-n:127.0.0.1:65173_ x:collection1 s:shard1 c:control_collection r:core_node1) [n:127.0.0.1:65173_ c:control_collection s:shard1 r:core_node1 x:collection1] o.a.s.c.ZkController We are http://127.0.0.1:65173/collection1/ and leader is http://127.0.0.1:65173/collection1/
   [junit4]   2> 481999 INFO  (coreZkRegister-1817-thread-1-processing-n:127.0.0.1:65173_ x:collection1 s:shard1 c:control_collection r:core_node1) [n:127.0.0.1:65173_ c:control_collection s:shard1 r:core_node1 x:collection1] o.a.s.c.ZkController No LogReplay needed for core=collection1 baseURL=http://127.0.0.1:65173
   [junit4]   2> 481999 INFO  (coreZkRegister-1817-thread-1-processing-n:127.0.0.1:65173_ x:collection1 s:shard1 c:control_collection r:core_node1) [n:127.0.0.1:65173_ c:control_collection s:shard1 r:core_node1 x:collection1] o.a.s.c.ZkController I am the leader, no recovery necessary
   [junit4]   2> 482000 INFO  (coreZkRegister-1817-thread-1-processing-n:127.0.0.1:65173_ x:collection1 s:shard1 c:control_collection r:core_node1) [n:127.0.0.1:65173_ c:control_collection s:shard1 r:core_node1 x:collection1] o.a.s.c.ZkController publishing state=active
   [junit4]   2> 482000 INFO  (coreZkRegister-1817-thread-1-processing-n:127.0.0.1:65173_ x:collection1 s:shard1 c:control_collection r:core_node1) [n:127.0.0.1:65173_ c:control_collection s:shard1 r:core_node1 x:collection1] o.a.s.c.ZkController numShards not found on descriptor - reading it from system property
   [junit4]   2> 482010 INFO  (OverseerStateUpdate-96505560969641988-127.0.0.1:65173_-n_0000000000) [n:127.0.0.1:65173_    ] o.a.s.c.Overseer processMessage: queueSize: 1, message = {
   [junit4]   2>   "core":"collection1",
   [junit4]   2>   "core_node_name":"core_node1",
   [junit4]   2>   "roles":null,
   [junit4]   2>   "base_url":"http://127.0.0.1:65173",
   [junit4]   2>   "node_name":"127.0.0.1:65173_",
   [junit4]   2>   "numShards":"1",
   [junit4]   2>   "state":"active",
   [junit4]   2>   "shard":"shard1",
   [junit4]   2>   "collection":"control_collection",
   [junit4]   2>   "operation":"state"} current state version: 2
   [junit4]   2> 482010 INFO  (OverseerStateUpdate-96505560969641988-127.0.0.1:65173_-n_0000000000) [n:127.0.0.1:65173_    ] o.a.s.c.o.ReplicaMutator Update state numShards=1 message={
   [junit4]   2>   "core":"collection1",
   [junit4]   2>   "core_node_name":"core_node1",
   [junit4]   2>   "roles":null,
   [junit4]   2>   "base_url":"http://127.0.0.1:65173",
   [junit4]   2>   "node_name":"127.0.0.1:65173_",
   [junit4]   2>   "numShards":"1",
   [junit4]   2>   "state":"active",
   [junit4]   2>   "shard":"shard1",
   [junit4]   2>   "collection":"control_collection",
   [junit4]   2>   "operation":"state"}
   [junit4]   2> 482012 INFO  (coreZkRegister-1817-thread-1-processing-n:127.0.0.1:65173_ x:collection1 s:shard1 c:control_collection r:core_node1) [n:127.0.0.1:65173_ c:control_collection s:shard1 r:core_node1 x:collection1] o.a.s.c.c.ZkStateReader Checking legacy cluster state for collection control_collection
   [junit4]   2> 482129 INFO  (zkCallback-725-thread-3-processing-n:127.0.0.1:65173_) [n:127.0.0.1:65173_    ] o.a.s.c.c.ZkStateReader A cluster state change: [WatchedEvent state:SyncConnected type:NodeDataChanged path:/clusterstate.json], has occurred - updating... (live nodes size: [1])
   [junit4]   2> 482130 INFO  (zkCallback-729-thread-1) [    ] o.a.s.c.c.ZkStateReader A cluster state change: [WatchedEvent state:SyncConnected type:NodeDataChanged path:/clusterstate.json], has occurred - updating... (live nodes size: [1])
   [junit4]   2> 482152 INFO  (TEST-CollectionTooManyReplicasTest.testDownedShards-seed#[9FC6A8FB1F9044DD]) [    ] o.a.s.SolrTestCaseJ4 Writing core.properties file to /export/home/jenkins/workspace/Lucene-Solr-master-Solaris/solr/build/solr-core/test/J0/temp/solr.cloud.CollectionTooManyReplicasTest_9FC6A8FB1F9044DD-001/shard-1-001/cores/collection1
   [junit4]   2> 482152 INFO  (TEST-CollectionTooManyReplicasTest.testDownedShards-seed#[9FC6A8FB1F9044DD]) [    ] o.a.s.c.AbstractFullDistribZkTestBase create jetty 1 in directory /export/home/jenkins/workspace/Lucene-Solr-master-Solaris/solr/build/solr-core/test/J0/temp/solr.cloud.CollectionTooManyReplicasTest_9FC6A8FB1F9044DD-001/shard-1-001
   [junit4]   2> 482152 INFO  (TEST-CollectionTooManyReplicasTest.testDownedShards-seed#[9FC6A8FB1F9044DD]) [    ] o.e.j.s.Server jetty-9.3.8.v20160314
   [junit4]   2> 482158 INFO  (TEST-CollectionTooManyReplicasTest.testDownedShards-seed#[9FC6A8FB1F9044DD]) [    ] o.e.j.s.h.ContextHandler Started o.e.j.s.ServletContextHandler@1470743f{/,null,AVAILABLE}
   [junit4]   2> 482159 INFO  (TEST-CollectionTooManyReplicasTest.testDownedShards-seed#[9FC6A8FB1F9044DD]) [    ] o.e.j.s.ServerConnector Started ServerConnector@10673dbe{HTTP/1.1,[http/1.1]}{127.0.0.1:55588}
   [junit4]   2> 482159 INFO  (TEST-CollectionTooManyReplicasTest.testDownedShards-seed#[9FC6A8FB1F9044DD]) [    ] o.e.j.s.Server Started @485120ms
   [junit4]   2> 482159 INFO  (TEST-CollectionTooManyReplicasTest.testDownedShards-seed#[9FC6A8FB1F9044DD]) [    ] o.a.s.c.s.e.JettySolrRunner Jetty properties: {solr.data.dir=/export/home/jenkins/workspace/Lucene-Solr-master-Solaris/solr/build/solr-core/test/J0/temp/solr.cloud.CollectionTooManyReplicasTest_9FC6A8FB1F9044DD-001/tempDir-001/jetty1, solrconfig=solrconfig.xml, hostContext=/, hostPort=55588, coreRootDirectory=/export/home/jenkins/workspace/Lucene-Solr-master-Solaris/solr/build/solr-core/test/J0/temp/solr.cloud.CollectionTooManyReplicasTest_9FC6A8FB1F9044DD-001/shard-1-001/cores}
   [junit4]   2> 482159 INFO  (TEST-CollectionTooManyReplicasTest.testDownedShards-seed#[9FC6A8FB1F9044DD]) [    ] o.a.s.s.SolrDispatchFilter SolrDispatchFilter.init(): sun.misc.Launcher$AppClassLoader@6d06d69c
   [junit4]   2> 482159 INFO  (TEST-CollectionTooManyReplicasTest.testDownedShards-seed#[9FC6A8FB1F9044DD]) [    ] o.a.s.c.SolrResourceLoader new SolrResourceLoader for directory: '/export/home/jenkins/workspace/Lucene-Solr-master-Solaris/solr/build/solr-core/test/J0/temp/solr.cloud.CollectionTooManyReplicasTest_9FC6A8FB1F9044DD-001/shard-1-001'
   [junit4]   2> 482212 INFO  (TEST-CollectionTooManyReplicasTest.testDownedShards-seed#[9FC6A8FB1F9044DD]) [    ] o.a.s.c.SolrResourceLoader JNDI not configured for solr (NoInitialContextEx)
   [junit4]   2> 482212 INFO  (TEST-CollectionTooManyReplicasTest.testDownedShards-seed#[9FC6A8FB1F9044DD]) [    ] o.a.s.c.SolrResourceLoader solr home defaulted to 'solr/' (could not find system property or JNDI)
   [junit4]   2> 482212 INFO  (TEST-CollectionTooManyReplicasTest.testDownedShards-seed#[9FC6A8FB1F9044DD]) [    ] o.a.s.c.c.SolrZkClient Using default ZkCredentialsProvider
   [junit4]   2> 482213 INFO  (TEST-CollectionTooManyReplicasTest.testDownedShards-seed#[9FC6A8FB1F9044DD]) [    ] o.a.s.c.c.ConnectionManager Waiting for client to connect to ZooKeeper
   [junit4]   2> 482215 INFO  (zkCallback-730-thread-1) [    ] o.a.s.c.c.ConnectionManager Watcher org.apache.solr.common.cloud.ConnectionManager@5f1d0f06 name:ZooKeeperConnection Watcher:127.0.0.1:53395/solr got event WatchedEvent state:SyncConnected type:None path:null path:null type:None
   [junit4]   2> 482215 INFO  (TEST-CollectionTooManyReplicasTest.testDownedShards-seed#[9FC6A8FB1F9044DD]) [    ] o.a.s.c.c.ConnectionManager Client is connected to ZooKeeper
   [junit4]   2> 482215 INFO  (TEST-CollectionTooManyReplicasTest.testDownedShards-seed#[9FC6A8FB1F9044DD]) [    ] o.a.s.c.c.SolrZkClient Using default ZkACLProvider
   [junit4]   2> 482218 INFO  (TEST-CollectionTooManyReplicasTest.testDownedShards-seed#[9FC6A8FB1F9044DD]) [    ] o.a.s.s.SolrDispatchFilter Loading solr.xml from SolrHome (not found in ZooKeeper)
   [junit4]   2> 482218 INFO  (TEST-CollectionTooManyReplicasTest.testDownedShards-seed#[9FC6A8FB1F9044DD]) [    ] o.a.s.c.SolrXmlConfig Loading container configuration from /export/home/jenkins/workspace/Lucene-Solr-master-Solaris/solr/build/solr-core/test/J0/temp/solr.cloud.CollectionTooManyReplicasTest_9FC6A8FB1F9044DD-001/shard-1-001/solr.xml
   [junit4]   2> 482223 INFO  (TEST-CollectionTooManyReplicasTest.testDownedShards-seed#[9FC6A8FB1F9044DD]) [    ] o.a.s.c.CorePropertiesLocator Config-defined core root directory: /export/home/jenkins/workspace/Lucene-Solr-master-Solaris/solr/build/solr-core/test/J0/temp/solr.cloud.CollectionTooManyReplicasTest_9FC6A8FB1F9044DD-001/shard-1-001/cores
   [junit4]   2> 482223 INFO  (TEST-CollectionTooManyRepli

[...truncated too long message...]

eadPoolExecutor$AbortPolicy.rejectedExecution(ThreadPoolExecutor.java:2047)
   [junit4]   2> 	at java.util.concurrent.ThreadPoolExecutor.reject(ThreadPoolExecutor.java:823)
   [junit4]   2> 	at java.util.concurrent.ThreadPoolExecutor.execute(ThreadPoolExecutor.java:1369)
   [junit4]   2> 	at org.apache.solr.common.util.ExecutorUtil$MDCAwareThreadPoolExecutor.execute(ExecutorUtil.java:214)
   [junit4]   2> 	at java.util.concurrent.AbstractExecutorService.submit(AbstractExecutorService.java:112)
   [junit4]   2> 	at org.apache.solr.common.cloud.SolrZkClient$3.process(SolrZkClient.java:266)
   [junit4]   2> 	at org.apache.zookeeper.ClientCnxn$EventThread.processEvent(ClientCnxn.java:522)
   [junit4]   2> 	at org.apache.zookeeper.ClientCnxn$EventThread.run(ClientCnxn.java:498)
   [junit4]   2> 218908 ERROR (TEST-TestCollectionStateWatchers.testWaitForStateWatcherIsRetainedOnPredicateFailure-seed#[CCB29B6C0452746]-EventThread) [n:127.0.0.1:41245_solr    ] o.a.z.ClientCnxn Error while calling watcher 
   [junit4]   2> java.util.concurrent.RejectedExecutionException: Task org.apache.solr.common.util.ExecutorUtil$MDCAwareThreadPoolExecutor$$Lambda$12/857105079@366c972c rejected from org.apache.solr.common.util.ExecutorUtil$MDCAwareThreadPoolExecutor@32530539[Shutting down, pool size = 1, active threads = 0, queued tasks = 0, completed tasks = 20]
   [junit4]   2> 	at java.util.concurrent.ThreadPoolExecutor$AbortPolicy.rejectedExecution(ThreadPoolExecutor.java:2047)
   [junit4]   2> 	at java.util.concurrent.ThreadPoolExecutor.reject(ThreadPoolExecutor.java:823)
   [junit4]   2> 	at java.util.concurrent.ThreadPoolExecutor.execute(ThreadPoolExecutor.java:1369)
   [junit4]   2> 	at org.apache.solr.common.util.ExecutorUtil$MDCAwareThreadPoolExecutor.execute(ExecutorUtil.java:214)
   [junit4]   2> 	at java.util.concurrent.AbstractExecutorService.submit(AbstractExecutorService.java:112)
   [junit4]   2> 	at org.apache.solr.common.cloud.SolrZkClient$3.process(SolrZkClient.java:266)
   [junit4]   2> 	at org.apache.zookeeper.ClientCnxn$EventThread.processEvent(ClientCnxn.java:522)
   [junit4]   2> 	at org.apache.zookeeper.ClientCnxn$EventThread.run(ClientCnxn.java:498)
   [junit4]   2> 218918 ERROR (TEST-TestCollectionStateWatchers.testWaitForStateWatcherIsRetainedOnPredicateFailure-seed#[CCB29B6C0452746]-EventThread) [n:127.0.0.1:41245_solr    ] o.a.z.ClientCnxn Error while calling watcher 
   [junit4]   2> java.util.concurrent.RejectedExecutionException: Task org.apache.solr.common.util.ExecutorUtil$MDCAwareThreadPoolExecutor$$Lambda$12/857105079@14eb7c92 rejected from org.apache.solr.common.util.ExecutorUtil$MDCAwareThreadPoolExecutor@32530539[Terminated, pool size = 0, active threads = 0, queued tasks = 0, completed tasks = 20]
   [junit4]   2> 	at java.util.concurrent.ThreadPoolExecutor$AbortPolicy.rejectedExecution(ThreadPoolExecutor.java:2047)
   [junit4]   2> 	at java.util.concurrent.ThreadPoolExecutor.reject(ThreadPoolExecutor.java:823)
   [junit4]   2> 	at java.util.concurrent.ThreadPoolExecutor.execute(ThreadPoolExecutor.java:1369)
   [junit4]   2> 	at org.apache.solr.common.util.ExecutorUtil$MDCAwareThreadPoolExecutor.execute(ExecutorUtil.java:214)
   [junit4]   2> 	at java.util.concurrent.AbstractExecutorService.submit(AbstractExecutorService.java:112)
   [junit4]   2> 	at org.apache.solr.common.cloud.SolrZkClient$3.process(SolrZkClient.java:266)
   [junit4]   2> 	at org.apache.zookeeper.ClientCnxn$EventThread.processEvent(ClientCnxn.java:522)
   [junit4]   2> 	at org.apache.zookeeper.ClientCnxn$EventThread.run(ClientCnxn.java:498)
   [junit4]   2> 218907 INFO  (zkCallback-536-thread-1-processing-n:127.0.0.1:51034_solr) [n:127.0.0.1:51034_solr    ] o.a.s.c.c.ZkStateReader A live node change: [WatchedEvent state:SyncConnected type:NodeChildrenChanged path:/live_nodes], has occurred - updating... (live nodes size: [4])
   [junit4]   2> 218919 WARN  (zkCallback-536-thread-1-processing-n:127.0.0.1:51034_solr) [n:127.0.0.1:51034_solr    ] o.a.s.c.c.ZkStateReader ZooKeeper watch triggered, but Solr cannot talk to ZK: [KeeperErrorCode = Session expired for /live_nodes]
   [junit4]   2> 218916 INFO  (OverseerStateUpdate-96505762945302536-127.0.0.1:36973_solr-n_0000000000) [n:127.0.0.1:36973_solr    ] o.a.s.c.o.ZkStateWriter going to update_collection /collections/stateformat1/state.json version: 6
   [junit4]   2> 218920 INFO  (jetty-launcher-516-thread-2) [    ] o.e.j.s.h.ContextHandler Stopped o.e.j.s.ServletContextHandler@3e139acc{/solr,null,UNAVAILABLE}
   [junit4]   2> 218924 INFO  (jetty-launcher-516-thread-1) [    ] o.a.s.c.Overseer Overseer (id=96505762945302536-127.0.0.1:36973_solr-n_0000000000) closing
   [junit4]   2> 218926 INFO  (OverseerStateUpdate-96505762945302536-127.0.0.1:36973_solr-n_0000000000) [n:127.0.0.1:36973_solr    ] o.a.s.c.Overseer Overseer Loop exiting : 127.0.0.1:36973_solr
   [junit4]   2> 218929 INFO  (zkCallback-532-thread-6-processing-n:127.0.0.1:36973_solr) [n:127.0.0.1:36973_solr    ] o.a.s.c.c.ZkStateReader Updated live nodes from ZooKeeper... (4) -> (1)
   [junit4]   2> 218930 INFO  (zkCallback-532-thread-6-processing-n:127.0.0.1:36973_solr) [n:127.0.0.1:36973_solr    ] o.a.s.c.c.ZkStateReader A live node change: [WatchedEvent state:SyncConnected type:NodeChildrenChanged path:/live_nodes], has occurred - updating... (live nodes size: [1])
   [junit4]   2> 218930 WARN  (zkCallback-532-thread-6-processing-n:127.0.0.1:36973_solr) [n:127.0.0.1:36973_solr    ] o.a.s.c.c.ZkStateReader ZooKeeper watch triggered, but Solr cannot talk to ZK: [KeeperErrorCode = Session expired for /live_nodes]
   [junit4]   2> 218932 INFO  (jetty-launcher-516-thread-1) [    ] o.e.j.s.h.ContextHandler Stopped o.e.j.s.ServletContextHandler@a9f18af{/solr,null,UNAVAILABLE}
   [junit4]   2> 218936 INFO  (SUITE-TestCollectionStateWatchers-seed#[CCB29B6C0452746]-worker) [    ] o.a.s.c.ZkTestServer connecting to 127.0.0.1:58700 58700
   [junit4]   2> 218980 WARN  (NIOServerCxn.Factory:0.0.0.0/0.0.0.0:0) [    ] o.a.z.s.NIOServerCnxnFactory Ignoring unexpected runtime exception
   [junit4]   2> java.nio.channels.CancelledKeyException
   [junit4]   2> 	at sun.nio.ch.SelectionKeyImpl.ensureValid(SelectionKeyImpl.java:73)
   [junit4]   2> 	at sun.nio.ch.SelectionKeyImpl.readyOps(SelectionKeyImpl.java:87)
   [junit4]   2> 	at org.apache.zookeeper.server.NIOServerCnxnFactory.run(NIOServerCnxnFactory.java:187)
   [junit4]   2> 	at java.lang.Thread.run(Thread.java:745)
   [junit4]   2> 218981 INFO  (Thread-249) [    ] o.a.s.c.ZkTestServer connecting to 127.0.0.1:58700 58700
   [junit4]   2> 218982 WARN  (Thread-249) [    ] o.a.s.c.ZkTestServer Watch limit violations: 
   [junit4]   2> Maximum concurrent create/delete watches above limit:
   [junit4]   2> 
   [junit4]   2> 	8	/solr/aliases.json
   [junit4]   2> 	8	/solr/configs/config
   [junit4]   2> 	8	/solr/clusterprops.json
   [junit4]   2> 	7	/solr/security.json
   [junit4]   2> 	3	/solr/collections/stateformat1/state.json
   [junit4]   2> 
   [junit4]   2> Maximum concurrent data watches above limit:
   [junit4]   2> 
   [junit4]   2> 	17	/solr/collections/falsepredicate/state.json
   [junit4]   2> 	12	/solr/collections/waitforstate/state.json
   [junit4]   2> 	8	/solr/clusterstate.json
   [junit4]   2> 	7	/solr/collections/testcollection/state.json
   [junit4]   2> 	3	/solr/collections/stateformat1/state.json
   [junit4]   2> 	2	/solr/overseer_elect/election/96505762945302539-127.0.0.1:51034_solr-n_0000000001
   [junit4]   2> 	2	/solr/collections/currentstate/state.json
   [junit4]   2> 	2	/solr/overseer_elect/election/96505762945302550-127.0.0.1:41245_solr-n_0000000004
   [junit4]   2> 	2	/solr/collections/tobedeleted/state.json
   [junit4]   2> 
   [junit4]   2> Maximum concurrent children watches above limit:
   [junit4]   2> 
   [junit4]   2> 	53	/solr/overseer/queue
   [junit4]   2> 	33	/solr/overseer/collection-queue-work
   [junit4]   2> 	18	/solr/overseer/queue-work
   [junit4]   2> 	8	/solr/collections
   [junit4]   2> 	5	/solr/live_nodes
   [junit4]   2> 
   [junit4]   2> 218983 INFO  (SUITE-TestCollectionStateWatchers-seed#[CCB29B6C0452746]-worker) [    ] o.a.s.SolrTestCaseJ4 ###deleteCore
   [junit4]   2> NOTE: leaving temporary files on disk at: /export/home/jenkins/workspace/Lucene-Solr-master-Solaris/solr/build/solr-solrj/test/J0/temp/solr.common.cloud.TestCollectionStateWatchers_CCB29B6C0452746-001
   [junit4]   2> Aug 30, 2016 12:45:34 PM com.carrotsearch.randomizedtesting.ThreadLeakControl checkThreadLeaks
   [junit4]   2> WARNING: Will linger awaiting termination of 5 leaked thread(s).
   [junit4]   2> NOTE: test params are: codec=Asserting(Lucene62): {}, docValues:{}, maxPointsInLeafNode=1082, maxMBSortInHeap=6.632810181487399, sim=ClassicSimilarity, locale=uk-UA, timezone=Europe/Astrakhan
   [junit4]   2> NOTE: SunOS 5.11 amd64/Oracle Corporation 1.8.0_102 (64-bit)/cpus=3,threads=1,free=192849680,total=404750336
   [junit4]   2> NOTE: All tests run in this JVM: [SolrDocumentTest, TestJavaBinCodec, StreamExpressionToExpessionTest, GraphExpressionTest, TestCoreAdmin, TestDelegationTokenResponse, ConcurrentUpdateSolrClientTest, SolrExampleStreamingTest, ModifiableSolrParamsTest, TestSpellCheckResponse, TestDocumentObjectBinder, TestSolrJErrorHandling, SolrExampleXMLTest, TestSolrProperties, TestCollectionAdminRequest, CloudSolrClientTest, TestDelegationTokenRequest, TestXMLEscaping, TestUpdateRequestCodec, NamedListTest, JettyWebappTest, SolrExampleStreamingBinaryTest, SolrExampleBinaryTest, LargeVolumeBinaryJettyTest, TestBatchUpdate, LargeVolumeEmbeddedTest, TestEmbeddedSolrServer, TestHash, FieldAnalysisResponseTest, AnlysisResponseBaseTest, GetByIdTest, BasicHttpSolrClientTest, StreamExpressionToExplanationTest, StreamingTest, SolrPingTest, NoOpResponseParserTest, TestToleratedUpdateError, SolrZkClientTest, TestCollectionStateWatchers]
   [junit4] Completed [85/85 (2!)] on J0 in 55.12s, 9 tests, 1 failure <<< FAILURES!

[...truncated 59467 lines...]


Mime
View raw message