lucene-dev mailing list archives

Site index · List index
Message view « Date » · « Thread »
Top « Date » · « Thread »
From Policeman Jenkins Server <jenk...@thetaphi.de>
Subject [JENKINS] Lucene-Solr-master-Linux (32bit/jdk1.8.0_102) - Build # 17571 - Still Unstable!
Date Mon, 15 Aug 2016 13:36:40 GMT
Build: http://jenkins.thetaphi.de/job/Lucene-Solr-master-Linux/17571/
Java: 32bit/jdk1.8.0_102 -server -XX:+UseSerialGC

1 tests failed.
FAILED:  org.apache.solr.cloud.RecoveryZkTest.test

Error Message:
Captured an uncaught exception in thread: Thread[id=9352, name=updateExecutor-1763-thread-3, state=RUNNABLE, group=TGRP-RecoveryZkTest]

Stack Trace:
com.carrotsearch.randomizedtesting.UncaughtExceptionError: Captured an uncaught exception in thread: Thread[id=9352, name=updateExecutor-1763-thread-3, state=RUNNABLE, group=TGRP-RecoveryZkTest]
	at __randomizedtesting.SeedInfo.seed([FF7B6D4FA437E1D5:772F52950ACB8C2D]:0)
Caused by: org.apache.solr.common.SolrException: Replica: https://127.0.0.1:32925/z/k/collection1/ should have been marked under leader initiated recovery in ZkController but wasn't.
	at __randomizedtesting.SeedInfo.seed([FF7B6D4FA437E1D5]:0)
	at org.apache.solr.cloud.LeaderInitiatedRecoveryThread.run(LeaderInitiatedRecoveryThread.java:88)
	at org.apache.solr.common.util.ExecutorUtil$MDCAwareThreadPoolExecutor.lambda$execute$0(ExecutorUtil.java:229)
	at java.util.concurrent.ThreadPoolExecutor.runWorker(ThreadPoolExecutor.java:1142)
	at java.util.concurrent.ThreadPoolExecutor$Worker.run(ThreadPoolExecutor.java:617)
	at java.lang.Thread.run(Thread.java:745)




Build Log:
[...truncated 11440 lines...]
   [junit4] Suite: org.apache.solr.cloud.RecoveryZkTest
   [junit4]   2> Creating dataDir: /home/jenkins/workspace/Lucene-Solr-master-Linux/solr/build/solr-core/test/J0/temp/solr.cloud.RecoveryZkTest_FF7B6D4FA437E1D5-001/init-core-data-001
   [junit4]   2> 1053766 INFO  (SUITE-RecoveryZkTest-seed#[FF7B6D4FA437E1D5]-worker) [    ] o.a.s.SolrTestCaseJ4 Randomized ssl (true) and clientAuth (false) via: @org.apache.solr.util.RandomizeSSL(reason=, ssl=NaN, value=NaN, clientAuth=NaN)
   [junit4]   2> 1053767 INFO  (SUITE-RecoveryZkTest-seed#[FF7B6D4FA437E1D5]-worker) [    ] o.a.s.BaseDistributedSearchTestCase Setting hostContext system property: /z/k
   [junit4]   2> 1053769 INFO  (TEST-RecoveryZkTest.test-seed#[FF7B6D4FA437E1D5]) [    ] o.a.s.c.ZkTestServer STARTING ZK TEST SERVER
   [junit4]   2> 1053769 INFO  (Thread-2124) [    ] o.a.s.c.ZkTestServer client port:0.0.0.0/0.0.0.0:0
   [junit4]   2> 1053769 INFO  (Thread-2124) [    ] o.a.s.c.ZkTestServer Starting server
   [junit4]   2> 1053869 INFO  (TEST-RecoveryZkTest.test-seed#[FF7B6D4FA437E1D5]) [    ] o.a.s.c.ZkTestServer start zk server on port:43126
   [junit4]   2> 1053869 INFO  (TEST-RecoveryZkTest.test-seed#[FF7B6D4FA437E1D5]) [    ] o.a.s.c.c.SolrZkClient Using default ZkCredentialsProvider
   [junit4]   2> 1053869 INFO  (TEST-RecoveryZkTest.test-seed#[FF7B6D4FA437E1D5]) [    ] o.a.s.c.c.ConnectionManager Waiting for client to connect to ZooKeeper
   [junit4]   2> 1053871 INFO  (zkCallback-1749-thread-1) [    ] o.a.s.c.c.ConnectionManager Watcher org.apache.solr.common.cloud.ConnectionManager@a8478c name:ZooKeeperConnection Watcher:127.0.0.1:43126 got event WatchedEvent state:SyncConnected type:None path:null path:null type:None
   [junit4]   2> 1053871 INFO  (TEST-RecoveryZkTest.test-seed#[FF7B6D4FA437E1D5]) [    ] o.a.s.c.c.ConnectionManager Client is connected to ZooKeeper
   [junit4]   2> 1053871 INFO  (TEST-RecoveryZkTest.test-seed#[FF7B6D4FA437E1D5]) [    ] o.a.s.c.c.SolrZkClient Using default ZkACLProvider
   [junit4]   2> 1053871 INFO  (TEST-RecoveryZkTest.test-seed#[FF7B6D4FA437E1D5]) [    ] o.a.s.c.c.SolrZkClient makePath: /solr
   [junit4]   2> 1053872 INFO  (TEST-RecoveryZkTest.test-seed#[FF7B6D4FA437E1D5]) [    ] o.a.s.c.c.SolrZkClient Using default ZkCredentialsProvider
   [junit4]   2> 1053872 INFO  (TEST-RecoveryZkTest.test-seed#[FF7B6D4FA437E1D5]) [    ] o.a.s.c.c.ConnectionManager Waiting for client to connect to ZooKeeper
   [junit4]   2> 1053873 INFO  (zkCallback-1750-thread-1) [    ] o.a.s.c.c.ConnectionManager Watcher org.apache.solr.common.cloud.ConnectionManager@1caad34 name:ZooKeeperConnection Watcher:127.0.0.1:43126/solr got event WatchedEvent state:SyncConnected type:None path:null path:null type:None
   [junit4]   2> 1053873 INFO  (TEST-RecoveryZkTest.test-seed#[FF7B6D4FA437E1D5]) [    ] o.a.s.c.c.ConnectionManager Client is connected to ZooKeeper
   [junit4]   2> 1053873 INFO  (TEST-RecoveryZkTest.test-seed#[FF7B6D4FA437E1D5]) [    ] o.a.s.c.c.SolrZkClient Using default ZkACLProvider
   [junit4]   2> 1053873 INFO  (TEST-RecoveryZkTest.test-seed#[FF7B6D4FA437E1D5]) [    ] o.a.s.c.c.SolrZkClient makePath: /collections/collection1
   [junit4]   2> 1053873 INFO  (TEST-RecoveryZkTest.test-seed#[FF7B6D4FA437E1D5]) [    ] o.a.s.c.c.SolrZkClient makePath: /collections/collection1/shards
   [junit4]   2> 1053874 INFO  (TEST-RecoveryZkTest.test-seed#[FF7B6D4FA437E1D5]) [    ] o.a.s.c.c.SolrZkClient makePath: /collections/control_collection
   [junit4]   2> 1053874 INFO  (TEST-RecoveryZkTest.test-seed#[FF7B6D4FA437E1D5]) [    ] o.a.s.c.c.SolrZkClient makePath: /collections/control_collection/shards
   [junit4]   2> 1053874 INFO  (TEST-RecoveryZkTest.test-seed#[FF7B6D4FA437E1D5]) [    ] o.a.s.c.AbstractZkTestCase put /home/jenkins/workspace/Lucene-Solr-master-Linux/solr/core/src/test-files/solr/collection1/conf/solrconfig-tlog.xml to /configs/conf1/solrconfig.xml
   [junit4]   2> 1053875 INFO  (TEST-RecoveryZkTest.test-seed#[FF7B6D4FA437E1D5]) [    ] o.a.s.c.c.SolrZkClient makePath: /configs/conf1/solrconfig.xml
   [junit4]   2> 1053876 INFO  (TEST-RecoveryZkTest.test-seed#[FF7B6D4FA437E1D5]) [    ] o.a.s.c.AbstractZkTestCase put /home/jenkins/workspace/Lucene-Solr-master-Linux/solr/core/src/test-files/solr/collection1/conf/schema15.xml to /configs/conf1/schema.xml
   [junit4]   2> 1053876 INFO  (TEST-RecoveryZkTest.test-seed#[FF7B6D4FA437E1D5]) [    ] o.a.s.c.c.SolrZkClient makePath: /configs/conf1/schema.xml
   [junit4]   2> 1053876 INFO  (TEST-RecoveryZkTest.test-seed#[FF7B6D4FA437E1D5]) [    ] o.a.s.c.AbstractZkTestCase put /home/jenkins/workspace/Lucene-Solr-master-Linux/solr/core/src/test-files/solr/collection1/conf/solrconfig.snippet.randomindexconfig.xml to /configs/conf1/solrconfig.snippet.randomindexconfig.xml
   [junit4]   2> 1053876 INFO  (TEST-RecoveryZkTest.test-seed#[FF7B6D4FA437E1D5]) [    ] o.a.s.c.c.SolrZkClient makePath: /configs/conf1/solrconfig.snippet.randomindexconfig.xml
   [junit4]   2> 1053877 INFO  (TEST-RecoveryZkTest.test-seed#[FF7B6D4FA437E1D5]) [    ] o.a.s.c.AbstractZkTestCase put /home/jenkins/workspace/Lucene-Solr-master-Linux/solr/core/src/test-files/solr/collection1/conf/stopwords.txt to /configs/conf1/stopwords.txt
   [junit4]   2> 1053877 INFO  (TEST-RecoveryZkTest.test-seed#[FF7B6D4FA437E1D5]) [    ] o.a.s.c.c.SolrZkClient makePath: /configs/conf1/stopwords.txt
   [junit4]   2> 1053877 INFO  (TEST-RecoveryZkTest.test-seed#[FF7B6D4FA437E1D5]) [    ] o.a.s.c.AbstractZkTestCase put /home/jenkins/workspace/Lucene-Solr-master-Linux/solr/core/src/test-files/solr/collection1/conf/protwords.txt to /configs/conf1/protwords.txt
   [junit4]   2> 1053877 INFO  (TEST-RecoveryZkTest.test-seed#[FF7B6D4FA437E1D5]) [    ] o.a.s.c.c.SolrZkClient makePath: /configs/conf1/protwords.txt
   [junit4]   2> 1053878 INFO  (TEST-RecoveryZkTest.test-seed#[FF7B6D4FA437E1D5]) [    ] o.a.s.c.AbstractZkTestCase put /home/jenkins/workspace/Lucene-Solr-master-Linux/solr/core/src/test-files/solr/collection1/conf/currency.xml to /configs/conf1/currency.xml
   [junit4]   2> 1053878 INFO  (TEST-RecoveryZkTest.test-seed#[FF7B6D4FA437E1D5]) [    ] o.a.s.c.c.SolrZkClient makePath: /configs/conf1/currency.xml
   [junit4]   2> 1053878 INFO  (TEST-RecoveryZkTest.test-seed#[FF7B6D4FA437E1D5]) [    ] o.a.s.c.AbstractZkTestCase put /home/jenkins/workspace/Lucene-Solr-master-Linux/solr/core/src/test-files/solr/collection1/conf/enumsConfig.xml to /configs/conf1/enumsConfig.xml
   [junit4]   2> 1053879 INFO  (TEST-RecoveryZkTest.test-seed#[FF7B6D4FA437E1D5]) [    ] o.a.s.c.c.SolrZkClient makePath: /configs/conf1/enumsConfig.xml
   [junit4]   2> 1053879 INFO  (TEST-RecoveryZkTest.test-seed#[FF7B6D4FA437E1D5]) [    ] o.a.s.c.AbstractZkTestCase put /home/jenkins/workspace/Lucene-Solr-master-Linux/solr/core/src/test-files/solr/collection1/conf/open-exchange-rates.json to /configs/conf1/open-exchange-rates.json
   [junit4]   2> 1053879 INFO  (TEST-RecoveryZkTest.test-seed#[FF7B6D4FA437E1D5]) [    ] o.a.s.c.c.SolrZkClient makePath: /configs/conf1/open-exchange-rates.json
   [junit4]   2> 1053880 INFO  (TEST-RecoveryZkTest.test-seed#[FF7B6D4FA437E1D5]) [    ] o.a.s.c.AbstractZkTestCase put /home/jenkins/workspace/Lucene-Solr-master-Linux/solr/core/src/test-files/solr/collection1/conf/mapping-ISOLatin1Accent.txt to /configs/conf1/mapping-ISOLatin1Accent.txt
   [junit4]   2> 1053880 INFO  (TEST-RecoveryZkTest.test-seed#[FF7B6D4FA437E1D5]) [    ] o.a.s.c.c.SolrZkClient makePath: /configs/conf1/mapping-ISOLatin1Accent.txt
   [junit4]   2> 1053880 INFO  (TEST-RecoveryZkTest.test-seed#[FF7B6D4FA437E1D5]) [    ] o.a.s.c.AbstractZkTestCase put /home/jenkins/workspace/Lucene-Solr-master-Linux/solr/core/src/test-files/solr/collection1/conf/old_synonyms.txt to /configs/conf1/old_synonyms.txt
   [junit4]   2> 1053880 INFO  (TEST-RecoveryZkTest.test-seed#[FF7B6D4FA437E1D5]) [    ] o.a.s.c.c.SolrZkClient makePath: /configs/conf1/old_synonyms.txt
   [junit4]   2> 1053881 INFO  (TEST-RecoveryZkTest.test-seed#[FF7B6D4FA437E1D5]) [    ] o.a.s.c.AbstractZkTestCase put /home/jenkins/workspace/Lucene-Solr-master-Linux/solr/core/src/test-files/solr/collection1/conf/synonyms.txt to /configs/conf1/synonyms.txt
   [junit4]   2> 1053881 INFO  (TEST-RecoveryZkTest.test-seed#[FF7B6D4FA437E1D5]) [    ] o.a.s.c.c.SolrZkClient makePath: /configs/conf1/synonyms.txt
   [junit4]   2> 1053881 INFO  (TEST-RecoveryZkTest.test-seed#[FF7B6D4FA437E1D5]) [    ] o.a.s.c.c.SolrZkClient Using default ZkCredentialsProvider
   [junit4]   2> 1053882 INFO  (TEST-RecoveryZkTest.test-seed#[FF7B6D4FA437E1D5]) [    ] o.a.s.c.c.ConnectionManager Waiting for client to connect to ZooKeeper
   [junit4]   2> 1053882 INFO  (zkCallback-1752-thread-1) [    ] o.a.s.c.c.ConnectionManager Watcher org.apache.solr.common.cloud.ConnectionManager@19bbc6d name:ZooKeeperConnection Watcher:127.0.0.1:43126/solr got event WatchedEvent state:SyncConnected type:None path:null path:null type:None
   [junit4]   2> 1053882 INFO  (TEST-RecoveryZkTest.test-seed#[FF7B6D4FA437E1D5]) [    ] o.a.s.c.c.ConnectionManager Client is connected to ZooKeeper
   [junit4]   2> 1053882 INFO  (TEST-RecoveryZkTest.test-seed#[FF7B6D4FA437E1D5]) [    ] o.a.s.c.c.SolrZkClient Using default ZkACLProvider
   [junit4]   2> 1053941 INFO  (TEST-RecoveryZkTest.test-seed#[FF7B6D4FA437E1D5]) [    ] o.a.s.SolrTestCaseJ4 Writing core.properties file to /home/jenkins/workspace/Lucene-Solr-master-Linux/solr/build/solr-core/test/J0/temp/solr.cloud.RecoveryZkTest_FF7B6D4FA437E1D5-001/control-001/cores/collection1
   [junit4]   2> 1053943 INFO  (TEST-RecoveryZkTest.test-seed#[FF7B6D4FA437E1D5]) [    ] o.e.j.s.Server jetty-9.3.8.v20160314
   [junit4]   2> 1053944 INFO  (TEST-RecoveryZkTest.test-seed#[FF7B6D4FA437E1D5]) [    ] o.e.j.s.h.ContextHandler Started o.e.j.s.ServletContextHandler@3c4f22{/z/k,null,AVAILABLE}
   [junit4]   2> 1053947 INFO  (TEST-RecoveryZkTest.test-seed#[FF7B6D4FA437E1D5]) [    ] o.e.j.s.ServerConnector Started ServerConnector@1fd19aa{SSL,[ssl, http/1.1]}{127.0.0.1:38523}
   [junit4]   2> 1053947 INFO  (TEST-RecoveryZkTest.test-seed#[FF7B6D4FA437E1D5]) [    ] o.e.j.s.Server Started @1055874ms
   [junit4]   2> 1053947 INFO  (TEST-RecoveryZkTest.test-seed#[FF7B6D4FA437E1D5]) [    ] o.a.s.c.s.e.JettySolrRunner Jetty properties: {solr.data.dir=/home/jenkins/workspace/Lucene-Solr-master-Linux/solr/build/solr-core/test/J0/temp/solr.cloud.RecoveryZkTest_FF7B6D4FA437E1D5-001/tempDir-001/control/data, hostContext=/z/k, hostPort=38523, coreRootDirectory=/home/jenkins/workspace/Lucene-Solr-master-Linux/solr/build/solr-core/test/J0/../../../../../../../../../home/jenkins/workspace/Lucene-Solr-master-Linux/solr/build/solr-core/test/J0/temp/solr.cloud.RecoveryZkTest_FF7B6D4FA437E1D5-001/control-001/cores}
   [junit4]   2> 1053947 INFO  (TEST-RecoveryZkTest.test-seed#[FF7B6D4FA437E1D5]) [    ] o.a.s.s.SolrDispatchFilter SolrDispatchFilter.init(): sun.misc.Launcher$AppClassLoader@1d16e93
   [junit4]   2> 1053947 INFO  (TEST-RecoveryZkTest.test-seed#[FF7B6D4FA437E1D5]) [    ] o.a.s.c.SolrResourceLoader new SolrResourceLoader for directory: '/home/jenkins/workspace/Lucene-Solr-master-Linux/solr/build/solr-core/test/J0/temp/solr.cloud.RecoveryZkTest_FF7B6D4FA437E1D5-001/control-001'
   [junit4]   2> 1053947 INFO  (TEST-RecoveryZkTest.test-seed#[FF7B6D4FA437E1D5]) [    ] o.a.s.c.SolrResourceLoader JNDI not configured for solr (NoInitialContextEx)
   [junit4]   2> 1053947 INFO  (TEST-RecoveryZkTest.test-seed#[FF7B6D4FA437E1D5]) [    ] o.a.s.c.SolrResourceLoader solr home defaulted to 'solr/' (could not find system property or JNDI)
   [junit4]   2> 1053948 INFO  (TEST-RecoveryZkTest.test-seed#[FF7B6D4FA437E1D5]) [    ] o.a.s.c.c.SolrZkClient Using default ZkCredentialsProvider
   [junit4]   2> 1053948 INFO  (TEST-RecoveryZkTest.test-seed#[FF7B6D4FA437E1D5]) [    ] o.a.s.c.c.ConnectionManager Waiting for client to connect to ZooKeeper
   [junit4]   2> 1053948 INFO  (zkCallback-1753-thread-1) [    ] o.a.s.c.c.ConnectionManager Watcher org.apache.solr.common.cloud.ConnectionManager@e76626 name:ZooKeeperConnection Watcher:127.0.0.1:43126/solr got event WatchedEvent state:SyncConnected type:None path:null path:null type:None
   [junit4]   2> 1053948 INFO  (TEST-RecoveryZkTest.test-seed#[FF7B6D4FA437E1D5]) [    ] o.a.s.c.c.ConnectionManager Client is connected to ZooKeeper
   [junit4]   2> 1053949 INFO  (TEST-RecoveryZkTest.test-seed#[FF7B6D4FA437E1D5]) [    ] o.a.s.c.c.SolrZkClient Using default ZkACLProvider
   [junit4]   2> 1053949 INFO  (TEST-RecoveryZkTest.test-seed#[FF7B6D4FA437E1D5]) [    ] o.a.s.s.SolrDispatchFilter Loading solr.xml from SolrHome (not found in ZooKeeper)
   [junit4]   2> 1053949 INFO  (TEST-RecoveryZkTest.test-seed#[FF7B6D4FA437E1D5]) [    ] o.a.s.c.SolrXmlConfig Loading container configuration from /home/jenkins/workspace/Lucene-Solr-master-Linux/solr/build/solr-core/test/J0/temp/solr.cloud.RecoveryZkTest_FF7B6D4FA437E1D5-001/control-001/solr.xml
   [junit4]   2> 1053953 INFO  (TEST-RecoveryZkTest.test-seed#[FF7B6D4FA437E1D5]) [    ] o.a.s.c.CorePropertiesLocator Config-defined core root directory: /home/jenkins/workspace/Lucene-Solr-master-Linux/solr/build/solr-core/test/J0/../../../../../../../../../home/jenkins/workspace/Lucene-Solr-master-Linux/solr/build/solr-core/test/J0/temp/solr.cloud.RecoveryZkTest_FF7B6D4FA437E1D5-001/control-001/cores
   [junit4]   2> 1053953 INFO  (TEST-RecoveryZkTest.test-seed#[FF7B6D4FA437E1D5]) [    ] o.a.s.c.CoreContainer New CoreContainer 26143849
   [junit4]   2> 1053953 INFO  (TEST-RecoveryZkTest.test-seed#[FF7B6D4FA437E1D5]) [    ] o.a.s.c.CoreContainer Loading cores into CoreContainer [instanceDir=/home/jenkins/workspace/Lucene-Solr-master-Linux/solr/build/solr-core/test/J0/temp/solr.cloud.RecoveryZkTest_FF7B6D4FA437E1D5-001/control-001]
   [junit4]   2> 1053953 WARN  (TEST-RecoveryZkTest.test-seed#[FF7B6D4FA437E1D5]) [    ] o.a.s.c.CoreContainer Couldn't add files from /home/jenkins/workspace/Lucene-Solr-master-Linux/solr/build/solr-core/test/J0/temp/solr.cloud.RecoveryZkTest_FF7B6D4FA437E1D5-001/control-001/lib to classpath: /home/jenkins/workspace/Lucene-Solr-master-Linux/solr/build/solr-core/test/J0/temp/solr.cloud.RecoveryZkTest_FF7B6D4FA437E1D5-001/control-001/lib
   [junit4]   2> 1053953 INFO  (TEST-RecoveryZkTest.test-seed#[FF7B6D4FA437E1D5]) [    ] o.a.s.h.c.HttpShardHandlerFactory created with socketTimeout : 90000,urlScheme : ,connTimeout : 15000,maxConnectionsPerHost : 20,maxConnections : 10000,corePoolSize : 0,maximumPoolSize : 2147483647,maxThreadIdleTime : 5,sizeOfQueue : -1,fairnessPolicy : false,
   [junit4]   2> 1053955 INFO  (TEST-RecoveryZkTest.test-seed#[FF7B6D4FA437E1D5]) [    ] o.a.s.u.UpdateShardHandler Created UpdateShardHandler HTTP client with params: socketTimeout=340000&connTimeout=45000&maxConnections=100000&maxConnectionsPerHost=100000
   [junit4]   2> 1053955 INFO  (TEST-RecoveryZkTest.test-seed#[FF7B6D4FA437E1D5]) [    ] o.a.s.l.LogWatcher SLF4J impl is org.slf4j.impl.Log4jLoggerFactory
   [junit4]   2> 1053955 INFO  (TEST-RecoveryZkTest.test-seed#[FF7B6D4FA437E1D5]) [    ] o.a.s.l.LogWatcher Registering Log Listener [Log4j (org.slf4j.impl.Log4jLoggerFactory)]
   [junit4]   2> 1053955 INFO  (TEST-RecoveryZkTest.test-seed#[FF7B6D4FA437E1D5]) [    ] o.a.s.c.ZkContainer Zookeeper client=127.0.0.1:43126/solr
   [junit4]   2> 1053955 INFO  (TEST-RecoveryZkTest.test-seed#[FF7B6D4FA437E1D5]) [    ] o.a.s.c.ZkController zkHost includes chroot
   [junit4]   2> 1053955 INFO  (TEST-RecoveryZkTest.test-seed#[FF7B6D4FA437E1D5]) [    ] o.a.s.c.c.SolrZkClient Using default ZkCredentialsProvider
   [junit4]   2> 1053956 INFO  (TEST-RecoveryZkTest.test-seed#[FF7B6D4FA437E1D5]) [    ] o.a.s.c.c.ConnectionManager Waiting for client to connect to ZooKeeper
   [junit4]   2> 1053956 INFO  (zkCallback-1756-thread-1) [    ] o.a.s.c.c.ConnectionManager Watcher org.apache.solr.common.cloud.ConnectionManager@16542b5 name:ZooKeeperConnection Watcher:127.0.0.1:43126 got event WatchedEvent state:SyncConnected type:None path:null path:null type:None
   [junit4]   2> 1053956 INFO  (TEST-RecoveryZkTest.test-seed#[FF7B6D4FA437E1D5]) [    ] o.a.s.c.c.ConnectionManager Client is connected to ZooKeeper
   [junit4]   2> 1053956 INFO  (TEST-RecoveryZkTest.test-seed#[FF7B6D4FA437E1D5]) [    ] o.a.s.c.c.SolrZkClient Using default ZkACLProvider
   [junit4]   2> 1053957 INFO  (TEST-RecoveryZkTest.test-seed#[FF7B6D4FA437E1D5]) [n:127.0.0.1:38523_z%2Fk    ] o.a.s.c.ZkController Added new OnReconnect listener org.apache.solr.cloud.ZkController$$Lambda$87/13543940@57476d
   [junit4]   2> 1053957 INFO  (TEST-RecoveryZkTest.test-seed#[FF7B6D4FA437E1D5]) [n:127.0.0.1:38523_z%2Fk    ] o.a.s.c.c.ConnectionManager Waiting for client to connect to ZooKeeper
   [junit4]   2> 1053958 INFO  (zkCallback-1757-thread-1-processing-n:127.0.0.1:38523_z%2Fk) [n:127.0.0.1:38523_z%2Fk    ] o.a.s.c.c.ConnectionManager Watcher org.apache.solr.common.cloud.ConnectionManager@bfd7fa name:ZooKeeperConnection Watcher:127.0.0.1:43126/solr got event WatchedEvent state:SyncConnected type:None path:null path:null type:None
   [junit4]   2> 1053958 INFO  (TEST-RecoveryZkTest.test-seed#[FF7B6D4FA437E1D5]) [n:127.0.0.1:38523_z%2Fk    ] o.a.s.c.c.ConnectionManager Client is connected to ZooKeeper
   [junit4]   2> 1053958 INFO  (TEST-RecoveryZkTest.test-seed#[FF7B6D4FA437E1D5]) [n:127.0.0.1:38523_z%2Fk    ] o.a.s.c.c.SolrZkClient makePath: /overseer/queue
   [junit4]   2> 1053960 INFO  (TEST-RecoveryZkTest.test-seed#[FF7B6D4FA437E1D5]) [n:127.0.0.1:38523_z%2Fk    ] o.a.s.c.c.SolrZkClient makePath: /overseer/collection-queue-work
   [junit4]   2> 1053960 INFO  (TEST-RecoveryZkTest.test-seed#[FF7B6D4FA437E1D5]) [n:127.0.0.1:38523_z%2Fk    ] o.a.s.c.c.SolrZkClient makePath: /overseer/collection-map-running
   [junit4]   2> 1053961 INFO  (TEST-RecoveryZkTest.test-seed#[FF7B6D4FA437E1D5]) [n:127.0.0.1:38523_z%2Fk    ] o.a.s.c.c.SolrZkClient makePath: /overseer/collection-map-completed
   [junit4]   2> 1053961 INFO  (TEST-RecoveryZkTest.test-seed#[FF7B6D4FA437E1D5]) [n:127.0.0.1:38523_z%2Fk    ] o.a.s.c.c.SolrZkClient makePath: /overseer/collection-map-failure
   [junit4]   2> 1053962 INFO  (TEST-RecoveryZkTest.test-seed#[FF7B6D4FA437E1D5]) [n:127.0.0.1:38523_z%2Fk    ] o.a.s.c.c.SolrZkClient makePath: /live_nodes
   [junit4]   2> 1053962 INFO  (TEST-RecoveryZkTest.test-seed#[FF7B6D4FA437E1D5]) [n:127.0.0.1:38523_z%2Fk    ] o.a.s.c.c.SolrZkClient makePath: /aliases.json
   [junit4]   2> 1053963 INFO  (TEST-RecoveryZkTest.test-seed#[FF7B6D4FA437E1D5]) [n:127.0.0.1:38523_z%2Fk    ] o.a.s.c.c.SolrZkClient makePath: /clusterstate.json
   [junit4]   2> 1053963 INFO  (TEST-RecoveryZkTest.test-seed#[FF7B6D4FA437E1D5]) [n:127.0.0.1:38523_z%2Fk    ] o.a.s.c.c.SolrZkClient makePath: /security.json
   [junit4]   2> 1053963 INFO  (TEST-RecoveryZkTest.test-seed#[FF7B6D4FA437E1D5]) [n:127.0.0.1:38523_z%2Fk    ] o.a.s.c.c.ZkStateReader Updating cluster state from ZooKeeper... 
   [junit4]   2> 1053963 INFO  (TEST-RecoveryZkTest.test-seed#[FF7B6D4FA437E1D5]) [n:127.0.0.1:38523_z%2Fk    ] o.a.s.c.c.ZkStateReader Loaded cluster properties: {urlScheme=https}
   [junit4]   2> 1053963 INFO  (TEST-RecoveryZkTest.test-seed#[FF7B6D4FA437E1D5]) [n:127.0.0.1:38523_z%2Fk    ] o.a.s.c.c.ZkStateReader Updated live nodes from ZooKeeper... (0) -> (0)
   [junit4]   2> 1053964 INFO  (TEST-RecoveryZkTest.test-seed#[FF7B6D4FA437E1D5]) [n:127.0.0.1:38523_z%2Fk    ] o.a.s.c.c.SolrZkClient makePath: /overseer_elect
   [junit4]   2> 1053964 INFO  (TEST-RecoveryZkTest.test-seed#[FF7B6D4FA437E1D5]) [n:127.0.0.1:38523_z%2Fk    ] o.a.s.c.c.SolrZkClient makePath: /overseer_elect/election
   [junit4]   2> 1053965 INFO  (TEST-RecoveryZkTest.test-seed#[FF7B6D4FA437E1D5]) [n:127.0.0.1:38523_z%2Fk    ] o.a.s.c.Overseer Overseer (id=null) closing
   [junit4]   2> 1053965 INFO  (TEST-RecoveryZkTest.test-seed#[FF7B6D4FA437E1D5]) [n:127.0.0.1:38523_z%2Fk    ] o.a.s.c.LeaderElector Joined leadership election with path: /overseer_elect/election/96420930657910789-127.0.0.1:38523_z%2Fk-n_0000000000
   [junit4]   2> 1053965 INFO  (TEST-RecoveryZkTest.test-seed#[FF7B6D4FA437E1D5]) [n:127.0.0.1:38523_z%2Fk    ] o.a.s.c.OverseerElectionContext I am going to be the leader 127.0.0.1:38523_z%2Fk
   [junit4]   2> 1053965 INFO  (TEST-RecoveryZkTest.test-seed#[FF7B6D4FA437E1D5]) [n:127.0.0.1:38523_z%2Fk    ] o.a.s.c.c.SolrZkClient makePath: /overseer_elect/leader
   [junit4]   2> 1053965 INFO  (TEST-RecoveryZkTest.test-seed#[FF7B6D4FA437E1D5]) [n:127.0.0.1:38523_z%2Fk    ] o.a.s.c.Overseer Overseer (id=96420930657910789-127.0.0.1:38523_z%2Fk-n_0000000000) starting
   [junit4]   2> 1053966 INFO  (TEST-RecoveryZkTest.test-seed#[FF7B6D4FA437E1D5]) [n:127.0.0.1:38523_z%2Fk    ] o.a.s.c.c.SolrZkClient makePath: /overseer/queue-work
   [junit4]   2> 1053967 INFO  (TEST-RecoveryZkTest.test-seed#[FF7B6D4FA437E1D5]) [n:127.0.0.1:38523_z%2Fk    ] o.a.s.c.OverseerAutoReplicaFailoverThread Starting OverseerAutoReplicaFailoverThread autoReplicaFailoverWorkLoopDelay=10000 autoReplicaFailoverWaitAfterExpiration=10000 autoReplicaFailoverBadNodeExpiration=60000
   [junit4]   2> 1053967 INFO  (OverseerCollectionConfigSetProcessor-96420930657910789-127.0.0.1:38523_z%2Fk-n_0000000000) [n:127.0.0.1:38523_z%2Fk    ] o.a.s.c.OverseerTaskProcessor Process current queue of overseer operations
   [junit4]   2> 1053967 INFO  (OverseerStateUpdate-96420930657910789-127.0.0.1:38523_z%2Fk-n_0000000000) [n:127.0.0.1:38523_z%2Fk    ] o.a.s.c.Overseer Starting to work on the main queue
   [junit4]   2> 1053967 INFO  (TEST-RecoveryZkTest.test-seed#[FF7B6D4FA437E1D5]) [n:127.0.0.1:38523_z%2Fk    ] o.a.s.c.ZkController Register node as live in ZooKeeper:/live_nodes/127.0.0.1:38523_z%2Fk
   [junit4]   2> 1053968 INFO  (TEST-RecoveryZkTest.test-seed#[FF7B6D4FA437E1D5]) [n:127.0.0.1:38523_z%2Fk    ] o.a.s.c.c.SolrZkClient makePath: /live_nodes/127.0.0.1:38523_z%2Fk
   [junit4]   2> 1053968 INFO  (OverseerStateUpdate-96420930657910789-127.0.0.1:38523_z%2Fk-n_0000000000) [n:127.0.0.1:38523_z%2Fk    ] o.a.s.c.c.ZkStateReader Updated live nodes from ZooKeeper... (0) -> (0)
   [junit4]   2> 1053968 INFO  (zkCallback-1757-thread-1-processing-n:127.0.0.1:38523_z%2Fk) [n:127.0.0.1:38523_z%2Fk    ] o.a.s.c.c.ZkStateReader A live node change: [WatchedEvent state:SyncConnected type:NodeChildrenChanged path:/live_nodes], has occurred - updating... (live nodes size: [0])
   [junit4]   2> 1053968 INFO  (zkCallback-1757-thread-1-processing-n:127.0.0.1:38523_z%2Fk) [n:127.0.0.1:38523_z%2Fk    ] o.a.s.c.c.ZkStateReader Updated live nodes from ZooKeeper... (0) -> (1)
   [junit4]   2> 1053980 INFO  (TEST-RecoveryZkTest.test-seed#[FF7B6D4FA437E1D5]) [n:127.0.0.1:38523_z%2Fk    ] o.a.s.c.CoreContainer Security conf doesn't exist. Skipping setup for authorization module.
   [junit4]   2> 1053980 INFO  (TEST-RecoveryZkTest.test-seed#[FF7B6D4FA437E1D5]) [n:127.0.0.1:38523_z%2Fk    ] o.a.s.c.CoreContainer No authentication plugin used.
   [junit4]   2> 1053981 INFO  (TEST-RecoveryZkTest.test-seed#[FF7B6D4FA437E1D5]) [n:127.0.0.1:38523_z%2Fk    ] o.a.s.c.CorePropertiesLocator Looking for core definitions underneath /home/jenkins/workspace/Lucene-Solr-master-Linux/solr/build/solr-core/test/J0/../../../../../../../../../home/jenkins/workspace/Lucene-Solr-master-Linux/solr/build/solr-core/test/J0/temp/solr.cloud.RecoveryZkTest_FF7B6D4FA437E1D5-001/control-001/cores
   [junit4]   2> 1053981 INFO  (TEST-RecoveryZkTest.test-seed#[FF7B6D4FA437E1D5]) [n:127.0.0.1:38523_z%2Fk    ] o.a.s.c.CoreDescriptor Created CoreDescriptor: {name=collection1, config=solrconfig.xml, transient=false, schema=schema.xml, loadOnStartup=true, configSetProperties=configsetprops.json, collection=control_collection, coreNodeName=, dataDir=data/, shard=}
   [junit4]   2> 1053982 INFO  (TEST-RecoveryZkTest.test-seed#[FF7B6D4FA437E1D5]) [n:127.0.0.1:38523_z%2Fk    ] o.a.s.c.CorePropertiesLocator Found core collection1 in /home/jenkins/workspace/Lucene-Solr-master-Linux/solr/build/solr-core/test/J0/../../../../../../../../../home/jenkins/workspace/Lucene-Solr-master-Linux/solr/build/solr-core/test/J0/temp/solr.cloud.RecoveryZkTest_FF7B6D4FA437E1D5-001/control-001/cores/collection1
   [junit4]   2> 1053982 INFO  (TEST-RecoveryZkTest.test-seed#[FF7B6D4FA437E1D5]) [n:127.0.0.1:38523_z%2Fk    ] o.a.s.c.CorePropertiesLocator Found 1 core definitions
   [junit4]   2> 1053982 INFO  (coreLoadExecutor-4548-thread-1-processing-n:127.0.0.1:38523_z%2Fk) [n:127.0.0.1:38523_z%2Fk c:control_collection   x:collection1] o.a.s.c.ZkController publishing state=down
   [junit4]   2> 1053982 INFO  (coreLoadExecutor-4548-thread-1-processing-n:127.0.0.1:38523_z%2Fk) [n:127.0.0.1:38523_z%2Fk c:control_collection   x:collection1] o.a.s.c.ZkController numShards not found on descriptor - reading it from system property
   [junit4]   2> 1053982 INFO  (TEST-RecoveryZkTest.test-seed#[FF7B6D4FA437E1D5]) [n:127.0.0.1:38523_z%2Fk    ] o.a.s.s.SolrDispatchFilter user.dir=/home/jenkins/workspace/Lucene-Solr-master-Linux/solr/build/solr-core/test/J0
   [junit4]   2> 1053982 INFO  (TEST-RecoveryZkTest.test-seed#[FF7B6D4FA437E1D5]) [n:127.0.0.1:38523_z%2Fk    ] o.a.s.s.SolrDispatchFilter SolrDispatchFilter.init() done
   [junit4]   2> 1053982 INFO  (coreLoadExecutor-4548-thread-1-processing-n:127.0.0.1:38523_z%2Fk) [n:127.0.0.1:38523_z%2Fk c:control_collection   x:collection1] o.a.s.c.ZkController Collection control_collection not visible yet, but flagging it so a watch is registered when it becomes visible
   [junit4]   2> 1053982 INFO  (OverseerStateUpdate-96420930657910789-127.0.0.1:38523_z%2Fk-n_0000000000) [n:127.0.0.1:38523_z%2Fk    ] o.a.s.c.Overseer processMessage: queueSize: 1, message = {
   [junit4]   2>   "core":"collection1",
   [junit4]   2>   "roles":null,
   [junit4]   2>   "base_url":"https://127.0.0.1:38523/z/k",
   [junit4]   2>   "node_name":"127.0.0.1:38523_z%2Fk",
   [junit4]   2>   "numShards":"1",
   [junit4]   2>   "state":"down",
   [junit4]   2>   "shard":null,
   [junit4]   2>   "collection":"control_collection",
   [junit4]   2>   "operation":"state"} current state version: 0
   [junit4]   2> 1053983 INFO  (OverseerStateUpdate-96420930657910789-127.0.0.1:38523_z%2Fk-n_0000000000) [n:127.0.0.1:38523_z%2Fk    ] o.a.s.c.o.ReplicaMutator Update state numShards=1 message={
   [junit4]   2>   "core":"collection1",
   [junit4]   2>   "roles":null,
   [junit4]   2>   "base_url":"https://127.0.0.1:38523/z/k",
   [junit4]   2>   "node_name":"127.0.0.1:38523_z%2Fk",
   [junit4]   2>   "numShards":"1",
   [junit4]   2>   "state":"down",
   [junit4]   2>   "shard":null,
   [junit4]   2>   "collection":"control_collection",
   [junit4]   2>   "operation":"state"}
   [junit4]   2> 1053983 INFO  (coreLoadExecutor-4548-thread-1-processing-n:127.0.0.1:38523_z%2Fk) [n:127.0.0.1:38523_z%2Fk c:control_collection   x:collection1] o.a.s.c.c.ZkStateReader Deleting data for [control_collection]
   [junit4]   2> 1053983 INFO  (OverseerStateUpdate-96420930657910789-127.0.0.1:38523_z%2Fk-n_0000000000) [n:127.0.0.1:38523_z%2Fk    ] o.a.s.c.o.ClusterStateMutator building a new cName: control_collection
   [junit4]   2> 1053983 INFO  (OverseerStateUpdate-96420930657910789-127.0.0.1:38523_z%2Fk-n_0000000000) [n:127.0.0.1:38523_z%2Fk    ] o.a.s.c.o.ReplicaMutator Assigning new node to shard shard=shard1
   [junit4]   2> 1053984 INFO  (coreLoadExecutor-4548-thread-1-processing-n:127.0.0.1:38523_z%2Fk) [n:127.0.0.1:38523_z%2Fk c:control_collection   x:collection1] o.a.s.c.ZkController look for our core node name
   [junit4]   2> 1053984 INFO  (zkCallback-1757-thread-1-processing-n:127.0.0.1:38523_z%2Fk) [n:127.0.0.1:38523_z%2Fk    ] o.a.s.c.c.ZkStateReader A cluster state change: [WatchedEvent state:SyncConnected type:NodeDataChanged path:/clusterstate.json], has occurred - updating... (live nodes size: [1])
   [junit4]   2> 1054984 INFO  (coreLoadExecutor-4548-thread-1-processing-n:127.0.0.1:38523_z%2Fk) [n:127.0.0.1:38523_z%2Fk c:control_collection   x:collection1] o.a.s.c.ZkController waiting to find shard id in clusterstate for collection1
   [junit4]   2> 1054984 INFO  (coreLoadExecutor-4548-thread-1-processing-n:127.0.0.1:38523_z%2Fk) [n:127.0.0.1:38523_z%2Fk c:control_collection   x:collection1] o.a.s.c.ZkController Check for collection zkNode:control_collection
   [junit4]   2> 1054984 INFO  (coreLoadExecutor-4548-thread-1-processing-n:127.0.0.1:38523_z%2Fk) [n:127.0.0.1:38523_z%2Fk c:control_collection   x:collection1] o.a.s.c.ZkController Collection zkNode exists
   [junit4]   2> 1054984 INFO  (coreLoadExecutor-4548-thread-1-processing-n:127.0.0.1:38523_z%2Fk) [n:127.0.0.1:38523_z%2Fk c:control_collection   x:collection1] o.a.s.c.c.ZkStateReader Load collection config from: [/collections/control_collection]
   [junit4]   2> 1054985 INFO  (coreLoadExecutor-4548-thread-1-processing-n:127.0.0.1:38523_z%2Fk) [n:127.0.0.1:38523_z%2Fk c:control_collection   x:collection1] o.a.s.c.c.ZkStateReader path=[/collections/control_collection] [configName]=[conf1] specified config exists in ZooKeeper
   [junit4]   2> 1054985 INFO  (coreLoadExecutor-4548-thread-1-processing-n:127.0.0.1:38523_z%2Fk) [n:127.0.0.1:38523_z%2Fk c:control_collection   x:collection1] o.a.s.c.SolrResourceLoader new SolrResourceLoader for directory: '/home/jenkins/workspace/Lucene-Solr-master-Linux/solr/build/solr-core/test/J0/temp/solr.cloud.RecoveryZkTest_FF7B6D4FA437E1D5-001/control-001/cores/collection1'
   [junit4]   2> 1054985 INFO  (coreLoadExecutor-4548-thread-1-processing-n:127.0.0.1:38523_z%2Fk) [n:127.0.0.1:38523_z%2Fk c:control_collection   x:collection1] o.a.s.c.SolrResourceLoader JNDI not configured for solr (NoInitialContextEx)
   [junit4]   2> 1054985 INFO  (coreLoadExecutor-4548-thread-1-processing-n:127.0.0.1:38523_z%2Fk) [n:127.0.0.1:38523_z%2Fk c:control_collection   x:collection1] o.a.s.c.SolrResourceLoader solr home defaulted to 'solr/' (could not find system property or JNDI)
   [junit4]   2> 1054986 INFO  (coreLoadExecutor-4548-thread-1-processing-n:127.0.0.1:38523_z%2Fk) [n:127.0.0.1:38523_z%2Fk c:control_collection   x:collection1] o.a.s.c.Config loaded config solrconfig.xml with version 0 
   [junit4]   2> 1054989 INFO  (coreLoadExecutor-4548-thread-1-processing-n:127.0.0.1:38523_z%2Fk) [n:127.0.0.1:38523_z%2Fk c:control_collection   x:collection1] o.a.s.c.SolrConfig current version of requestparams : -1
   [junit4]   2> 1054991 WARN  (coreLoadExecutor-4548-thread-1-processing-n:127.0.0.1:38523_z%2Fk) [n:127.0.0.1:38523_z%2Fk c:control_collection   x:collection1] o.a.s.c.Config Beginning with Solr 5.5, <mergePolicy> is deprecated, use <mergePolicyFactory> instead.
   [junit4]   2> 1054992 INFO  (coreLoadExecutor-4548-thread-1-processing-n:127.0.0.1:38523_z%2Fk) [n:127.0.0.1:38523_z%2Fk c:control_collection   x:collection1] o.a.s.c.SolrConfig Using Lucene MatchVersion: 7.0.0
   [junit4]   2> 1054998 INFO  (coreLoadExecutor-4548-thread-1-processing-n:127.0.0.1:38523_z%2Fk) [n:127.0.0.1:38523_z%2Fk c:control_collection   x:collection1] o.a.s.c.SolrConfig Loaded SolrConfig: solrconfig.xml
   [junit4]   2> 1055001 INFO  (coreLoadExecutor-4548-thread-1-processing-n:127.0.0.1:38523_z%2Fk) [n:127.0.0.1:38523_z%2Fk c:control_collection   x:collection1] o.a.s.s.IndexSchema [collection1] Schema name=test
   [junit4]   2> 1055054 INFO  (coreLoadExecutor-4548-thread-1-processing-n:127.0.0.1:38523_z%2Fk) [n:127.0.0.1:38523_z%2Fk c:control_collection   x:collection1] o.a.s.s.IndexSchema default search field in schema is text
   [junit4]   2> 1055054 INFO  (coreLoadExecutor-4548-thread-1-processing-n:127.0.0.1:38523_z%2Fk) [n:127.0.0.1:38523_z%2Fk c:control_collection   x:collection1] o.a.s.s.IndexSchema unique key field: id
   [junit4]   2> 1055055 INFO  (coreLoadExecutor-4548-thread-1-processing-n:127.0.0.1:38523_z%2Fk) [n:127.0.0.1:38523_z%2Fk c:control_collection   x:collection1] o.a.s.s.FileExchangeRateProvider Reloading exchange rates from file currency.xml
   [junit4]   2> 1055056 INFO  (coreLoadExecutor-4548-thread-1-processing-n:127.0.0.1:38523_z%2Fk) [n:127.0.0.1:38523_z%2Fk c:control_collection   x:collection1] o.a.s.s.FileExchangeRateProvider Reloading exchange rates from file currency.xml
   [junit4]   2> 1055062 INFO  (coreLoadExecutor-4548-thread-1-processing-n:127.0.0.1:38523_z%2Fk) [n:127.0.0.1:38523_z%2Fk c:control_collection   x:collection1] o.a.s.c.ConfigSetProperties Did not find ConfigSet properties, assuming default properties: Can't find resource 'configsetprops.json' in classpath or '/configs/conf1', cwd=/home/jenkins/workspace/Lucene-Solr-master-Linux/solr/build/solr-core/test/J0
   [junit4]   2> 1055062 INFO  (coreLoadExecutor-4548-thread-1-processing-n:127.0.0.1:38523_z%2Fk) [n:127.0.0.1:38523_z%2Fk c:control_collection   x:collection1] o.a.s.c.CoreContainer Creating SolrCore 'collection1' using configuration from collection control_collection
   [junit4]   2> 1055062 INFO  (coreLoadExecutor-4548-thread-1-processing-n:127.0.0.1:38523_z%2Fk) [n:127.0.0.1:38523_z%2Fk c:control_collection s:shard1 r:core_node1 x:collection1] o.a.s.c.SolrCore org.apache.solr.core.MockDirectoryFactory
   [junit4]   2> 1055062 INFO  (coreLoadExecutor-4548-thread-1-processing-n:127.0.0.1:38523_z%2Fk) [n:127.0.0.1:38523_z%2Fk c:control_collection s:shard1 r:core_node1 x:collection1] o.a.s.c.SolrCore [[collection1] ] Opening new SolrCore at [/home/jenkins/workspace/Lucene-Solr-master-Linux/solr/build/solr-core/test/J0/temp/solr.cloud.RecoveryZkTest_FF7B6D4FA437E1D5-001/control-001/cores/collection1], dataDir=[/home/jenkins/workspace/Lucene-Solr-master-Linux/solr/build/solr-core/test/J0/../../../../../../../../../home/jenkins/workspace/Lucene-Solr-master-Linux/solr/build/solr-core/test/J0/temp/solr.cloud.RecoveryZkTest_FF7B6D4FA437E1D5-001/control-001/cores/collection1/data/]
   [junit4]   2> 1055062 INFO  (coreLoadExecutor-4548-thread-1-processing-n:127.0.0.1:38523_z%2Fk) [n:127.0.0.1:38523_z%2Fk c:control_collection s:shard1 r:core_node1 x:collection1] o.a.s.c.JmxMonitoredMap JMX monitoring is enabled. Adding Solr mbeans to JMX Server: com.sun.jmx.mbeanserver.JmxMBeanServer@16fc28e
   [junit4]   2> 1055063 INFO  (coreLoadExecutor-4548-thread-1-processing-n:127.0.0.1:38523_z%2Fk) [n:127.0.0.1:38523_z%2Fk c:control_collection s:shard1 r:core_node1 x:collection1] o.a.s.c.CachingDirectoryFactory return new directory for /home/jenkins/workspace/Lucene-Solr-master-Linux/solr/build/solr-core/test/J0/../../../../../../../../../home/jenkins/workspace/Lucene-Solr-master-Linux/solr/build/solr-core/test/J0/temp/solr.cloud.RecoveryZkTest_FF7B6D4FA437E1D5-001/control-001/cores/collection1/data/snapshot_metadata
   [junit4]   2> 1055063 INFO  (coreLoadExecutor-4548-thread-1-processing-n:127.0.0.1:38523_z%2Fk) [n:127.0.0.1:38523_z%2Fk c:control_collection s:shard1 r:core_node1 x:collection1] o.a.s.c.s.SolrSnapshotMetaDataManager Loading from snapshot metadata file...
   [junit4]   2> 1055063 INFO  (coreLoadExecutor-4548-thread-1-processing-n:127.0.0.1:38523_z%2Fk) [n:127.0.0.1:38523_z%2Fk c:control_collection s:shard1 r:core_node1 x:collection1] o.a.s.c.CachingDirectoryFactory return new directory for /home/jenkins/workspace/Lucene-Solr-master-Linux/solr/build/solr-core/test/J0/../../../../../../../../../home/jenkins/workspace/Lucene-Solr-master-Linux/solr/build/solr-core/test/J0/temp/solr.cloud.RecoveryZkTest_FF7B6D4FA437E1D5-001/control-001/cores/collection1/data
   [junit4]   2> 1055063 INFO  (coreLoadExecutor-4548-thread-1-processing-n:127.0.0.1:38523_z%2Fk) [n:127.0.0.1:38523_z%2Fk c:control_collection s:shard1 r:core_node1 x:collection1] o.a.s.c.SolrCore New index directory detected: old=null new=/home/jenkins/workspace/Lucene-Solr-master-Linux/solr/build/solr-core/test/J0/../../../../../../../../../home/jenkins/workspace/Lucene-Solr-master-Linux/solr/build/solr-core/test/J0/temp/solr.cloud.RecoveryZkTest_FF7B6D4FA437E1D5-001/control-001/cores/collection1/data/index/
   [junit4]   2> 1055063 WARN  (coreLoadExecutor-4548-thread-1-processing-n:127.0.0.1:38523_z%2Fk) [n:127.0.0.1:38523_z%2Fk c:control_collection s:shard1 r:core_node1 x:collection1] o.a.s.c.SolrCore [collection1] Solr index directory '/home/jenkins/workspace/Lucene-Solr-master-Linux/solr/build/solr-core/test/J0/../../../../../../../../../home/jenkins/workspace/Lucene-Solr-master-Linux/solr/build/solr-core/test/J0/temp/solr.cloud.RecoveryZkTest_FF7B6D4FA437E1D5-001/control-001/cores/collection1/data/index' doesn't exist. Creating new index...
   [junit4]   2> 1055064 INFO  (coreLoadExecutor-4548-thread-1-processing-n:127.0.0.1:38523_z%2Fk) [n:127.0.0.1:38523_z%2Fk c:control_collection s:shard1 r:core_node1 x:collection1] o.a.s.c.CachingDirectoryFactory return new directory for /home/jenkins/workspace/Lucene-Solr-master-Linux/solr/build/solr-core/test/J0/../../../../../../../../../home/jenkins/workspace/Lucene-Solr-master-Linux/solr/build/solr-core/test/J0/temp/solr.cloud.RecoveryZkTest_FF7B6D4FA437E1D5-001/control-001/cores/collection1/data/index
   [junit4]   2> 1055064 INFO  (coreLoadExecutor-4548-thread-1-processing-n:127.0.0.1:38523_z%2Fk) [n:127.0.0.1:38523_z%2Fk c:control_collection s:shard1 r:core_node1 x:collection1] o.a.s.u.RandomMergePolicy RandomMergePolicy wrapping class org.apache.lucene.index.LogDocMergePolicy: [LogDocMergePolicy: minMergeSize=1000, mergeFactor=25, maxMergeSize=9223372036854775807, maxMergeSizeForForcedMerge=9223372036854775807, calibrateSizeByDeletes=false, maxMergeDocs=2147483647, maxCFSSegmentSizeMB=8.796093022207999E12, noCFSRatio=0.5284436844598078]
   [junit4]   2> 1055064 INFO  (coreLoadExecutor-4548-thread-1-processing-n:127.0.0.1:38523_z%2Fk) [n:127.0.0.1:38523_z%2Fk c:control_collection s:shard1 r:core_node1 x:collection1] o.a.s.c.SolrDeletionPolicy SolrDeletionPolicy.onCommit: commits: num=1
   [junit4]   2> 	commit{dir=MockDirectoryWrapper(RAMDirectory@2631a3 lockFactory=org.apache.lucene.store.SingleInstanceLockFactory@1ef4da7),segFN=segments_1,generation=1}
   [junit4]   2> 1055064 INFO  (coreLoadExecutor-4548-thread-1-processing-n:127.0.0.1:38523_z%2Fk) [n:127.0.0.1:38523_z%2Fk c:control_collection s:shard1 r:core_node1 x:collection1] o.a.s.c.SolrDeletionPolicy newest commit generation = 1
   [junit4]   2> 1055065 INFO  (OldIndexDirectoryCleanupThreadForCore-collection1) [n:127.0.0.1:38523_z%2Fk c:control_collection s:shard1 r:core_node1 x:collection1] o.a.s.c.SolrCore Looking for old index directories to cleanup for core collection1 in /home/jenkins/workspace/Lucene-Solr-master-Linux/solr/build/solr-core/test/J0/../../../../../../../../../home/jenkins/workspace/Lucene-Solr-master-Linux/solr/build/solr-core/test/J0/temp/solr.cloud.RecoveryZkTest_FF7B6D4FA437E1D5-001/control-001/cores/collection1/data/
   [junit4]   2> 1055065 WARN  (OldIndexDirectoryCleanupThreadForCore-collection1) [n:127.0.0.1:38523_z%2Fk c:control_collection s:shard1 r:core_node1 x:collection1] o.a.s.c.DirectoryFactory /home/jenkins/workspace/Lucene-Solr-master-Linux/solr/build/solr-core/test/J0/../../../../../../../../../home/jenkins/workspace/Lucene-Solr-master-Linux/solr/build/solr-core/test/J0/temp/solr.cloud.RecoveryZkTest_FF7B6D4FA437E1D5-001/control-001/cores/collection1/data/ does not point to a valid data directory; skipping clean-up of old index directories.
   [junit4]   2> 1055067 INFO  (coreLoadExecutor-4548-thread-1-processing-n:127.0.0.1:38523_z%2Fk) [n:127.0.0.1:38523_z%2Fk c:control_collection s:shard1 r:core_node1 x:collection1] o.a.s.u.p.UpdateRequestProcessorChain creating updateRequestProcessorChain "nodistrib"
   [junit4]   2> 1055067 INFO  (coreLoadExecutor-4548-thread-1-processing-n:127.0.0.1:38523_z%2Fk) [n:127.0.0.1:38523_z%2Fk c:control_collection s:shard1 r:core_node1 x:collection1] o.a.s.u.p.UpdateRequestProcessorChain creating updateRequestProcessorChain "dedupe"
   [junit4]   2> 1055067 INFO  (coreLoadExecutor-4548-thread-1-processing-n:127.0.0.1:38523_z%2Fk) [n:127.0.0.1:38523_z%2Fk c:control_collection s:shard1 r:core_node1 x:collection1] o.a.s.u.p.UpdateRequestProcessorChain inserting DistributedUpdateProcessorFactory into updateRequestProcessorChain "dedupe"
   [junit4]   2> 1055067 INFO  (coreLoadExecutor-4548-thread-1-processing-n:127.0.0.1:38523_z%2Fk) [n:127.0.0.1:38523_z%2Fk c:control_collection s:shard1 r:core_node1 x:collection1] o.a.s.u.p.UpdateRequestProcessorChain creating updateRequestProcessorChain "stored_sig"
   [junit4]   2> 1055067 INFO  (coreLoadExecutor-4548-thread-1-processing-n:127.0.0.1:38523_z%2Fk) [n:127.0.0.1:38523_z%2Fk c:control_collection s:shard1 r:core_node1 x:collection1] o.a.s.u.p.UpdateRequestProcessorChain inserting DistributedUpdateProcessorFactory into updateRequestProcessorChain "stored_sig"
   [junit4]   2> 1055067 INFO  (coreLoadExecutor-4548-thread-1-processing-n:127.0.0.1:38523_z%2Fk) [n:127.0.0.1:38523_z%2Fk c:control_collection s:shard1 r:core_node1 x:collection1] o.a.s.u.p.UpdateRequestProcessorChain creating updateRequestProcessorChain "distrib-dup-test-chain-explicit"
   [junit4]   2> 1055067 INFO  (coreLoadExecutor-4548-thread-1-processing-n:127.0.0.1:38523_z%2Fk) [n:127.0.0.1:38523_z%2Fk c:control_collection s:shard1 r:core_node1 x:collection1] o.a.s.u.p.UpdateRequestProcessorChain creating updateRequestProcessorChain "distrib-dup-test-chain-implicit"
   [junit4]   2> 1055067 INFO  (coreLoadExecutor-4548-thread-1-processing-n:127.0.0.1:38523_z%2Fk) [n:127.0.0.1:38523_z%2Fk c:control_collection s:shard1 r:core_node1 x:collection1] o.a.s.u.p.UpdateRequestProcessorChain inserting DistributedUpdateProcessorFactory into updateRequestProcessorChain "distrib-dup-test-chain-implicit"
   [junit4]   2> 1055067 INFO  (coreLoadExecutor-4548-thread-1-processing-n:127.0.0.1:38523_z%2Fk) [n:127.0.0.1:38523_z%2Fk c:control_collection s:shard1 r:core_node1 x:collection1] o.a.s.c.SolrCore no updateRequestProcessorChain defined as default, creating implicit default
   [junit4]   2> 1055067 WARN  (coreLoadExecutor-4548-thread-1-processing-n:127.0.0.1:38523_z%2Fk) [n:127.0.0.1:38523_z%2Fk c:control_collection s:shard1 r:core_node1 x:collection1] o.a.s.c.RequestHandlers INVALID paramSet a in requestHandler {type = requestHandler,name = /dump,class = DumpRequestHandler,args = {defaults={a=A,b=B}}}
   [junit4]   2> 1055068 INFO  (coreLoadExecutor-4548-thread-1-processing-n:127.0.0.1:38523_z%2Fk) [n:127.0.0.1:38523_z%2Fk c:control_collection s:shard1 r:core_node1 x:collection1] o.a.s.h.l.XMLLoader xsltCacheLifetimeSeconds=60
   [junit4]   2> 1055069 INFO  (coreLoadExecutor-4548-thread-1-processing-n:127.0.0.1:38523_z%2Fk) [n:127.0.0.1:38523_z%2Fk c:control_collection s:shard1 r:core_node1 x:collection1] o.a.s.h.l.XMLLoader xsltCacheLifetimeSeconds=60
   [junit4]   2> 1055069 INFO  (coreLoadExecutor-4548-thread-1-processing-n:127.0.0.1:38523_z%2Fk) [n:127.0.0.1:38523_z%2Fk c:control_collection s:shard1 r:core_node1 x:collection1] o.a.s.h.l.XMLLoader xsltCacheLifetimeSeconds=60
   [junit4]   2> 1055070 INFO  (coreLoadExecutor-4548-thread-1-processing-n:127.0.0.1:38523_z%2Fk) [n:127.0.0.1:38523_z%2Fk c:control_collection s:shard1 r:core_node1 x:collection1] o.a.s.h.l.XMLLoader xsltCacheLifetimeSeconds=60
   [junit4]   2> 1055072 INFO  (coreLoadExecutor-4548-thread-1-processing-n:127.0.0.1:38523_z%2Fk) [n:127.0.0.1:38523_z%2Fk c:control_collection s:shard1 r:core_node1 x:collection1] o.a.s.c.RequestHandlers Registered paths: /admin/mbeans,standard,/update/json/docs,/admin/luke,/export,/get,/admin/properties,/update/json,/admin/threads,/dump,/update/csv,/sql,/graph,/admin/segments,/admin/system,/replication,/config,/stream,/schema,/admin/plugins,/admin/logging,/admin/ping,/update,/admin/file,/terms
   [junit4]   2> 1055072 INFO  (coreLoadExecutor-4548-thread-1-processing-n:127.0.0.1:38523_z%2Fk) [n:127.0.0.1:38523_z%2Fk c:control_collection s:shard1 r:core_node1 x:collection1] o.a.s.c.SolrCore Using default statsCache cache: org.apache.solr.search.stats.LocalStatsCache
   [junit4]   2> 1055072 INFO  (coreLoadExecutor-4548-thread-1-processing-n:127.0.0.1:38523_z%2Fk) [n:127.0.0.1:38523_z%2Fk c:control_collection s:shard1 r:core_node1 x:collection1] o.a.s.u.UpdateHandler Using UpdateLog implementation: org.apache.solr.update.UpdateLog
   [junit4]   2> 1055072 INFO  (coreLoadExecutor-4548-thread-1-processing-n:127.0.0.1:38523_z%2Fk) [n:127.0.0.1:38523_z%2Fk c:control_collection s:shard1 r:core_node1 x:collection1] o.a.s.u.UpdateLog Initializing UpdateLog: dataDir= defaultSyncLevel=FLUSH numRecordsToKeep=100 maxNumLogsToKeep=10 numVersionBuckets=65536
   [junit4]   2> 1055073 INFO  (coreLoadExecutor-4548-thread-1-processing-n:127.0.0.1:38523_z%2Fk) [n:127.0.0.1:38523_z%2Fk c:control_collection s:shard1 r:core_node1 x:collection1] o.a.s.u.CommitTracker Hard AutoCommit: disabled
   [junit4]   2> 1055073 INFO  (coreLoadExecutor-4548-thread-1-processing-n:127.0.0.1:38523_z%2Fk) [n:127.0.0.1:38523_z%2Fk c:control_collection s:shard1 r:core_node1 x:collection1] o.a.s.u.CommitTracker Soft AutoCommit: disabled
   [junit4]   2> 1055073 INFO  (coreLoadExecutor-4548-thread-1-processing-n:127.0.0.1:38523_z%2Fk) [n:127.0.0.1:38523_z%2Fk c:control_collection s:shard1 r:core_node1 x:collection1] o.a.s.u.RandomMergePolicy RandomMergePolicy wrapping class org.apache.lucene.index.LogDocMergePolicy: [LogDocMergePolicy: minMergeSize=1000, mergeFactor=26, maxMergeSize=9223372036854775807, maxMergeSizeForForcedMerge=9223372036854775807, calibrateSizeByDeletes=true, maxMergeDocs=2147483647, maxCFSSegmentSizeMB=8.796093022207999E12, noCFSRatio=1.0]
   [junit4]   2> 1055073 INFO  (coreLoadExecutor-4548-thread-1-processing-n:127.0.0.1:38523_z%2Fk) [n:127.0.0.1:38523_z%2Fk c:control_collection s:shard1 r:core_node1 x:collection1] o.a.s.c.SolrDeletionPolicy SolrDeletionPolicy.onInit: commits: num=1
   [junit4]   2> 	commit{dir=MockDirectoryWrapper(RAMDirectory@2631a3 lockFactory=org.apache.lucene.store.SingleInstanceLockFactory@1ef4da7),segFN=segments_1,generation=1}
   [junit4]   2> 1055073 INFO  (coreLoadExecutor-4548-thread-1-processing-n:127.0.0.1:38523_z%2Fk) [n:127.0.0.1:38523_z%2Fk c:control_collection s:shard1 r:core_node1 x:collection1] o.a.s.c.SolrDeletionPolicy newest commit generation = 1
   [junit4]   2> 1055074 INFO  (coreLoadExecutor-4548-thread-1-processing-n:127.0.0.1:38523_z%2Fk) [n:127.0.0.1:38523_z%2Fk c:control_collection s:shard1 r:core_node1 x:collection1] o.a.s.s.SolrIndexSearcher Opening [Searcher@678080[collection1] main]
   [junit4]   2> 1055074 INFO  (coreLoadExecutor-4548-thread-1-processing-n:127.0.0.1:38523_z%2Fk) [n:127.0.0.1:38523_z%2Fk c:control_collection s:shard1 r:core_node1 x:collection1] o.a.s.c.c.ZkStateReader Load collection config from: [/collections/control_collection]
   [junit4]   2> 1055074 INFO  (coreLoadExecutor-4548-thread-1-processing-n:127.0.0.1:38523_z%2Fk) [n:127.0.0.1:38523_z%2Fk c:control_collection s:shard1 r:core_node1 x:collection1] o.a.s.c.c.ZkStateReader path=[/collections/control_collection] [configName]=[conf1] specified config exists in ZooKeeper
   [junit4]   2> 1055074 INFO  (coreLoadExecutor-4548-thread-1-processing-n:127.0.0.1:38523_z%2Fk) [n:127.0.0.1:38523_z%2Fk c:control_collection s:shard1 r:core_node1 x:collection1] o.a.s.r.ManagedResourceStorage Setting up ZooKeeper-based storage for the RestManager with znodeBase: /configs/conf1
   [junit4]   2> 1055074 INFO  (coreLoadExecutor-4548-thread-1-processing-n:127.0.0.1:38523_z%2Fk) [n:127.0.0.1:38523_z%2Fk c:control_collection s:shard1 r:core_node1 x:collection1] o.a.s.r.ManagedResourceStorage Configured ZooKeeperStorageIO with znodeBase: /configs/conf1
   [junit4]   2> 1055074 INFO  (coreLoadExecutor-4548-thread-1-processing-n:127.0.0.1:38523_z%2Fk) [n:127.0.0.1:38523_z%2Fk c:control_collection s:shard1 r:core_node1 x:collection1] o.a.s.r.RestManager Initializing RestManager with initArgs: {}
   [junit4]   2> 1055074 INFO  (coreLoadExecutor-4548-thread-1-processing-n:127.0.0.1:38523_z%2Fk) [n:127.0.0.1:38523_z%2Fk c:control_collection s:shard1 r:core_node1 x:collection1] o.a.s.r.ManagedResourceStorage Reading _rest_managed.json using ZooKeeperStorageIO:path=/configs/conf1
   [junit4]   2> 1055074 INFO  (coreLoadExecutor-4548-thread-1-processing-n:127.0.0.1:38523_z%2Fk) [n:127.0.0.1:38523_z%2Fk c:control_collection s:shard1 r:core_node1 x:collection1] o.a.s.r.ManagedResourceStorage No data found for znode /configs/conf1/_rest_managed.json
   [junit4]   2> 1055074 INFO  (coreLoadExecutor-4548-thread-1-processing-n:127.0.0.1:38523_z%2Fk) [n:127.0.0.1:38523_z%2Fk c:control_collection s:shard1 r:core_node1 x:collection1] o.a.s.r.ManagedResourceStorage Loaded null at path _rest_managed.json using ZooKeeperStorageIO:path=/configs/conf1
   [junit4]   2> 1055074 INFO  (coreLoadExecutor-4548-thread-1-processing-n:127.0.0.1:38523_z%2Fk) [n:127.0.0.1:38523_z%2Fk c:control_collection s:shard1 r:core_node1 x:collection1] o.a.s.r.RestManager Initializing 0 registered ManagedResources
   [junit4]   2> 1055075 INFO  (coreLoadExecutor-4548-thread-1-processing-n:127.0.0.1:38523_z%2Fk) [n:127.0.0.1:38523_z%2Fk c:control_collection s:shard1 r:core_node1 x:collection1] o.a.s.h.ReplicationHandler Commits will be reserved for  10000
   [junit4]   2> 1055075 INFO  (searcherExecutor-4549-thread-1-processing-n:127.0.0.1:38523_z%2Fk x:collection1 s:shard1 c:control_collection r:core_node1) [n:127.0.0.1:38523_z%2Fk c:control_collection s:shard1 r:core_node1 x:collection1] o.a.s.c.SolrCore [collection1] Registered new searcher Searcher@678080[collection1] main{ExitableDirectoryReader(UninvertingDirectoryReader())}
   [junit4]   2> 1055075 INFO  (coreLoadExecutor-4548-thread-1-processing-n:127.0.0.1:38523_z%2Fk) [n:127.0.0.1:38523_z%2Fk c:control_collection s:shard1 r:core_node1 x:collection1] o.a.s.u.UpdateLog Looking up max value of version field to seed version buckets
   [junit4]   2> 1055076 INFO  (coreLoadExecutor-4548-thread-1-processing-n:127.0.0.1:38523_z%2Fk) [n:127.0.0.1:38523_z%2Fk c:control_collection s:shard1 r:core_node1 x:collection1] o.a.s.u.VersionInfo Refreshing highest value of _version_ for 65536 version buckets from index
   [junit4]   2> 1055076 INFO  (coreLoadExecutor-4548-thread-1-processing-n:127.0.0.1:38523_z%2Fk) [n:127.0.0.1:38523_z%2Fk c:control_collection s:shard1 r:core_node1 x:collection1] o.a.s.u.VersionInfo No terms found for _version_, cannot seed version bucket highest value from index
   [junit4]   2> 1055076 INFO  (coreLoadExecutor-4548-thread-1-processing-n:127.0.0.1:38523_z%2Fk) [n:127.0.0.1:38523_z%2Fk c:control_collection s:shard1 r:core_node1 x:collection1] o.a.s.u.UpdateLog Could not find max version in index or recent updates, using new clock 1542734891896012800
   [junit4]   2> 1055077 INFO  (coreLoadExecutor-4548-thread-1-processing-n:127.0.0.1:38523_z%2Fk) [n:127.0.0.1:38523_z%2Fk c:control_collection s:shard1 r:core_node1 x:collection1] o.a.s.u.UpdateLog Took 1.0ms to seed version buckets with highest version 1542734891896012800
   [junit4]   2> 1055077 INFO  (coreLoadExecutor-4548-thread-1-processing-n:127.0.0.1:38523_z%2Fk) [n:127.0.0.1:38523_z%2Fk c:control_collection s:shard1 r:core_node1 x:collection1] o.a.s.c.ZkController watch zkdir /configs/conf1
   [junit4]   2> 1055078 INFO  (coreLoadExecutor-4548-thread-1-processing-n:127.0.0.1:38523_z%2Fk) [n:127.0.0.1:38523_z%2Fk c:control_collection s:shard1 r:core_node1 x:collection1] o.a.s.c.CoreContainer registering core: collection1
   [junit4]   2> 1055078 INFO  (coreZkRegister-4541-thread-1-processing-n:127.0.0.1:38523_z%2Fk x:collection1 s:shard1 c:control_collection r:core_node1) [n:127.0.0.1:38523_z%2Fk c:control_collection s:shard1 r:core_node1 x:collection1] o.a.s.c.ZkController Register replica - core:collection1 address:https://127.0.0.1:38523/z/k collection:control_collection shard:shard1
   [junit4]   2> 1055078 INFO  (coreZkRegister-4541-thread-1-processing-n:127.0.0.1:38523_z%2Fk x:collection1 s:shard1 c:control_collection r:core_node1) [n:127.0.0.1:38523_z%2Fk c:control_collection s:shard1 r:core_node1 x:collection1] o.a.s.c.c.SolrZkClient makePath: /collections/control_collection/leader_elect/shard1/election
   [junit4]   2> 1055079 INFO  (coreZkRegister-4541-thread-1-processing-n:127.0.0.1:38523_z%2Fk x:collection1 s:shard1 c:control_collection r:core_node1) [n:127.0.0.1:38523_z%2Fk c:control_collection s:shard1 r:core_node1 x:collection1] o.a.s.c.LeaderElector Joined leadership election with path: /collections/control_collection/leader_elect/shard1/election/96420930657910789-core_node1-n_0000000000
   [junit4]   2> 1055079 INFO  (coreZkRegister-4541-thread-1-processing-n:127.0.0.1:38523_z%2Fk x:collection1 s:shard1 c:control_collection r:core_node1) [n:127.0.0.1:38523_z%2Fk c:control_collection s:shard1 r:core_node1 x:collection1] o.a.s.c.ShardLeaderElectionContext Running the leader process for shard=shard1 and weAreReplacement=false and leaderVoteWait=10000
   [junit4]   2> 1055080 INFO  (coreZkRegister-4541-thread-1-processing-n:127.0.0.1:38523_z%2Fk x:collection1 s:shard1 c:control_collection r:core_node1) [n:127.0.0.1:38523_z%2Fk c:control_collection s:shard1 r:core_node1 x:collection1] o.a.s.c.ShardLeaderElectionContext Enough replicas found to continue.
   [junit4]   2> 1055080 INFO  (coreZkRegister-4541-thread-1-processing-n:127.0.0.1:38523_z%2Fk x:collection1 s:shard1 c:control_collection r:core_node1) [n:127.0.0.1:38523_z%2Fk c:control_collection s:shard1 r:core_node1 x:collection1] o.a.s.c.ShardLeaderElectionContext I may be the new leader - try and sync
   [junit4]   2> 1055080 INFO  (coreZkRegister-4541-thread-1-processing-n:127.0.0.1:38523_z%2Fk x:collection1 s:shard1 c:control_collection r:core_node1) [n:127.0.0.1:38523_z%2Fk c:control_collection s:shard1 r:core_node1 x:collection1] o.a.s.c.SyncStrategy Sync replicas to https://127.0.0.1:38523/z/k/collection1/
   [junit4]   2> 1055080 INFO  (OverseerStateUpdate-96420930657910789-127.0.0.1:38523_z%2Fk-n_0000000000) [n:127.0.0.1:38523_z%2Fk    ] o.a.s.c.Overseer processMessage: queueSize: 1, message = {
   [junit4]   2>   "operation":"leader",
   [junit4]   2>   "shard":"shard1",
   [junit4]   2>   "collection":"control_collection"} current state version: 1
   [junit4]   2> 1055080 INFO  (coreZkRegister-4541-thread-1-processing-n:127.0.0.1:38523_z%2Fk x:collection1 s:shard1 c:control_collection r:core_node1) [n:127.0.0.1:38523_z%2Fk c:control_collection s:shard1 r:core_node1 x:collection1] o.a.s.c.SyncStrategy Sync Success - now sync replicas to me
   [junit4]   2> 1055080 INFO  (coreZkRegister-4541-thread-1-processing-n:127.0.0.1:38523_z%2Fk x:collection1 s:shard1 c:control_collection r:core_node1) [n:127.0.0.1:38523_z%2Fk c:control_collection s:shard1 r:core_node1 x:collection1] o.a.s.c.SyncStrategy https://127.0.0.1:38523/z/k/collection1/ has no replicas
   [junit4]   2> 1055080 INFO  (coreZkRegister-4541-thread-1-processing-n:127.0.0.1:38523_z%2Fk x:collection1 s:shard1 c:control_collection r:core_node1) [n:127.0.0.1:38523_z%2Fk c:control_collection s:shard1 r:core_node1 x:collection1] o.a.s.c.c.SolrZkClient makePath: /collections/control_collection/leaders/shard1
   [junit4]   2> 1055081 INFO  (coreZkRegister-4541-thread-1-processing-n:127.0.0.1:38523_z%2Fk x:collection1 s:shard1 c:control_collection r:core_node1) [n:127.0.0.1:38523_z%2Fk c:control_collection s:shard1 r:core_node1 x:collection1] o.a.s.c.ShardLeaderElectionContextBase Creating leader registration node /collections/control_collection/leaders/shard1/leader after winning as /collections/control_collection/leader_elect/shard1/election/96420930657910789-core_node1-n_0000000000
   [junit4]   2> 1055082 INFO  (coreZkRegister-4541-thread-1-processing-n:127.0.0.1:38523_z%2Fk x:collection1 s:shard1 c:control_collection r:core_node1) [n:127.0.0.1:38523_z%2Fk c:control_collection s:shard1 r:core_node1 x:collection1] o.a.s.c.ShardLeaderElectionContext I am the new leader: https://127.0.0.1:38523/z/k/collection1/ shard1
   [junit4]   2> 1055082 INFO  (OverseerStateUpdate-96420930657910789-127.0.0.1:38523_z%2Fk-n_0000000000) [n:127.0.0.1:38523_z%2Fk    ] o.a.s.c.Overseer processMessage: queueSize: 1, message = {
   [junit4]   2>   "operation":"leader",
   [junit4]   2>   "shard":"shard1",
   [junit4]   2>   "collection":"control_collection",
   [junit4]   2>   "base_url":"https://127.0.0.1:38523/z/k",
   [junit4]   2>   "core":"collection1",
   [junit4]   2>   "state":"active"} current state version: 1
   [junit4]   2> 1055183 INFO  (zkCallback-1757-thread-1-processing-n:127.0.0.1:38523_z%2Fk) [n:127.0.0.1:38523_z%2Fk    ] o.a.s.c.c.ZkStateReader A cluster state change: [WatchedEvent state:SyncConnected type:NodeDataChanged path:/clusterstate.json], has occurred - updating... (live nodes size: [1])
   [junit4]   2> 1055232 INFO  (coreZkRegister-4541-thread-1-processing-n:127.0.0.1:38523_z%2Fk x:collection1 s:shard1 c:control_collection r:core_node1) [n:127.0.0.1:38523_z%2Fk c:control_collection s:shard1 r:core_node1 x:collection1] o.a.s.c.ZkController We are https://127.0.0.1:38523/z/k/collection1/ and leader is https://127.0.0.1:38523/z/k/collection1/
   [junit4]   2> 1055232 INFO  (coreZkRegister-4541-thread-1-processing-n:127.0.0.1:38523_z%2Fk x:collection1 s:shard1 c:control_collection r:core_node1) [n:127.0.0.1:38523_z%2Fk c:control_collection s:shard1 r:core_node1 x:collection1] o.a.s.c.ZkController No LogReplay needed for core=collection1 baseURL=https://127.0.0.1:38523/z/k
   [junit4]   2> 1055232 INFO  (coreZkRegister-4541-thread-1-processing-n:127.0.0.1:38523_z%2Fk x:collection1 s:shard1 c:control_collection r:core_node1) [n:127.0.0.1:38523_z%2Fk c:control_collection s:shard1 r:core_node1 x:collection1] o.a.s.c.ZkController I am the leader, no recovery necessary
   [junit4]   2> 1055232 INFO  (coreZkRegister-4541-thread-1-processing-n:127.0.0.1:38523_z%2Fk x:collection1 s:shard1 c:control_collection r:core_node1) [n:127.0.0.1:38523_z%2Fk c:control_collection s:shard1 r:core_node1 x:collection1] o.a.s.c.ZkController publishing state=active
   [junit4]   2> 1055232 INFO  (coreZkRegister-4541-thread-1-processing-n:127.0.0.1:38523_z%2Fk x:collection1 s:shard1 c:control_collection r:core_node1) [n:127.0.0.1:38523_z%2Fk c:control_collection s:shard1 r:core_node1 x:collection1] o.a.s.c.ZkController numShards not found on descriptor - reading it from system property
   [junit4]   2> 1055233 INFO  (coreZkRegister-4541-thread-1-processing-n:127.0.0.1:38523_z%2Fk x:collection1 s:shard1 c:control_collection r:core_node1) [n:127.0.0.1:38523_z%2Fk c:control_collection s:shard1 r:core_node1 x:collection1] o.a.s.c.c.ZkStateReader Checking legacy cluster state for collection control_collection
   [junit4]   2> 1055233 INFO  (OverseerStateUpdate-96420930657910789-127.0.0.1:38523_z%2Fk-n_0000000000) [n:127.0.0.1:38523_z%2Fk    ] o.a.s.c.Overseer processMessage: queueSize: 1, message = {
   [junit4]   2>   "core":"collection1",
   [junit4]   2>   "core_node_name":"core_node1",
   [junit4]   2>   "roles":null,
   [junit4]   2>   "base_url":"https://127.0.0.1:38523/z/k",
   [junit4]   2>   "node_name":"127.0.0.1:38523_z%2Fk",
   [junit4]   2>   "numShards":"1",
   [junit4]   2>   "state":"active",
   [junit4]   2>   "shard":"shard1",
   [junit4]   2>   "collection":"control_collection",
   [junit4]   2>   "operation":"state"} current state version: 2
   [junit4]   2> 1055233 INFO  (OverseerStateUpdate-96420930657910789-127.0.0.1:38523_z%2Fk-n_0000000000) [n:127.0.0.1:38523_z%2Fk    ] o.a.s.c.o.ReplicaMutator Update state numShards=1 message={
   [junit4]   2>   "core":"collection1",
   [junit4]   2>   "core_node_name":"core_node1",
   [junit4]   2>   "roles":null,
   [junit4]   2>   "base_url":"https://127.0.0.1:38523/z/k",
   [junit4]   2>   "node_name":"127.0.0.1:38523_z%2Fk",
   [junit4]   2>   "numShards":"1",
   [junit4]   2>   "state":"active",
   [junit4]   2>   "shard":"shard1",
   [junit4]   2>   "collection":"control_collection",
   [junit4]   2>   "operation":"state"}
   [junit4]   2> 1055334 INFO  (zkCallback-1757-thread-1-processing-n:127.0.0.1:38523_z%2Fk) [n:127.0.0.1:38523_z%2Fk    ] o.a.s.c.c.ZkStateReader A cluster state change: [WatchedEvent state:SyncConnected type:NodeDataChanged path:/clusterstate.json], has occurred - updating... (live nodes size: [1])
   [junit4]   2> 1055485 INFO  (TEST-RecoveryZkTest.test-seed#[FF7B6D4FA437E1D5]) [    ] o.a.s.c.c.SolrZkClient Using default ZkCredentialsProvider
   [junit4]   2> 1055485 INFO  (TEST-RecoveryZkTest.test-seed#[FF7B6D4FA437E1D5]) [    ] o.a.s.c.c.ConnectionManager Waiting for client to connect to ZooKeeper
   [junit4]   2> 1055486 INFO  (zkCallback-1761-thread-1) [    ] o.a.s.c.c.ConnectionManager Watcher org.apache.solr.common.cloud.ConnectionManager@1190092 name:ZooKeeperConnection Watcher:127.0.0.1:43126/solr got event WatchedEvent state:SyncConnected type:None path:null path:null type:None
   [junit4]   2> 1055486 INFO  (TEST-RecoveryZkTest.test-seed#[FF7B6D4FA437E1D5]) [    ] o.a.s.c.c.ConnectionManager Client is connected to ZooKeeper
   [junit4]   2> 1055486 INFO  (TEST-RecoveryZkTest.test-seed#[FF7B6D4FA437E1D5]) [    ] o.a.s.c.c.SolrZkClient Using default ZkACLProvider
   [junit4]   2> 1055486 INFO  (TEST-RecoveryZkTest.test-seed#[FF7B6D4FA437E1D5]) [    ] o.a.s.c.c.ZkStateReader Updating cluster state from ZooKeeper... 
   [junit4]   2> 1055486 INFO  (TEST-RecoveryZkTest.test-seed#[FF7B6D4FA437E1D5]) [    ] o.a.s.c.c.ZkStateReader Loaded cluster properties: {urlScheme=https}
   [junit4]   2> 1055486 INFO  (TEST-RecoveryZkTest.test-seed#[FF7B6D4FA437E1D5]) [    ] o.a.s.c.c.ZkStateReader Updated live nodes from ZooKeeper... (0) -> (1)
   [junit4]   2> 1055487 INFO  (TEST-RecoveryZkTest.test-seed#[FF7B6D4FA437E1D5]) [    ] o.a.s.c.ChaosMonkey monkey: init - expire sessions:false cause connection loss:false
   [junit4]   2> 1055547 INFO  (TEST-RecoveryZkTest.test-seed#[FF7B6D4FA437E1D5]) [    ] o.a.s.SolrTestCaseJ4 Writing core.properties file to /home/jenkins/workspace/Lucene-Solr-master-Linux/solr/build/solr-core/test/J0/temp/solr.cloud.RecoveryZkTest_FF7B6D4FA437E1D5-001/shard-1-001/cores/collection1
   [junit4]   2> 1055547 INFO  (TEST-RecoveryZkTest.test-seed#[FF7B6D4FA437E1D5]) [    ] o.a.s.c.AbstractFullDistribZkTestBase create jetty 1 in directory /home/jenkins/workspace/Lucene-Solr-master-Linux/solr/build/solr-core/test/J0/temp/solr.cloud.RecoveryZkTest_FF7B6D4FA437E1D5-001/shard-1-001
   [junit4]   2> 1055549 INFO  (TEST-RecoveryZkTest.test-seed#[FF7B6D4FA437E1D5]) [    ] o.e.j.s.Server jetty-9.3.8.v20160314
   [junit4]   2> 1055549 INFO  (TEST-RecoveryZkTest.test-seed#[FF7B6D4FA437E1D5]) [    ] o.e.j.s.h.ContextHandler Started o.e.j.s.ServletContextHandler@1914d80{/z/k,null,AVAILABLE}
   [junit4]   2> 1055550 INFO  (TEST-RecoveryZkTest.test-seed#[FF7B6D4FA437E1D5]) [    ] o.e.j.s.ServerConnector Started ServerConnector@1346d2{SSL,[ssl, http/1.1]}{127.0.0.1:32866}
   [junit4]   2> 1055550 INFO  (TEST-RecoveryZkTest.test-seed#[FF7B6D4FA437E1D5]) [    ] o.e.j.s.Server Started @1057477ms
   [junit4]   2> 1055551 INFO  (TEST-RecoveryZkTest.test-seed#[FF7B6D4FA437E1D5]) [    ] o.a.s.c.s.e.JettySolrRunner Jetty properties: {solr.data.dir=/home/jenkins/workspace/Lucene-Solr-master-Linux/solr/build/solr-core/test/J0/temp/solr.cloud.RecoveryZkTest_FF7B6D4FA437E1D5-001/tempDir-001/jetty1, solrconfig=solrconfig.xml, hostContext=/z/k, hostPort=32866, coreRootDirectory=/home/jenkins/workspace/Lucene-Solr-master-Linux/solr/build/solr-core/test/J0/temp/solr.cloud.RecoveryZkTest_FF7B6D4FA437E1D5-001/shard-1-001/cores}
   [junit4]   2> 1055551 INFO  (TEST-RecoveryZkTest.test-seed#[FF7B6D4FA437E1D5]) [    ] o.a.s.s.SolrDispatchFilter SolrDispatchFilter.init(): sun.misc.Launcher$AppClassLoader@1d16e93
   [junit4]   2> 1055551 INFO  (TEST-RecoveryZkTest.test-seed#[FF7B6D4FA437E1D5]) [    ] o.a.s.c.SolrResourceLoader new SolrResourceLoader for directory: '/home/jenkins/workspace/Lucene-Solr-master-Linux/solr/build/solr-core/test/J0/temp/solr.cloud.RecoveryZkTest_FF7B6D4FA437E1D5-001/shard-1-001'
   [junit4]   2> 1055551 INFO  (TEST-RecoveryZkTest.test-seed#[FF7B6D4FA437E1D5]) [    ] o.a.s.c.SolrResourceLoader JNDI not configured for solr (NoInitialContextEx)
   [junit4]   2> 1055551 INFO  (TEST-RecoveryZkTest.test-seed#[FF7B6D4FA437E1D5]) [    ] o.a.s.c.SolrResourceLoader solr home defaulted to 'solr/' (could not find system property or JNDI)
   [junit4]   2> 1055551 INFO  (TEST-RecoveryZkTest.test-seed#[FF7B6D4FA437E1D5]) [    ] o.a.s.c.c.SolrZkClient Using default ZkCredentialsProvider
   [junit4]   2> 1055551 INFO  (TEST-RecoveryZkTest.test-seed#[FF7B6D4FA437E1D5]) [    ] o.a.s.c.c.ConnectionManager Waiting for client to connect to ZooKeeper
   [junit4]   2> 1055552 INFO  (zkCallback-1762-thread-1) [    ] o.a.s.c.c.ConnectionManager Watcher org.apache.solr.common.cloud.ConnectionManager@458081 name:ZooKeeperConnection Watcher:127.0.0.1:43126/solr got event WatchedEvent state:SyncConnected type:None path:null path:null type:None
   [junit4]   2> 1055552 INFO  (TEST-RecoveryZkTest.test-seed#[FF7B6D4FA437E1D5]) [    ] o.a.s.c.c.ConnectionManager Client is connected to ZooKeeper
   [junit4]   2> 1055552 INFO  (TEST-RecoveryZkTest.test-seed#[FF7B6D4FA437E1D5]) [    ] o.a.s.c.c.SolrZkClient Using default ZkACLProvider
   [junit4]   2> 1055553 INFO  (TEST-RecoveryZkTest.test-seed#[FF7B6D4FA437E1D5]) [    ] o.a.s.s.SolrDispatchFilter Loading solr.xml from SolrHome (not found in ZooKeeper)
   [junit4]   2> 1055553 INFO  (TEST-RecoveryZkTest.test-seed#[FF7B6D4FA437E1D5]) [    ] o.a.s.c.SolrXmlConfig Loading container configuration from /home/jenkins/workspace/Lucene-Solr-master-Linux/solr/build/solr-core/test/J0/temp/solr.cloud.RecoveryZkTest_FF7B6D4FA437E1D5-001/shard-1-001/solr.xml
   [junit4]   2> 1055556 INFO  (TEST-RecoveryZkTest.test-seed#[FF7B6D4FA437E1D5]) [    ] o.a.s.c.CorePropertiesLocator Config-defined core root directory: /home/jenkins/workspace/Lucene-Solr-master-Linux/solr/build/solr-core/test/J0/temp/solr.cloud.RecoveryZkTest_FF7B6D4FA437E1D5-001/shard-1-001/cores
   [junit4]   2> 1055557 INFO  (TEST-RecoveryZkTest.test-seed#[FF7B6D4FA437E1D5]) [    ] o.a.s.c.CoreContainer New CoreContainer 11632674
   [junit4]   2> 1055557 INFO  (TEST-RecoveryZkTest.test-seed#[FF7B6D4FA437E1D5]) [    ] o.a.s.c.CoreContainer Loading cores into CoreContainer [instanceDir=/home/jenkins/workspace/Lucene-Solr-master-Linux/solr/build/solr-core/test/J0/temp/solr.cloud.RecoveryZkTest_FF7B6D4FA437E1D5-001/shard-1-001]
   [junit4]   2> 1055557 WARN  (TEST-RecoveryZkTest.test-seed#[FF7B6D4FA437E1D5]) [    ] o.a.s.c.CoreContainer Couldn't add files from /home/jenkins/workspace/Lucene-Solr-master-Linux/solr/build/solr-core/test/J0/temp/solr.cloud.RecoveryZkTest_FF7B6D4FA437E1D5-001/shard-1-001/lib to classpath: /home/jenkins/workspace/Lucene-Solr-master-Linux/solr/build/solr-core/test/J0/temp/solr.cloud.RecoveryZkTest_FF7B6D4FA437E1D5-001/shard-1-001/lib
   [junit4]   2> 1055557 INFO  (TEST-RecoveryZkTest.test-seed#[FF7B6D4FA437E1D5]) [    ] o.a.s.h.c.HttpShardHandlerFactory created with socketTimeout : 90000,urlScheme : ,connTimeout : 15000,maxConnectionsPerHost : 20,maxConnections : 10000,corePoolSize : 0,maximumPoolSize : 2147483647,maxThreadIdleTime : 5,sizeOfQueue : -1,fairnessPolicy : false,
   [junit4]   2> 1055558 INFO  (TEST-RecoveryZkTest.test-seed#[FF7B6D4FA437E1D5]) [    ] o.a.s.u.UpdateShardHandler Created UpdateShardHandler HTTP client with params: socketTimeout=340000&connTimeout=45000&maxConnections=100000&maxConnectionsPerHost=100000
   [junit4]   2> 1055558 INFO  (TEST-RecoveryZkTest.test-seed#[FF7B6D4FA437E1D5]) [    ] o.a.s.l.LogWatcher SLF4J impl is org.slf4j.impl.Log4jLoggerFactory
   [junit4]   2> 1055558 INFO  (TEST-RecoveryZkTest.test-seed#[FF7B6D4FA437E1D5]) [    ] o.a.s.l.LogWatcher Registering Log Listener [Log4j (org.slf4j.impl.Log4jLoggerFactory)]
   [junit4]   2> 1055558 INFO  (TEST-RecoveryZkTest.test-seed#[FF7B6D4FA437E1D5]) [    ] o.a.s.c.ZkContainer Zookeeper client=127.0.0.1:43126/solr
   [junit4]   2> 1055559 INFO  (TEST-RecoveryZkTest.test-seed#[FF7B6D4FA437E1D5]) [    ] o.a.s.c.ZkController zkHost includes chroot
   [junit4]   2> 1055559 INFO  (TEST-RecoveryZkTest.test-seed#[FF7B6D4FA437E1D5]) [    ] o.a.s.c.c.SolrZkClient Using default ZkCredentialsProvider
   [junit4]   2> 1055559 INFO  (TEST-RecoveryZkTest.test-seed#[FF7B6D4FA437E1D5]) [    ] o.a.s.c.c.ConnectionManager Waiting for client to connect to ZooKeeper
   [junit4]   2> 1055559 INFO  (zkCallback-1765-thread-1) [    ] o.a.s.c.c.ConnectionManager Watcher org.apache.solr.common.cloud.ConnectionManager@1a81106 name:ZooKeeperConnection Watcher:127.0.0.1:43126 got event WatchedEvent state:SyncConnected type:None path:null path:null type:None
   [junit4]   2> 1055559 INFO  (TEST-RecoveryZkTest.test-seed#[FF7B6D4FA437E1D5]) [    ] o.a.s.c.c.ConnectionManager Client is connected to ZooKeeper
   [junit4]   2> 1055560 INFO  (TEST-RecoveryZkTest.test-seed#[FF7B6D4FA437E1D5]) [    ] o.a.s.c.c.SolrZkClient Using default ZkACLProvider
   [junit4]   2> 1055560 INFO  (TEST-RecoveryZkTest.test-seed#[FF7B6D4FA437E1D5]) [n:127.0.0.1:32866_z%2Fk    ] o.a.s.c.ZkController Added new OnReconnect listener org.apache.solr.cloud.ZkController$$Lambda$87/13543940@1574dcc
   [junit4]   2> 1055560 INFO  (TEST-RecoveryZkTest.test-seed#[FF7B6D4FA437E1D5]) [n:127.0.0.1:32866_z%2Fk    ] o.a.s.c.c.ConnectionManager Waiting for client to connect to ZooKeeper
   [junit4]   2> 1055561 INFO  (zkCallback-1766-thread-1-processing-n:127.0.0.1:32866_z%2Fk) [n:127.0.0.1:32866_z%2Fk    ] o.a.s.c.c.ConnectionManager Watcher org.apache.solr.common.cloud.ConnectionManager@920d46 name:ZooKeeperConnection Watcher:127.0.0.1:43126/solr got event WatchedEvent state:SyncConnected type:None path:null path:null type:None
   [junit4]   2> 1055561 INFO  (TEST-RecoveryZkTest.test-seed#[FF7B6D4FA437E1D5]) [n:127.0.0.1:32866_z%2Fk    ] o.a.s.c.c.ConnectionManager Client is connected to ZooKeeper
   [junit4]   2> 1055562 INFO  (TEST-RecoveryZkTest.test-seed#[FF7B6D4FA437E1D5]) [n:127.0.0.1:32866_z%2Fk    ] o.a.s.c.c.ZkStateReader Updating cluster state from ZooKeeper... 
   [junit4]   2> 1055563 INFO  (TEST-RecoveryZkTest.test-seed#[FF7B6D4FA437E1D5]) [n:127.0.0.1:32866_z%2Fk    ] o.a.s.c.c.ZkStateReader Loaded cluster properties: {urlScheme=https}
   [junit4]   2> 1055563 INFO  (TEST-RecoveryZkTest.test-seed#[FF7B6D4FA437E1D5]) [n:127.0.0.1:32866_z%2Fk    ] o.a.s.c.c.ZkStateReader Updated live nodes from ZooKeeper... (0) -> (1)
   [junit4]   2> 1055564 INFO  (TEST-RecoveryZkTest.test-seed#[FF7B6D4FA437E1D5]) [n:127.0.0.1:32866_z%2Fk    ] o.a.s.c.Overseer Overseer (id=null) closing
   [junit4]   2> 1055564 INFO  (TEST-RecoveryZkTest.test-seed#[FF7B6D4FA437E1D5]) [n:127.0.0.1:32866_z%2Fk    ] o.a.s.c.LeaderElector Joined leadership election with path: /overseer_elect/election/96420930657910793-127.0.0.1:32866_z%2Fk-n_0000000001
   [junit4]   2> 1055564 INFO  (TEST-RecoveryZkTest.test-seed#[FF7B6D4FA437E1D5]) [n:127.0.0.1:32866_z%2Fk    ] o.a.s.c.LeaderElector Watching path /overseer_elect/election/96420930657910789-127.0.0.1:38523_z%2Fk-n_0000000000 to know if I could be the leader
   [junit4]   2> 1055564 INFO  (TEST-RecoveryZkTest.test-seed#[FF7B6D4FA437E1D5]) [n:127.0.0.1:32866_z%2Fk    ] o.a.s.c.ZkController Publish node=127.0.0.1:32866_z%2Fk as DOWN
   [junit4]   2> 1055564 INFO  (TEST-RecoveryZkTest.test-seed#[FF7B6D4FA437E1D5]) [n:127.0.0.1:32866_z%2Fk    ] o.a.s.c.ZkController Register node as live in ZooKeeper:/live_nodes/127.0.0.1:32866_z%2Fk
   [junit4]   2> 1055565 INFO  (TEST-RecoveryZkTest.test-seed#[FF7B6D4FA437E1D5]) [n:127.0.0.1:32866_z%2Fk    ] o.a.s.c.c.SolrZkClient makePath: /live_nodes/127.0.0.1:32866_z%2Fk
   [junit4]   2> 1055565 INFO  (OverseerStateUpdate-96420930657910789-127.0.0.1:38523_z%2Fk-n_0000000000) [n:127.0.0.1:38523_z%2Fk    ] o.a.s.c.Overseer processMessage: queueSize: 1, message = {
   [junit4]   2>   "operation":"downnode",
   [junit4]   2>   "node_name":"127.0.0.1:32866_z%2Fk"} current state version: 3
   [junit4]   2> 1055565 INFO  (OverseerStateUpdate-96420930657910789-127.0.0.1:38523_z%2Fk-n_0000000000) [n:127.0.0.1:38523_z%2Fk    ] o.a.s.c.o.NodeMutator DownNode state invoked for node: 127.0.0.1:32866_z%2Fk
   [junit4]   2> 1055565 INFO  (zkCallback-1757-thread-2-processing-n:127.0.0.1:38523_z%2Fk) [n:127.0.0.1:38523_z%2Fk    ] o.a.s.c.c.ZkStateReader A live node change: [WatchedEvent state:SyncConnected type:NodeChildrenChanged path:/live_nodes], has occurred - updating... (live nodes size: [1])
   [junit4]   2> 1055565 INFO  (zkCallback-1761-thread-1) [    ] o.a.s.c.c.ZkStateReader A live node change: [WatchedEvent state:SyncConnected type:NodeChildrenChanged path:/live_nodes], has occurred - updating... (live nodes size: [1])
   [junit4]   2> 1055565 INFO  (zkCallback-1766-thread-1-processing-n:127.0.0.1:32866_z%2Fk) [n:127.0.0.1:32866_z%2Fk    ] o.a.s.c.c.ZkStateReader A live node change: [WatchedEvent state:SyncConnected type:NodeChildrenChanged path:/live_nodes], has occurred - updating... (live nodes size: [1])
   [junit4]   2> 1055565 INFO  (zkCallback-1757-thread-2-processing-n:127.0.0.1:38523_z%2Fk) [n:127.0.0.1:38523_z%2Fk    ] o.a.s.c.c.ZkStateReader Updated live nodes from ZooKeeper... (1) -> (2)
   [junit4]   2> 1055565 INFO  (zkCallback-1761-thread-1) [    ] o.a.s.c.c.ZkStateReader Updated live nodes from ZooKeeper... (1) -> (2)
   [junit4]   2> 1055565 INFO  (zkCallback-1766-thread-1-processing-n:127.0.0.1:32866_z%2Fk) [n:127.0.0.1:32866_z%2Fk    ] o.a.s.c.c.ZkStateReader Updated live nodes from ZooKeeper... (1) -> (2)
   [junit4]   2> 1055580 INFO  (TEST-RecoveryZkTest.test-seed#[FF7B6D4FA437E1D5]) [n:127.0.0.1:32866_z%2Fk    ] o.a.s.c.CoreContainer Security conf doesn't exist. Skipping setup for authorization module.
   [junit4]   2> 1055580 INFO  (TEST-RecoveryZkTest.test-seed#[FF7B6D4FA437E1D5]) [n:127.0.0.1:32866_z%2Fk    ] o.a.s.c.CoreContainer No authentication plugin used.
   [junit4]   2> 1055580 INFO  (TEST-RecoveryZkTest.test-seed#[FF7B6D4FA437E1D5]) [n:127.0.0.1:32866_z%2Fk    ] o.a.s.c.CorePropertiesLocator Looking for core definitions underneath /home/jenkins/workspace/Lucene-Solr-master-Linux/solr/build/solr-core/test/J0/temp/solr.cloud.RecoveryZkTest_FF7B6D4FA437E1D5-001/shard-1-001/cores
   [junit4]   2> 1055581 INFO  (TEST-RecoveryZkTest.test-seed#[FF7B6D4FA437E1D5]) [n:127.0.0.1:32866_z%2Fk    ] o.a.s.c.CoreDescriptor Created CoreDescriptor: {name=collection1, config=solrconfig.xml, transient=false, schema=schema.xml, loadOnStartup=true, configSetProperties=configsetprops.json, collection=collection1, coreNodeName=, dataDir=data/, shard=}
   [junit4]   2> 1055581 INFO  (TEST-RecoveryZkTest.test-seed#[FF7B6D4FA437E1D5]) [n:127.0.0.1:32866_z%2Fk    ] o.a.s.c.CorePropertiesLocator Found core collection1 in /home/jenkins/workspace/Lucene-Solr-master-Linux/solr/build/solr-core/test/J0/temp/solr.cloud.RecoveryZkTest_FF7B6D4FA437E1D5-001/shard-1-001/cores/collection1
   [junit4]   2> 1055581 INFO  (TEST-RecoveryZkTest.test-seed#[FF7B6D4FA437E1D5]) [n:127.0.0.1:32866_z%2Fk    ] o.a.s.c.CorePropertiesLocator Found 1 core definitions
   [junit4]   2> 1055581 INFO  (coreLoadExecutor-4559-thread-1-processing-n:127.0.0.1:32866_z%2Fk) [n:127.0.0.1:32866_z%2Fk c:collection1   x:collection1] o.a.s.c.ZkController publishing state=down
   [junit4]   2> 1055581 INFO  (TEST-RecoveryZkTest.test-seed#[FF7B6D4FA437E1D5]) [n:127.0.0.1:32866_z%2Fk    ] o.a.s.s.SolrDispatchFilter user.dir=/home/jenkins/workspace/Lucene-Solr-master-Linux/solr/build/solr-core/test/J0
   [junit4]   2> 1055581 INFO  (TEST-RecoveryZkTest.test-seed#[FF7B6D4FA437E1D5]) [n:127.0.0.1:32866_z%2Fk    ] o.a.s.s.SolrDispatchFilter SolrDispatchFilter.init() done
   [junit4]   2> 1055581 INFO  (coreLoadExecutor-4559-thread-1-processing-n:127.0.0.1:32866_z%2Fk) [n:127.0.0.1:32866_z%2Fk c:collection1   x:collection1] o.a.s.c.ZkController numShards not found on descriptor - reading it from system property
   [junit4]   2> 1055582 INFO  (coreLoadExecutor-4559-thread-1-processing-n:127.0.0.1:32866_z%2Fk) [n:127.0.0.1:32866_z%2Fk c:collection1   x:collection1] o.a.s.c.ZkController Collection collection1 not visible yet, but flagging it so a watch is registered when it becomes visible
   [junit4]   2> 1055582 INFO  (OverseerStateUpdate-96420930657910789-127.0.0.1:38523_z%2Fk-n_0000000000) [n:127.0.0.1:38523_z%2Fk    ] o.a.s.c.Overseer processMessage: queueSize: 1, message = {
   [junit4]   2>   "core":"collection1",
   [junit4]   2>   "roles":null,
   [junit4]   2>   "base_url":"https://127.0.0.1:32866/z/k",
   [junit4]   2>   "node_name":"127.0.0.1:32866_z%2Fk",
   [junit4]   2>   "numShards":"1",
   [junit4]   2>   "state":"down",
   [junit4]   2>   "shard":null,
   [junit4]   2>   "collection":"collection1",
   [junit4]   2>   "operation":"state"} current state version: 3
   [junit4]   2> 1055582 INFO  (OverseerStateUpdate-96420930657910789-127.0.0.1:38523_z%2Fk-n_0000000000) [n:127.0.0.1:38523_z%2Fk    ] o.a.s.c.o.ReplicaMutator Update state numShards=1 message={
   [junit4]   2>   "core":"collection1",
   [junit4]   2>   "roles":null,
   [junit4]   2>   "base_url":"https://127.0.0.1:32866/z/k",
   [junit4]   2>   "node_name":"127.0.0.1:32866_z%2Fk",
   [junit4]   2>   "numShards":"1",
   [junit4]   2>   "state":"down",
   [junit4]   2>   "shard":null,
   [junit4]   2>   "collection":"collection1",
   [junit4]   2>   "operation":"state"}
   [junit4]   2> 1055582 INFO  (coreLoadExecutor-4559-thread-1-processing-n:127.0.0.1:32866_z%2Fk) [n:127.0.0.1:32866_z%2Fk c:collection1   x:collection1] o.a.s.c.c.ZkStateReader Deleting data for [collection1]
   [junit4]   2> 1055582 INFO  (OverseerStateUpdate-96420930657910789-127.0.0.1:38523_z%2Fk-n_0000000000) [n:127.0.0.1:38523_z%2Fk    ] o.a.s.c.o.ClusterStateMutator building a new cName: collection1
   [junit4]   2> 1055582 INFO  (OverseerStateUpdate-96420930657910789-127.0.0.1:38523_z%2Fk-n_0000000000) [n:127.0.0.1:38523_z%2Fk    ] o.a.s.c.o.ReplicaMutator Assigning new node to shard shard=shard1
   [junit4]   2> 1055582 INFO  (coreLoadExecutor-4559-thread-1-processing-n:127.0.0.1:32866_z%2Fk) [n:127.0.0.1:32866_z%2Fk c:collection1   x:collection1] o.a.s.c.ZkController look for our core node name
   [junit4]   2> 1055683 INFO  (zkCallback-1761-thread-1) [    ] o.a.s.c.c.ZkStateReader A cluster state change: [WatchedEvent state:SyncConnected type:NodeDataChanged path:/clusterstate.json], has occurred - updating... (live nodes size: [2])
   [junit4]   2> 1055683 INFO  (zkCallback-1757-thread-2-processing-n:127.0.0.1:38523_z%2Fk) [n:127.0.0.1:38523_z%2Fk    ] o.a.s.c.c.ZkStateReader A cluster state change: [WatchedEvent state:SyncConnected type:NodeDataChanged path:/clusterstate.json], has occurred - updating... (live nodes size: [2])
   [junit4]   2> 1055684 INFO  (zkCallback-1766-thread-1-processing-n:127.0.0.1:32866_z%2Fk) [n:127.0.0.1:32866_z%2Fk    ] o.a.s.c.c.ZkStateReader A cluster state change: [WatchedEvent state:SyncConnected type:NodeDataChanged path:/clusterstate.json], has occurred - updating... (live nodes size: [2])
   [junit4]   2> 1056583 INFO  (coreLoadExecutor-4559-thread-1-processing-n:127.0.0.1:32866_z%2Fk) [n:127.0.0.1:32866_z%2Fk c:collection1   x:collection1] o.a.s.c.ZkController waiting to find shard id in clusterstate for collection1
   [junit4]   2> 1056583 INFO  (coreLoadExecutor-4559-thread-1-processing-n:127.0.0.1:32866_z%2Fk) [n:127.0.0.1:32866_z%2Fk c:collection1   x:collection1] o.a.s.c.ZkController Check for collection zkNode:collection1
   [junit4]   2> 1056583 INFO  (coreLoadExecutor-4559-thread-1-processing-n:127.0.0.1:32866_z%2Fk) [n:127.0.0.1:32866_z%2Fk c:collection1   x:collection1] o.a.s.c.ZkController Collection zkNode exists
   [junit4]   2> 1056583 INFO  (coreLoadExecutor-4559-thread-1-processing-n:127.0.0.1:32866_z%2Fk) [n:127.0.0.1:32866_z%2Fk c:collection1   x:collection1] o.a.s.c.c.ZkStateReader Load collection config from: [/collections/collection1]
   [junit4]   2> 1056584 INFO  (coreLoadExecutor-4559-thread-1-processing-n:127.0.0.1:32866_z%2Fk) [n:127.0.0.1:32866_z%2Fk c:collection1   x:collection1] o.a.s.c.c.ZkStateReader path=[/collections/collection1] [configName]=[conf1] specified config exists in ZooKeeper
   [junit4]   2> 1056584 INFO  (coreLoadExecutor-4559-thread-1-processing-n:127.0.0.1:32866_z%2Fk) [n:127.0.0.1:32866_z%2Fk c:collection1   x:collection1] o.a.s.c.SolrResourceLoader new SolrResourceLoader for directory: '/home/jenkins/workspace/Lucene-Solr-master-Linux/solr/build/solr-core/test/J0/temp/solr.cloud.RecoveryZkTest_FF7B6D4FA437E1D5-001/shard-1-001/cores/collection1'
   [junit4]   2> 1056584 INFO  (coreLoadExecutor-4559-thread-1-processing-n:127.0.0.1:32866_z%2Fk) [n:127.0.0.1:32866_z%2Fk c:collection1   x:collection1] o.a.s.c.SolrResourceLoader JNDI not configured for solr (NoInitialContextEx)
   [junit4]   2> 1056584 INFO  (coreLoadExecutor-4559-thread-1-processing-n:127.0.0.1:32866_z%2Fk) [n:127.0.0.1:32866_z%2Fk c:collection1   x:collection1] o.a.s.c.SolrResourceLoader solr home defaulted to 'solr/' (could not find system property or JNDI)
   [junit4]   2> 1056585 INFO  (coreLoadExecutor-4559-thread-1-processing-n:127.0.0.1:32866_z%2Fk) [n:127.0.0.1:32866_z%2Fk c:collection1   x:collection1] o.a.s.c.Config loaded config solrconfig.xml with version 0 
   [junit4]   2> 1056588 INFO  (coreLoadExecutor-4559-thread-1-processing-n:127.0.0.1:32866_z%2Fk) [n:127.0.0.1:32866_z%2Fk c:collection1   x:collection1] o.a.s.c.SolrConfig current version of requestparams : -1
   [junit4]   2> 1056590 WARN  (coreLoadExecutor-4559-thread-1-processing-n:127.0.0.1:32866_z%2Fk) [n:127.0.0.1:32866_z%2Fk c:collection1   x:collection1] o.a.s.c.Config Beginning with Solr 5.5, <mergePolicy> is deprecated, use <mergePolicyFactory> instead.
   [junit4]   2> 1056590 INFO  (coreLoadExecutor-4559-thread-1-processing-n:127.0.0.1:32866_z%2Fk) [n:127.0.0.1:32866_z%2Fk c:collection1   x:collection1] o.a.s.c.SolrConfig Using Lucene MatchVersion: 7.0.0
   [junit4]   2> 1056597 INFO  (coreLoadExecutor-4559-thread-1-processing-n:127.0.0.1:32866_z%2Fk) [n:127.0.0.1:32866_z%2Fk c:collection1   x:collection1] o.a.s.c.SolrConfig Loaded SolrConfig: solrconfig.xml
   [junit4]   2> 1056600 INFO  (coreLoadExecutor-4559-thread-1-processing-n:127.0.0.1:32866_z%2Fk) [n:127.0.0.1:32866_z%2Fk c:collection1   x:collection1] o.a.s.s.IndexSchema [collection1] Schema name=test
   [junit4]   2> 1056680 INFO  (coreLoadExecutor-4559-thread-1-processing-n:127.0.0.1:32866_z%2Fk) [n:127.0.0.1:32866_z%2Fk c:collection1   x:collection1] o.a.s.s.IndexSchema default search field in schema is text
   [junit4]   2> 1056682 INFO  (coreLoadExecutor-4559-thread-1-processing-n:127.0.0.1:32866_z%2Fk) [n:127.0.0.1:32866_z%2Fk c:collection1   x:collection1] o.a.s.s.IndexSchema unique key field: id
   [junit4]   2> 1056682 INFO  (coreLoadExecutor-4559-thread-1-processing-n:127.0.0.1:32866_z%2Fk) [n:127.0.0.1:32866_z%2Fk c:collection1   x:collection1] o.a.s.s.FileExchangeRateProvider Reloading exchange rates from file currency.xml
   [junit4]   2> 1056684 INFO  (coreLoadExecutor-4559-thread-1-processing-n:127.0.0.1:32866_z%2Fk) [n:127.0.0.1:32866_z%2Fk c:collection1   x:collection1] o.a.s.s.FileExchangeRateProvider Reloading exchange rates from file currency.xml
   [junit4]   2> 1056690 INFO  (coreLoadExecutor-4559-thread-1-processing-n:127.0.0.1:32866_z%2Fk) [n:127.0.0.1:32866_z%2Fk c:collection1   x:collection1] o.a.s.c.ConfigSetProperties Did not find ConfigSet properties, assuming default properties: Can't find resource 'configsetprops.json' in classpath or '/configs/conf1', cwd=/home/jenkins/workspace/Lucene-Solr-master-Linux/solr/build/solr-core/test/J0
   [junit4]   2> 1056690 INFO  (coreLoadExecutor-4559-thread-1-processing-n:127.0.0.1:32866_z%2Fk) [n:127.0.0.1:32866_z%2Fk c:collection1   x:collection1] o.a.s.c.CoreContainer Creating SolrCore 'collection1' using configuration from collection collection1
   [junit4]   2> 1056690 INFO  (coreLoadExecutor-4559-thread-1-processing-n:127.0.0.1:32866_z%2Fk) [n:127.0.0.1:32866_z%2Fk c:collection1 s:shard1 r:core_node1 x:collection1] o.a.s.c.SolrCore org.apache.solr.core.MockDirectoryFactory
   [junit4]   2> 1056690 INFO  (coreLoadExecutor-4559-thread-1-processing-n:127.0.0.1:32866_z%2Fk) [n:127.0.0.1:32866_z%2Fk c:collection1 s:shard1 r:core_node1 x:collection1] o.a.s.c.SolrCore [[collection1] ] Opening new SolrCore at [/home/jenkins/workspace/Lucene-Solr-master-Linux/solr/build/solr-core/test/J0/temp/solr.cloud.RecoveryZkTest_FF7B6D4FA437E1D5-001/shard-1-001/cores/collection1], dataDir=[/home/jenkins/workspace/Lucene-Solr-master-Linux/solr/build/solr-core/test/J0/temp/solr.cloud.RecoveryZkTest_FF7B6D4FA437E1D5-001/shard-1-001/cores/collection1/data/]
   [junit4]   2> 1056690 INFO  (coreLoadExecutor-4559-thread-1-processing-n:127.0.0.1:32866_z%2Fk) [n:127.0.0.1:32866_z%2Fk c:collection1 s:shard1 r:core_node1 x:collection1] o.a.s.c.JmxMonitoredMap JMX monitoring is enabled. Adding Solr mbeans to JMX Server: com.sun.jmx.mbeanserver.JmxMBeanServer@16fc28e
   [junit4]   2> 1056691 INFO  (coreLoadExecutor-4559-thread-1-processing-n:127.0.0.1:32866_z%2Fk) [n:127.0.0.1:32866_z%2Fk c:collection1 s:shard1 r:core_node1 x:collection1] o.a.s.c.CachingDirectoryFactory return new directory for /home/jenkins/workspace/Lucene-Solr-master-Linux/solr/build/solr-core/test/J0/temp/solr.cloud.RecoveryZkTest_FF7B6D4FA437E1D5-001/shard-1-001/cores/collection1/data/snapshot_metadata
   [junit4]   2> 1056691 INFO  (coreLoadExecutor-4559-thread-1-processing-n:127.0.0.1:32866_z%2Fk) [n:127.0.0.1:32866_z%2Fk c:collection1 s:shard1 r:core_node1 x:collection1] o.a.s.c.s.SolrSnapshotMetaDataManager Loading from snapshot metadata file...
   [junit4]   2> 1056691 INFO  (coreLoadExecutor-4559-thread-1-processing-n:127.0.0.1:32866_z%2Fk) [n:127.0.0.1:32866_z%2Fk c:collection1 s:shard1 r:core_node1 x:collection1] o.a.s.c.CachingDirectoryFactory return new directory for /home/jenkins/workspace/Lucene-Solr-master-Linux/solr/build/solr-core/test/J0/temp/solr.cloud.RecoveryZkTest_FF7B6D4FA437E1D5-001/shard-1-001/cores/collection1/data
   [junit4]   2> 1056691 INFO  (coreLoadExecutor-4559-thread-1-processing-n:127.0.0.1:32866_z%2Fk) [n:127.0.0.1:32866_z%2Fk c:collection1 s:shard1 r:core_node1 x:collection1] o.a.s.c.SolrCore New index directory detected: old=null new=/home/jenkins/workspace/Lucene-Solr-master-Linux/solr/build/solr-core/test/J0/temp/solr.cloud.RecoveryZkTest_FF7B6D4FA437E1D5-001/shard-1-001/cores/collection1/data/index/
   [junit4]   2> 1056691 WARN  (coreLoadExecutor-4559-thread-1-processing-n:127.0.0.1:32866_z%2Fk) [n:127.0.0.1:32866_z%2Fk c:collection1 s:shard1 r:core_node1 x:collection1] o.a.s.c.SolrCore [collection1] Solr index directory '/home/jenkins/workspace/Lucene-Solr-master-Linux/solr/build/solr-core/test/J0/temp/solr.cloud.RecoveryZkTest_FF7B6D4FA437E1D5-001/shard-1-001/cores/collection1/data/index' doesn't exist. Creating new index...
   [junit4]   2> 1056691 INFO  (coreLoadExecutor-4559-thread-1-processing-n:127.0.0.1:32866_z%2Fk) [n:127.0.0.1:32866_z%2Fk c:collection1 s:shard1 r:core_node1 x:collection1] o.a.s.c.CachingDirectoryFactory return new directory for /home/jenkins/workspace/Lucene-Solr-master-Linux/solr/build/solr-core/test/J0/temp/solr.cloud.RecoveryZkTest_FF7B6D4FA437E1D5-001/shard-1-001/cores/collection1/data/index
   [junit4]   2> 1056691 INFO  (coreLoadExecutor-4559-thread-1-processing-n:127.0.0.1:32866_z%2Fk) [n:127.0.0.1:32866_z%2Fk c:collection1 s:shard1 r:core_node1 x:collection1] o.a.s.u.RandomMergePolicy RandomMergePolicy wrapping class org.apache.lucene.index.LogDocMergePolicy: [LogDocMergePolicy: minMergeSize=1000, mergeFactor=25, maxMergeSize=9223372036854775807, maxMergeSizeForForcedMerge=9223372036854775807, calibrateSizeByDeletes=false, maxMergeDocs=2147483647, maxCFSSegmentSizeMB=8.796093022207999E12, noCFSRatio=0.5284436844598078]
   [junit4]   2> 1056692 INFO  (coreLoadExecutor-4559-thread-1-processing-n:127.0.0.1:32866_z%2Fk) [n:127.0.0.1:32866_z%2Fk c:collection1 s:shard1 r:core_node1 x:collection1] o.a.s.c.SolrDeletionPolicy SolrDeletionPolicy.onCommit: commits: num=1
   [junit4]   2> 	commit{dir=MockDirectoryWrapper(RAMDirectory@19970a2 lockFactory=org.apache.lucene.store.SingleInstanceLockFactory@168b5ca),segFN=segments_1,generation=1}
   [junit4]   2> 1056692 INFO  (coreLoadExecutor-4559-thread-1-processing-n:127.0.0.1:32866_z%2Fk) [n:127.0.0.1:32866_z%2Fk c:collection1 s:shard1 r:core_node1 x:collection1] o.a.s.c.SolrDeletionPolicy newest commit generation = 1
   [junit4]   2> 1056692 INFO  (OldI

[...truncated too long message...]

[n:127.0.0.1:32925_z%2Fk c:collection1 s:shard1 r:core_node2 x:collection1] o.a.s.c.CachingDirectoryFactory Closing directory, CoreContainer#isShutdown=true
   [junit4]   2> 1090529 INFO  (zkCallback-1779-thread-1-processing-n:127.0.0.1:32925_z%2Fk) [n:127.0.0.1:32925_z%2Fk c:collection1 s:shard1 r:core_node2 x:collection1] o.a.s.c.CachingDirectoryFactory Closing directory: /home/jenkins/workspace/Lucene-Solr-master-Linux/solr/build/solr-core/test/J0/temp/solr.cloud.RecoveryZkTest_FF7B6D4FA437E1D5-001/shard-2-001/cores/collection1/data/snapshot_metadata
   [junit4]   2> 1090529 INFO  (zkCallback-1779-thread-1-processing-n:127.0.0.1:32925_z%2Fk) [n:127.0.0.1:32925_z%2Fk c:collection1 s:shard1 r:core_node2 x:collection1] o.a.s.c.ElectionContext Canceling election /collections/collection1/leader_elect/shard1/election/96420930657910799-core_node2-n_0000000002
   [junit4]   2> 1090529 WARN  (zkCallback-1779-thread-1-processing-n:127.0.0.1:32925_z%2Fk) [n:127.0.0.1:32925_z%2Fk c:collection1 s:shard1 r:core_node2 x:collection1] o.a.s.c.LeaderElector 
   [junit4]   2> org.apache.zookeeper.KeeperException$SessionExpiredException: KeeperErrorCode = Session expired for /collections/collection1/leader_elect/shard1/election/96420930657910799-core_node2-n_0000000002
   [junit4]   2> 	at org.apache.zookeeper.KeeperException.create(KeeperException.java:127)
   [junit4]   2> 	at org.apache.zookeeper.KeeperException.create(KeeperException.java:51)
   [junit4]   2> 	at org.apache.zookeeper.ZooKeeper.delete(ZooKeeper.java:873)
   [junit4]   2> 	at org.apache.solr.common.cloud.SolrZkClient$2.execute(SolrZkClient.java:244)
   [junit4]   2> 	at org.apache.solr.common.cloud.SolrZkClient$2.execute(SolrZkClient.java:241)
   [junit4]   2> 	at org.apache.solr.common.cloud.ZkCmdExecutor.retryOperation(ZkCmdExecutor.java:60)
   [junit4]   2> 	at org.apache.solr.common.cloud.SolrZkClient.delete(SolrZkClient.java:241)
   [junit4]   2> 	at org.apache.solr.cloud.ElectionContext.cancelElection(ElectionContext.java:85)
   [junit4]   2> 	at org.apache.solr.cloud.ShardLeaderElectionContextBase.cancelElection(ElectionContext.java:142)
   [junit4]   2> 	at org.apache.solr.cloud.ShardLeaderElectionContext.cancelElection(ElectionContext.java:274)
   [junit4]   2> 	at org.apache.solr.cloud.ShardLeaderElectionContext.runLeaderProcess(ElectionContext.java:450)
   [junit4]   2> 	at org.apache.solr.cloud.LeaderElector.runIamLeaderProcess(LeaderElector.java:170)
   [junit4]   2> 	at org.apache.solr.cloud.LeaderElector.checkIfIamLeader(LeaderElector.java:135)
   [junit4]   2> 	at org.apache.solr.cloud.LeaderElector.access$200(LeaderElector.java:56)
   [junit4]   2> 	at org.apache.solr.cloud.LeaderElector$ElectionWatcher.process(LeaderElector.java:348)
   [junit4]   2> 	at org.apache.solr.common.cloud.SolrZkClient$3.lambda$process$0(SolrZkClient.java:266)
   [junit4]   2> 	at java.util.concurrent.Executors$RunnableAdapter.call(Executors.java:511)
   [junit4]   2> 	at java.util.concurrent.FutureTask.run(FutureTask.java:266)
   [junit4]   2> 	at org.apache.solr.common.util.ExecutorUtil$MDCAwareThreadPoolExecutor.lambda$execute$0(ExecutorUtil.java:229)
   [junit4]   2> 	at java.util.concurrent.ThreadPoolExecutor.runWorker(ThreadPoolExecutor.java:1142)
   [junit4]   2> 	at java.util.concurrent.ThreadPoolExecutor$Worker.run(ThreadPoolExecutor.java:617)
   [junit4]   2> 	at java.lang.Thread.run(Thread.java:745)
   [junit4]   2> 1090531 INFO  (TEST-RecoveryZkTest.test-seed#[FF7B6D4FA437E1D5]) [    ] o.e.j.s.ServerConnector Stopped ServerConnector@1f84a80{SSL,[ssl, http/1.1]}{127.0.0.1:32925}
   [junit4]   2> 1090531 INFO  (TEST-RecoveryZkTest.test-seed#[FF7B6D4FA437E1D5]) [    ] o.e.j.s.h.ContextHandler Stopped o.e.j.s.ServletContextHandler@3a6c0d{/z/k,null,UNAVAILABLE}
   [junit4]   2> 1090532 INFO  (TEST-RecoveryZkTest.test-seed#[FF7B6D4FA437E1D5]) [    ] o.a.s.c.ChaosMonkey monkey: stop shard! 38523
   [junit4]   2> 1090532 INFO  (TEST-RecoveryZkTest.test-seed#[FF7B6D4FA437E1D5]) [    ] o.a.s.c.ZkTestServer connecting to 127.0.0.1:43126 43126
   [junit4]   2> 1090686 INFO  (Thread-2124) [    ] o.a.s.c.ZkTestServer connecting to 127.0.0.1:43126 43126
   [junit4]   2> 1090686 WARN  (Thread-2124) [    ] o.a.s.c.ZkTestServer Watch limit violations: 
   [junit4]   2> Maximum concurrent create/delete watches above limit:
   [junit4]   2> 
   [junit4]   2> 	5	/solr/aliases.json
   [junit4]   2> 	4	/solr/security.json
   [junit4]   2> 	4	/solr/configs/conf1
   [junit4]   2> 	3	/solr/collections/collection1/state.json
   [junit4]   2> 
   [junit4]   2> Maximum concurrent data watches above limit:
   [junit4]   2> 
   [junit4]   2> 	5	/solr/clusterstate.json
   [junit4]   2> 	5	/solr/clusterprops.json
   [junit4]   2> 	2	/solr/collections/collection1/leader_elect/shard1/election/96420930657910793-core_node1-n_0000000000
   [junit4]   2> 	2	/solr/overseer_elect/election/96420930657910793-127.0.0.1:32866_z%2Fk-n_0000000001
   [junit4]   2> 
   [junit4]   2> Maximum concurrent children watches above limit:
   [junit4]   2> 
   [junit4]   2> 	65	/solr/overseer/queue
   [junit4]   2> 	36	/solr/overseer/collection-queue-work
   [junit4]   2> 	5	/solr/collections
   [junit4]   2> 	4	/solr/live_nodes
   [junit4]   2> 	4	/solr/overseer/queue-work
   [junit4]   2> 
   [junit4]   2> NOTE: reproduce with: ant test  -Dtestcase=RecoveryZkTest -Dtests.method=test -Dtests.seed=FF7B6D4FA437E1D5 -Dtests.multiplier=3 -Dtests.slow=true -Dtests.locale=hr-HR -Dtests.timezone=Atlantic/Bermuda -Dtests.asserts=true -Dtests.file.encoding=US-ASCII
   [junit4] ERROR   36.9s J0 | RecoveryZkTest.test <<<
   [junit4]    > Throwable #1: com.carrotsearch.randomizedtesting.UncaughtExceptionError: Captured an uncaught exception in thread: Thread[id=9352, name=updateExecutor-1763-thread-3, state=RUNNABLE, group=TGRP-RecoveryZkTest]
   [junit4]    > 	at __randomizedtesting.SeedInfo.seed([FF7B6D4FA437E1D5:772F52950ACB8C2D]:0)
   [junit4]    > Caused by: org.apache.solr.common.SolrException: Replica: https://127.0.0.1:32925/z/k/collection1/ should have been marked under leader initiated recovery in ZkController but wasn't.
   [junit4]    > 	at __randomizedtesting.SeedInfo.seed([FF7B6D4FA437E1D5]:0)
   [junit4]    > 	at org.apache.solr.cloud.LeaderInitiatedRecoveryThread.run(LeaderInitiatedRecoveryThread.java:88)
   [junit4]    > 	at org.apache.solr.common.util.ExecutorUtil$MDCAwareThreadPoolExecutor.lambda$execute$0(ExecutorUtil.java:229)
   [junit4]    > 	at java.util.concurrent.ThreadPoolExecutor.runWorker(ThreadPoolExecutor.java:1142)
   [junit4]    > 	at java.util.concurrent.ThreadPoolExecutor$Worker.run(ThreadPoolExecutor.java:617)
   [junit4]    > 	at java.lang.Thread.run(Thread.java:745)
   [junit4]   2> 1090689 INFO  (SUITE-RecoveryZkTest-seed#[FF7B6D4FA437E1D5]-worker) [    ] o.a.s.SolrTestCaseJ4 ###deleteCore
   [junit4]   2> NOTE: test params are: codec=Asserting(Lucene62): {rnd_b=Lucene50(blocksize=128), _version_=PostingsFormat(name=MockRandom), a_t=PostingsFormat(name=Memory doPackFST= false), a_i=Lucene50(blocksize=128), id=Lucene50(blocksize=128)}, docValues:{}, maxPointsInLeafNode=676, maxMBSortInHeap=5.325752622021825, sim=RandomSimilarity(queryNorm=true): {}, locale=hr-HR, timezone=Atlantic/Bermuda
   [junit4]   2> NOTE: Linux 4.4.0-31-generic i386/Oracle Corporation 1.8.0_102 (32-bit)/cpus=12,threads=1,free=288726920,total=518979584
   [junit4]   2> NOTE: All tests run in this JVM: [TestJsonFacets, TestCollectionAPI, TestFieldCacheSanityChecker, DataDrivenBlockJoinTest, StandardRequestHandlerTest, TestDocSet, TestRangeQuery, TestSolrConfigHandler, DisMaxRequestHandlerTest, HLLUtilTest, SyncSliceTest, TestRandomFlRTGCloud, SecurityConfHandlerTest, CachingDirectoryFactoryTest, HdfsChaosMonkeyNothingIsSafeTest, TestFastOutputStream, TestRemoteStreaming, TestSSLRandomization, TestRandomFaceting, TestHighFrequencyDictionaryFactory, TestManagedResourceStorage, BigEndianAscendingWordDeserializerTest, TestReqParamsAPI, IndexSchemaRuntimeFieldTest, TestSolrCloudWithDelegationTokens, DateFieldTest, CdcrRequestHandlerTest, TestFieldCacheVsDocValues, TestBadConfig, CursorPagingTest, TestCloudInspectUtil, DefaultValueUpdateProcessorTest, OverseerTaskQueueTest, CollectionStateFormat2Test, TestDistributedSearch, CheckHdfsIndexTest, CloudMLTQParserTest, HighlighterMaxOffsetTest, TestHighlightDedupGrouping, RequiredFieldsTest, TestSolr4Spatial, TestReplicaProperties, TestSortByMinMaxFunction, SolrXmlInZkTest, RAMDirectoryFactoryTest, AlternateDirectoryTest, TestLazyCores, OutputWriterTest, TestNRTOpen, SolrRequestParserTest, TestFieldResource, TestSchemaNameResource, JSONWriterTest, DocExpirationUpdateProcessorFactoryTest, DeleteInactiveReplicaTest, BasicZkTest, TestLMDirichletSimilarityFactory, UUIDFieldTest, EchoParamsTest, TestReplicationHandler, TestAddFieldRealTimeGet, HdfsTlogReplayBufferedWhileIndexingTest, SolrCoreTest, ExplicitHLLTest, DistributedExpandComponentTest, TestConfigSetsAPIZkFailure, TestLuceneMatchVersion, IndexSchemaTest, ZkNodePropsTest, TestNoOpRegenerator, TestOmitPositions, TestAnalyzedSuggestions, StressHdfsTest, TestStressLucene, FacetPivotSmallTest, CacheHeaderTest, ConnectionManagerTest, TestFoldingMultitermQuery, ZkStateWriterTest, TestImplicitCoreProperties, ResponseLogComponentTest, AtomicUpdatesTest, TestSimpleQParserPlugin, TestRandomCollapseQParserPlugin, TestSolrCoreSnapshots, CdcrBootstrapTest, TestSchemaVersionResource, TestCrossCoreJoin, DistribCursorPagingTest, TestRTGBase, TestBlendedInfixSuggestions, TestSolrConfigHandlerCloud, TestCloudManagedSchema, TestLRUCache, TestRandomDVFaceting, TestPhraseSuggestions, TestConfigSetProperties, TestArbitraryIndexDir, DocumentAnalysisRequestHandlerTest, TestPseudoReturnFields, FileBasedSpellCheckerTest, TestManagedSynonymFilterFactory, OverseerTest, LeaderElectionIntegrationTest, ShardRoutingTest, RecoveryZkTest]
   [junit4] Completed [272/629 (1!)] on J0 in 37.01s, 1 test, 1 error <<< FAILURES!

[...truncated 53556 lines...]


Mime
View raw message