lucene-dev mailing list archives

Site index · List index
Message view « Date » · « Thread »
Top « Date » · « Thread »
From Policeman Jenkins Server <jenk...@thetaphi.de>
Subject [JENKINS] Lucene-Solr-master-MacOSX (64bit/jdk1.8.0) - Build # 3482 - Unstable!
Date Tue, 16 Aug 2016 23:00:59 GMT
Build: http://jenkins.thetaphi.de/job/Lucene-Solr-master-MacOSX/3482/
Java: 64bit/jdk1.8.0 -XX:-UseCompressedOops -XX:+UseConcMarkSweepGC

1 tests failed.
FAILED:  org.apache.solr.cloud.RecoveryZkTest.test

Error Message:
There are still nodes recoverying - waited for 120 seconds

Stack Trace:
java.lang.AssertionError: There are still nodes recoverying - waited for 120 seconds
	at __randomizedtesting.SeedInfo.seed([335333712DD16BB6:BB070CAB832D064E]:0)
	at org.junit.Assert.fail(Assert.java:93)
	at org.apache.solr.cloud.AbstractDistribZkTestBase.waitForRecoveriesToFinish(AbstractDistribZkTestBase.java:182)
	at org.apache.solr.cloud.AbstractFullDistribZkTestBase.waitForRecoveriesToFinish(AbstractFullDistribZkTestBase.java:862)
	at org.apache.solr.cloud.AbstractFullDistribZkTestBase.waitForThingsToLevelOut(AbstractFullDistribZkTestBase.java:1418)
	at org.apache.solr.cloud.RecoveryZkTest.test(RecoveryZkTest.java:105)
	at sun.reflect.NativeMethodAccessorImpl.invoke0(Native Method)
	at sun.reflect.NativeMethodAccessorImpl.invoke(NativeMethodAccessorImpl.java:62)
	at sun.reflect.DelegatingMethodAccessorImpl.invoke(DelegatingMethodAccessorImpl.java:43)
	at java.lang.reflect.Method.invoke(Method.java:498)
	at com.carrotsearch.randomizedtesting.RandomizedRunner.invoke(RandomizedRunner.java:1764)
	at com.carrotsearch.randomizedtesting.RandomizedRunner$8.evaluate(RandomizedRunner.java:871)
	at com.carrotsearch.randomizedtesting.RandomizedRunner$9.evaluate(RandomizedRunner.java:907)
	at com.carrotsearch.randomizedtesting.RandomizedRunner$10.evaluate(RandomizedRunner.java:921)
	at org.apache.solr.BaseDistributedSearchTestCase$ShardsRepeatRule$ShardsFixedStatement.callStatement(BaseDistributedSearchTestCase.java:985)
	at org.apache.solr.BaseDistributedSearchTestCase$ShardsRepeatRule$ShardsStatement.evaluate(BaseDistributedSearchTestCase.java:960)
	at com.carrotsearch.randomizedtesting.rules.SystemPropertiesRestoreRule$1.evaluate(SystemPropertiesRestoreRule.java:57)
	at org.apache.lucene.util.TestRuleSetupTeardownChained$1.evaluate(TestRuleSetupTeardownChained.java:49)
	at org.apache.lucene.util.AbstractBeforeAfterRule$1.evaluate(AbstractBeforeAfterRule.java:45)
	at org.apache.lucene.util.TestRuleThreadAndTestName$1.evaluate(TestRuleThreadAndTestName.java:48)
	at org.apache.lucene.util.TestRuleIgnoreAfterMaxFailures$1.evaluate(TestRuleIgnoreAfterMaxFailures.java:64)
	at org.apache.lucene.util.TestRuleMarkFailure$1.evaluate(TestRuleMarkFailure.java:47)
	at com.carrotsearch.randomizedtesting.rules.StatementAdapter.evaluate(StatementAdapter.java:36)
	at com.carrotsearch.randomizedtesting.ThreadLeakControl$StatementRunner.run(ThreadLeakControl.java:367)
	at com.carrotsearch.randomizedtesting.ThreadLeakControl.forkTimeoutingTask(ThreadLeakControl.java:809)
	at com.carrotsearch.randomizedtesting.ThreadLeakControl$3.evaluate(ThreadLeakControl.java:460)
	at com.carrotsearch.randomizedtesting.RandomizedRunner.runSingleTest(RandomizedRunner.java:880)
	at com.carrotsearch.randomizedtesting.RandomizedRunner$5.evaluate(RandomizedRunner.java:781)
	at com.carrotsearch.randomizedtesting.RandomizedRunner$6.evaluate(RandomizedRunner.java:816)
	at com.carrotsearch.randomizedtesting.RandomizedRunner$7.evaluate(RandomizedRunner.java:827)
	at com.carrotsearch.randomizedtesting.rules.StatementAdapter.evaluate(StatementAdapter.java:36)
	at com.carrotsearch.randomizedtesting.rules.SystemPropertiesRestoreRule$1.evaluate(SystemPropertiesRestoreRule.java:57)
	at org.apache.lucene.util.AbstractBeforeAfterRule$1.evaluate(AbstractBeforeAfterRule.java:45)
	at com.carrotsearch.randomizedtesting.rules.StatementAdapter.evaluate(StatementAdapter.java:36)
	at org.apache.lucene.util.TestRuleStoreClassName$1.evaluate(TestRuleStoreClassName.java:41)
	at com.carrotsearch.randomizedtesting.rules.NoShadowingOrOverridesOnMethodsRule$1.evaluate(NoShadowingOrOverridesOnMethodsRule.java:40)
	at com.carrotsearch.randomizedtesting.rules.NoShadowingOrOverridesOnMethodsRule$1.evaluate(NoShadowingOrOverridesOnMethodsRule.java:40)
	at com.carrotsearch.randomizedtesting.rules.StatementAdapter.evaluate(StatementAdapter.java:36)
	at com.carrotsearch.randomizedtesting.rules.StatementAdapter.evaluate(StatementAdapter.java:36)
	at com.carrotsearch.randomizedtesting.rules.StatementAdapter.evaluate(StatementAdapter.java:36)
	at org.apache.lucene.util.TestRuleAssertionsRequired$1.evaluate(TestRuleAssertionsRequired.java:53)
	at org.apache.lucene.util.TestRuleMarkFailure$1.evaluate(TestRuleMarkFailure.java:47)
	at org.apache.lucene.util.TestRuleIgnoreAfterMaxFailures$1.evaluate(TestRuleIgnoreAfterMaxFailures.java:64)
	at org.apache.lucene.util.TestRuleIgnoreTestSuites$1.evaluate(TestRuleIgnoreTestSuites.java:54)
	at com.carrotsearch.randomizedtesting.rules.StatementAdapter.evaluate(StatementAdapter.java:36)
	at com.carrotsearch.randomizedtesting.ThreadLeakControl$StatementRunner.run(ThreadLeakControl.java:367)
	at java.lang.Thread.run(Thread.java:745)




Build Log:
[...truncated 10828 lines...]
   [junit4] Suite: org.apache.solr.cloud.RecoveryZkTest
   [junit4]   2> Creating dataDir: /Users/jenkins/workspace/Lucene-Solr-master-MacOSX/solr/build/solr-core/test/J0/temp/solr.cloud.RecoveryZkTest_335333712DD16BB6-001/init-core-data-001
   [junit4]   2> 557830 INFO  (SUITE-RecoveryZkTest-seed#[335333712DD16BB6]-worker) [    ] o.a.s.SolrTestCaseJ4 Randomized ssl (false) and clientAuth (false) via: @org.apache.solr.util.RandomizeSSL(reason=, value=NaN, ssl=NaN, clientAuth=NaN) w/ MAC_OS_X supressed clientAuth
   [junit4]   2> 557830 INFO  (SUITE-RecoveryZkTest-seed#[335333712DD16BB6]-worker) [    ] o.a.s.BaseDistributedSearchTestCase Setting hostContext system property: /yjo/j
   [junit4]   2> 557833 INFO  (TEST-RecoveryZkTest.test-seed#[335333712DD16BB6]) [    ] o.a.s.c.ZkTestServer STARTING ZK TEST SERVER
   [junit4]   2> 557833 INFO  (Thread-725) [    ] o.a.s.c.ZkTestServer client port:0.0.0.0/0.0.0.0:0
   [junit4]   2> 557833 INFO  (Thread-725) [    ] o.a.s.c.ZkTestServer Starting server
   [junit4]   2> 557937 INFO  (TEST-RecoveryZkTest.test-seed#[335333712DD16BB6]) [    ] o.a.s.c.ZkTestServer start zk server on port:60525
   [junit4]   2> 557937 INFO  (TEST-RecoveryZkTest.test-seed#[335333712DD16BB6]) [    ] o.a.s.c.c.SolrZkClient Using default ZkCredentialsProvider
   [junit4]   2> 557938 INFO  (TEST-RecoveryZkTest.test-seed#[335333712DD16BB6]) [    ] o.a.s.c.c.ConnectionManager Waiting for client to connect to ZooKeeper
   [junit4]   2> 557982 INFO  (zkCallback-933-thread-1) [    ] o.a.s.c.c.ConnectionManager Watcher org.apache.solr.common.cloud.ConnectionManager@48fb40ec name:ZooKeeperConnection Watcher:127.0.0.1:60525 got event WatchedEvent state:SyncConnected type:None path:null path:null type:None
   [junit4]   2> 557982 INFO  (TEST-RecoveryZkTest.test-seed#[335333712DD16BB6]) [    ] o.a.s.c.c.ConnectionManager Client is connected to ZooKeeper
   [junit4]   2> 557983 INFO  (TEST-RecoveryZkTest.test-seed#[335333712DD16BB6]) [    ] o.a.s.c.c.SolrZkClient Using default ZkACLProvider
   [junit4]   2> 557983 INFO  (TEST-RecoveryZkTest.test-seed#[335333712DD16BB6]) [    ] o.a.s.c.c.SolrZkClient makePath: /solr
   [junit4]   2> 557992 INFO  (TEST-RecoveryZkTest.test-seed#[335333712DD16BB6]) [    ] o.a.s.c.c.SolrZkClient Using default ZkCredentialsProvider
   [junit4]   2> 557994 INFO  (TEST-RecoveryZkTest.test-seed#[335333712DD16BB6]) [    ] o.a.s.c.c.ConnectionManager Waiting for client to connect to ZooKeeper
   [junit4]   2> 557995 INFO  (zkCallback-934-thread-1) [    ] o.a.s.c.c.ConnectionManager Watcher org.apache.solr.common.cloud.ConnectionManager@2a8bb9e3 name:ZooKeeperConnection Watcher:127.0.0.1:60525/solr got event WatchedEvent state:SyncConnected type:None path:null path:null type:None
   [junit4]   2> 557995 INFO  (TEST-RecoveryZkTest.test-seed#[335333712DD16BB6]) [    ] o.a.s.c.c.ConnectionManager Client is connected to ZooKeeper
   [junit4]   2> 557995 INFO  (TEST-RecoveryZkTest.test-seed#[335333712DD16BB6]) [    ] o.a.s.c.c.SolrZkClient Using default ZkACLProvider
   [junit4]   2> 557995 INFO  (TEST-RecoveryZkTest.test-seed#[335333712DD16BB6]) [    ] o.a.s.c.c.SolrZkClient makePath: /collections/collection1
   [junit4]   2> 557999 INFO  (TEST-RecoveryZkTest.test-seed#[335333712DD16BB6]) [    ] o.a.s.c.c.SolrZkClient makePath: /collections/collection1/shards
   [junit4]   2> 558003 INFO  (TEST-RecoveryZkTest.test-seed#[335333712DD16BB6]) [    ] o.a.s.c.c.SolrZkClient makePath: /collections/control_collection
   [junit4]   2> 558007 INFO  (TEST-RecoveryZkTest.test-seed#[335333712DD16BB6]) [    ] o.a.s.c.c.SolrZkClient makePath: /collections/control_collection/shards
   [junit4]   2> 558011 INFO  (TEST-RecoveryZkTest.test-seed#[335333712DD16BB6]) [    ] o.a.s.c.AbstractZkTestCase put /Users/jenkins/workspace/Lucene-Solr-master-MacOSX/solr/core/src/test-files/solr/collection1/conf/solrconfig-tlog.xml to /configs/conf1/solrconfig.xml
   [junit4]   2> 558011 INFO  (TEST-RecoveryZkTest.test-seed#[335333712DD16BB6]) [    ] o.a.s.c.c.SolrZkClient makePath: /configs/conf1/solrconfig.xml
   [junit4]   2> 558016 INFO  (TEST-RecoveryZkTest.test-seed#[335333712DD16BB6]) [    ] o.a.s.c.AbstractZkTestCase put /Users/jenkins/workspace/Lucene-Solr-master-MacOSX/solr/core/src/test-files/solr/collection1/conf/schema15.xml to /configs/conf1/schema.xml
   [junit4]   2> 558016 INFO  (TEST-RecoveryZkTest.test-seed#[335333712DD16BB6]) [    ] o.a.s.c.c.SolrZkClient makePath: /configs/conf1/schema.xml
   [junit4]   2> 558020 INFO  (TEST-RecoveryZkTest.test-seed#[335333712DD16BB6]) [    ] o.a.s.c.AbstractZkTestCase put /Users/jenkins/workspace/Lucene-Solr-master-MacOSX/solr/core/src/test-files/solr/collection1/conf/solrconfig.snippet.randomindexconfig.xml to /configs/conf1/solrconfig.snippet.randomindexconfig.xml
   [junit4]   2> 558020 INFO  (TEST-RecoveryZkTest.test-seed#[335333712DD16BB6]) [    ] o.a.s.c.c.SolrZkClient makePath: /configs/conf1/solrconfig.snippet.randomindexconfig.xml
   [junit4]   2> 558023 INFO  (TEST-RecoveryZkTest.test-seed#[335333712DD16BB6]) [    ] o.a.s.c.AbstractZkTestCase put /Users/jenkins/workspace/Lucene-Solr-master-MacOSX/solr/core/src/test-files/solr/collection1/conf/stopwords.txt to /configs/conf1/stopwords.txt
   [junit4]   2> 558023 INFO  (TEST-RecoveryZkTest.test-seed#[335333712DD16BB6]) [    ] o.a.s.c.c.SolrZkClient makePath: /configs/conf1/stopwords.txt
   [junit4]   2> 558026 INFO  (TEST-RecoveryZkTest.test-seed#[335333712DD16BB6]) [    ] o.a.s.c.AbstractZkTestCase put /Users/jenkins/workspace/Lucene-Solr-master-MacOSX/solr/core/src/test-files/solr/collection1/conf/protwords.txt to /configs/conf1/protwords.txt
   [junit4]   2> 558026 INFO  (TEST-RecoveryZkTest.test-seed#[335333712DD16BB6]) [    ] o.a.s.c.c.SolrZkClient makePath: /configs/conf1/protwords.txt
   [junit4]   2> 558029 INFO  (TEST-RecoveryZkTest.test-seed#[335333712DD16BB6]) [    ] o.a.s.c.AbstractZkTestCase put /Users/jenkins/workspace/Lucene-Solr-master-MacOSX/solr/core/src/test-files/solr/collection1/conf/currency.xml to /configs/conf1/currency.xml
   [junit4]   2> 558029 INFO  (TEST-RecoveryZkTest.test-seed#[335333712DD16BB6]) [    ] o.a.s.c.c.SolrZkClient makePath: /configs/conf1/currency.xml
   [junit4]   2> 558033 INFO  (TEST-RecoveryZkTest.test-seed#[335333712DD16BB6]) [    ] o.a.s.c.AbstractZkTestCase put /Users/jenkins/workspace/Lucene-Solr-master-MacOSX/solr/core/src/test-files/solr/collection1/conf/enumsConfig.xml to /configs/conf1/enumsConfig.xml
   [junit4]   2> 558033 INFO  (TEST-RecoveryZkTest.test-seed#[335333712DD16BB6]) [    ] o.a.s.c.c.SolrZkClient makePath: /configs/conf1/enumsConfig.xml
   [junit4]   2> 558036 INFO  (TEST-RecoveryZkTest.test-seed#[335333712DD16BB6]) [    ] o.a.s.c.AbstractZkTestCase put /Users/jenkins/workspace/Lucene-Solr-master-MacOSX/solr/core/src/test-files/solr/collection1/conf/open-exchange-rates.json to /configs/conf1/open-exchange-rates.json
   [junit4]   2> 558037 INFO  (TEST-RecoveryZkTest.test-seed#[335333712DD16BB6]) [    ] o.a.s.c.c.SolrZkClient makePath: /configs/conf1/open-exchange-rates.json
   [junit4]   2> 558040 INFO  (TEST-RecoveryZkTest.test-seed#[335333712DD16BB6]) [    ] o.a.s.c.AbstractZkTestCase put /Users/jenkins/workspace/Lucene-Solr-master-MacOSX/solr/core/src/test-files/solr/collection1/conf/mapping-ISOLatin1Accent.txt to /configs/conf1/mapping-ISOLatin1Accent.txt
   [junit4]   2> 558040 INFO  (TEST-RecoveryZkTest.test-seed#[335333712DD16BB6]) [    ] o.a.s.c.c.SolrZkClient makePath: /configs/conf1/mapping-ISOLatin1Accent.txt
   [junit4]   2> 558043 INFO  (TEST-RecoveryZkTest.test-seed#[335333712DD16BB6]) [    ] o.a.s.c.AbstractZkTestCase put /Users/jenkins/workspace/Lucene-Solr-master-MacOSX/solr/core/src/test-files/solr/collection1/conf/old_synonyms.txt to /configs/conf1/old_synonyms.txt
   [junit4]   2> 558043 INFO  (TEST-RecoveryZkTest.test-seed#[335333712DD16BB6]) [    ] o.a.s.c.c.SolrZkClient makePath: /configs/conf1/old_synonyms.txt
   [junit4]   2> 558048 INFO  (TEST-RecoveryZkTest.test-seed#[335333712DD16BB6]) [    ] o.a.s.c.AbstractZkTestCase put /Users/jenkins/workspace/Lucene-Solr-master-MacOSX/solr/core/src/test-files/solr/collection1/conf/synonyms.txt to /configs/conf1/synonyms.txt
   [junit4]   2> 558048 INFO  (TEST-RecoveryZkTest.test-seed#[335333712DD16BB6]) [    ] o.a.s.c.c.SolrZkClient makePath: /configs/conf1/synonyms.txt
   [junit4]   2> 558054 WARN  (NIOServerCxn.Factory:0.0.0.0/0.0.0.0:0) [    ] o.a.z.s.NIOServerCnxn caught end of stream exception
   [junit4]   2> EndOfStreamException: Unable to read additional data from client sessionid 0x15695464cf80001, likely client has closed socket
   [junit4]   2> 	at org.apache.zookeeper.server.NIOServerCnxn.doIO(NIOServerCnxn.java:228)
   [junit4]   2> 	at org.apache.zookeeper.server.NIOServerCnxnFactory.run(NIOServerCnxnFactory.java:208)
   [junit4]   2> 	at java.lang.Thread.run(Thread.java:745)
   [junit4]   2> 558439 INFO  (TEST-RecoveryZkTest.test-seed#[335333712DD16BB6]) [    ] o.a.s.SolrTestCaseJ4 Writing core.properties file to /Users/jenkins/workspace/Lucene-Solr-master-MacOSX/solr/build/solr-core/test/J0/temp/solr.cloud.RecoveryZkTest_335333712DD16BB6-001/control-001/cores/collection1
   [junit4]   2> 558444 INFO  (TEST-RecoveryZkTest.test-seed#[335333712DD16BB6]) [    ] o.e.j.s.Server jetty-9.3.8.v20160314
   [junit4]   2> 558450 INFO  (TEST-RecoveryZkTest.test-seed#[335333712DD16BB6]) [    ] o.e.j.s.h.ContextHandler Started o.e.j.s.ServletContextHandler@2ce5b063{/yjo/j,null,AVAILABLE}
   [junit4]   2> 558451 INFO  (TEST-RecoveryZkTest.test-seed#[335333712DD16BB6]) [    ] o.e.j.s.ServerConnector Started ServerConnector@1a1ee7b2{HTTP/1.1,[http/1.1]}{127.0.0.1:60528}
   [junit4]   2> 558452 INFO  (TEST-RecoveryZkTest.test-seed#[335333712DD16BB6]) [    ] o.e.j.s.Server Started @565298ms
   [junit4]   2> 558452 INFO  (TEST-RecoveryZkTest.test-seed#[335333712DD16BB6]) [    ] o.a.s.c.s.e.JettySolrRunner Jetty properties: {solr.data.dir=/Users/jenkins/workspace/Lucene-Solr-master-MacOSX/solr/build/solr-core/test/J0/temp/solr.cloud.RecoveryZkTest_335333712DD16BB6-001/tempDir-001/control/data, hostContext=/yjo/j, hostPort=60528, coreRootDirectory=/Users/jenkins/workspace/Lucene-Solr-master-MacOSX/solr/build/solr-core/test/J0/temp/solr.cloud.RecoveryZkTest_335333712DD16BB6-001/control-001/cores}
   [junit4]   2> 558452 INFO  (TEST-RecoveryZkTest.test-seed#[335333712DD16BB6]) [    ] o.a.s.s.SolrDispatchFilter SolrDispatchFilter.init(): sun.misc.Launcher$AppClassLoader@4554617c
   [junit4]   2> 558452 INFO  (TEST-RecoveryZkTest.test-seed#[335333712DD16BB6]) [    ] o.a.s.c.SolrResourceLoader new SolrResourceLoader for directory: '/Users/jenkins/workspace/Lucene-Solr-master-MacOSX/solr/build/solr-core/test/J0/temp/solr.cloud.RecoveryZkTest_335333712DD16BB6-001/control-001'
   [junit4]   2> 558452 INFO  (TEST-RecoveryZkTest.test-seed#[335333712DD16BB6]) [    ] o.a.s.c.SolrResourceLoader JNDI not configured for solr (NoInitialContextEx)
   [junit4]   2> 558452 INFO  (TEST-RecoveryZkTest.test-seed#[335333712DD16BB6]) [    ] o.a.s.c.SolrResourceLoader solr home defaulted to 'solr/' (could not find system property or JNDI)
   [junit4]   2> 558453 INFO  (TEST-RecoveryZkTest.test-seed#[335333712DD16BB6]) [    ] o.a.s.c.c.SolrZkClient Using default ZkCredentialsProvider
   [junit4]   2> 558457 INFO  (TEST-RecoveryZkTest.test-seed#[335333712DD16BB6]) [    ] o.a.s.c.c.ConnectionManager Waiting for client to connect to ZooKeeper
   [junit4]   2> 558458 INFO  (zkCallback-935-thread-1) [    ] o.a.s.c.c.ConnectionManager Watcher org.apache.solr.common.cloud.ConnectionManager@7a7f178c name:ZooKeeperConnection Watcher:127.0.0.1:60525/solr got event WatchedEvent state:SyncConnected type:None path:null path:null type:None
   [junit4]   2> 558458 INFO  (TEST-RecoveryZkTest.test-seed#[335333712DD16BB6]) [    ] o.a.s.c.c.ConnectionManager Client is connected to ZooKeeper
   [junit4]   2> 558458 INFO  (TEST-RecoveryZkTest.test-seed#[335333712DD16BB6]) [    ] o.a.s.c.c.SolrZkClient Using default ZkACLProvider
   [junit4]   2> 558460 INFO  (TEST-RecoveryZkTest.test-seed#[335333712DD16BB6]) [    ] o.a.s.s.SolrDispatchFilter Loading solr.xml from SolrHome (not found in ZooKeeper)
   [junit4]   2> 558460 INFO  (TEST-RecoveryZkTest.test-seed#[335333712DD16BB6]) [    ] o.a.s.c.SolrXmlConfig Loading container configuration from /Users/jenkins/workspace/Lucene-Solr-master-MacOSX/solr/build/solr-core/test/J0/temp/solr.cloud.RecoveryZkTest_335333712DD16BB6-001/control-001/solr.xml
   [junit4]   2> 558510 INFO  (TEST-RecoveryZkTest.test-seed#[335333712DD16BB6]) [    ] o.a.s.c.CorePropertiesLocator Config-defined core root directory: /Users/jenkins/workspace/Lucene-Solr-master-MacOSX/solr/build/solr-core/test/J0/temp/solr.cloud.RecoveryZkTest_335333712DD16BB6-001/control-001/cores
   [junit4]   2> 558510 INFO  (TEST-RecoveryZkTest.test-seed#[335333712DD16BB6]) [    ] o.a.s.c.CoreContainer New CoreContainer 2054725099
   [junit4]   2> 558510 INFO  (TEST-RecoveryZkTest.test-seed#[335333712DD16BB6]) [    ] o.a.s.c.CoreContainer Loading cores into CoreContainer [instanceDir=/Users/jenkins/workspace/Lucene-Solr-master-MacOSX/solr/build/solr-core/test/J0/temp/solr.cloud.RecoveryZkTest_335333712DD16BB6-001/control-001]
   [junit4]   2> 558511 WARN  (TEST-RecoveryZkTest.test-seed#[335333712DD16BB6]) [    ] o.a.s.c.CoreContainer Couldn't add files from /Users/jenkins/workspace/Lucene-Solr-master-MacOSX/solr/build/solr-core/test/J0/temp/solr.cloud.RecoveryZkTest_335333712DD16BB6-001/control-001/lib to classpath: /Users/jenkins/workspace/Lucene-Solr-master-MacOSX/solr/build/solr-core/test/J0/temp/solr.cloud.RecoveryZkTest_335333712DD16BB6-001/control-001/lib
   [junit4]   2> 558511 INFO  (TEST-RecoveryZkTest.test-seed#[335333712DD16BB6]) [    ] o.a.s.h.c.HttpShardHandlerFactory created with socketTimeout : 90000,urlScheme : ,connTimeout : 15000,maxConnectionsPerHost : 20,maxConnections : 10000,corePoolSize : 0,maximumPoolSize : 2147483647,maxThreadIdleTime : 5,sizeOfQueue : -1,fairnessPolicy : false,
   [junit4]   2> 558538 INFO  (TEST-RecoveryZkTest.test-seed#[335333712DD16BB6]) [    ] o.a.s.u.UpdateShardHandler Created UpdateShardHandler HTTP client with params: socketTimeout=340000&connTimeout=45000&maxConnections=100000&maxConnectionsPerHost=100000
   [junit4]   2> 558538 INFO  (TEST-RecoveryZkTest.test-seed#[335333712DD16BB6]) [    ] o.a.s.l.LogWatcher SLF4J impl is org.slf4j.impl.Log4jLoggerFactory
   [junit4]   2> 558538 INFO  (TEST-RecoveryZkTest.test-seed#[335333712DD16BB6]) [    ] o.a.s.l.LogWatcher Registering Log Listener [Log4j (org.slf4j.impl.Log4jLoggerFactory)]
   [junit4]   2> 558538 INFO  (TEST-RecoveryZkTest.test-seed#[335333712DD16BB6]) [    ] o.a.s.c.ZkContainer Zookeeper client=127.0.0.1:60525/solr
   [junit4]   2> 558538 INFO  (TEST-RecoveryZkTest.test-seed#[335333712DD16BB6]) [    ] o.a.s.c.ZkController zkHost includes chroot
   [junit4]   2> 558538 INFO  (TEST-RecoveryZkTest.test-seed#[335333712DD16BB6]) [    ] o.a.s.c.c.SolrZkClient Using default ZkCredentialsProvider
   [junit4]   2> 558539 INFO  (TEST-RecoveryZkTest.test-seed#[335333712DD16BB6]) [    ] o.a.s.c.c.ConnectionManager Waiting for client to connect to ZooKeeper
   [junit4]   2> 558541 INFO  (zkCallback-938-thread-1) [    ] o.a.s.c.c.ConnectionManager Watcher org.apache.solr.common.cloud.ConnectionManager@24226c06 name:ZooKeeperConnection Watcher:127.0.0.1:60525 got event WatchedEvent state:SyncConnected type:None path:null path:null type:None
   [junit4]   2> 558542 INFO  (TEST-RecoveryZkTest.test-seed#[335333712DD16BB6]) [    ] o.a.s.c.c.ConnectionManager Client is connected to ZooKeeper
   [junit4]   2> 558542 INFO  (TEST-RecoveryZkTest.test-seed#[335333712DD16BB6]) [    ] o.a.s.c.c.SolrZkClient Using default ZkACLProvider
   [junit4]   2> 558544 INFO  (TEST-RecoveryZkTest.test-seed#[335333712DD16BB6]) [n:127.0.0.1:60528_yjo%2Fj    ] o.a.s.c.ZkController Added new OnReconnect listener org.apache.solr.cloud.ZkController$$Lambda$9/976535915@620ba4e1
   [junit4]   2> 558546 INFO  (TEST-RecoveryZkTest.test-seed#[335333712DD16BB6]) [n:127.0.0.1:60528_yjo%2Fj    ] o.a.s.c.c.ConnectionManager Waiting for client to connect to ZooKeeper
   [junit4]   2> 558547 INFO  (zkCallback-939-thread-1-processing-n:127.0.0.1:60528_yjo%2Fj) [n:127.0.0.1:60528_yjo%2Fj    ] o.a.s.c.c.ConnectionManager Watcher org.apache.solr.common.cloud.ConnectionManager@682e06d7 name:ZooKeeperConnection Watcher:127.0.0.1:60525/solr got event WatchedEvent state:SyncConnected type:None path:null path:null type:None
   [junit4]   2> 558547 INFO  (TEST-RecoveryZkTest.test-seed#[335333712DD16BB6]) [n:127.0.0.1:60528_yjo%2Fj    ] o.a.s.c.c.ConnectionManager Client is connected to ZooKeeper
   [junit4]   2> 558549 INFO  (TEST-RecoveryZkTest.test-seed#[335333712DD16BB6]) [n:127.0.0.1:60528_yjo%2Fj    ] o.a.s.c.c.SolrZkClient makePath: /overseer/queue
   [junit4]   2> 558554 INFO  (TEST-RecoveryZkTest.test-seed#[335333712DD16BB6]) [n:127.0.0.1:60528_yjo%2Fj    ] o.a.s.c.c.SolrZkClient makePath: /overseer/collection-queue-work
   [junit4]   2> 558559 INFO  (TEST-RecoveryZkTest.test-seed#[335333712DD16BB6]) [n:127.0.0.1:60528_yjo%2Fj    ] o.a.s.c.c.SolrZkClient makePath: /overseer/collection-map-running
   [junit4]   2> 558563 INFO  (TEST-RecoveryZkTest.test-seed#[335333712DD16BB6]) [n:127.0.0.1:60528_yjo%2Fj    ] o.a.s.c.c.SolrZkClient makePath: /overseer/collection-map-completed
   [junit4]   2> 558566 INFO  (TEST-RecoveryZkTest.test-seed#[335333712DD16BB6]) [n:127.0.0.1:60528_yjo%2Fj    ] o.a.s.c.c.SolrZkClient makePath: /overseer/collection-map-failure
   [junit4]   2> 558570 INFO  (TEST-RecoveryZkTest.test-seed#[335333712DD16BB6]) [n:127.0.0.1:60528_yjo%2Fj    ] o.a.s.c.c.SolrZkClient makePath: /live_nodes
   [junit4]   2> 558573 INFO  (TEST-RecoveryZkTest.test-seed#[335333712DD16BB6]) [n:127.0.0.1:60528_yjo%2Fj    ] o.a.s.c.c.SolrZkClient makePath: /aliases.json
   [junit4]   2> 558575 INFO  (TEST-RecoveryZkTest.test-seed#[335333712DD16BB6]) [n:127.0.0.1:60528_yjo%2Fj    ] o.a.s.c.c.SolrZkClient makePath: /clusterstate.json
   [junit4]   2> 558577 INFO  (TEST-RecoveryZkTest.test-seed#[335333712DD16BB6]) [n:127.0.0.1:60528_yjo%2Fj    ] o.a.s.c.c.SolrZkClient makePath: /security.json
   [junit4]   2> 558578 INFO  (TEST-RecoveryZkTest.test-seed#[335333712DD16BB6]) [n:127.0.0.1:60528_yjo%2Fj    ] o.a.s.c.c.ZkStateReader Updating cluster state from ZooKeeper... 
   [junit4]   2> 558580 INFO  (TEST-RecoveryZkTest.test-seed#[335333712DD16BB6]) [n:127.0.0.1:60528_yjo%2Fj    ] o.a.s.c.c.ZkStateReader Loaded empty cluster properties
   [junit4]   2> 558581 INFO  (TEST-RecoveryZkTest.test-seed#[335333712DD16BB6]) [n:127.0.0.1:60528_yjo%2Fj    ] o.a.s.c.c.ZkStateReader Updated live nodes from ZooKeeper... (0) -> (0)
   [junit4]   2> 558586 INFO  (TEST-RecoveryZkTest.test-seed#[335333712DD16BB6]) [n:127.0.0.1:60528_yjo%2Fj    ] o.a.s.c.c.SolrZkClient makePath: /overseer_elect
   [junit4]   2> 558588 INFO  (TEST-RecoveryZkTest.test-seed#[335333712DD16BB6]) [n:127.0.0.1:60528_yjo%2Fj    ] o.a.s.c.c.SolrZkClient makePath: /overseer_elect/election
   [junit4]   2> 558591 INFO  (TEST-RecoveryZkTest.test-seed#[335333712DD16BB6]) [n:127.0.0.1:60528_yjo%2Fj    ] o.a.s.c.Overseer Overseer (id=null) closing
   [junit4]   2> 558592 INFO  (TEST-RecoveryZkTest.test-seed#[335333712DD16BB6]) [n:127.0.0.1:60528_yjo%2Fj    ] o.a.s.c.LeaderElector Joined leadership election with path: /overseer_elect/election/96428571206615044-127.0.0.1:60528_yjo%2Fj-n_0000000000
   [junit4]   2> 558592 INFO  (TEST-RecoveryZkTest.test-seed#[335333712DD16BB6]) [n:127.0.0.1:60528_yjo%2Fj    ] o.a.s.c.OverseerElectionContext I am going to be the leader 127.0.0.1:60528_yjo%2Fj
   [junit4]   2> 558592 INFO  (TEST-RecoveryZkTest.test-seed#[335333712DD16BB6]) [n:127.0.0.1:60528_yjo%2Fj    ] o.a.s.c.c.SolrZkClient makePath: /overseer_elect/leader
   [junit4]   2> 558597 INFO  (TEST-RecoveryZkTest.test-seed#[335333712DD16BB6]) [n:127.0.0.1:60528_yjo%2Fj    ] o.a.s.c.Overseer Overseer (id=96428571206615044-127.0.0.1:60528_yjo%2Fj-n_0000000000) starting
   [junit4]   2> 558602 INFO  (TEST-RecoveryZkTest.test-seed#[335333712DD16BB6]) [n:127.0.0.1:60528_yjo%2Fj    ] o.a.s.c.c.SolrZkClient makePath: /overseer/queue-work
   [junit4]   2> 558612 INFO  (TEST-RecoveryZkTest.test-seed#[335333712DD16BB6]) [n:127.0.0.1:60528_yjo%2Fj    ] o.a.s.c.OverseerAutoReplicaFailoverThread Starting OverseerAutoReplicaFailoverThread autoReplicaFailoverWorkLoopDelay=10000 autoReplicaFailoverWaitAfterExpiration=10000 autoReplicaFailoverBadNodeExpiration=60000
   [junit4]   2> 558612 INFO  (OverseerCollectionConfigSetProcessor-96428571206615044-127.0.0.1:60528_yjo%2Fj-n_0000000000) [n:127.0.0.1:60528_yjo%2Fj    ] o.a.s.c.OverseerTaskProcessor Process current queue of overseer operations
   [junit4]   2> 558613 INFO  (OverseerStateUpdate-96428571206615044-127.0.0.1:60528_yjo%2Fj-n_0000000000) [n:127.0.0.1:60528_yjo%2Fj    ] o.a.s.c.Overseer Starting to work on the main queue
   [junit4]   2> 558614 INFO  (TEST-RecoveryZkTest.test-seed#[335333712DD16BB6]) [n:127.0.0.1:60528_yjo%2Fj    ] o.a.s.c.ZkController Register node as live in ZooKeeper:/live_nodes/127.0.0.1:60528_yjo%2Fj
   [junit4]   2> 558614 INFO  (TEST-RecoveryZkTest.test-seed#[335333712DD16BB6]) [n:127.0.0.1:60528_yjo%2Fj    ] o.a.s.c.c.SolrZkClient makePath: /live_nodes/127.0.0.1:60528_yjo%2Fj
   [junit4]   2> 558616 INFO  (OverseerStateUpdate-96428571206615044-127.0.0.1:60528_yjo%2Fj-n_0000000000) [n:127.0.0.1:60528_yjo%2Fj    ] o.a.s.c.c.ZkStateReader Updated live nodes from ZooKeeper... (0) -> (0)
   [junit4]   2> 558617 INFO  (zkCallback-939-thread-1-processing-n:127.0.0.1:60528_yjo%2Fj) [n:127.0.0.1:60528_yjo%2Fj    ] o.a.s.c.c.ZkStateReader A live node change: [WatchedEvent state:SyncConnected type:NodeChildrenChanged path:/live_nodes], has occurred - updating... (live nodes size: [0])
   [junit4]   2> 558618 INFO  (zkCallback-939-thread-1-processing-n:127.0.0.1:60528_yjo%2Fj) [n:127.0.0.1:60528_yjo%2Fj    ] o.a.s.c.c.ZkStateReader Updated live nodes from ZooKeeper... (0) -> (1)
   [junit4]   2> 558633 INFO  (TEST-RecoveryZkTest.test-seed#[335333712DD16BB6]) [n:127.0.0.1:60528_yjo%2Fj    ] o.a.s.c.CoreContainer Security conf doesn't exist. Skipping setup for authorization module.
   [junit4]   2> 558633 INFO  (TEST-RecoveryZkTest.test-seed#[335333712DD16BB6]) [n:127.0.0.1:60528_yjo%2Fj    ] o.a.s.c.CoreContainer No authentication plugin used.
   [junit4]   2> 558634 INFO  (TEST-RecoveryZkTest.test-seed#[335333712DD16BB6]) [n:127.0.0.1:60528_yjo%2Fj    ] o.a.s.c.CorePropertiesLocator Looking for core definitions underneath /Users/jenkins/workspace/Lucene-Solr-master-MacOSX/solr/build/solr-core/test/J0/temp/solr.cloud.RecoveryZkTest_335333712DD16BB6-001/control-001/cores
   [junit4]   2> 558635 INFO  (TEST-RecoveryZkTest.test-seed#[335333712DD16BB6]) [n:127.0.0.1:60528_yjo%2Fj    ] o.a.s.c.CoreDescriptor Created CoreDescriptor: {name=collection1, config=solrconfig.xml, transient=false, schema=schema.xml, loadOnStartup=true, configSetProperties=configsetprops.json, collection=control_collection, coreNodeName=, dataDir=data/, shard=}
   [junit4]   2> 558635 INFO  (TEST-RecoveryZkTest.test-seed#[335333712DD16BB6]) [n:127.0.0.1:60528_yjo%2Fj    ] o.a.s.c.CorePropertiesLocator Found core collection1 in /Users/jenkins/workspace/Lucene-Solr-master-MacOSX/solr/build/solr-core/test/J0/temp/solr.cloud.RecoveryZkTest_335333712DD16BB6-001/control-001/cores/collection1
   [junit4]   2> 558635 INFO  (TEST-RecoveryZkTest.test-seed#[335333712DD16BB6]) [n:127.0.0.1:60528_yjo%2Fj    ] o.a.s.c.CorePropertiesLocator Found 1 core definitions
   [junit4]   2> 558637 INFO  (coreLoadExecutor-1449-thread-1-processing-n:127.0.0.1:60528_yjo%2Fj) [n:127.0.0.1:60528_yjo%2Fj c:control_collection   x:collection1] o.a.s.c.ZkController publishing state=down
   [junit4]   2> 558637 INFO  (coreLoadExecutor-1449-thread-1-processing-n:127.0.0.1:60528_yjo%2Fj) [n:127.0.0.1:60528_yjo%2Fj c:control_collection   x:collection1] o.a.s.c.ZkController numShards not found on descriptor - reading it from system property
   [junit4]   2> 558638 INFO  (coreLoadExecutor-1449-thread-1-processing-n:127.0.0.1:60528_yjo%2Fj) [n:127.0.0.1:60528_yjo%2Fj c:control_collection   x:collection1] o.a.s.c.ZkController Collection control_collection not visible yet, but flagging it so a watch is registered when it becomes visible
   [junit4]   2> 558639 INFO  (TEST-RecoveryZkTest.test-seed#[335333712DD16BB6]) [n:127.0.0.1:60528_yjo%2Fj    ] o.a.s.s.SolrDispatchFilter user.dir=/Users/jenkins/workspace/Lucene-Solr-master-MacOSX/solr/build/solr-core/test/J0
   [junit4]   2> 558639 INFO  (TEST-RecoveryZkTest.test-seed#[335333712DD16BB6]) [n:127.0.0.1:60528_yjo%2Fj    ] o.a.s.s.SolrDispatchFilter SolrDispatchFilter.init() done
   [junit4]   2> 558639 INFO  (OverseerStateUpdate-96428571206615044-127.0.0.1:60528_yjo%2Fj-n_0000000000) [n:127.0.0.1:60528_yjo%2Fj    ] o.a.s.c.Overseer processMessage: queueSize: 1, message = {
   [junit4]   2>   "core":"collection1",
   [junit4]   2>   "roles":null,
   [junit4]   2>   "base_url":"http://127.0.0.1:60528/yjo/j",
   [junit4]   2>   "node_name":"127.0.0.1:60528_yjo%2Fj",
   [junit4]   2>   "numShards":"1",
   [junit4]   2>   "state":"down",
   [junit4]   2>   "shard":null,
   [junit4]   2>   "collection":"control_collection",
   [junit4]   2>   "operation":"state"} current state version: 0
   [junit4]   2> 558639 INFO  (OverseerStateUpdate-96428571206615044-127.0.0.1:60528_yjo%2Fj-n_0000000000) [n:127.0.0.1:60528_yjo%2Fj    ] o.a.s.c.o.ReplicaMutator Update state numShards=1 message={
   [junit4]   2>   "core":"collection1",
   [junit4]   2>   "roles":null,
   [junit4]   2>   "base_url":"http://127.0.0.1:60528/yjo/j",
   [junit4]   2>   "node_name":"127.0.0.1:60528_yjo%2Fj",
   [junit4]   2>   "numShards":"1",
   [junit4]   2>   "state":"down",
   [junit4]   2>   "shard":null,
   [junit4]   2>   "collection":"control_collection",
   [junit4]   2>   "operation":"state"}
   [junit4]   2> 558639 INFO  (coreLoadExecutor-1449-thread-1-processing-n:127.0.0.1:60528_yjo%2Fj) [n:127.0.0.1:60528_yjo%2Fj c:control_collection   x:collection1] o.a.s.c.c.ZkStateReader Deleting data for [control_collection]
   [junit4]   2> 558640 INFO  (OverseerStateUpdate-96428571206615044-127.0.0.1:60528_yjo%2Fj-n_0000000000) [n:127.0.0.1:60528_yjo%2Fj    ] o.a.s.c.o.ClusterStateMutator building a new cName: control_collection
   [junit4]   2> 558641 INFO  (OverseerStateUpdate-96428571206615044-127.0.0.1:60528_yjo%2Fj-n_0000000000) [n:127.0.0.1:60528_yjo%2Fj    ] o.a.s.c.o.ReplicaMutator Assigning new node to shard shard=shard1
   [junit4]   2> 558641 INFO  (coreLoadExecutor-1449-thread-1-processing-n:127.0.0.1:60528_yjo%2Fj) [n:127.0.0.1:60528_yjo%2Fj c:control_collection   x:collection1] o.a.s.c.ZkController look for our core node name
   [junit4]   2> 558642 INFO  (zkCallback-939-thread-1-processing-n:127.0.0.1:60528_yjo%2Fj) [n:127.0.0.1:60528_yjo%2Fj    ] o.a.s.c.c.ZkStateReader A cluster state change: [WatchedEvent state:SyncConnected type:NodeDataChanged path:/clusterstate.json], has occurred - updating... (live nodes size: [1])
   [junit4]   2> 559649 INFO  (coreLoadExecutor-1449-thread-1-processing-n:127.0.0.1:60528_yjo%2Fj) [n:127.0.0.1:60528_yjo%2Fj c:control_collection   x:collection1] o.a.s.c.ZkController waiting to find shard id in clusterstate for collection1
   [junit4]   2> 559649 INFO  (coreLoadExecutor-1449-thread-1-processing-n:127.0.0.1:60528_yjo%2Fj) [n:127.0.0.1:60528_yjo%2Fj c:control_collection   x:collection1] o.a.s.c.ZkController Check for collection zkNode:control_collection
   [junit4]   2> 559649 INFO  (coreLoadExecutor-1449-thread-1-processing-n:127.0.0.1:60528_yjo%2Fj) [n:127.0.0.1:60528_yjo%2Fj c:control_collection   x:collection1] o.a.s.c.ZkController Collection zkNode exists
   [junit4]   2> 559649 INFO  (coreLoadExecutor-1449-thread-1-processing-n:127.0.0.1:60528_yjo%2Fj) [n:127.0.0.1:60528_yjo%2Fj c:control_collection   x:collection1] o.a.s.c.c.ZkStateReader Load collection config from: [/collections/control_collection]
   [junit4]   2> 559650 INFO  (coreLoadExecutor-1449-thread-1-processing-n:127.0.0.1:60528_yjo%2Fj) [n:127.0.0.1:60528_yjo%2Fj c:control_collection   x:collection1] o.a.s.c.c.ZkStateReader path=[/collections/control_collection] [configName]=[conf1] specified config exists in ZooKeeper
   [junit4]   2> 559650 INFO  (coreLoadExecutor-1449-thread-1-processing-n:127.0.0.1:60528_yjo%2Fj) [n:127.0.0.1:60528_yjo%2Fj c:control_collection   x:collection1] o.a.s.c.SolrResourceLoader new SolrResourceLoader for directory: '/Users/jenkins/workspace/Lucene-Solr-master-MacOSX/solr/build/solr-core/test/J0/temp/solr.cloud.RecoveryZkTest_335333712DD16BB6-001/control-001/cores/collection1'
   [junit4]   2> 559651 INFO  (coreLoadExecutor-1449-thread-1-processing-n:127.0.0.1:60528_yjo%2Fj) [n:127.0.0.1:60528_yjo%2Fj c:control_collection   x:collection1] o.a.s.c.SolrResourceLoader JNDI not configured for solr (NoInitialContextEx)
   [junit4]   2> 559651 INFO  (coreLoadExecutor-1449-thread-1-processing-n:127.0.0.1:60528_yjo%2Fj) [n:127.0.0.1:60528_yjo%2Fj c:control_collection   x:collection1] o.a.s.c.SolrResourceLoader solr home defaulted to 'solr/' (could not find system property or JNDI)
   [junit4]   2> 559652 INFO  (coreLoadExecutor-1449-thread-1-processing-n:127.0.0.1:60528_yjo%2Fj) [n:127.0.0.1:60528_yjo%2Fj c:control_collection   x:collection1] o.a.s.c.Config loaded config solrconfig.xml with version 0 
   [junit4]   2> 559660 INFO  (coreLoadExecutor-1449-thread-1-processing-n:127.0.0.1:60528_yjo%2Fj) [n:127.0.0.1:60528_yjo%2Fj c:control_collection   x:collection1] o.a.s.c.SolrConfig current version of requestparams : -1
   [junit4]   2> 559668 INFO  (coreLoadExecutor-1449-thread-1-processing-n:127.0.0.1:60528_yjo%2Fj) [n:127.0.0.1:60528_yjo%2Fj c:control_collection   x:collection1] o.a.s.c.SolrConfig Using Lucene MatchVersion: 7.0.0
   [junit4]   2> 559683 INFO  (coreLoadExecutor-1449-thread-1-processing-n:127.0.0.1:60528_yjo%2Fj) [n:127.0.0.1:60528_yjo%2Fj c:control_collection   x:collection1] o.a.s.c.SolrConfig Loaded SolrConfig: solrconfig.xml
   [junit4]   2> 559688 INFO  (coreLoadExecutor-1449-thread-1-processing-n:127.0.0.1:60528_yjo%2Fj) [n:127.0.0.1:60528_yjo%2Fj c:control_collection   x:collection1] o.a.s.s.IndexSchema [collection1] Schema name=test
   [junit4]   2> 559803 INFO  (coreLoadExecutor-1449-thread-1-processing-n:127.0.0.1:60528_yjo%2Fj) [n:127.0.0.1:60528_yjo%2Fj c:control_collection   x:collection1] o.a.s.s.IndexSchema default search field in schema is text
   [junit4]   2> 559803 INFO  (coreLoadExecutor-1449-thread-1-processing-n:127.0.0.1:60528_yjo%2Fj) [n:127.0.0.1:60528_yjo%2Fj c:control_collection   x:collection1] o.a.s.s.IndexSchema unique key field: id
   [junit4]   2> 559804 INFO  (coreLoadExecutor-1449-thread-1-processing-n:127.0.0.1:60528_yjo%2Fj) [n:127.0.0.1:60528_yjo%2Fj c:control_collection   x:collection1] o.a.s.s.FileExchangeRateProvider Reloading exchange rates from file currency.xml
   [junit4]   2> 559809 INFO  (coreLoadExecutor-1449-thread-1-processing-n:127.0.0.1:60528_yjo%2Fj) [n:127.0.0.1:60528_yjo%2Fj c:control_collection   x:collection1] o.a.s.s.FileExchangeRateProvider Reloading exchange rates from file currency.xml
   [junit4]   2> 559840 INFO  (coreLoadExecutor-1449-thread-1-processing-n:127.0.0.1:60528_yjo%2Fj) [n:127.0.0.1:60528_yjo%2Fj c:control_collection   x:collection1] o.a.s.c.ConfigSetProperties Did not find ConfigSet properties, assuming default properties: Can't find resource 'configsetprops.json' in classpath or '/configs/conf1', cwd=/Users/jenkins/workspace/Lucene-Solr-master-MacOSX/solr/build/solr-core/test/J0
   [junit4]   2> 559840 INFO  (coreLoadExecutor-1449-thread-1-processing-n:127.0.0.1:60528_yjo%2Fj) [n:127.0.0.1:60528_yjo%2Fj c:control_collection   x:collection1] o.a.s.c.CoreContainer Creating SolrCore 'collection1' using configuration from collection control_collection
   [junit4]   2> 559840 INFO  (coreLoadExecutor-1449-thread-1-processing-n:127.0.0.1:60528_yjo%2Fj) [n:127.0.0.1:60528_yjo%2Fj c:control_collection s:shard1 r:core_node1 x:collection1] o.a.s.c.SolrCore org.apache.solr.core.MockDirectoryFactory
   [junit4]   2> 559841 INFO  (coreLoadExecutor-1449-thread-1-processing-n:127.0.0.1:60528_yjo%2Fj) [n:127.0.0.1:60528_yjo%2Fj c:control_collection s:shard1 r:core_node1 x:collection1] o.a.s.c.SolrCore [[collection1] ] Opening new SolrCore at [/Users/jenkins/workspace/Lucene-Solr-master-MacOSX/solr/build/solr-core/test/J0/temp/solr.cloud.RecoveryZkTest_335333712DD16BB6-001/control-001/cores/collection1], dataDir=[/Users/jenkins/workspace/Lucene-Solr-master-MacOSX/solr/build/solr-core/test/J0/temp/solr.cloud.RecoveryZkTest_335333712DD16BB6-001/control-001/cores/collection1/data/]
   [junit4]   2> 559841 INFO  (coreLoadExecutor-1449-thread-1-processing-n:127.0.0.1:60528_yjo%2Fj) [n:127.0.0.1:60528_yjo%2Fj c:control_collection s:shard1 r:core_node1 x:collection1] o.a.s.c.JmxMonitoredMap JMX monitoring is enabled. Adding Solr mbeans to JMX Server: com.sun.jmx.mbeanserver.JmxMBeanServer@7559d1e2
   [junit4]   2> 559841 INFO  (coreLoadExecutor-1449-thread-1-processing-n:127.0.0.1:60528_yjo%2Fj) [n:127.0.0.1:60528_yjo%2Fj c:control_collection s:shard1 r:core_node1 x:collection1] o.a.s.c.CachingDirectoryFactory return new directory for /Users/jenkins/workspace/Lucene-Solr-master-MacOSX/solr/build/solr-core/test/J0/temp/solr.cloud.RecoveryZkTest_335333712DD16BB6-001/control-001/cores/collection1/data/snapshot_metadata
   [junit4]   2> 559841 INFO  (coreLoadExecutor-1449-thread-1-processing-n:127.0.0.1:60528_yjo%2Fj) [n:127.0.0.1:60528_yjo%2Fj c:control_collection s:shard1 r:core_node1 x:collection1] o.a.s.c.s.SolrSnapshotMetaDataManager Loading from snapshot metadata file...
   [junit4]   2> 559842 INFO  (coreLoadExecutor-1449-thread-1-processing-n:127.0.0.1:60528_yjo%2Fj) [n:127.0.0.1:60528_yjo%2Fj c:control_collection s:shard1 r:core_node1 x:collection1] o.a.s.c.CachingDirectoryFactory return new directory for /Users/jenkins/workspace/Lucene-Solr-master-MacOSX/solr/build/solr-core/test/J0/temp/solr.cloud.RecoveryZkTest_335333712DD16BB6-001/control-001/cores/collection1/data
   [junit4]   2> 559842 INFO  (coreLoadExecutor-1449-thread-1-processing-n:127.0.0.1:60528_yjo%2Fj) [n:127.0.0.1:60528_yjo%2Fj c:control_collection s:shard1 r:core_node1 x:collection1] o.a.s.c.SolrCore New index directory detected: old=null new=/Users/jenkins/workspace/Lucene-Solr-master-MacOSX/solr/build/solr-core/test/J0/temp/solr.cloud.RecoveryZkTest_335333712DD16BB6-001/control-001/cores/collection1/data/index/
   [junit4]   2> 559842 WARN  (coreLoadExecutor-1449-thread-1-processing-n:127.0.0.1:60528_yjo%2Fj) [n:127.0.0.1:60528_yjo%2Fj c:control_collection s:shard1 r:core_node1 x:collection1] o.a.s.c.SolrCore [collection1] Solr index directory '/Users/jenkins/workspace/Lucene-Solr-master-MacOSX/solr/build/solr-core/test/J0/temp/solr.cloud.RecoveryZkTest_335333712DD16BB6-001/control-001/cores/collection1/data/index' doesn't exist. Creating new index...
   [junit4]   2> 559842 INFO  (coreLoadExecutor-1449-thread-1-processing-n:127.0.0.1:60528_yjo%2Fj) [n:127.0.0.1:60528_yjo%2Fj c:control_collection s:shard1 r:core_node1 x:collection1] o.a.s.c.CachingDirectoryFactory return new directory for /Users/jenkins/workspace/Lucene-Solr-master-MacOSX/solr/build/solr-core/test/J0/temp/solr.cloud.RecoveryZkTest_335333712DD16BB6-001/control-001/cores/collection1/data/index
   [junit4]   2> 559842 INFO  (coreLoadExecutor-1449-thread-1-processing-n:127.0.0.1:60528_yjo%2Fj) [n:127.0.0.1:60528_yjo%2Fj c:control_collection s:shard1 r:core_node1 x:collection1] o.a.s.u.RandomMergePolicy RandomMergePolicy wrapping class org.apache.lucene.index.AlcoholicMergePolicy: [AlcoholicMergePolicy: minMergeSize=0, mergeFactor=10, maxMergeSize=2023388403, maxMergeSizeForForcedMerge=9223372036854775807, calibrateSizeByDeletes=true, maxMergeDocs=2147483647, maxCFSSegmentSizeMB=8.796093022207999E12, noCFSRatio=0.1]
   [junit4]   2> 559848 INFO  (coreLoadExecutor-1449-thread-1-processing-n:127.0.0.1:60528_yjo%2Fj) [n:127.0.0.1:60528_yjo%2Fj c:control_collection s:shard1 r:core_node1 x:collection1] o.a.s.c.SolrDeletionPolicy SolrDeletionPolicy.onCommit: commits: num=1
   [junit4]   2> 	commit{dir=MockDirectoryWrapper(RAMDirectory@78b0dba6 lockFactory=org.apache.lucene.store.SingleInstanceLockFactory@765840ba),segFN=segments_1,generation=1}
   [junit4]   2> 559848 INFO  (coreLoadExecutor-1449-thread-1-processing-n:127.0.0.1:60528_yjo%2Fj) [n:127.0.0.1:60528_yjo%2Fj c:control_collection s:shard1 r:core_node1 x:collection1] o.a.s.c.SolrDeletionPolicy newest commit generation = 1
   [junit4]   2> 559851 INFO  (OldIndexDirectoryCleanupThreadForCore-collection1) [n:127.0.0.1:60528_yjo%2Fj c:control_collection s:shard1 r:core_node1 x:collection1] o.a.s.c.SolrCore Looking for old index directories to cleanup for core collection1 in /Users/jenkins/workspace/Lucene-Solr-master-MacOSX/solr/build/solr-core/test/J0/temp/solr.cloud.RecoveryZkTest_335333712DD16BB6-001/control-001/cores/collection1/data/
   [junit4]   2> 559851 WARN  (OldIndexDirectoryCleanupThreadForCore-collection1) [n:127.0.0.1:60528_yjo%2Fj c:control_collection s:shard1 r:core_node1 x:collection1] o.a.s.c.DirectoryFactory /Users/jenkins/workspace/Lucene-Solr-master-MacOSX/solr/build/solr-core/test/J0/temp/solr.cloud.RecoveryZkTest_335333712DD16BB6-001/control-001/cores/collection1/data/ does not point to a valid data directory; skipping clean-up of old index directories.
   [junit4]   2> 559860 INFO  (coreLoadExecutor-1449-thread-1-processing-n:127.0.0.1:60528_yjo%2Fj) [n:127.0.0.1:60528_yjo%2Fj c:control_collection s:shard1 r:core_node1 x:collection1] o.a.s.u.p.UpdateRequestProcessorChain creating updateRequestProcessorChain "nodistrib"
   [junit4]   2> 559860 INFO  (coreLoadExecutor-1449-thread-1-processing-n:127.0.0.1:60528_yjo%2Fj) [n:127.0.0.1:60528_yjo%2Fj c:control_collection s:shard1 r:core_node1 x:collection1] o.a.s.u.p.UpdateRequestProcessorChain creating updateRequestProcessorChain "dedupe"
   [junit4]   2> 559861 INFO  (coreLoadExecutor-1449-thread-1-processing-n:127.0.0.1:60528_yjo%2Fj) [n:127.0.0.1:60528_yjo%2Fj c:control_collection s:shard1 r:core_node1 x:collection1] o.a.s.u.p.UpdateRequestProcessorChain inserting DistributedUpdateProcessorFactory into updateRequestProcessorChain "dedupe"
   [junit4]   2> 559861 INFO  (coreLoadExecutor-1449-thread-1-processing-n:127.0.0.1:60528_yjo%2Fj) [n:127.0.0.1:60528_yjo%2Fj c:control_collection s:shard1 r:core_node1 x:collection1] o.a.s.u.p.UpdateRequestProcessorChain creating updateRequestProcessorChain "stored_sig"
   [junit4]   2> 559861 INFO  (coreLoadExecutor-1449-thread-1-processing-n:127.0.0.1:60528_yjo%2Fj) [n:127.0.0.1:60528_yjo%2Fj c:control_collection s:shard1 r:core_node1 x:collection1] o.a.s.u.p.UpdateRequestProcessorChain inserting DistributedUpdateProcessorFactory into updateRequestProcessorChain "stored_sig"
   [junit4]   2> 559861 INFO  (coreLoadExecutor-1449-thread-1-processing-n:127.0.0.1:60528_yjo%2Fj) [n:127.0.0.1:60528_yjo%2Fj c:control_collection s:shard1 r:core_node1 x:collection1] o.a.s.u.p.UpdateRequestProcessorChain creating updateRequestProcessorChain "distrib-dup-test-chain-explicit"
   [junit4]   2> 559861 INFO  (coreLoadExecutor-1449-thread-1-processing-n:127.0.0.1:60528_yjo%2Fj) [n:127.0.0.1:60528_yjo%2Fj c:control_collection s:shard1 r:core_node1 x:collection1] o.a.s.u.p.UpdateRequestProcessorChain creating updateRequestProcessorChain "distrib-dup-test-chain-implicit"
   [junit4]   2> 559861 INFO  (coreLoadExecutor-1449-thread-1-processing-n:127.0.0.1:60528_yjo%2Fj) [n:127.0.0.1:60528_yjo%2Fj c:control_collection s:shard1 r:core_node1 x:collection1] o.a.s.u.p.UpdateRequestProcessorChain inserting DistributedUpdateProcessorFactory into updateRequestProcessorChain "distrib-dup-test-chain-implicit"
   [junit4]   2> 559861 INFO  (coreLoadExecutor-1449-thread-1-processing-n:127.0.0.1:60528_yjo%2Fj) [n:127.0.0.1:60528_yjo%2Fj c:control_collection s:shard1 r:core_node1 x:collection1] o.a.s.c.SolrCore no updateRequestProcessorChain defined as default, creating implicit default
   [junit4]   2> 559861 WARN  (coreLoadExecutor-1449-thread-1-processing-n:127.0.0.1:60528_yjo%2Fj) [n:127.0.0.1:60528_yjo%2Fj c:control_collection s:shard1 r:core_node1 x:collection1] o.a.s.c.RequestHandlers INVALID paramSet a in requestHandler {type = requestHandler,name = /dump,class = DumpRequestHandler,args = {defaults={a=A,b=B}}}
   [junit4]   2> 559866 INFO  (coreLoadExecutor-1449-thread-1-processing-n:127.0.0.1:60528_yjo%2Fj) [n:127.0.0.1:60528_yjo%2Fj c:control_collection s:shard1 r:core_node1 x:collection1] o.a.s.h.l.XMLLoader xsltCacheLifetimeSeconds=60
   [junit4]   2> 559867 INFO  (coreLoadExecutor-1449-thread-1-processing-n:127.0.0.1:60528_yjo%2Fj) [n:127.0.0.1:60528_yjo%2Fj c:control_collection s:shard1 r:core_node1 x:collection1] o.a.s.h.l.XMLLoader xsltCacheLifetimeSeconds=60
   [junit4]   2> 559868 INFO  (coreLoadExecutor-1449-thread-1-processing-n:127.0.0.1:60528_yjo%2Fj) [n:127.0.0.1:60528_yjo%2Fj c:control_collection s:shard1 r:core_node1 x:collection1] o.a.s.h.l.XMLLoader xsltCacheLifetimeSeconds=60
   [junit4]   2> 559869 INFO  (coreLoadExecutor-1449-thread-1-processing-n:127.0.0.1:60528_yjo%2Fj) [n:127.0.0.1:60528_yjo%2Fj c:control_collection s:shard1 r:core_node1 x:collection1] o.a.s.h.l.XMLLoader xsltCacheLifetimeSeconds=60
   [junit4]   2> 559875 INFO  (coreLoadExecutor-1449-thread-1-processing-n:127.0.0.1:60528_yjo%2Fj) [n:127.0.0.1:60528_yjo%2Fj c:control_collection s:shard1 r:core_node1 x:collection1] o.a.s.c.RequestHandlers Registered paths: /admin/mbeans,standard,/update/json/docs,/admin/luke,/export,/get,/admin/properties,/update/json,/admin/threads,/dump,/update/csv,/sql,/graph,/admin/segments,/admin/system,/replication,/config,/stream,/schema,/admin/plugins,/admin/logging,/admin/ping,/update,/admin/file,/terms
   [junit4]   2> 559875 INFO  (coreLoadExecutor-1449-thread-1-processing-n:127.0.0.1:60528_yjo%2Fj) [n:127.0.0.1:60528_yjo%2Fj c:control_collection s:shard1 r:core_node1 x:collection1] o.a.s.c.SolrCore Using default statsCache cache: org.apache.solr.search.stats.LocalStatsCache
   [junit4]   2> 559876 INFO  (coreLoadExecutor-1449-thread-1-processing-n:127.0.0.1:60528_yjo%2Fj) [n:127.0.0.1:60528_yjo%2Fj c:control_collection s:shard1 r:core_node1 x:collection1] o.a.s.u.UpdateHandler Using UpdateLog implementation: org.apache.solr.update.UpdateLog
   [junit4]   2> 559876 INFO  (coreLoadExecutor-1449-thread-1-processing-n:127.0.0.1:60528_yjo%2Fj) [n:127.0.0.1:60528_yjo%2Fj c:control_collection s:shard1 r:core_node1 x:collection1] o.a.s.u.UpdateLog Initializing UpdateLog: dataDir= defaultSyncLevel=FLUSH numRecordsToKeep=100 maxNumLogsToKeep=10 numVersionBuckets=65536
   [junit4]   2> 559877 INFO  (coreLoadExecutor-1449-thread-1-processing-n:127.0.0.1:60528_yjo%2Fj) [n:127.0.0.1:60528_yjo%2Fj c:control_collection s:shard1 r:core_node1 x:collection1] o.a.s.u.CommitTracker Hard AutoCommit: disabled
   [junit4]   2> 559877 INFO  (coreLoadExecutor-1449-thread-1-processing-n:127.0.0.1:60528_yjo%2Fj) [n:127.0.0.1:60528_yjo%2Fj c:control_collection s:shard1 r:core_node1 x:collection1] o.a.s.u.CommitTracker Soft AutoCommit: disabled
   [junit4]   2> 559898 INFO  (coreLoadExecutor-1449-thread-1-processing-n:127.0.0.1:60528_yjo%2Fj) [n:127.0.0.1:60528_yjo%2Fj c:control_collection s:shard1 r:core_node1 x:collection1] o.a.s.u.RandomMergePolicy RandomMergePolicy wrapping class org.apache.lucene.index.TieredMergePolicy: [TieredMergePolicy: maxMergeAtOnce=40, maxMergeAtOnceExplicit=43, maxMergedSegmentMB=83.0419921875, floorSegmentMB=1.677734375, forceMergeDeletesPctAllowed=23.213341112033234, segmentsPerTier=36.0, maxCFSSegmentSizeMB=8.796093022207999E12, noCFSRatio=1.0
   [junit4]   2> 559909 INFO  (coreLoadExecutor-1449-thread-1-processing-n:127.0.0.1:60528_yjo%2Fj) [n:127.0.0.1:60528_yjo%2Fj c:control_collection s:shard1 r:core_node1 x:collection1] o.a.s.c.SolrDeletionPolicy SolrDeletionPolicy.onInit: commits: num=1
   [junit4]   2> 	commit{dir=MockDirectoryWrapper(RAMDirectory@78b0dba6 lockFactory=org.apache.lucene.store.SingleInstanceLockFactory@765840ba),segFN=segments_1,generation=1}
   [junit4]   2> 559909 INFO  (coreLoadExecutor-1449-thread-1-processing-n:127.0.0.1:60528_yjo%2Fj) [n:127.0.0.1:60528_yjo%2Fj c:control_collection s:shard1 r:core_node1 x:collection1] o.a.s.c.SolrDeletionPolicy newest commit generation = 1
   [junit4]   2> 559909 INFO  (coreLoadExecutor-1449-thread-1-processing-n:127.0.0.1:60528_yjo%2Fj) [n:127.0.0.1:60528_yjo%2Fj c:control_collection s:shard1 r:core_node1 x:collection1] o.a.s.s.SolrIndexSearcher Opening [Searcher@2813b0d4[collection1] main]
   [junit4]   2> 559909 INFO  (coreLoadExecutor-1449-thread-1-processing-n:127.0.0.1:60528_yjo%2Fj) [n:127.0.0.1:60528_yjo%2Fj c:control_collection s:shard1 r:core_node1 x:collection1] o.a.s.c.c.ZkStateReader Load collection config from: [/collections/control_collection]
   [junit4]   2> 559910 INFO  (coreLoadExecutor-1449-thread-1-processing-n:127.0.0.1:60528_yjo%2Fj) [n:127.0.0.1:60528_yjo%2Fj c:control_collection s:shard1 r:core_node1 x:collection1] o.a.s.c.c.ZkStateReader path=[/collections/control_collection] [configName]=[conf1] specified config exists in ZooKeeper
   [junit4]   2> 559910 INFO  (coreLoadExecutor-1449-thread-1-processing-n:127.0.0.1:60528_yjo%2Fj) [n:127.0.0.1:60528_yjo%2Fj c:control_collection s:shard1 r:core_node1 x:collection1] o.a.s.r.ManagedResourceStorage Setting up ZooKeeper-based storage for the RestManager with znodeBase: /configs/conf1
   [junit4]   2> 559911 INFO  (coreLoadExecutor-1449-thread-1-processing-n:127.0.0.1:60528_yjo%2Fj) [n:127.0.0.1:60528_yjo%2Fj c:control_collection s:shard1 r:core_node1 x:collection1] o.a.s.r.ManagedResourceStorage Configured ZooKeeperStorageIO with znodeBase: /configs/conf1
   [junit4]   2> 559911 INFO  (coreLoadExecutor-1449-thread-1-processing-n:127.0.0.1:60528_yjo%2Fj) [n:127.0.0.1:60528_yjo%2Fj c:control_collection s:shard1 r:core_node1 x:collection1] o.a.s.r.RestManager Initializing RestManager with initArgs: {}
   [junit4]   2> 559911 INFO  (coreLoadExecutor-1449-thread-1-processing-n:127.0.0.1:60528_yjo%2Fj) [n:127.0.0.1:60528_yjo%2Fj c:control_collection s:shard1 r:core_node1 x:collection1] o.a.s.r.ManagedResourceStorage Reading _rest_managed.json using ZooKeeperStorageIO:path=/configs/conf1
   [junit4]   2> 559912 INFO  (coreLoadExecutor-1449-thread-1-processing-n:127.0.0.1:60528_yjo%2Fj) [n:127.0.0.1:60528_yjo%2Fj c:control_collection s:shard1 r:core_node1 x:collection1] o.a.s.r.ManagedResourceStorage No data found for znode /configs/conf1/_rest_managed.json
   [junit4]   2> 559912 INFO  (coreLoadExecutor-1449-thread-1-processing-n:127.0.0.1:60528_yjo%2Fj) [n:127.0.0.1:60528_yjo%2Fj c:control_collection s:shard1 r:core_node1 x:collection1] o.a.s.r.ManagedResourceStorage Loaded null at path _rest_managed.json using ZooKeeperStorageIO:path=/configs/conf1
   [junit4]   2> 559912 INFO  (coreLoadExecutor-1449-thread-1-processing-n:127.0.0.1:60528_yjo%2Fj) [n:127.0.0.1:60528_yjo%2Fj c:control_collection s:shard1 r:core_node1 x:collection1] o.a.s.r.RestManager Initializing 0 registered ManagedResources
   [junit4]   2> 559912 INFO  (coreLoadExecutor-1449-thread-1-processing-n:127.0.0.1:60528_yjo%2Fj) [n:127.0.0.1:60528_yjo%2Fj c:control_collection s:shard1 r:core_node1 x:collection1] o.a.s.h.ReplicationHandler Commits will be reserved for  10000
   [junit4]   2> 559923 INFO  (searcherExecutor-1450-thread-1-processing-n:127.0.0.1:60528_yjo%2Fj x:collection1 s:shard1 c:control_collection r:core_node1) [n:127.0.0.1:60528_yjo%2Fj c:control_collection s:shard1 r:core_node1 x:collection1] o.a.s.c.SolrCore [collection1] Registered new searcher Searcher@2813b0d4[collection1] main{ExitableDirectoryReader(UninvertingDirectoryReader())}
   [junit4]   2> 559923 INFO  (coreLoadExecutor-1449-thread-1-processing-n:127.0.0.1:60528_yjo%2Fj) [n:127.0.0.1:60528_yjo%2Fj c:control_collection s:shard1 r:core_node1 x:collection1] o.a.s.u.UpdateLog Looking up max value of version field to seed version buckets
   [junit4]   2> 559923 INFO  (coreLoadExecutor-1449-thread-1-processing-n:127.0.0.1:60528_yjo%2Fj) [n:127.0.0.1:60528_yjo%2Fj c:control_collection s:shard1 r:core_node1 x:collection1] o.a.s.u.VersionInfo Refreshing highest value of _version_ for 65536 version buckets from index
   [junit4]   2> 559923 INFO  (coreLoadExecutor-1449-thread-1-processing-n:127.0.0.1:60528_yjo%2Fj) [n:127.0.0.1:60528_yjo%2Fj c:control_collection s:shard1 r:core_node1 x:collection1] o.a.s.u.VersionInfo No terms found for _version_, cannot seed version bucket highest value from index
   [junit4]   2> 559923 INFO  (coreLoadExecutor-1449-thread-1-processing-n:127.0.0.1:60528_yjo%2Fj) [n:127.0.0.1:60528_yjo%2Fj c:control_collection s:shard1 r:core_node1 x:collection1] o.a.s.u.UpdateLog Could not find max version in index or recent updates, using new clock 1542857141494218752
   [junit4]   2> 559925 INFO  (coreLoadExecutor-1449-thread-1-processing-n:127.0.0.1:60528_yjo%2Fj) [n:127.0.0.1:60528_yjo%2Fj c:control_collection s:shard1 r:core_node1 x:collection1] o.a.s.u.UpdateLog Took 1.0ms to seed version buckets with highest version 1542857141494218752
   [junit4]   2> 559926 INFO  (coreLoadExecutor-1449-thread-1-processing-n:127.0.0.1:60528_yjo%2Fj) [n:127.0.0.1:60528_yjo%2Fj c:control_collection s:shard1 r:core_node1 x:collection1] o.a.s.c.ZkController watch zkdir /configs/conf1
   [junit4]   2> 559926 INFO  (coreLoadExecutor-1449-thread-1-processing-n:127.0.0.1:60528_yjo%2Fj) [n:127.0.0.1:60528_yjo%2Fj c:control_collection s:shard1 r:core_node1 x:collection1] o.a.s.c.CoreContainer registering core: collection1
   [junit4]   2> 559927 INFO  (coreZkRegister-1442-thread-1-processing-n:127.0.0.1:60528_yjo%2Fj x:collection1 s:shard1 c:control_collection r:core_node1) [n:127.0.0.1:60528_yjo%2Fj c:control_collection s:shard1 r:core_node1 x:collection1] o.a.s.c.ZkController Register replica - core:collection1 address:http://127.0.0.1:60528/yjo/j collection:control_collection shard:shard1
   [junit4]   2> 559928 INFO  (coreZkRegister-1442-thread-1-processing-n:127.0.0.1:60528_yjo%2Fj x:collection1 s:shard1 c:control_collection r:core_node1) [n:127.0.0.1:60528_yjo%2Fj c:control_collection s:shard1 r:core_node1 x:collection1] o.a.s.c.c.SolrZkClient makePath: /collections/control_collection/leader_elect/shard1/election
   [junit4]   2> 559934 INFO  (coreZkRegister-1442-thread-1-processing-n:127.0.0.1:60528_yjo%2Fj x:collection1 s:shard1 c:control_collection r:core_node1) [n:127.0.0.1:60528_yjo%2Fj c:control_collection s:shard1 r:core_node1 x:collection1] o.a.s.c.LeaderElector Joined leadership election with path: /collections/control_collection/leader_elect/shard1/election/96428571206615044-core_node1-n_0000000000
   [junit4]   2> 559935 INFO  (coreZkRegister-1442-thread-1-processing-n:127.0.0.1:60528_yjo%2Fj x:collection1 s:shard1 c:control_collection r:core_node1) [n:127.0.0.1:60528_yjo%2Fj c:control_collection s:shard1 r:core_node1 x:collection1] o.a.s.c.ShardLeaderElectionContext Running the leader process for shard=shard1 and weAreReplacement=false and leaderVoteWait=10000
   [junit4]   2> 559937 INFO  (coreZkRegister-1442-thread-1-processing-n:127.0.0.1:60528_yjo%2Fj x:collection1 s:shard1 c:control_collection r:core_node1) [n:127.0.0.1:60528_yjo%2Fj c:control_collection s:shard1 r:core_node1 x:collection1] o.a.s.c.ShardLeaderElectionContext Enough replicas found to continue.
   [junit4]   2> 559937 INFO  (coreZkRegister-1442-thread-1-processing-n:127.0.0.1:60528_yjo%2Fj x:collection1 s:shard1 c:control_collection r:core_node1) [n:127.0.0.1:60528_yjo%2Fj c:control_collection s:shard1 r:core_node1 x:collection1] o.a.s.c.ShardLeaderElectionContext I may be the new leader - try and sync
   [junit4]   2> 559937 INFO  (coreZkRegister-1442-thread-1-processing-n:127.0.0.1:60528_yjo%2Fj x:collection1 s:shard1 c:control_collection r:core_node1) [n:127.0.0.1:60528_yjo%2Fj c:control_collection s:shard1 r:core_node1 x:collection1] o.a.s.c.SyncStrategy Sync replicas to http://127.0.0.1:60528/yjo/j/collection1/
   [junit4]   2> 559937 INFO  (coreZkRegister-1442-thread-1-processing-n:127.0.0.1:60528_yjo%2Fj x:collection1 s:shard1 c:control_collection r:core_node1) [n:127.0.0.1:60528_yjo%2Fj c:control_collection s:shard1 r:core_node1 x:collection1] o.a.s.c.SyncStrategy Sync Success - now sync replicas to me
   [junit4]   2> 559938 INFO  (coreZkRegister-1442-thread-1-processing-n:127.0.0.1:60528_yjo%2Fj x:collection1 s:shard1 c:control_collection r:core_node1) [n:127.0.0.1:60528_yjo%2Fj c:control_collection s:shard1 r:core_node1 x:collection1] o.a.s.c.SyncStrategy http://127.0.0.1:60528/yjo/j/collection1/ has no replicas
   [junit4]   2> 559938 INFO  (OverseerStateUpdate-96428571206615044-127.0.0.1:60528_yjo%2Fj-n_0000000000) [n:127.0.0.1:60528_yjo%2Fj    ] o.a.s.c.Overseer processMessage: queueSize: 1, message = {
   [junit4]   2>   "operation":"leader",
   [junit4]   2>   "shard":"shard1",
   [junit4]   2>   "collection":"control_collection"} current state version: 1
   [junit4]   2> 559939 INFO  (coreZkRegister-1442-thread-1-processing-n:127.0.0.1:60528_yjo%2Fj x:collection1 s:shard1 c:control_collection r:core_node1) [n:127.0.0.1:60528_yjo%2Fj c:control_collection s:shard1 r:core_node1 x:collection1] o.a.s.c.c.SolrZkClient makePath: /collections/control_collection/leaders/shard1
   [junit4]   2> 559943 INFO  (coreZkRegister-1442-thread-1-processing-n:127.0.0.1:60528_yjo%2Fj x:collection1 s:shard1 c:control_collection r:core_node1) [n:127.0.0.1:60528_yjo%2Fj c:control_collection s:shard1 r:core_node1 x:collection1] o.a.s.c.ShardLeaderElectionContextBase Creating leader registration node /collections/control_collection/leaders/shard1/leader after winning as /collections/control_collection/leader_elect/shard1/election/96428571206615044-core_node1-n_0000000000
   [junit4]   2> 559948 INFO  (coreZkRegister-1442-thread-1-processing-n:127.0.0.1:60528_yjo%2Fj x:collection1 s:shard1 c:control_collection r:core_node1) [n:127.0.0.1:60528_yjo%2Fj c:control_collection s:shard1 r:core_node1 x:collection1] o.a.s.c.ShardLeaderElectionContext I am the new leader: http://127.0.0.1:60528/yjo/j/collection1/ shard1
   [junit4]   2> 559949 INFO  (OverseerStateUpdate-96428571206615044-127.0.0.1:60528_yjo%2Fj-n_0000000000) [n:127.0.0.1:60528_yjo%2Fj    ] o.a.s.c.Overseer processMessage: queueSize: 1, message = {
   [junit4]   2>   "operation":"leader",
   [junit4]   2>   "shard":"shard1",
   [junit4]   2>   "collection":"control_collection",
   [junit4]   2>   "base_url":"http://127.0.0.1:60528/yjo/j",
   [junit4]   2>   "core":"collection1",
   [junit4]   2>   "state":"active"} current state version: 1
   [junit4]   2> 560054 INFO  (zkCallback-939-thread-2-processing-n:127.0.0.1:60528_yjo%2Fj) [n:127.0.0.1:60528_yjo%2Fj    ] o.a.s.c.c.ZkStateReader A cluster state change: [WatchedEvent state:SyncConnected type:NodeDataChanged path:/clusterstate.json], has occurred - updating... (live nodes size: [1])
   [junit4]   2> 560106 INFO  (coreZkRegister-1442-thread-1-processing-n:127.0.0.1:60528_yjo%2Fj x:collection1 s:shard1 c:control_collection r:core_node1) [n:127.0.0.1:60528_yjo%2Fj c:control_collection s:shard1 r:core_node1 x:collection1] o.a.s.c.ZkController We are http://127.0.0.1:60528/yjo/j/collection1/ and leader is http://127.0.0.1:60528/yjo/j/collection1/
   [junit4]   2> 560106 INFO  (coreZkRegister-1442-thread-1-processing-n:127.0.0.1:60528_yjo%2Fj x:collection1 s:shard1 c:control_collection r:core_node1) [n:127.0.0.1:60528_yjo%2Fj c:control_collection s:shard1 r:core_node1 x:collection1] o.a.s.c.ZkController No LogReplay needed for core=collection1 baseURL=http://127.0.0.1:60528/yjo/j
   [junit4]   2> 560106 INFO  (coreZkRegister-1442-thread-1-processing-n:127.0.0.1:60528_yjo%2Fj x:collection1 s:shard1 c:control_collection r:core_node1) [n:127.0.0.1:60528_yjo%2Fj c:control_collection s:shard1 r:core_node1 x:collection1] o.a.s.c.ZkController I am the leader, no recovery necessary
   [junit4]   2> 560106 INFO  (coreZkRegister-1442-thread-1-processing-n:127.0.0.1:60528_yjo%2Fj x:collection1 s:shard1 c:control_collection r:core_node1) [n:127.0.0.1:60528_yjo%2Fj c:control_collection s:shard1 r:core_node1 x:collection1] o.a.s.c.ZkController publishing state=active
   [junit4]   2> 560106 INFO  (coreZkRegister-1442-thread-1-processing-n:127.0.0.1:60528_yjo%2Fj x:collection1 s:shard1 c:control_collection r:core_node1) [n:127.0.0.1:60528_yjo%2Fj c:control_collection s:shard1 r:core_node1 x:collection1] o.a.s.c.ZkController numShards not found on descriptor - reading it from system property
   [junit4]   2> 560108 INFO  (coreZkRegister-1442-thread-1-processing-n:127.0.0.1:60528_yjo%2Fj x:collection1 s:shard1 c:control_collection r:core_node1) [n:127.0.0.1:60528_yjo%2Fj c:control_collection s:shard1 r:core_node1 x:collection1] o.a.s.c.c.ZkStateReader Checking legacy cluster state for collection control_collection
   [junit4]   2> 560109 INFO  (OverseerStateUpdate-96428571206615044-127.0.0.1:60528_yjo%2Fj-n_0000000000) [n:127.0.0.1:60528_yjo%2Fj    ] o.a.s.c.Overseer processMessage: queueSize: 1, message = {
   [junit4]   2>   "core":"collection1",
   [junit4]   2>   "core_node_name":"core_node1",
   [junit4]   2>   "roles":null,
   [junit4]   2>   "base_url":"http://127.0.0.1:60528/yjo/j",
   [junit4]   2>   "node_name":"127.0.0.1:60528_yjo%2Fj",
   [junit4]   2>   "numShards":"1",
   [junit4]   2>   "state":"active",
   [junit4]   2>   "shard":"shard1",
   [junit4]   2>   "collection":"control_collection",
   [junit4]   2>   "operation":"state"} current state version: 2
   [junit4]   2> 560109 INFO  (OverseerStateUpdate-96428571206615044-127.0.0.1:60528_yjo%2Fj-n_0000000000) [n:127.0.0.1:60528_yjo%2Fj    ] o.a.s.c.o.ReplicaMutator Update state numShards=1 message={
   [junit4]   2>   "core":"collection1",
   [junit4]   2>   "core_node_name":"core_node1",
   [junit4]   2>   "roles":null,
   [junit4]   2>   "base_url":"http://127.0.0.1:60528/yjo/j",
   [junit4]   2>   "node_name":"127.0.0.1:60528_yjo%2Fj",
   [junit4]   2>   "numShards":"1",
   [junit4]   2>   "state":"active",
   [junit4]   2>   "shard":"shard1",
   [junit4]   2>   "collection":"control_collection",
   [junit4]   2>   "operation":"state"}
   [junit4]   2> 560152 INFO  (TEST-RecoveryZkTest.test-seed#[335333712DD16BB6]) [    ] o.a.s.c.c.SolrZkClient Using default ZkCredentialsProvider
   [junit4]   2> 560153 INFO  (TEST-RecoveryZkTest.test-seed#[335333712DD16BB6]) [    ] o.a.s.c.c.ConnectionManager Waiting for client to connect to ZooKeeper
   [junit4]   2> 560155 INFO  (zkCallback-943-thread-1) [    ] o.a.s.c.c.ConnectionManager Watcher org.apache.solr.common.cloud.ConnectionManager@5cd1524c name:ZooKeeperConnection Watcher:127.0.0.1:60525/solr got event WatchedEvent state:SyncConnected type:None path:null path:null type:None
   [junit4]   2> 560155 INFO  (TEST-RecoveryZkTest.test-seed#[335333712DD16BB6]) [    ] o.a.s.c.c.ConnectionManager Client is connected to ZooKeeper
   [junit4]   2> 560156 INFO  (TEST-RecoveryZkTest.test-seed#[335333712DD16BB6]) [    ] o.a.s.c.c.SolrZkClient Using default ZkACLProvider
   [junit4]   2> 560156 INFO  (TEST-RecoveryZkTest.test-seed#[335333712DD16BB6]) [    ] o.a.s.c.c.ZkStateReader Updating cluster state from ZooKeeper... 
   [junit4]   2> 560157 INFO  (TEST-RecoveryZkTest.test-seed#[335333712DD16BB6]) [    ] o.a.s.c.c.ZkStateReader Loaded empty cluster properties
   [junit4]   2> 560158 INFO  (TEST-RecoveryZkTest.test-seed#[335333712DD16BB6]) [    ] o.a.s.c.c.ZkStateReader Updated live nodes from ZooKeeper... (0) -> (1)
   [junit4]   2> 560162 INFO  (TEST-RecoveryZkTest.test-seed#[335333712DD16BB6]) [    ] o.a.s.c.ChaosMonkey monkey: init - expire sessions:false cause connection loss:false
   [junit4]   2> 560162 INFO  (TEST-RecoveryZkTest.test-seed#[335333712DD16BB6]) [    ] o.a.s.c.AbstractFullDistribZkTestBase Creating collection1 with stateFormat=2
   [junit4]   2> 560162 INFO  (TEST-RecoveryZkTest.test-seed#[335333712DD16BB6]) [    ] o.a.s.c.c.SolrZkClient Using default ZkCredentialsProvider
   [junit4]   2> 560163 INFO  (TEST-RecoveryZkTest.test-seed#[335333712DD16BB6]) [    ] o.a.s.c.c.ConnectionManager Waiting for client to connect to ZooKeeper
   [junit4]   2> 560165 INFO  (zkCallback-944-thread-1) [    ] o.a.s.c.c.ConnectionManager Watcher org.apache.solr.common.cloud.ConnectionManager@26e7abda name:ZooKeeperConnection Watcher:127.0.0.1:60525/solr got event WatchedEvent state:SyncConnected type:None path:null path:null type:None
   [junit4]   2> 560165 INFO  (TEST-RecoveryZkTest.test-seed#[335333712DD16BB6]) [    ] o.a.s.c.c.ConnectionManager Client is connected to ZooKeeper
   [junit4]   2> 560165 INFO  (TEST-RecoveryZkTest.test-seed#[335333712DD16BB6]) [    ] o.a.s.c.c.SolrZkClient Using default ZkACLProvider
   [junit4]   2> 560170 INFO  (OverseerStateUpdate-96428571206615044-127.0.0.1:60528_yjo%2Fj-n_0000000000) [n:127.0.0.1:60528_yjo%2Fj    ] o.a.s.c.Overseer processMessage: queueSize: 1, message = {
   [junit4]   2>   "operation":"create",
   [junit4]   2>   "name":"collection1",
   [junit4]   2>   "numShards":"1",
   [junit4]   2>   "stateFormat":"2"} current state version: 2
   [junit4]   2> 560170 INFO  (OverseerStateUpdate-96428571206615044-127.0.0.1:60528_yjo%2Fj-n_0000000000) [n:127.0.0.1:60528_yjo%2Fj    ] o.a.s.c.o.ClusterStateMutator building a new cName: collection1
   [junit4]   2> 560171 INFO  (zkCallback-943-thread-1) [    ] o.a.s.c.c.ZkStateReader A cluster state change: [WatchedEvent state:SyncConnected type:NodeDataChanged path:/clusterstate.json], has occurred - updating... (live nodes size: [1])
   [junit4]   2> 560173 INFO  (zkCallback-939-thread-3-processing-n:127.0.0.1:60528_yjo%2Fj) [n:127.0.0.1:60528_yjo%2Fj    ] o.a.s.c.c.ZkStateReader A cluster state change: [WatchedEvent state:SyncConnected type:NodeDataChanged path:/clusterstate.json], has occurred - updating... (live nodes size: [1])
   [junit4]   2> 560287 INFO  (OverseerStateUpdate-96428571206615044-127.0.0.1:60528_yjo%2Fj-n_0000000000) [n:127.0.0.1:60528_yjo%2Fj    ] o.a.s.c.o.ZkStateWriter going to create_collection /collections/collection1/state.json
   [junit4]   2> 560568 INFO  (TEST-RecoveryZkTest.test-seed#[335333712DD16BB6]) [    ] o.a.s.SolrTestCaseJ4 Writing core.properties file to /Users/jenkins/workspace/Lucene-Solr-master-MacOSX/solr/build/solr-core/test/J0/temp/solr.cloud.RecoveryZkTest_335333712DD16BB6-001/shard-1-001/cores/collection1
   [junit4]   2> 560570 INFO  (TEST-RecoveryZkTest.test-seed#[335333712DD16BB6]) [    ] o.a.s.c.AbstractFullDistribZkTestBase create jetty 1 in directory /Users/jenkins/workspace/Lucene-Solr-master-MacOSX/solr/build/solr-core/test/J0/temp/solr.cloud.RecoveryZkTest_335333712DD16BB6-001/shard-1-001
   [junit4]   2> 560571 INFO  (TEST-RecoveryZkTest.test-seed#[335333712DD16BB6]) [    ] o.e.j.s.Server jetty-9.3.8.v20160314
   [junit4]   2> 560574 INFO  (TEST-RecoveryZkTest.test-seed#[335333712DD16BB6]) [    ] o.e.j.s.h.ContextHandler Started o.e.j.s.ServletContextHandler@73bdeaea{/yjo/j,null,AVAILABLE}
   [junit4]   2> 560575 INFO  (TEST-RecoveryZkTest.test-seed#[335333712DD16BB6]) [    ] o.e.j.s.ServerConnector Started ServerConnector@3ae4bc1e{HTTP/1.1,[http/1.1]}{127.0.0.1:60534}
   [junit4]   2> 560575 INFO  (TEST-RecoveryZkTest.test-seed#[335333712DD16BB6]) [    ] o.e.j.s.Server Started @567421ms
   [junit4]   2> 560575 INFO  (TEST-RecoveryZkTest.test-seed#[335333712DD16BB6]) [    ] o.a.s.c.s.e.JettySolrRunner Jetty properties: {solr.data.dir=/Users/jenkins/workspace/Lucene-Solr-master-MacOSX/solr/build/solr-core/test/J0/temp/solr.cloud.RecoveryZkTest_335333712DD16BB6-001/tempDir-001/jetty1, solrconfig=solrconfig.xml, hostContext=/yjo/j, hostPort=60534, coreRootDirectory=/Users/jenkins/workspace/Lucene-Solr-master-MacOSX/solr/build/solr-core/test/J0/../../../../../../../../../Users/jenkins/workspace/Lucene-Solr-master-MacOSX/solr/build/solr-core/test/J0/temp/solr.cloud.RecoveryZkTest_335333712DD16BB6-001/shard-1-001/cores}
   [junit4]   2> 560576 INFO  (TEST-RecoveryZkTest.test-seed#[335333712DD16BB6]) [    ] o.a.s.s.SolrDispatchFilter SolrDispatchFilter.init(): sun.misc.Launcher$AppClassLoader@4554617c
   [junit4]   2> 560576 INFO  (TEST-RecoveryZkTest.test-seed#[335333712DD16BB6]) [    ] o.a.s.c.SolrResourceLoader new SolrResourceLoader for directory: '/Users/jenkins/workspace/Lucene-Solr-master-MacOSX/solr/build/solr-core/test/J0/temp/solr.cloud.RecoveryZkTest_335333712DD16BB6-001/shard-1-001'
   [junit4]   2> 560581 INFO  (TEST-RecoveryZkTest.test-seed#[335333712DD16BB6]) [    ] o.a.s.c.SolrResourceLoader JNDI not configured for solr (NoInitialContextEx)
   [junit4]   2> 560581 INFO  (TEST-RecoveryZkTest.test-seed#[335333712DD16BB6]) [    ] o.a.s.c.SolrResourceLoader solr home defaulted to 'solr/' (could not find system property or JNDI)
   [junit4]   2> 560581 INFO  (TEST-RecoveryZkTest.test-seed#[335333712DD16BB6]) [    ] o.a.s.c.c.SolrZkClient Using default ZkCredentialsProvider
   [junit4]   2> 560583 INFO  (TEST-RecoveryZkTest.test-seed#[335333712DD16BB6]) [    ] o.a.s.c.c.ConnectionManager Waiting for client to connect to ZooKeeper
   [junit4]   2> 560584 INFO  (zkCallback-945-thread-1) [    ] o.a.s.c.c.ConnectionManager Watcher org.apache.solr.common.cloud.ConnectionManager@68041ebe name:ZooKeeperConnection Watcher:127.0.0.1:60525/solr got event WatchedEvent state:SyncConnected type:None path:null path:null type:None
   [junit4]   2> 560584 INFO  (TEST-RecoveryZkTest.test-seed#[335333712DD16BB6]) [    ] o.a.s.c.c.ConnectionManager Client is connected to ZooKeeper
   [junit4]   2> 560584 INFO  (TEST-RecoveryZkTest.test-seed#[335333712DD16BB6]) [    ] o.a.s.c.c.SolrZkClient Using default ZkACLProvider
   [junit4]   2> 560586 INFO  (TEST-RecoveryZkTest.test-seed#[335333712DD16BB6]) [    ] o.a.s.s.SolrDispatchFilter Loading solr.xml from SolrHome (not found in ZooKeeper)
   [junit4]   2> 560586 INFO  (TEST-RecoveryZkTest.test-seed#[335333712DD16BB6]) [    ] o.a.s.c.SolrXmlConfig Loading container configuration from /Users/jenkins/workspace/Lucene-Solr-master-MacOSX/solr/build/solr-core/test/J0/temp/solr.cloud.RecoveryZkTest_335333712DD16BB6-001/shard-1-001/solr.xml
   [junit4]   2> 560606 INFO  (TEST-RecoveryZkTest.test-seed#[335333712DD16BB6]) [    ] o.a.s.c.CorePropertiesLocator Config-defined core root directory: /Users/jenkins/workspace/Lucene-Solr-master-MacOSX/solr/build/solr-core/test/J0/../../../../../../../../../Users/jenkins/workspace/Lucene-Solr-master-MacOSX/solr/build/solr-core/test/J0/temp/solr.cloud.RecoveryZkTest_335333712DD16BB6-001/shard-1-001/cores
   [junit4]   2> 560606 INFO  (TEST-RecoveryZkTest.test-seed#[335333712DD16BB6]) [    ] o.a.s.c.CoreContainer New CoreContainer 896888924
   [junit4]   2> 560606 INFO  (TEST-RecoveryZkTest.test-seed#[335333712DD16BB6]) [    ] o.a.s.c.CoreContainer Loading cores into CoreContainer [instanceDir=/Users/jenkins/workspace/Lucene-Solr-master-MacOSX/solr/build/solr-core/test/J0/temp/solr.cloud.RecoveryZkTest_335333712DD16BB6-001/shard-1-001]
   [junit4]   2> 560607 WARN  (TEST-RecoveryZkTest.test-seed#[335333712DD16BB6]) [    ] o.a.s.c.CoreContainer Couldn't add files from /Users/jenkins/workspace/Lucene-Solr-master-MacOSX/solr/build/solr-core/test/J0/temp/solr.cloud.RecoveryZkTest_335333712DD16BB6-001/shard-1-001/lib to classpath: /Users/jenkins/workspace/Lucene-Solr-master-MacOSX/solr/build/solr-core/test/J0/temp/solr.cloud.RecoveryZkTest_335333712DD16BB6-001/shard-1-001/lib
   [junit4]   2> 560607 INFO  (TEST-RecoveryZkTest.test-seed#[335333712DD16BB6]) [    ] o.a.s.h.c.HttpShardHandlerFactory created with socketTimeout : 90000,urlScheme : ,connTimeout : 15000,maxConnectionsPerHost : 20,maxConnections : 10000,corePoolSize : 0,maximumPoolSize : 2147483647,maxThreadIdleTime : 5,sizeOfQueue : -1,fairnessPolicy : false,
   [junit4]   2> 560615 INFO  (TEST-RecoveryZkTest.test-seed#[335333712DD16BB6]) [    ] o.a.s.u.UpdateShardHandler Created UpdateShardHandler HTTP client with params: socketTimeout=340000&connTimeout=45000&maxConnections=100000&maxConnectionsPerHost=100000
   [junit4]   2> 560615 INFO  (TEST-RecoveryZkTest.test-seed#[335333712DD16BB6]) [    ] o.a.s.l.LogWatcher SLF4J impl is org.slf4j.impl.Log4jLoggerFactory
   [junit4]   2> 560615 INFO  (TEST-RecoveryZkTest.test-seed#[335333712DD16BB6]) [    ] o.a.s.l.LogWatcher Registering Log Listener [Log4j (org.slf4j.impl.Log4jLoggerFactory)]
   [junit4]   2> 560615 INFO  (TEST-RecoveryZkTest.test-seed#[335333712DD16BB6]) [    ] o.a.s.c.ZkContainer Zookeeper client=127.0.0.1:60525/solr
   [junit4]   2> 560615 INFO  (TEST-RecoveryZkTest.test-seed#[335333712DD16BB6]) [    ] o.a.s.c.ZkController zkHost includes chroot
   [junit4]   2> 560615 INFO  (TEST-RecoveryZkTest.test-seed#[335333712DD16BB6]) [    ] o.a.s.c.c.SolrZkClient Using default ZkCredentialsProvider
   [junit4]   2> 560617 INFO  (TEST-RecoveryZkTest.test-seed#[335333712DD16BB6]) [    ] o.a.s.c.c.ConnectionManager Waiting for client to connect to ZooKeeper
   [junit4]   2> 560618 INFO  (zkCallback-948-thread-1) [    ] o.a.s.c.c.ConnectionManager Watcher org.apache.solr.common.cloud.ConnectionManager@6d2f517f name:ZooKeeperConnection Watcher:127.0.0.1:60525 got event WatchedEvent state:SyncConnected type:None path:null path:null type:None
   [junit4]   2> 560619 INFO  (TEST-RecoveryZkTest.test-seed#[335333712DD16BB6]) [    ] o.a.s.c.c.ConnectionManager Client is connected to ZooKeeper
   [junit4]   2> 560620 INFO  (TEST-RecoveryZkTest.test-seed#[335333712DD16BB6]) [    ] o.a.s.c.c.SolrZkClient Using default ZkACLProvider
   [junit4]   2> 560625 INFO  (TEST-RecoveryZkTest.test-seed#[335333712DD16BB6]) [n:127.0.0.1:60534_yjo%2Fj    ] o.a.s.c.ZkController Added new OnReconnect listener org.apache.solr.cloud.ZkController$$Lambda$9/976535915@a97bc40
   [junit4]   2> 560629 INFO  (TEST-RecoveryZkTest.test-seed#[335333712DD16BB6]) [n:127.0.0.1:60534_yjo%2Fj    ] o.a.s.c.c.ConnectionManager Waiting for client to connect to ZooKeeper
   [junit4]   2> 560629 INFO  (zkCallback-949-thread-1-processing-n:127.0.0.1:60534_yjo%2Fj) [n:127.0.0.1:60534_yjo%2Fj    ] o.a.s.c.c.ConnectionManager Watcher org.apache.solr.common.cloud.ConnectionManager@6d92e825 name:ZooKeeperConnection Watcher:127.0.0.1:60525/solr got event WatchedEvent state:SyncConnected type:None path:null path:null type:None
   [junit4]   2> 560629 INFO  (TEST-RecoveryZkTest.test-seed#[335333712DD16BB6]) [n:127.0.0.1:60534_yjo%2Fj    ] o.a.s.c.c.ConnectionManager Client is connected to ZooKeeper
   [junit4]   2> 560653 INFO  (TEST-RecoveryZkTest.test-seed#[335333712DD16BB6]) [n:127.0.0.1:60534_yjo%2Fj    ] o.a.s.c.c.ZkStateReader Updating cluster state from ZooKeeper... 
   [junit4]   2> 560654 INFO  (TEST-RecoveryZkTest.test-seed#[335333712DD16BB6]) [n:127.0.0.1:60534_yjo%2Fj    ] o.a.s.c.c.ZkStateReader Loaded empty cluster properties
   [junit4]   2> 560655 INFO  (TEST-RecoveryZkTest.test-seed#[335333712DD16BB6]) [n:127.0.0.1:60534_yjo%2Fj    ] o.a.s.c.c.ZkStateReader Updated live nodes from ZooKeeper... (0) -> (1)
   [junit4]   2> 560662 INFO  (TEST-RecoveryZkTest.test-seed#[335333712DD16BB6]) [n:127.0.0.1:60534_yjo%2Fj    ] o.a.s.c.Overseer Overseer (id=null) closing
   [junit4]   2> 560662 INFO  (TEST-RecoveryZkTest.test-seed#[335333712DD16BB6]) [n:127.0.0.1:60534_yjo%2Fj    ] o.a.s.c.LeaderElector Joined leadership election with path: /overseer_elect/election/96428571206615049-127.0.0.1:60534_yjo%2Fj-n_0000000001
   [junit4]   2> 560664 INFO  (TEST-RecoveryZkTest.test-seed#[335333712DD16BB6]) [n:127.0.0.1:60534_yjo%2Fj    ] o.a.s.c.LeaderElector Watching path /overseer_elect/election/96428571206615044-127.0.0.1:60528_yjo%2Fj-n_0000000000 to know if I could be the leader
   [junit4]   2> 560665 INFO  (TEST-RecoveryZkTest.test-seed#[335333712DD16BB6]) [n:127.0.0.1:60534_yjo%2Fj    ] o.a.s.c.ZkController Publish node=127.0.0.1:60534_yjo%2Fj as DOWN
   [junit4]   2> 560673 INFO  (TEST-RecoveryZkTest.test-seed#[335333712DD16BB6]) [n:127.0.0.1:60534_yjo%2Fj    ] o.a.s.c.ZkController Register node as live in ZooKeeper:/live_nodes/127.0.0.1:60534_yjo%2Fj
   [junit4]   2> 560674 INFO  (TEST-RecoveryZkTest.test-seed#[335333712DD16BB6]) [n:127.0.0.1:60534_yjo%2Fj    ] o.a.s.c.c.SolrZkClient makePath: /live_nodes/127.0.0.1:60534_yjo%2Fj
   [junit4]   2> 560675 INFO  (OverseerStateUpdate-96428571206615044-127.0.0.1:60528_yjo%2Fj-n_0000000000) [n:127.0.0.1:60528_yjo%2Fj    ] o.a.s.c.Overseer processMessage: queueSize: 1, message = {
   [junit4]   2>   "operation":"downnode",
   [junit4]   2>   "node_name":"127.0.0.1:60534_yjo%2Fj"} current state version: 3
   [junit4]   2> 560675 INFO  (OverseerStateUpdate-96428571206615044-127.0.0.1:60528_yjo%2Fj-n_0000000000) [n:127.0.0.1:60528_yjo%2Fj    ] o.a.s.c.o.NodeMutator DownNode state invoked for node: 127.0.0.1:60534_yjo%2Fj
   [junit4]   2> 560679 INFO  (zkCallback-939-thread-1-processing-n:127.0.0.1:60528_yjo%2Fj) [n:127.0.0.1:60528_yjo%2Fj    ] o.a.s.c.c.ZkStateReader A cluster state change: [WatchedEvent state:SyncConnected type:NodeDataChanged path:/clusterstate.json], has occurred - updating... (live nodes size: [1])
   [junit4]   2> 560679 INFO  (zkCallback-949-thread-1-processing-n:127.0.0.1:60534_yjo%2Fj) [n:127.0.0.1:60534_yjo%2Fj    ] o.a.s.c.c.ZkStateReader A cluster state change: [WatchedEvent state:SyncConnected type:NodeDataChanged path:/clusterstate.json], has occurred - updating... (live nodes size: [1])
   [junit4]   2> 560696 INFO  (zkCallback-943-thread-1) [    ] o.a.s.c.c.ZkStateReader A cluster state change: [WatchedEvent state:SyncConnected type:NodeDataChanged path:/clusterstate.json], has occurred - updating... (live nodes size: [1])
   [junit4]   2> 560696 INFO  (zkCallback-939-thread-3-processing-n:127.0.0.1:60528_yjo%2Fj) [n:127.0.0.1:60528_yjo%2Fj    ] o.a.s.c.c.ZkStateReader A live node change: [WatchedEvent state:SyncConnected type:NodeChildrenChanged path:/live_nodes], has occurred - updating... (live nodes size: [1])
   [junit4]   2> 560697 INFO  (zkCallback-939-thread-3-processing-n:127.0.0.1:60528_yjo%2Fj) [n:127.0.0.1:60528_yjo%2Fj    ] o.a.s.c.c.ZkStateReader Updated live nodes from ZooKeeper... (1) -> (2)
   [junit4]   2> 560717 INFO  (TEST-RecoveryZkTest.test-seed#[335333712DD16BB6]) [n:127.0.0.1:60534_yjo%2Fj    ] o.a.s.c.CoreContainer Security conf doesn't exist. Skipping setup for authorization module.
   [junit4]   2> 560698 INFO  (zkCallback-949-thread-2-processing-n:127.0.0.1:60534_yjo%2Fj) [n:127.0.0.1:60534_yjo%2Fj    ] o.a.s.c.c.ZkStateReader A live node change: [WatchedEvent state:SyncConnected type:NodeChildrenChanged path:/live_nodes], has occurred - updating... (live nodes size: [1])
   [junit4]   2> 560697 INFO  (zkCallback-943-thread-1) [    ] o.a.s.c.c.ZkStateReader A live node change: [WatchedEvent state:SyncConnected type:NodeChildrenChanged path:/live_nodes], has occurred - updating... (live nodes size: [1])
   [junit4]   2> 560762 INFO  (zkCallback-949-thread-2-processing-n:127.0.0.1:60534_yjo%2Fj) [n:127.0.0.1:60534_yjo%2Fj    ] o.a.s.c.c.ZkStateReader Updated live nodes from ZooKeeper... (1) -> (2)
   [junit4]   2> 560762 INFO  (zkCallback-943-thread-1) [    ] o.a.s.c.c.ZkStateReader Updated live nodes from ZooKeeper... (1) -> (2)
   [junit4]   2> 560762 INFO  (TEST-RecoveryZkTest.test-seed#[335333712DD16BB6]) [n:127.0.0.1:60534_yjo%2Fj    ] o.a.s.c.CoreContainer No authentication plugin used.
   [junit4]   2> 560770 INFO  (TEST-RecoveryZkTest.test-seed#[335333712DD16BB6]) [n:127.0.0.1:60534_yjo%2Fj    ] o.a.s.c.CorePropertiesLocator Looking for core definitions underneath /Users/jenkins/workspace/Lucene-Solr-master-MacOSX/solr/build/solr-core/test/J0/../../../../../../../../../Users/jenkins/workspace/Lucene-Solr-master-MacOSX/solr/build/solr-core/test/J0/temp/solr.cloud.RecoveryZkTest_335333712DD16BB6-001/shard-1-001/cores
   [junit4]   2> 560773 INFO  (TEST-RecoveryZkTest.test-seed#[335333712DD16BB6]) [n:127.0.0.1:60534_yjo%2Fj    ] o.a.s.c.CoreDescriptor Created CoreDescriptor: {name=collection1, config=solrconfig.xml, transient=false, schema=schema.xml, loadOnStartup=true, configSetProperties=configsetprops.json, collection=collection1, coreNodeName=, dataDir=data/, shard=}
   [junit4]   2> 560773 INFO  (TEST-RecoveryZkTest.test-seed#[335333712DD16BB6]) [n:127.0.0.1:60534_yjo%2Fj    ] o.a.s.c.CorePropertiesLocator Found core collection1 in /Users/jenkins/workspace/Lucene-Solr-master-MacOSX/solr/build/solr-core/test/J0/../../../../../../../../../Users/jenkins/workspace/Lucene-Solr-master-MacOSX/solr/build/solr-core/test/J0/temp/solr.cloud.RecoveryZkTest_335333712DD16BB6-001/shard-1-001/cores/collection1
   [junit4]   2> 560774 INFO  (TEST-RecoveryZkTest.test-seed#[335333712DD16BB6]) [n:127.0.0.1:60534_yjo%2Fj    ] o.a.s.c.CorePropertiesLocator Found 1 core definitions
   [junit4]   2> 560777 INFO  (coreLoadExecutor-1460-thread-1-processing-n:127.0.0.1:60534_yjo%2Fj) [n:127.0.0.1:60534_yjo%2Fj c:collection1   x:collection1] o.a.s.c.ZkController publishing state=down
   [junit4]   2> 560777 INFO  (coreLoadExecutor-1460-thread-1-processing-n:127.0.0.1:60534_yjo%2Fj) [n:127.0.0.1:60534_yjo%2Fj c:collection1   x:collection1] o.a.s.c.ZkController numShards not found on descriptor - reading it from system property
   [junit4]   2> 560777 INFO  (TEST-RecoveryZkTest.test-seed#[335333712DD16BB6]) [n:127.0.0.1:60534_yjo%2Fj    ] o.a.s.s.SolrDispatchFilter user.dir=/Users/jenkins/workspace/Lucene-Solr-master-MacOSX/solr/build/solr-core/test/J0
   [junit4]   2> 560778 INFO  (TEST-RecoveryZkTest.test-seed#[335333712DD16BB6]) [n:127.0.0.1:60534_yjo%2Fj    ] o.a.s.s.SolrDispatchFilter SolrDispatchFilter.init() done
   [junit4]   2> 560779 INFO  (coreLoadExecutor-1460-thread-1-processing-n:127.0.0.1:60534_yjo%2Fj) [n:127.0.0.1:60534_yjo%2Fj c:collection1   x:collection1] o.a.s.c.ZkController Registering watch for collection collection1
   [junit4]   2> 560780 INFO  (OverseerStateUpdate-96428571206615044-127.0.0.1:60528_yjo%2Fj-n_0000000000) [n:127.0.0.1:60528_yjo%2Fj    ] o.a.s.c.Overseer processMessage: queueSize: 1, message = {
   [junit4]   2>   "core":"collection1",
   [junit4]   2>   "roles":null,
   [junit4]   2>   "base_url":"http://127.0.0.1:60534/yjo/j",
   [junit4]   2>   "node_name":"127.0.0.1:60534_yjo%2Fj",
   [junit4]   2>   "numShards":"1",
   [junit4]   2>   "state":"down",
   [junit4]   2>   "shard":null,
   [junit4]   2>   "collection":"collection1",
   [junit4]   2>   "operation":"state"} current state version: 4
   [junit4]   2> 560780 INFO  (OverseerStateUpdate-96428571206615044-127.0.0.1:60528_yjo%2Fj-n_0000000000) [n:127.0.0.1:60528_yjo%2Fj    ] o.a.s.c.o.ReplicaMutator Update state numShards=1 message={
   [junit4]   2>   "core":"collection1",
   [junit4]   2>   "roles":null,
   [junit4]   2>   "base_url":"http://127.0.0.1:60534/yjo/j",
   [junit4]   2>   "node_name":"127.0.0.1:60534_yjo%2Fj",
   [junit4]   2>   "numShards":"1",
   [junit4]   2>   "state":"down",
   [junit4]   2>   "shard":null,
   [junit4]   2>   "collection":"collection1",
   [junit4]   2>   "operation":"state"}
   [junit4]   2> 560780 INFO  (OverseerStateUpdate-96428571206615044-127.0.0.1:60528_yjo%2Fj-n_0000000000) [n:127.0.0.1:60528_yjo%2Fj    ] o.a.s.c.o.ReplicaMutator Collection already exists with numShards=1
   [junit4]   2> 560780 INFO  (OverseerStateUpdate-96428571206615044-127.0.0.1:60528_yjo%2Fj-n_0000000000) [n:127.0.0.1:60528_yjo%2Fj    ] o.a.s.c.o.ReplicaMutator Assigning new node to shard shard=shard1
   [junit4]   2> 560781 INFO  (coreLoadExecutor-1460-thread-1-processing-n:127.0.0.1:60534_yjo%2Fj) [n:127.0.0.1:60534_yjo%2Fj c:collection1   x:collection1] o.a.s.c.c.ZkStateReader Add data for [collection1] ver [0]
   [junit4]   2> 560781 INFO  (coreLoadExecutor-1460-thread-1-processing-n:127.0.0.1:60534_yjo%2Fj) [n:127.0.0.1:60534_yjo%2Fj c:collection1   x:collection1] o.a.s.c.ZkController look for our core node name
   [junit4]   2> 560886 INFO  (OverseerStateUpdate-96428571206615044-127.0.0.1:60528_yjo%2Fj-n_0000000000) [n:127.0.0.1:60528_yjo%2Fj    ] o.a.s.c.o.ZkStateWriter going to update_collection /collections/collection1/state.json version: 0
   [junit4]   2> 560887 INFO  (zkCallback-949-thread-2-processing-n:127.0.0.1:60534_yjo%2Fj) [n:127.0.0.1:60534_yjo%2Fj    ] o.a.s.c.c.ZkStateReader A cluster state change: [WatchedEvent state:SyncConnected type:NodeDataChanged path:/collections/collection1/state.json] for collection [collection1] has occurred - updating... (live nodes size: [2])
   [junit4]   2> 560887 INFO  (zkCallback-949-thread-2-processing-n:127.0.0.1:60534_yjo%2Fj) [n:127.0.0.1:60534_yjo%2Fj    ] o.a.s.c.c.ZkStateReader Updating data for [collection1] from [0] to [1]
   [junit4]   2> 561783 INFO  (coreLoadExecutor-1460-thread-1-processing-n:127.0.0.1:60534_yjo%2Fj) [n:127.0.0.1:60534_yjo%2Fj c:collection1   x:collection1] o.a.s.c.ZkController waiting to find shard id in clusterstate for collection1
   [junit4]   2> 561783 INFO  (coreLoadExecutor-1460-thread-1-processing-n:127.0.0.1:60534_yjo%2Fj) [n:127.0.0.1:60534_yjo%2Fj c:collection1   x:collection1] o.a.s.c.ZkController Check for collection zkNode:collection1
   [junit4]   2> 561784 INFO  (coreLoadExecutor-1460-thread-1-processing-n:127.0.0.1:60534_yjo%2Fj) [n:127.0.0.1:60534_yjo%2Fj c:collection1   x:collection1] o.a.s.c.ZkController Collection zkNode exists
   [junit4]   2> 561784 INFO  (coreLoadExecutor-1460-thread-1-processing-n:127.0.0.1:60534_yjo%2Fj) [n:127.0.0.1:60534_yjo%2Fj c:collection1   x:collection1] o.a.s.c.c.ZkStateReader Load collection config from: [/collections/collection1]
   [junit4]   2> 561785 INFO  (coreLoadExecutor-1460-thread-1-processing-n:127.0.0.1:60534_yjo%2Fj) [n:127.0.0.1:60534_yjo%2Fj c:collection1   x:collection1] o.a.s.c.c.ZkStateReader path=[/collections/collection1] [configName]=[conf1] specified config exists in ZooKeeper
   [junit4]   2> 561785 INFO  (coreLoadExecutor-1460-thread-1-processing-n:127.0.0.1:60534_yjo%2Fj) [n:127.0.0.1:60534_yjo%2Fj c:collection1   x:collection1] o.a.s.c.SolrResourceLoader new SolrResourceLoader for directory: '/Users/jenkins/workspace/Lucene-Solr-master-MacOSX/solr/build/solr-core/test/J0/temp/solr.cloud.RecoveryZkTest_335333712DD16BB6-001/shard-1-001/cores/collection1'
   [junit4]   2> 561786 INFO  (coreLoadExecutor-1460-thread-1-processing-n:127.0.0.1:60534_yjo%2Fj) [n:127.0.0.1:60534_yjo%2Fj c:collection1   x:collection1] o.a.s.c.SolrResourceLoader JNDI not configured for solr (NoInitialContextEx)
   [junit4]   2> 561786 INFO  (coreLoadExecutor-1460-thread-1-processing-n:127.0.0.1:60534_yjo%2Fj) [n:127.0.0.1:60534_yjo%2Fj c:collection1   x:collection1] o.a.s.c.SolrResourceLoader solr home defaulted to 'solr/' (could not find system property or JNDI)
   [junit4]   2> 561789 INFO  (coreLoadExecutor-1460-thread-1-processing-n:127.0.0.1:60534_yjo%2Fj) [n:127.0.0.1:60534_yjo%2Fj c:collection1   x:collection1] o.a.s.c.Config loaded config solrconfig.xml with version 0 
   [junit4]   2> 561800 INFO  (coreLoadExecutor-1460-thread-1-processing-n:127.0.0.1:60534_yjo%2Fj) [n:127.0.0.1:60534_yjo%2Fj c:collection1   x:collection1] o.a.s.c.SolrConfig current version of requestparams : -1
   [junit4]   2> 561813 INFO  (coreLoadExecutor-1460-thread-1-processing-n:127.0.0.1:60534_yjo%2Fj) [n:127.0.0.1:60534_yjo%2Fj c:collection1   x:collection1] o.a.s.c.SolrConfig Using Lucene MatchVersion: 7.0.0
   [junit4]   2> 561861 INFO  (coreLoadExecutor-1460-thread-1-processing-n:127.0.0.1:60534_yjo%2Fj) [n:127.0.0.1:60534_yjo%2Fj c:collection1   x:collection1] o.a.s.c.SolrConfig Loaded SolrConfig: solrconfig.xml
   [junit4]   2> 561874 INFO  (coreLoadExecutor-1460-thread-1-processing-n:127.0.0.1:60534_yjo%2Fj) [n:127.0.0.1:60534_yjo%2Fj c:collection1   x:collection1] o.a.s.s.IndexSchema [collection1] Schema name=test
   [junit4]   2> 562115 INFO  (coreLoadExecutor-1460-thread-1-processing-n:127.0.0.1:60534_yjo%2Fj) [n:127.0.0.1:60534_yjo%2Fj c:collection1   x:collection1] o.a.s.s.IndexSchema default search field in schema is text
   [junit4]   2> 562116 INFO  (coreLoadExecutor-1460-thread-1-processing-n:127.0.0.1:60534_yjo%2Fj) [n:127.0.0.1:60534_yjo%2Fj c:collection1   x:collection1] o.a.s.s.IndexSchema unique key field: id
   [junit4]   2> 562117 INFO  (coreLoadExecutor-1460-thread-1-processing-n:127.0.0.1:60534_yjo%2Fj) [n:127.0.0.1:60534_yjo%2Fj c:collection1   x:collection1] o.a.s.s.FileExchangeRateProvider Reloading exchange rates from file currency.xml
   [junit4]   2> 562121 INFO  (coreLoadExecutor-1460-thread-1-processing-n:127.0.0.1:60534_yjo%2Fj) [n:127.0.0.1:60534_yjo%2Fj c:collection1   x:collection1] o.a.s.s.FileExchangeRateProvider Reloading exchange rates from fil

[...truncated too long message...]

kins/workspace/Lucene-Solr-master-MacOSX/solr/build/solr-core/test/J0/temp/solr.cloud.RecoveryZkTest_335333712DD16BB6-001/shard-2-001/cores/collection1/data/index [CachedDir<<refCount=0;path=/Users/jenkins/workspace/Lucene-Solr-master-MacOSX/solr/build/solr-core/test/J0/temp/solr.cloud.RecoveryZkTest_335333712DD16BB6-001/shard-2-001/cores/collection1/data/index;done=false>>]
   [junit4]   2> 696266 INFO  (recoveryExecutor-960-thread-1-processing-n:127.0.0.1:60538_yjo%2Fj x:collection1 s:shard1 c:collection1 r:core_node2) [n:127.0.0.1:60538_yjo%2Fj c:collection1 s:shard1 r:core_node2 x:collection1] o.a.s.c.CachingDirectoryFactory Closing directory, CoreContainer#isShutdown=true
   [junit4]   2> 696266 INFO  (recoveryExecutor-960-thread-1-processing-n:127.0.0.1:60538_yjo%2Fj x:collection1 s:shard1 c:collection1 r:core_node2) [n:127.0.0.1:60538_yjo%2Fj c:collection1 s:shard1 r:core_node2 x:collection1] o.a.s.c.CachingDirectoryFactory Closing directory: /Users/jenkins/workspace/Lucene-Solr-master-MacOSX/solr/build/solr-core/test/J0/temp/solr.cloud.RecoveryZkTest_335333712DD16BB6-001/shard-2-001/cores/collection1/data/index
   [junit4]   2> 696267 INFO  (recoveryExecutor-960-thread-1-processing-n:127.0.0.1:60538_yjo%2Fj x:collection1 s:shard1 c:collection1 r:core_node2) [n:127.0.0.1:60538_yjo%2Fj c:collection1 s:shard1 r:core_node2 x:collection1] o.a.s.c.CachingDirectoryFactory looking to close /Users/jenkins/workspace/Lucene-Solr-master-MacOSX/solr/build/solr-core/test/J0/temp/solr.cloud.RecoveryZkTest_335333712DD16BB6-001/shard-2-001/cores/collection1/data [CachedDir<<refCount=0;path=/Users/jenkins/workspace/Lucene-Solr-master-MacOSX/solr/build/solr-core/test/J0/temp/solr.cloud.RecoveryZkTest_335333712DD16BB6-001/shard-2-001/cores/collection1/data;done=false>>]
   [junit4]   2> 696267 INFO  (recoveryExecutor-960-thread-1-processing-n:127.0.0.1:60538_yjo%2Fj x:collection1 s:shard1 c:collection1 r:core_node2) [n:127.0.0.1:60538_yjo%2Fj c:collection1 s:shard1 r:core_node2 x:collection1] o.a.s.c.CachingDirectoryFactory Closing directory, CoreContainer#isShutdown=true
   [junit4]   2> 696267 INFO  (recoveryExecutor-960-thread-1-processing-n:127.0.0.1:60538_yjo%2Fj x:collection1 s:shard1 c:collection1 r:core_node2) [n:127.0.0.1:60538_yjo%2Fj c:collection1 s:shard1 r:core_node2 x:collection1] o.a.s.c.CachingDirectoryFactory Closing directory: /Users/jenkins/workspace/Lucene-Solr-master-MacOSX/solr/build/solr-core/test/J0/temp/solr.cloud.RecoveryZkTest_335333712DD16BB6-001/shard-2-001/cores/collection1/data
   [junit4]   2> 696267 INFO  (recoveryExecutor-960-thread-1-processing-n:127.0.0.1:60538_yjo%2Fj x:collection1 s:shard1 c:collection1 r:core_node2) [n:127.0.0.1:60538_yjo%2Fj c:collection1 s:shard1 r:core_node2 x:collection1] o.a.s.c.CachingDirectoryFactory looking to close /Users/jenkins/workspace/Lucene-Solr-master-MacOSX/solr/build/solr-core/test/J0/temp/solr.cloud.RecoveryZkTest_335333712DD16BB6-001/shard-2-001/cores/collection1/data/snapshot_metadata [CachedDir<<refCount=0;path=/Users/jenkins/workspace/Lucene-Solr-master-MacOSX/solr/build/solr-core/test/J0/temp/solr.cloud.RecoveryZkTest_335333712DD16BB6-001/shard-2-001/cores/collection1/data/snapshot_metadata;done=false>>]
   [junit4]   2> 696267 INFO  (recoveryExecutor-960-thread-1-processing-n:127.0.0.1:60538_yjo%2Fj x:collection1 s:shard1 c:collection1 r:core_node2) [n:127.0.0.1:60538_yjo%2Fj c:collection1 s:shard1 r:core_node2 x:collection1] o.a.s.c.CachingDirectoryFactory Closing directory, CoreContainer#isShutdown=true
   [junit4]   2> 696267 INFO  (recoveryExecutor-960-thread-1-processing-n:127.0.0.1:60538_yjo%2Fj x:collection1 s:shard1 c:collection1 r:core_node2) [n:127.0.0.1:60538_yjo%2Fj c:collection1 s:shard1 r:core_node2 x:collection1] o.a.s.c.CachingDirectoryFactory Closing directory: /Users/jenkins/workspace/Lucene-Solr-master-MacOSX/solr/build/solr-core/test/J0/temp/solr.cloud.RecoveryZkTest_335333712DD16BB6-001/shard-2-001/cores/collection1/data/snapshot_metadata
   [junit4]   2> 696268 INFO  (TEST-RecoveryZkTest.test-seed#[335333712DD16BB6]) [    ] o.a.s.c.Overseer Overseer (id=96428571206615055-127.0.0.1:60538_yjo%2Fj-n_0000000003) closing
   [junit4]   2> 696268 INFO  (OverseerStateUpdate-96428571206615055-127.0.0.1:60538_yjo%2Fj-n_0000000003) [n:127.0.0.1:60538_yjo%2Fj    ] o.a.s.c.Overseer Overseer Loop exiting : 127.0.0.1:60538_yjo%2Fj
   [junit4]   2> 696271 INFO  (zkCallback-962-thread-4-processing-n:127.0.0.1:60538_yjo%2Fj) [n:127.0.0.1:60538_yjo%2Fj    ] o.a.s.c.c.ZkStateReader A live node change: [WatchedEvent state:SyncConnected type:NodeChildrenChanged path:/live_nodes], has occurred - updating... (live nodes size: [1])
   [junit4]   2> 696271 WARN  (zkCallback-962-thread-4-processing-n:127.0.0.1:60538_yjo%2Fj) [n:127.0.0.1:60538_yjo%2Fj    ] o.a.s.c.c.ZkStateReader ZooKeeper watch triggered, but Solr cannot talk to ZK: [KeeperErrorCode = Session expired for /live_nodes]
   [junit4]   2> 696272 INFO  (TEST-RecoveryZkTest.test-seed#[335333712DD16BB6]) [    ] o.e.j.s.ServerConnector Stopped ServerConnector@26473479{HTTP/1.1,[http/1.1]}{127.0.0.1:60538}
   [junit4]   2> 696273 INFO  (TEST-RecoveryZkTest.test-seed#[335333712DD16BB6]) [    ] o.e.j.s.h.ContextHandler Stopped o.e.j.s.ServletContextHandler@49ddfc1d{/yjo/j,null,UNAVAILABLE}
   [junit4]   2> 696275 INFO  (TEST-RecoveryZkTest.test-seed#[335333712DD16BB6]) [    ] o.a.s.c.ZkTestServer connecting to 127.0.0.1:60525 60525
   [junit4]   2> 696319 INFO  (Thread-725) [    ] o.a.s.c.ZkTestServer connecting to 127.0.0.1:60525 60525
   [junit4]   2> 701950 WARN  (Thread-725) [    ] o.a.s.c.ZkTestServer Watch limit violations: 
   [junit4]   2> Maximum concurrent create/delete watches above limit:
   [junit4]   2> 
   [junit4]   2> 	5	/solr/aliases.json
   [junit4]   2> 	5	/solr/clusterprops.json
   [junit4]   2> 	4	/solr/security.json
   [junit4]   2> 	4	/solr/configs/conf1
   [junit4]   2> 
   [junit4]   2> Maximum concurrent data watches above limit:
   [junit4]   2> 
   [junit4]   2> 	5	/solr/clusterstate.json
   [junit4]   2> 	3	/solr/collections/collection1/state.json
   [junit4]   2> 	2	/solr/overseer_elect/election/96428571206615049-127.0.0.1:60534_yjo%2Fj-n_0000000001
   [junit4]   2> 	2	/solr/collections/collection1/leader_elect/shard1/election/96428571206615049-core_node1-n_0000000000
   [junit4]   2> 
   [junit4]   2> Maximum concurrent children watches above limit:
   [junit4]   2> 
   [junit4]   2> 	137	/solr/overseer/collection-queue-work
   [junit4]   2> 	31	/solr/overseer/queue
   [junit4]   2> 	11	/solr/overseer/queue-work
   [junit4]   2> 	5	/solr/collections
   [junit4]   2> 	4	/solr/live_nodes
   [junit4]   2> 
   [junit4]   2> NOTE: reproduce with: ant test  -Dtestcase=RecoveryZkTest -Dtests.method=test -Dtests.seed=335333712DD16BB6 -Dtests.slow=true -Dtests.locale=ar-AE -Dtests.timezone=Atlantic/Stanley -Dtests.asserts=true -Dtests.file.encoding=UTF-8
   [junit4] FAILURE  144s J0 | RecoveryZkTest.test <<<
   [junit4]    > Throwable #1: java.lang.AssertionError: There are still nodes recoverying - waited for 120 seconds
   [junit4]    > 	at __randomizedtesting.SeedInfo.seed([335333712DD16BB6:BB070CAB832D064E]:0)
   [junit4]    > 	at org.apache.solr.cloud.AbstractDistribZkTestBase.waitForRecoveriesToFinish(AbstractDistribZkTestBase.java:182)
   [junit4]    > 	at org.apache.solr.cloud.AbstractFullDistribZkTestBase.waitForRecoveriesToFinish(AbstractFullDistribZkTestBase.java:862)
   [junit4]    > 	at org.apache.solr.cloud.AbstractFullDistribZkTestBase.waitForThingsToLevelOut(AbstractFullDistribZkTestBase.java:1418)
   [junit4]    > 	at org.apache.solr.cloud.RecoveryZkTest.test(RecoveryZkTest.java:105)
   [junit4]    > 	at org.apache.solr.BaseDistributedSearchTestCase$ShardsRepeatRule$ShardsFixedStatement.callStatement(BaseDistributedSearchTestCase.java:985)
   [junit4]    > 	at org.apache.solr.BaseDistributedSearchTestCase$ShardsRepeatRule$ShardsStatement.evaluate(BaseDistributedSearchTestCase.java:960)
   [junit4]    > 	at java.lang.Thread.run(Thread.java:745)
   [junit4]   2> 701956 INFO  (SUITE-RecoveryZkTest-seed#[335333712DD16BB6]-worker) [    ] o.a.s.SolrTestCaseJ4 ###deleteCore
   [junit4]   2> NOTE: leaving temporary files on disk at: /Users/jenkins/workspace/Lucene-Solr-master-MacOSX/solr/build/solr-core/test/J0/temp/solr.cloud.RecoveryZkTest_335333712DD16BB6-001
   [junit4]   2> NOTE: test params are: codec=Asserting(Lucene62): {rnd_b=PostingsFormat(name=Memory doPackFST= true), _version_=PostingsFormat(name=Memory doPackFST= false), a_t=Lucene50(blocksize=128), a_i=PostingsFormat(name=Memory doPackFST= true), id=PostingsFormat(name=Memory doPackFST= true)}, docValues:{}, maxPointsInLeafNode=140, maxMBSortInHeap=6.745796132822803, sim=ClassicSimilarity, locale=ar-AE, timezone=Atlantic/Stanley
   [junit4]   2> NOTE: Mac OS X 10.11.6 x86_64/Oracle Corporation 1.8.0_102 (64-bit)/cpus=3,threads=1,free=36387416,total=153018368
   [junit4]   2> NOTE: All tests run in this JVM: [TestReplicaProperties, AsyncMigrateRouteKeyTest, TestFilteredDocIdSet, SampleTest, TestSolrCLIRunExample, TestSolrConfigHandlerConcurrent, TestUniqueKeyFieldResource, TestShortCircuitedRequests, TestDynamicLoading, ChaosMonkeyNothingIsSafeTest, TestSolrCloudWithDelegationTokens, HardAutoCommitTest, TestLFUCache, TestRestManager, TestLRUCache, ConfigSetsAPITest, TestQuerySenderNoQuery, TestDocBasedVersionConstraints, RemoteQueryErrorTest, TestHashPartitioner, TestJmxMonitoredMap, QueryEqualityTest, TestDefaultSearchFieldResource, SuggestComponentTest, QueryResultKeyTest, TestLocalFSCloudBackupRestore, TestMacros, TestConfigSetsAPI, CursorMarkTest, TestIBSimilarityFactory, TestReqParamsAPI, SimpleCollectionCreateDeleteTest, TestElisionMultitermQuery, TestHashQParserPlugin, TestMaxScoreQueryParser, TestFileDictionaryLookup, TestSchemaResource, HdfsDirectoryTest, RecoveryZkTest]
   [junit4] Completed [112/629 (1!)] on J0 in 144.15s, 1 test, 1 failure <<< FAILURES!

[...truncated 61788 lines...]


Mime
View raw message