lucene-dev mailing list archives

Site index · List index
Message view « Date » · « Thread »
Top « Date » · « Thread »
From Policeman Jenkins Server <jenk...@thetaphi.de>
Subject [JENKINS-EA] Lucene-Solr-master-Linux (64bit/jdk-9-ea+129) - Build # 17468 - Still Unstable!
Date Fri, 05 Aug 2016 07:28:29 GMT
Build: http://jenkins.thetaphi.de/job/Lucene-Solr-master-Linux/17468/
Java: 64bit/jdk-9-ea+129 -XX:+UseCompressedOops -XX:+UseParallelGC

1 tests failed.
FAILED:  org.apache.solr.cloud.TestSolrCloudWithSecureImpersonation.testProxyValidateHost

Error Message:
Error from server at https://127.0.0.1:37485/solr: Expected mime type application/octet-stream but got application/json. {   "RemoteException" : {     "message" : "Unauthorized connection for super-user: localHostAnyGroup from IP localhost.localdomain",     "exception" : "AuthorizationException",     "javaClassName" : "org.apache.hadoop.security.authorize.AuthorizationException"   } }

Stack Trace:
org.apache.solr.client.solrj.impl.HttpSolrClient$RemoteSolrException: Error from server at https://127.0.0.1:37485/solr: Expected mime type application/octet-stream but got application/json. {
  "RemoteException" : {
    "message" : "Unauthorized connection for super-user: localHostAnyGroup from IP localhost.localdomain",
    "exception" : "AuthorizationException",
    "javaClassName" : "org.apache.hadoop.security.authorize.AuthorizationException"
  }
}
	at __randomizedtesting.SeedInfo.seed([B596175E77DFB007:5068D7AF7298E4B0]:0)
	at org.apache.solr.client.solrj.impl.HttpSolrClient.executeMethod(HttpSolrClient.java:576)
	at org.apache.solr.client.solrj.impl.HttpSolrClient.request(HttpSolrClient.java:261)
	at org.apache.solr.client.solrj.impl.HttpSolrClient.request(HttpSolrClient.java:250)
	at org.apache.solr.client.solrj.SolrClient.request(SolrClient.java:1219)
	at org.apache.solr.cloud.TestSolrCloudWithSecureImpersonation.testProxyValidateHost(TestSolrCloudWithSecureImpersonation.java:260)
	at jdk.internal.reflect.NativeMethodAccessorImpl.invoke0(java.base@9-ea/Native Method)
	at jdk.internal.reflect.NativeMethodAccessorImpl.invoke(java.base@9-ea/NativeMethodAccessorImpl.java:62)
	at jdk.internal.reflect.DelegatingMethodAccessorImpl.invoke(java.base@9-ea/DelegatingMethodAccessorImpl.java:43)
	at java.lang.reflect.Method.invoke(java.base@9-ea/Method.java:533)
	at com.carrotsearch.randomizedtesting.RandomizedRunner.invoke(RandomizedRunner.java:1764)
	at com.carrotsearch.randomizedtesting.RandomizedRunner$8.evaluate(RandomizedRunner.java:871)
	at com.carrotsearch.randomizedtesting.RandomizedRunner$9.evaluate(RandomizedRunner.java:907)
	at com.carrotsearch.randomizedtesting.RandomizedRunner$10.evaluate(RandomizedRunner.java:921)
	at com.carrotsearch.randomizedtesting.rules.SystemPropertiesRestoreRule$1.evaluate(SystemPropertiesRestoreRule.java:57)
	at org.apache.lucene.util.TestRuleSetupTeardownChained$1.evaluate(TestRuleSetupTeardownChained.java:49)
	at org.apache.lucene.util.AbstractBeforeAfterRule$1.evaluate(AbstractBeforeAfterRule.java:45)
	at org.apache.lucene.util.TestRuleThreadAndTestName$1.evaluate(TestRuleThreadAndTestName.java:48)
	at org.apache.lucene.util.TestRuleIgnoreAfterMaxFailures$1.evaluate(TestRuleIgnoreAfterMaxFailures.java:64)
	at org.apache.lucene.util.TestRuleMarkFailure$1.evaluate(TestRuleMarkFailure.java:47)
	at com.carrotsearch.randomizedtesting.rules.StatementAdapter.evaluate(StatementAdapter.java:36)
	at com.carrotsearch.randomizedtesting.ThreadLeakControl$StatementRunner.run(ThreadLeakControl.java:367)
	at com.carrotsearch.randomizedtesting.ThreadLeakControl.forkTimeoutingTask(ThreadLeakControl.java:809)
	at com.carrotsearch.randomizedtesting.ThreadLeakControl$3.evaluate(ThreadLeakControl.java:460)
	at com.carrotsearch.randomizedtesting.RandomizedRunner.runSingleTest(RandomizedRunner.java:880)
	at com.carrotsearch.randomizedtesting.RandomizedRunner$5.evaluate(RandomizedRunner.java:781)
	at com.carrotsearch.randomizedtesting.RandomizedRunner$6.evaluate(RandomizedRunner.java:816)
	at com.carrotsearch.randomizedtesting.RandomizedRunner$7.evaluate(RandomizedRunner.java:827)
	at com.carrotsearch.randomizedtesting.rules.StatementAdapter.evaluate(StatementAdapter.java:36)
	at com.carrotsearch.randomizedtesting.rules.SystemPropertiesRestoreRule$1.evaluate(SystemPropertiesRestoreRule.java:57)
	at org.apache.lucene.util.AbstractBeforeAfterRule$1.evaluate(AbstractBeforeAfterRule.java:45)
	at com.carrotsearch.randomizedtesting.rules.StatementAdapter.evaluate(StatementAdapter.java:36)
	at org.apache.lucene.util.TestRuleStoreClassName$1.evaluate(TestRuleStoreClassName.java:41)
	at com.carrotsearch.randomizedtesting.rules.NoShadowingOrOverridesOnMethodsRule$1.evaluate(NoShadowingOrOverridesOnMethodsRule.java:40)
	at com.carrotsearch.randomizedtesting.rules.NoShadowingOrOverridesOnMethodsRule$1.evaluate(NoShadowingOrOverridesOnMethodsRule.java:40)
	at com.carrotsearch.randomizedtesting.rules.StatementAdapter.evaluate(StatementAdapter.java:36)
	at com.carrotsearch.randomizedtesting.rules.StatementAdapter.evaluate(StatementAdapter.java:36)
	at com.carrotsearch.randomizedtesting.rules.StatementAdapter.evaluate(StatementAdapter.java:36)
	at org.apache.lucene.util.TestRuleAssertionsRequired$1.evaluate(TestRuleAssertionsRequired.java:53)
	at org.apache.lucene.util.TestRuleMarkFailure$1.evaluate(TestRuleMarkFailure.java:47)
	at org.apache.lucene.util.TestRuleIgnoreAfterMaxFailures$1.evaluate(TestRuleIgnoreAfterMaxFailures.java:64)
	at org.apache.lucene.util.TestRuleIgnoreTestSuites$1.evaluate(TestRuleIgnoreTestSuites.java:54)
	at com.carrotsearch.randomizedtesting.rules.StatementAdapter.evaluate(StatementAdapter.java:36)
	at com.carrotsearch.randomizedtesting.ThreadLeakControl$StatementRunner.run(ThreadLeakControl.java:367)
	at java.lang.Thread.run(java.base@9-ea/Thread.java:843)




Build Log:
[...truncated 10813 lines...]
   [junit4] Suite: org.apache.solr.cloud.TestSolrCloudWithSecureImpersonation
   [junit4]   2> Creating dataDir: /home/jenkins/workspace/Lucene-Solr-master-Linux/solr/build/solr-core/test/J2/temp/solr.cloud.TestSolrCloudWithSecureImpersonation_B596175E77DFB007-001/init-core-data-001
   [junit4]   2> 237652 INFO  (SUITE-TestSolrCloudWithSecureImpersonation-seed#[B596175E77DFB007]-worker) [    ] o.a.s.SolrTestCaseJ4 Randomized ssl (true) and clientAuth (true) via: @org.apache.solr.util.RandomizeSSL(reason=, ssl=NaN, value=NaN, clientAuth=NaN)
   [junit4]   2> 237760 WARN  (SUITE-TestSolrCloudWithSecureImpersonation-seed#[B596175E77DFB007]-worker) [    ] o.a.h.u.NativeCodeLoader Unable to load native-hadoop library for your platform... using builtin-java classes where applicable
   [junit4]   2> 237886 INFO  (SUITE-TestSolrCloudWithSecureImpersonation-seed#[B596175E77DFB007]-worker) [    ] o.a.s.c.ZkTestServer STARTING ZK TEST SERVER
   [junit4]   2> 237886 INFO  (Thread-396) [    ] o.a.s.c.ZkTestServer client port:0.0.0.0/0.0.0.0:0
   [junit4]   2> 237887 INFO  (Thread-396) [    ] o.a.s.c.ZkTestServer Starting server
   [junit4]   2> 237987 INFO  (SUITE-TestSolrCloudWithSecureImpersonation-seed#[B596175E77DFB007]-worker) [    ] o.a.s.c.ZkTestServer start zk server on port:33845
   [junit4]   2> 237987 INFO  (SUITE-TestSolrCloudWithSecureImpersonation-seed#[B596175E77DFB007]-worker) [    ] o.a.s.c.c.SolrZkClient Using default ZkCredentialsProvider
   [junit4]   2> 237987 INFO  (SUITE-TestSolrCloudWithSecureImpersonation-seed#[B596175E77DFB007]-worker) [    ] o.a.s.c.c.ConnectionManager Waiting for client to connect to ZooKeeper
   [junit4]   2> 237989 INFO  (zkCallback-470-thread-1) [    ] o.a.s.c.c.ConnectionManager Watcher org.apache.solr.common.cloud.ConnectionManager@4c1107d name:ZooKeeperConnection Watcher:127.0.0.1:33845 got event WatchedEvent state:SyncConnected type:None path:null path:null type:None
   [junit4]   2> 237989 INFO  (SUITE-TestSolrCloudWithSecureImpersonation-seed#[B596175E77DFB007]-worker) [    ] o.a.s.c.c.ConnectionManager Client is connected to ZooKeeper
   [junit4]   2> 237989 INFO  (SUITE-TestSolrCloudWithSecureImpersonation-seed#[B596175E77DFB007]-worker) [    ] o.a.s.c.c.SolrZkClient Using default ZkACLProvider
   [junit4]   2> 237989 INFO  (SUITE-TestSolrCloudWithSecureImpersonation-seed#[B596175E77DFB007]-worker) [    ] o.a.s.c.c.SolrZkClient makePath: /solr/solr.xml
   [junit4]   2> 237990 INFO  (SUITE-TestSolrCloudWithSecureImpersonation-seed#[B596175E77DFB007]-worker) [    ] o.a.s.c.c.SolrZkClient makePath: /solr/clusterprops.json
   [junit4]   2> 237994 INFO  (jetty-launcher-469-thread-2) [    ] o.e.j.s.Server jetty-9.3.8.v20160314
   [junit4]   2> 237994 INFO  (jetty-launcher-469-thread-1) [    ] o.e.j.s.Server jetty-9.3.8.v20160314
   [junit4]   2> 237996 INFO  (jetty-launcher-469-thread-1) [    ] o.e.j.s.h.ContextHandler Started o.e.j.s.ServletContextHandler@680732c0{/solr,null,AVAILABLE}
   [junit4]   2> 237996 INFO  (jetty-launcher-469-thread-2) [    ] o.e.j.s.h.ContextHandler Started o.e.j.s.ServletContextHandler@2e262b{/solr,null,AVAILABLE}
   [junit4]   2> 237998 INFO  (jetty-launcher-469-thread-1) [    ] o.e.j.s.ServerConnector Started ServerConnector@338be41a{SSL,[ssl, http/1.1]}{127.0.0.1:37485}
   [junit4]   2> 237998 INFO  (jetty-launcher-469-thread-2) [    ] o.e.j.s.ServerConnector Started ServerConnector@35f70725{SSL,[ssl, http/1.1]}{127.0.0.1:33372}
   [junit4]   2> 237998 INFO  (jetty-launcher-469-thread-1) [    ] o.e.j.s.Server Started @240164ms
   [junit4]   2> 237998 INFO  (jetty-launcher-469-thread-2) [    ] o.e.j.s.Server Started @240164ms
   [junit4]   2> 237998 INFO  (jetty-launcher-469-thread-1) [    ] o.a.s.c.s.e.JettySolrRunner Jetty properties: {hostContext=/solr, hostPort=37485}
   [junit4]   2> 237998 INFO  (jetty-launcher-469-thread-2) [    ] o.a.s.c.s.e.JettySolrRunner Jetty properties: {hostContext=/solr, hostPort=33372}
   [junit4]   2> 237998 INFO  (jetty-launcher-469-thread-1) [    ] o.a.s.s.SolrDispatchFilter SolrDispatchFilter.init(): jdk.internal.loader.ClassLoaders$AppClassLoader@7907ec20
   [junit4]   2> 237998 INFO  (jetty-launcher-469-thread-2) [    ] o.a.s.s.SolrDispatchFilter SolrDispatchFilter.init(): jdk.internal.loader.ClassLoaders$AppClassLoader@7907ec20
   [junit4]   2> 237998 INFO  (jetty-launcher-469-thread-1) [    ] o.a.s.c.SolrResourceLoader new SolrResourceLoader for directory: '/home/jenkins/workspace/Lucene-Solr-master-Linux/solr/build/solr-core/test/J2/temp/solr.cloud.TestSolrCloudWithSecureImpersonation_B596175E77DFB007-001/tempDir-001/node1'
   [junit4]   2> 237998 INFO  (jetty-launcher-469-thread-2) [    ] o.a.s.c.SolrResourceLoader new SolrResourceLoader for directory: '/home/jenkins/workspace/Lucene-Solr-master-Linux/solr/build/solr-core/test/J2/temp/solr.cloud.TestSolrCloudWithSecureImpersonation_B596175E77DFB007-001/tempDir-001/node2'
   [junit4]   2> 237998 INFO  (jetty-launcher-469-thread-1) [    ] o.a.s.c.SolrResourceLoader JNDI not configured for solr (NoInitialContextEx)
   [junit4]   2> 237998 INFO  (jetty-launcher-469-thread-2) [    ] o.a.s.c.SolrResourceLoader JNDI not configured for solr (NoInitialContextEx)
   [junit4]   2> 237999 INFO  (jetty-launcher-469-thread-1) [    ] o.a.s.c.SolrResourceLoader solr home defaulted to 'solr/' (could not find system property or JNDI)
   [junit4]   2> 237999 INFO  (jetty-launcher-469-thread-2) [    ] o.a.s.c.SolrResourceLoader solr home defaulted to 'solr/' (could not find system property or JNDI)
   [junit4]   2> 237999 INFO  (jetty-launcher-469-thread-1) [    ] o.a.s.c.c.SolrZkClient Using default ZkCredentialsProvider
   [junit4]   2> 237999 INFO  (jetty-launcher-469-thread-2) [    ] o.a.s.c.c.SolrZkClient Using default ZkCredentialsProvider
   [junit4]   2> 237999 INFO  (jetty-launcher-469-thread-1) [    ] o.a.s.c.c.ConnectionManager Waiting for client to connect to ZooKeeper
   [junit4]   2> 237999 INFO  (jetty-launcher-469-thread-2) [    ] o.a.s.c.c.ConnectionManager Waiting for client to connect to ZooKeeper
   [junit4]   2> 238000 INFO  (zkCallback-472-thread-1) [    ] o.a.s.c.c.ConnectionManager Watcher org.apache.solr.common.cloud.ConnectionManager@50b7cb01 name:ZooKeeperConnection Watcher:127.0.0.1:33845/solr got event WatchedEvent state:SyncConnected type:None path:null path:null type:None
   [junit4]   2> 238000 INFO  (jetty-launcher-469-thread-1) [    ] o.a.s.c.c.ConnectionManager Client is connected to ZooKeeper
   [junit4]   2> 238000 INFO  (zkCallback-471-thread-1) [    ] o.a.s.c.c.ConnectionManager Watcher org.apache.solr.common.cloud.ConnectionManager@f91f440 name:ZooKeeperConnection Watcher:127.0.0.1:33845/solr got event WatchedEvent state:SyncConnected type:None path:null path:null type:None
   [junit4]   2> 238000 INFO  (jetty-launcher-469-thread-2) [    ] o.a.s.c.c.ConnectionManager Client is connected to ZooKeeper
   [junit4]   2> 238000 INFO  (jetty-launcher-469-thread-1) [    ] o.a.s.c.c.SolrZkClient Using default ZkACLProvider
   [junit4]   2> 238000 INFO  (jetty-launcher-469-thread-2) [    ] o.a.s.c.c.SolrZkClient Using default ZkACLProvider
   [junit4]   2> 238001 INFO  (jetty-launcher-469-thread-1) [    ] o.a.s.s.SolrDispatchFilter solr.xml found in ZooKeeper. Loading...
   [junit4]   2> 238001 INFO  (jetty-launcher-469-thread-2) [    ] o.a.s.s.SolrDispatchFilter solr.xml found in ZooKeeper. Loading...
   [junit4]   2> 238004 INFO  (jetty-launcher-469-thread-1) [    ] o.a.s.c.CorePropertiesLocator Config-defined core root directory: /home/jenkins/workspace/Lucene-Solr-master-Linux/solr/build/solr-core/test/J2/temp/solr.cloud.TestSolrCloudWithSecureImpersonation_B596175E77DFB007-001/tempDir-001/node1/.
   [junit4]   2> 238004 INFO  (jetty-launcher-469-thread-1) [    ] o.a.s.c.CoreContainer New CoreContainer 59027566
   [junit4]   2> 238004 INFO  (jetty-launcher-469-thread-2) [    ] o.a.s.c.CorePropertiesLocator Config-defined core root directory: /home/jenkins/workspace/Lucene-Solr-master-Linux/solr/build/solr-core/test/J2/temp/solr.cloud.TestSolrCloudWithSecureImpersonation_B596175E77DFB007-001/tempDir-001/node2/.
   [junit4]   2> 238004 INFO  (jetty-launcher-469-thread-1) [    ] o.a.s.c.CoreContainer Loading cores into CoreContainer [instanceDir=/home/jenkins/workspace/Lucene-Solr-master-Linux/solr/build/solr-core/test/J2/temp/solr.cloud.TestSolrCloudWithSecureImpersonation_B596175E77DFB007-001/tempDir-001/node1]
   [junit4]   2> 238004 INFO  (jetty-launcher-469-thread-2) [    ] o.a.s.c.CoreContainer New CoreContainer 1022683943
   [junit4]   2> 238004 INFO  (jetty-launcher-469-thread-2) [    ] o.a.s.c.CoreContainer Loading cores into CoreContainer [instanceDir=/home/jenkins/workspace/Lucene-Solr-master-Linux/solr/build/solr-core/test/J2/temp/solr.cloud.TestSolrCloudWithSecureImpersonation_B596175E77DFB007-001/tempDir-001/node2]
   [junit4]   2> 238005 WARN  (jetty-launcher-469-thread-1) [    ] o.a.s.c.CoreContainer Couldn't add files from /home/jenkins/workspace/Lucene-Solr-master-Linux/solr/build/solr-core/test/J2/temp/solr.cloud.TestSolrCloudWithSecureImpersonation_B596175E77DFB007-001/tempDir-001/node1/lib to classpath: /home/jenkins/workspace/Lucene-Solr-master-Linux/solr/build/solr-core/test/J2/temp/solr.cloud.TestSolrCloudWithSecureImpersonation_B596175E77DFB007-001/tempDir-001/node1/lib
   [junit4]   2> 238005 WARN  (jetty-launcher-469-thread-2) [    ] o.a.s.c.CoreContainer Couldn't add files from /home/jenkins/workspace/Lucene-Solr-master-Linux/solr/build/solr-core/test/J2/temp/solr.cloud.TestSolrCloudWithSecureImpersonation_B596175E77DFB007-001/tempDir-001/node2/lib to classpath: /home/jenkins/workspace/Lucene-Solr-master-Linux/solr/build/solr-core/test/J2/temp/solr.cloud.TestSolrCloudWithSecureImpersonation_B596175E77DFB007-001/tempDir-001/node2/lib
   [junit4]   2> 238005 INFO  (jetty-launcher-469-thread-1) [    ] o.a.s.h.c.HttpShardHandlerFactory created with socketTimeout : 90000,urlScheme : https,connTimeout : 15000,maxConnectionsPerHost : 20,maxConnections : 10000,corePoolSize : 0,maximumPoolSize : 2147483647,maxThreadIdleTime : 5,sizeOfQueue : -1,fairnessPolicy : false,
   [junit4]   2> 238005 INFO  (jetty-launcher-469-thread-2) [    ] o.a.s.h.c.HttpShardHandlerFactory created with socketTimeout : 90000,urlScheme : https,connTimeout : 15000,maxConnectionsPerHost : 20,maxConnections : 10000,corePoolSize : 0,maximumPoolSize : 2147483647,maxThreadIdleTime : 5,sizeOfQueue : -1,fairnessPolicy : false,
   [junit4]   2> 238006 INFO  (jetty-launcher-469-thread-1) [    ] o.a.s.u.UpdateShardHandler Created UpdateShardHandler HTTP client with params: socketTimeout=340000&connTimeout=45000&maxConnections=100000&maxConnectionsPerHost=100000
   [junit4]   2> 238006 INFO  (jetty-launcher-469-thread-1) [    ] o.a.s.l.LogWatcher SLF4J impl is org.slf4j.impl.Log4jLoggerFactory
   [junit4]   2> 238006 INFO  (jetty-launcher-469-thread-1) [    ] o.a.s.l.LogWatcher Registering Log Listener [Log4j (org.slf4j.impl.Log4jLoggerFactory)]
   [junit4]   2> 238006 INFO  (jetty-launcher-469-thread-2) [    ] o.a.s.u.UpdateShardHandler Created UpdateShardHandler HTTP client with params: socketTimeout=340000&connTimeout=45000&maxConnections=100000&maxConnectionsPerHost=100000
   [junit4]   2> 238006 INFO  (jetty-launcher-469-thread-2) [    ] o.a.s.l.LogWatcher SLF4J impl is org.slf4j.impl.Log4jLoggerFactory
   [junit4]   2> 238006 INFO  (jetty-launcher-469-thread-1) [    ] o.a.s.c.ZkContainer Zookeeper client=127.0.0.1:33845/solr
   [junit4]   2> 238006 INFO  (jetty-launcher-469-thread-2) [    ] o.a.s.l.LogWatcher Registering Log Listener [Log4j (org.slf4j.impl.Log4jLoggerFactory)]
   [junit4]   2> 238008 INFO  (jetty-launcher-469-thread-1) [    ] o.a.s.c.ZkController zkHost includes chroot
   [junit4]   2> 238008 INFO  (jetty-launcher-469-thread-1) [    ] o.a.s.c.c.SolrZkClient Using default ZkCredentialsProvider
   [junit4]   2> 238008 INFO  (jetty-launcher-469-thread-2) [    ] o.a.s.c.ZkContainer Zookeeper client=127.0.0.1:33845/solr
   [junit4]   2> 238008 INFO  (jetty-launcher-469-thread-2) [    ] o.a.s.c.ZkController zkHost includes chroot
   [junit4]   2> 238008 INFO  (jetty-launcher-469-thread-2) [    ] o.a.s.c.c.SolrZkClient Using default ZkCredentialsProvider
   [junit4]   2> 238008 INFO  (jetty-launcher-469-thread-1) [    ] o.a.s.c.c.ConnectionManager Waiting for client to connect to ZooKeeper
   [junit4]   2> 238008 INFO  (jetty-launcher-469-thread-2) [    ] o.a.s.c.c.ConnectionManager Waiting for client to connect to ZooKeeper
   [junit4]   2> 238009 INFO  (zkCallback-477-thread-1) [    ] o.a.s.c.c.ConnectionManager Watcher org.apache.solr.common.cloud.ConnectionManager@2ed9e0c7 name:ZooKeeperConnection Watcher:127.0.0.1:33845 got event WatchedEvent state:SyncConnected type:None path:null path:null type:None
   [junit4]   2> 238009 INFO  (jetty-launcher-469-thread-1) [    ] o.a.s.c.c.ConnectionManager Client is connected to ZooKeeper
   [junit4]   2> 238009 INFO  (zkCallback-478-thread-1) [    ] o.a.s.c.c.ConnectionManager Watcher org.apache.solr.common.cloud.ConnectionManager@58a7dd59 name:ZooKeeperConnection Watcher:127.0.0.1:33845 got event WatchedEvent state:SyncConnected type:None path:null path:null type:None
   [junit4]   2> 238009 INFO  (jetty-launcher-469-thread-1) [    ] o.a.s.c.c.SolrZkClient Using default ZkACLProvider
   [junit4]   2> 238009 INFO  (jetty-launcher-469-thread-2) [    ] o.a.s.c.c.ConnectionManager Client is connected to ZooKeeper
   [junit4]   2> 238009 INFO  (jetty-launcher-469-thread-2) [    ] o.a.s.c.c.SolrZkClient Using default ZkACLProvider
   [junit4]   2> 238010 INFO  (jetty-launcher-469-thread-1) [    ] o.a.s.c.ZkController Added new OnReconnect listener org.apache.solr.cloud.ZkController$$Lambda$138/780626917@1a93a978
   [junit4]   2> 238010 WARN  (NIOServerCxn.Factory:0.0.0.0/0.0.0.0:0) [    ] o.a.z.s.NIOServerCnxn caught end of stream exception
   [junit4]   2> EndOfStreamException: Unable to read additional data from client sessionid 0x156597a34c20004, likely client has closed socket
   [junit4]   2> 	at org.apache.zookeeper.server.NIOServerCnxn.doIO(NIOServerCnxn.java:228)
   [junit4]   2> 	at org.apache.zookeeper.server.NIOServerCnxnFactory.run(NIOServerCnxnFactory.java:208)
   [junit4]   2> 	at java.lang.Thread.run(java.base@9-ea/Thread.java:843)
   [junit4]   2> 238010 INFO  (jetty-launcher-469-thread-2) [    ] o.a.s.c.ZkController Added new OnReconnect listener org.apache.solr.cloud.ZkController$$Lambda$138/780626917@78dfc2ff
   [junit4]   2> 238010 INFO  (jetty-launcher-469-thread-1) [    ] o.a.s.c.c.ConnectionManager Waiting for client to connect to ZooKeeper
   [junit4]   2> 238010 INFO  (jetty-launcher-469-thread-2) [    ] o.a.s.c.c.ConnectionManager Waiting for client to connect to ZooKeeper
   [junit4]   2> 238010 INFO  (zkCallback-479-thread-1) [    ] o.a.s.c.c.ConnectionManager Watcher org.apache.solr.common.cloud.ConnectionManager@5660b559 name:ZooKeeperConnection Watcher:127.0.0.1:33845/solr got event WatchedEvent state:SyncConnected type:None path:null path:null type:None
   [junit4]   2> 238010 INFO  (jetty-launcher-469-thread-1) [    ] o.a.s.c.c.ConnectionManager Client is connected to ZooKeeper
   [junit4]   2> 238011 INFO  (zkCallback-480-thread-1) [    ] o.a.s.c.c.ConnectionManager Watcher org.apache.solr.common.cloud.ConnectionManager@113e5c52 name:ZooKeeperConnection Watcher:127.0.0.1:33845/solr got event WatchedEvent state:SyncConnected type:None path:null path:null type:None
   [junit4]   2> 238011 INFO  (jetty-launcher-469-thread-2) [    ] o.a.s.c.c.ConnectionManager Client is connected to ZooKeeper
   [junit4]   2> 238011 INFO  (jetty-launcher-469-thread-1) [    ] o.a.s.c.c.SolrZkClient makePath: /overseer/queue
   [junit4]   2> 238011 INFO  (jetty-launcher-469-thread-2) [    ] o.a.s.c.c.SolrZkClient makePath: /overseer/queue
   [junit4]   2> 238012 INFO  (jetty-launcher-469-thread-1) [    ] o.a.s.c.c.SolrZkClient makePath: /overseer/collection-queue-work
   [junit4]   2> 238012 INFO  (jetty-launcher-469-thread-2) [    ] o.a.s.c.c.SolrZkClient makePath: /overseer/collection-queue-work
   [junit4]   2> 238012 INFO  (jetty-launcher-469-thread-1) [    ] o.a.s.c.c.SolrZkClient makePath: /overseer/collection-map-running
   [junit4]   2> 238013 INFO  (jetty-launcher-469-thread-2) [    ] o.a.s.c.c.SolrZkClient makePath: /overseer/collection-map-running
   [junit4]   2> 238013 INFO  (jetty-launcher-469-thread-1) [    ] o.a.s.c.c.SolrZkClient makePath: /overseer/collection-map-completed
   [junit4]   2> 238013 INFO  (jetty-launcher-469-thread-2) [    ] o.a.s.c.c.SolrZkClient makePath: /overseer/collection-map-completed
   [junit4]   2> 238014 INFO  (jetty-launcher-469-thread-2) [    ] o.a.s.c.c.SolrZkClient makePath: /overseer/collection-map-failure
   [junit4]   2> 238014 INFO  (jetty-launcher-469-thread-1) [    ] o.a.s.c.c.SolrZkClient makePath: /overseer/collection-map-failure
   [junit4]   2> 238014 INFO  (jetty-launcher-469-thread-2) [    ] o.a.s.c.c.SolrZkClient makePath: /live_nodes
   [junit4]   2> 238014 INFO  (jetty-launcher-469-thread-1) [    ] o.a.s.c.c.SolrZkClient makePath: /live_nodes
   [junit4]   2> 238015 INFO  (jetty-launcher-469-thread-1) [    ] o.a.s.c.c.SolrZkClient makePath: /collections
   [junit4]   2> 238015 INFO  (jetty-launcher-469-thread-2) [    ] o.a.s.c.c.SolrZkClient makePath: /collections
   [junit4]   2> 238015 INFO  (jetty-launcher-469-thread-2) [    ] o.a.s.c.c.SolrZkClient makePath: /aliases.json
   [junit4]   2> 238015 INFO  (jetty-launcher-469-thread-1) [    ] o.a.s.c.c.SolrZkClient makePath: /aliases.json
   [junit4]   2> 238016 INFO  (jetty-launcher-469-thread-2) [    ] o.a.s.c.c.SolrZkClient makePath: /clusterstate.json
   [junit4]   2> 238016 INFO  (jetty-launcher-469-thread-1) [    ] o.a.s.c.c.SolrZkClient makePath: /clusterstate.json
   [junit4]   2> 238016 INFO  (jetty-launcher-469-thread-1) [    ] o.a.s.c.c.SolrZkClient makePath: /security.json
   [junit4]   2> 238016 INFO  (jetty-launcher-469-thread-2) [    ] o.a.s.c.c.SolrZkClient makePath: /security.json
   [junit4]   2> 238017 INFO  (jetty-launcher-469-thread-2) [    ] o.a.s.c.c.ZkStateReader Updating cluster state from ZooKeeper... 
   [junit4]   2> 238017 INFO  (jetty-launcher-469-thread-1) [    ] o.a.s.c.c.ZkStateReader Updating cluster state from ZooKeeper... 
   [junit4]   2> 238017 INFO  (jetty-launcher-469-thread-2) [    ] o.a.s.c.c.ZkStateReader Loaded cluster properties: {urlScheme=https}
   [junit4]   2> 238017 INFO  (jetty-launcher-469-thread-1) [    ] o.a.s.c.c.ZkStateReader Loaded cluster properties: {urlScheme=https}
   [junit4]   2> 238017 INFO  (jetty-launcher-469-thread-2) [    ] o.a.s.c.c.ZkStateReader Updated live nodes from ZooKeeper... (0) -> (0)
   [junit4]   2> 238017 INFO  (jetty-launcher-469-thread-1) [    ] o.a.s.c.c.ZkStateReader Updated live nodes from ZooKeeper... (0) -> (0)
   [junit4]   2> 238018 INFO  (jetty-launcher-469-thread-1) [    ] o.a.s.c.c.SolrZkClient makePath: /overseer_elect
   [junit4]   2> 238018 INFO  (jetty-launcher-469-thread-2) [    ] o.a.s.c.c.SolrZkClient makePath: /overseer_elect
   [junit4]   2> 238019 INFO  (jetty-launcher-469-thread-2) [    ] o.a.s.c.c.SolrZkClient makePath: /overseer_elect/election
   [junit4]   2> 238019 INFO  (jetty-launcher-469-thread-1) [    ] o.a.s.c.c.SolrZkClient makePath: /overseer_elect/election
   [junit4]   2> 238020 INFO  (jetty-launcher-469-thread-2) [    ] o.a.s.c.Overseer Overseer (id=null) closing
   [junit4]   2> 238020 INFO  (jetty-launcher-469-thread-1) [    ] o.a.s.c.Overseer Overseer (id=null) closing
   [junit4]   2> 238020 INFO  (jetty-launcher-469-thread-2) [    ] o.a.s.c.LeaderElector Joined leadership election with path: /overseer_elect/election/96362823441055750-127.0.0.1:33372_solr-n_0000000000
   [junit4]   2> 238020 INFO  (jetty-launcher-469-thread-1) [    ] o.a.s.c.LeaderElector Joined leadership election with path: /overseer_elect/election/96362823441055749-127.0.0.1:37485_solr-n_0000000001
   [junit4]   2> 238020 INFO  (jetty-launcher-469-thread-2) [    ] o.a.s.c.OverseerElectionContext I am going to be the leader 127.0.0.1:33372_solr
   [junit4]   2> 238021 INFO  (jetty-launcher-469-thread-2) [    ] o.a.s.c.c.SolrZkClient makePath: /overseer_elect/leader
   [junit4]   2> 238021 INFO  (jetty-launcher-469-thread-1) [    ] o.a.s.c.LeaderElector Watching path /overseer_elect/election/96362823441055750-127.0.0.1:33372_solr-n_0000000000 to know if I could be the leader
   [junit4]   2> 238021 INFO  (jetty-launcher-469-thread-1) [    ] o.a.s.c.ZkController Register node as live in ZooKeeper:/live_nodes/127.0.0.1:37485_solr
   [junit4]   2> 238021 INFO  (jetty-launcher-469-thread-1) [    ] o.a.s.c.c.SolrZkClient makePath: /live_nodes/127.0.0.1:37485_solr
   [junit4]   2> 238021 INFO  (jetty-launcher-469-thread-2) [    ] o.a.s.c.Overseer Overseer (id=96362823441055750-127.0.0.1:33372_solr-n_0000000000) starting
   [junit4]   2> 238021 INFO  (zkCallback-479-thread-1) [    ] o.a.s.c.c.ZkStateReader A live node change: [WatchedEvent state:SyncConnected type:NodeChildrenChanged path:/live_nodes], has occurred - updating... (live nodes size: [0])
   [junit4]   2> 238021 INFO  (zkCallback-479-thread-1) [    ] o.a.s.c.c.ZkStateReader Updated live nodes from ZooKeeper... (0) -> (1)
   [junit4]   2> 238022 INFO  (jetty-launcher-469-thread-2) [    ] o.a.s.c.c.SolrZkClient makePath: /overseer/queue-work
   [junit4]   2> 238024 INFO  (jetty-launcher-469-thread-2) [    ] o.a.s.c.OverseerAutoReplicaFailoverThread Starting OverseerAutoReplicaFailoverThread autoReplicaFailoverWorkLoopDelay=10000 autoReplicaFailoverWaitAfterExpiration=30000 autoReplicaFailoverBadNodeExpiration=60000
   [junit4]   2> 238024 INFO  (OverseerCollectionConfigSetProcessor-96362823441055750-127.0.0.1:33372_solr-n_0000000000) [    ] o.a.s.c.OverseerTaskProcessor Process current queue of overseer operations
   [junit4]   2> 238024 INFO  (OverseerStateUpdate-96362823441055750-127.0.0.1:33372_solr-n_0000000000) [    ] o.a.s.c.Overseer Starting to work on the main queue
   [junit4]   2> 238025 INFO  (jetty-launcher-469-thread-2) [    ] o.a.s.c.ZkController Publish node=127.0.0.1:33372_solr as DOWN
   [junit4]   2> 238025 INFO  (OverseerStateUpdate-96362823441055750-127.0.0.1:33372_solr-n_0000000000) [    ] o.a.s.c.c.ZkStateReader Updated live nodes from ZooKeeper... (0) -> (1)
   [junit4]   2> 238026 INFO  (jetty-launcher-469-thread-2) [    ] o.a.s.c.ZkController Register node as live in ZooKeeper:/live_nodes/127.0.0.1:33372_solr
   [junit4]   2> 238026 INFO  (jetty-launcher-469-thread-2) [    ] o.a.s.c.c.SolrZkClient makePath: /live_nodes/127.0.0.1:33372_solr
   [junit4]   2> 238026 INFO  (OverseerStateUpdate-96362823441055750-127.0.0.1:33372_solr-n_0000000000) [    ] o.a.s.c.Overseer processMessage: queueSize: 1, message = {
   [junit4]   2>   "operation":"downnode",
   [junit4]   2>   "node_name":"127.0.0.1:33372_solr"} current state version: 0
   [junit4]   2> 238026 INFO  (OverseerStateUpdate-96362823441055750-127.0.0.1:33372_solr-n_0000000000) [    ] o.a.s.c.o.NodeMutator DownNode state invoked for node: 127.0.0.1:33372_solr
   [junit4]   2> 238026 INFO  (zkCallback-479-thread-1) [    ] o.a.s.c.c.ZkStateReader A live node change: [WatchedEvent state:SyncConnected type:NodeChildrenChanged path:/live_nodes], has occurred - updating... (live nodes size: [1])
   [junit4]   2> 238027 INFO  (zkCallback-479-thread-1) [    ] o.a.s.c.c.ZkStateReader Updated live nodes from ZooKeeper... (1) -> (2)
   [junit4]   2> 238029 INFO  (zkCallback-480-thread-1) [    ] o.a.s.c.c.ZkStateReader A live node change: [WatchedEvent state:SyncConnected type:NodeChildrenChanged path:/live_nodes], has occurred - updating... (live nodes size: [1])
   [junit4]   2> 238029 INFO  (zkCallback-480-thread-1) [    ] o.a.s.c.c.ZkStateReader Updated live nodes from ZooKeeper... (1) -> (2)
   [junit4]   2> 238029 INFO  (jetty-launcher-469-thread-1) [    ] o.a.s.c.CoreContainer Security conf doesn't exist. Skipping setup for authorization module.
   [junit4]   2> 238029 INFO  (jetty-launcher-469-thread-1) [    ] o.a.s.c.CoreContainer Authentication plugin class obtained from system property 'authenticationPlugin': org.apache.solr.security.HttpParamDelegationTokenPlugin
   [junit4]   2> 238034 INFO  (jetty-launcher-469-thread-2) [    ] o.a.s.c.CoreContainer Security conf doesn't exist. Skipping setup for authorization module.
   [junit4]   2> 238034 INFO  (jetty-launcher-469-thread-2) [    ] o.a.s.c.CoreContainer Authentication plugin class obtained from system property 'authenticationPlugin': org.apache.solr.security.HttpParamDelegationTokenPlugin
   [junit4]   2> 238054 INFO  (jetty-launcher-469-thread-1) [    ] o.a.s.s.KerberosPlugin Params: {solr.kerberos.impersonator.user.noGroups.hosts=*, solr.kerberos.impersonator.user.bogusGroup.groups=__some_bogus_group, token.valid=30, cookie.domain=127.0.0.1, solr.kerberos.impersonator.user.anyHostAnyUser.groups=*, solr.kerberos.impersonator.user.bogusGroup.hosts=*, solr.kerberos.impersonator.user.anyHostAnyUser.hosts=*, token.validity=36000, solr.kerberos.impersonator.user.noHosts.groups=*, type=kerberos, solr.kerberos.impersonator.user.localHostAnyGroup.groups=*, delegation-token.token-kind=solr-dt, solr.kerberos.impersonator.user.wrongHost.hosts=1.1.1.1.1.1, cookie.path=/, zk-dt-secret-manager.znodeWorkingPath=solr/security/zkdtsm, solr.kerberos.impersonator.user.localHostAnyGroup.hosts=127.0.0.1, signer.secret.provider.zookeeper.path=/token, solr.kerberos.impersonator.user.anyHostUsersGroup.groups=jenkins, zk-dt-secret-manager.enable=true, solr.kerberos.impersonator.user.wrongHost.groups=*, kerberos.name.rules=DEFAULT, signer.secret.provider=zookeeper, solr.kerberos.impersonator.user.anyHostUsersGroup.hosts=*}
   [junit4]   2> 238054 INFO  (jetty-launcher-469-thread-2) [    ] o.a.s.s.KerberosPlugin Params: {solr.kerberos.impersonator.user.noGroups.hosts=*, solr.kerberos.impersonator.user.bogusGroup.groups=__some_bogus_group, token.valid=30, cookie.domain=127.0.0.1, solr.kerberos.impersonator.user.anyHostAnyUser.groups=*, solr.kerberos.impersonator.user.bogusGroup.hosts=*, solr.kerberos.impersonator.user.anyHostAnyUser.hosts=*, token.validity=36000, solr.kerberos.impersonator.user.noHosts.groups=*, type=kerberos, solr.kerberos.impersonator.user.localHostAnyGroup.groups=*, delegation-token.token-kind=solr-dt, solr.kerberos.impersonator.user.wrongHost.hosts=1.1.1.1.1.1, cookie.path=/, zk-dt-secret-manager.znodeWorkingPath=solr/security/zkdtsm, solr.kerberos.impersonator.user.localHostAnyGroup.hosts=127.0.0.1, signer.secret.provider.zookeeper.path=/token, solr.kerberos.impersonator.user.anyHostUsersGroup.groups=jenkins, zk-dt-secret-manager.enable=true, solr.kerberos.impersonator.user.wrongHost.groups=*, kerberos.name.rules=DEFAULT, signer.secret.provider=zookeeper, solr.kerberos.impersonator.user.anyHostUsersGroup.hosts=*}
   [junit4]   2> 238130 INFO  (jetty-launcher-469-thread-1) [    ] o.a.c.f.i.CuratorFrameworkImpl Starting
   [junit4]   2> 238130 INFO  (jetty-launcher-469-thread-2) [    ] o.a.c.f.i.CuratorFrameworkImpl Starting
   [junit4]   2> 238145 INFO  (jetty-launcher-469-thread-1-EventThread) [    ] o.a.c.f.s.ConnectionStateManager State change: CONNECTED
   [junit4]   2> 238145 INFO  (jetty-launcher-469-thread-2-EventThread) [    ] o.a.c.f.s.ConnectionStateManager State change: CONNECTED
   [junit4]   2> 238253 INFO  (jetty-launcher-469-thread-2) [    ] o.a.s.c.CoreContainer Reconfiguring HttpClient settings.
   [junit4]   2> 238253 INFO  (jetty-launcher-469-thread-1) [    ] o.a.s.c.CoreContainer Reconfiguring HttpClient settings.
   [junit4]   2> 238254 INFO  (jetty-launcher-469-thread-1) [    ] o.a.s.c.CorePropertiesLocator Looking for core definitions underneath /home/jenkins/workspace/Lucene-Solr-master-Linux/solr/build/solr-core/test/J2/temp/solr.cloud.TestSolrCloudWithSecureImpersonation_B596175E77DFB007-001/tempDir-001/node1/.
   [junit4]   2> 238254 INFO  (jetty-launcher-469-thread-2) [    ] o.a.s.c.CorePropertiesLocator Looking for core definitions underneath /home/jenkins/workspace/Lucene-Solr-master-Linux/solr/build/solr-core/test/J2/temp/solr.cloud.TestSolrCloudWithSecureImpersonation_B596175E77DFB007-001/tempDir-001/node2/.
   [junit4]   2> 238254 INFO  (jetty-launcher-469-thread-2) [    ] o.a.s.c.CorePropertiesLocator Found 0 core definitions
   [junit4]   2> 238254 INFO  (jetty-launcher-469-thread-1) [    ] o.a.s.c.CorePropertiesLocator Found 0 core definitions
   [junit4]   2> 238254 INFO  (jetty-launcher-469-thread-1) [    ] o.a.s.s.SolrDispatchFilter user.dir=/home/jenkins/workspace/Lucene-Solr-master-Linux/solr/build/solr-core/test/J2
   [junit4]   2> 238255 INFO  (jetty-launcher-469-thread-1) [    ] o.a.s.s.SolrDispatchFilter SolrDispatchFilter.init() done
   [junit4]   2> 238255 INFO  (jetty-launcher-469-thread-2) [    ] o.a.s.s.SolrDispatchFilter user.dir=/home/jenkins/workspace/Lucene-Solr-master-Linux/solr/build/solr-core/test/J2
   [junit4]   2> 238255 INFO  (jetty-launcher-469-thread-2) [    ] o.a.s.s.SolrDispatchFilter SolrDispatchFilter.init() done
   [junit4]   2> 238255 INFO  (SUITE-TestSolrCloudWithSecureImpersonation-seed#[B596175E77DFB007]-worker) [    ] o.a.s.c.c.SolrZkClient Using default ZkCredentialsProvider
   [junit4]   2> 238255 INFO  (SUITE-TestSolrCloudWithSecureImpersonation-seed#[B596175E77DFB007]-worker) [    ] o.a.s.c.c.ConnectionManager Waiting for client to connect to ZooKeeper
   [junit4]   2> 238256 INFO  (zkCallback-483-thread-1) [    ] o.a.s.c.c.ConnectionManager Watcher org.apache.solr.common.cloud.ConnectionManager@b6df5f2 name:ZooKeeperConnection Watcher:127.0.0.1:33845 got event WatchedEvent state:SyncConnected type:None path:null path:null type:None
   [junit4]   2> 238256 INFO  (SUITE-TestSolrCloudWithSecureImpersonation-seed#[B596175E77DFB007]-worker) [    ] o.a.s.c.c.ConnectionManager Client is connected to ZooKeeper
   [junit4]   2> 238256 INFO  (SUITE-TestSolrCloudWithSecureImpersonation-seed#[B596175E77DFB007]-worker) [    ] o.a.s.c.c.SolrZkClient Using default ZkACLProvider
   [junit4]   2> 238272 INFO  (TEST-TestSolrCloudWithSecureImpersonation.testProxyInvalidRemote-seed#[B596175E77DFB007]) [    ] o.a.s.SolrTestCaseJ4 ###Starting testProxyInvalidRemote
   [junit4]   2> 238600 WARN  (TEST-TestSolrCloudWithSecureImpersonation.testProxyInvalidRemote-seed#[B596175E77DFB007]) [    ] o.a.h.c.p.ResponseProcessCookies Invalid cookie header: "Set-Cookie: hadoop.auth="u=localHostAnyGroup&p=localHostAnyGroup&t=test&e=1470415996765&s=fIiOLh5ZQRz1bMWZGLgPMls4RqI="; Path=/; Domain=127.0.0.1; Expires=Jim, 05-Sid-2016 16:53:16 GMT; Secure; HttpOnly". Invalid 'expires' attribute: Jim, 05-Sid-2016 16:53:16 GMT
   [junit4]   2> 238601 INFO  (TEST-TestSolrCloudWithSecureImpersonation.testProxyInvalidRemote-seed#[B596175E77DFB007]) [    ] o.a.s.SolrTestCaseJ4 ###Ending testProxyInvalidRemote
   [junit4]   2> 238610 INFO  (TEST-TestSolrCloudWithSecureImpersonation.testProxyNullProxyUser-seed#[B596175E77DFB007]) [    ] o.a.s.SolrTestCaseJ4 ###Starting testProxyNullProxyUser
   [junit4]   2> java.lang.IllegalArgumentException: userName is NULL, empty or contains a '&'
   [junit4]   2> 	at org.apache.hadoop.security.authentication.util.AuthToken.checkForIllegalArgument(AuthToken.java:87)
   [junit4]   2> 	at org.apache.hadoop.security.authentication.util.AuthToken.<init>(AuthToken.java:70)
   [junit4]   2> 	at org.apache.hadoop.security.authentication.server.AuthenticationToken.<init>(AuthenticationToken.java:58)
   [junit4]   2> 	at org.apache.solr.security.HttpParamDelegationTokenPlugin$HttpParamDelegationTokenAuthenticationHandler$HttpParamAuthenticationHandler.authenticate(HttpParamDelegationTokenPlugin.java:213)
   [junit4]   2> 	at org.apache.hadoop.security.token.delegation.web.DelegationTokenAuthenticationHandler.authenticate(DelegationTokenAuthenticationHandler.java:348)
   [junit4]   2> 	at org.apache.solr.security.KerberosPlugin$RequestContinuesRecorderAuthenticationHandler.authenticate(KerberosPlugin.java:573)
   [junit4]   2> 	at org.apache.hadoop.security.authentication.server.AuthenticationFilter.doFilter(AuthenticationFilter.java:519)
   [junit4]   2> 	at org.apache.solr.security.DelegationTokenKerberosFilter.doFilter(DelegationTokenKerberosFilter.java:123)
   [junit4]   2> 	at org.apache.solr.security.HttpParamDelegationTokenPlugin$HttpParamToRequestFilter.doFilter(HttpParamDelegationTokenPlugin.java:245)
   [junit4]   2> 	at org.apache.solr.security.KerberosPlugin.doAuthenticate(KerberosPlugin.java:264)
   [junit4]   2> 	at org.apache.solr.servlet.SolrDispatchFilter.authenticateRequest(SolrDispatchFilter.java:312)
   [junit4]   2> 	at org.apache.solr.servlet.SolrDispatchFilter.doFilter(SolrDispatchFilter.java:222)
   [junit4]   2> 	at org.apache.solr.servlet.SolrDispatchFilter.doFilter(SolrDispatchFilter.java:208)
   [junit4]   2> 	at org.eclipse.jetty.servlet.ServletHandler$CachedChain.doFilter(ServletHandler.java:1676)
   [junit4]   2> 	at org.apache.solr.client.solrj.embedded.JettySolrRunner$DebugFilter.doFilter(JettySolrRunner.java:111)
   [junit4]   2> 	at org.eclipse.jetty.servlet.ServletHandler$CachedChain.doFilter(ServletHandler.java:1676)
   [junit4]   2> 	at org.eclipse.jetty.servlet.ServletHandler.doHandle(ServletHandler.java:581)
   [junit4]   2> 	at org.eclipse.jetty.server.session.SessionHandler.doHandle(SessionHandler.java:224)
   [junit4]   2> 	at org.eclipse.jetty.server.handler.ContextHandler.doHandle(ContextHandler.java:1160)
   [junit4]   2> 	at org.eclipse.jetty.servlet.ServletHandler.doScope(ServletHandler.java:511)
   [junit4]   2> 	at org.eclipse.jetty.server.session.SessionHandler.doScope(SessionHandler.java:185)
   [junit4]   2> 	at org.eclipse.jetty.server.handler.ContextHandler.doScope(ContextHandler.java:1092)
   [junit4]   2> 	at org.eclipse.jetty.server.handler.ScopedHandler.handle(ScopedHandler.java:141)
   [junit4]   2> 	at org.eclipse.jetty.server.handler.gzip.GzipHandler.handle(GzipHandler.java:462)
   [junit4]   2> 	at org.eclipse.jetty.server.handler.HandlerWrapper.handle(HandlerWrapper.java:134)
   [junit4]   2> 	at org.eclipse.jetty.server.Server.handle(Server.java:518)
   [junit4]   2> 	at org.eclipse.jetty.server.HttpChannel.handle(HttpChannel.java:308)
   [junit4]   2> 	at org.eclipse.jetty.server.HttpConnection.onFillable(HttpConnection.java:244)
   [junit4]   2> 	at org.eclipse.jetty.io.AbstractConnection$ReadCallback.succeeded(AbstractConnection.java:273)
   [junit4]   2> 	at org.eclipse.jetty.io.FillInterest.fillable(FillInterest.java:95)
   [junit4]   2> 	at org.eclipse.jetty.io.ssl.SslConnection.onFillable(SslConnection.java:186)
   [junit4]   2> 	at org.eclipse.jetty.io.AbstractConnection$ReadCallback.succeeded(AbstractConnection.java:273)
   [junit4]   2> 	at org.eclipse.jetty.io.FillInterest.fillable(FillInterest.java:95)
   [junit4]   2> 	at org.eclipse.jetty.io.SelectChannelEndPoint$2.run(SelectChannelEndPoint.java:93)
   [junit4]   2> 	at org.eclipse.jetty.util.thread.strategy.ExecuteProduceConsume.produceAndRun(ExecuteProduceConsume.java:246)
   [junit4]   2> 	at org.eclipse.jetty.util.thread.strategy.ExecuteProduceConsume.run(ExecuteProduceConsume.java:156)
   [junit4]   2> 	at org.eclipse.jetty.util.thread.QueuedThreadPool.runJob(QueuedThreadPool.java:654)
   [junit4]   2> 	at org.eclipse.jetty.util.thread.QueuedThreadPool$3.run(QueuedThreadPool.java:572)
   [junit4]   2> 	at java.lang.Thread.run(java.base@9-ea/Thread.java:843)
   [junit4]   2> 238618 WARN  (qtp246761432-2029) [    ] o.e.j.s.ServletHandler /solr/admin/collections
   [junit4]   2> org.apache.solr.common.SolrException: Error during request authentication, 
   [junit4]   2> 	at org.apache.solr.servlet.SolrDispatchFilter.authenticateRequest(SolrDispatchFilter.java:320)
   [junit4]   2> 	at org.apache.solr.servlet.SolrDispatchFilter.doFilter(SolrDispatchFilter.java:222)
   [junit4]   2> 	at org.apache.solr.servlet.SolrDispatchFilter.doFilter(SolrDispatchFilter.java:208)
   [junit4]   2> 	at org.eclipse.jetty.servlet.ServletHandler$CachedChain.doFilter(ServletHandler.java:1676)
   [junit4]   2> 	at org.apache.solr.client.solrj.embedded.JettySolrRunner$DebugFilter.doFilter(JettySolrRunner.java:111)
   [junit4]   2> 	at org.eclipse.jetty.servlet.ServletHandler$CachedChain.doFilter(ServletHandler.java:1676)
   [junit4]   2> 	at org.eclipse.jetty.servlet.ServletHandler.doHandle(ServletHandler.java:581)
   [junit4]   2> 	at org.eclipse.jetty.server.session.SessionHandler.doHandle(SessionHandler.java:224)
   [junit4]   2> 	at org.eclipse.jetty.server.handler.ContextHandler.doHandle(ContextHandler.java:1160)
   [junit4]   2> 	at org.eclipse.jetty.servlet.ServletHandler.doScope(ServletHandler.java:511)
   [junit4]   2> 	at org.eclipse.jetty.server.session.SessionHandler.doScope(SessionHandler.java:185)
   [junit4]   2> 	at org.eclipse.jetty.server.handler.ContextHandler.doScope(ContextHandler.java:1092)
   [junit4]   2> 	at org.eclipse.jetty.server.handler.ScopedHandler.handle(ScopedHandler.java:141)
   [junit4]   2> 	at org.eclipse.jetty.server.handler.gzip.GzipHandler.handle(GzipHandler.java:462)
   [junit4]   2> 	at org.eclipse.jetty.server.handler.HandlerWrapper.handle(HandlerWrapper.java:134)
   [junit4]   2> 	at org.eclipse.jetty.server.Server.handle(Server.java:518)
   [junit4]   2> 	at org.eclipse.jetty.server.HttpChannel.handle(HttpChannel.java:308)
   [junit4]   2> 	at org.eclipse.jetty.server.HttpConnection.onFillable(HttpConnection.java:244)
   [junit4]   2> 	at org.eclipse.jetty.io.AbstractConnection$ReadCallback.succeeded(AbstractConnection.java:273)
   [junit4]   2> 	at org.eclipse.jetty.io.FillInterest.fillable(FillInterest.java:95)
   [junit4]   2> 	at org.eclipse.jetty.io.ssl.SslConnection.onFillable(SslConnection.java:186)
   [junit4]   2> 	at org.eclipse.jetty.io.AbstractConnection$ReadCallback.succeeded(AbstractConnection.java:273)
   [junit4]   2> 	at org.eclipse.jetty.io.FillInterest.fillable(FillInterest.java:95)
   [junit4]   2> 	at org.eclipse.jetty.io.SelectChannelEndPoint$2.run(SelectChannelEndPoint.java:93)
   [junit4]   2> 	at org.eclipse.jetty.util.thread.strategy.ExecuteProduceConsume.produceAndRun(ExecuteProduceConsume.java:246)
   [junit4]   2> 	at org.eclipse.jetty.util.thread.strategy.ExecuteProduceConsume.run(ExecuteProduceConsume.java:156)
   [junit4]   2> 	at org.eclipse.jetty.util.thread.QueuedThreadPool.runJob(QueuedThreadPool.java:654)
   [junit4]   2> 	at org.eclipse.jetty.util.thread.QueuedThreadPool$3.run(QueuedThreadPool.java:572)
   [junit4]   2> 	at java.lang.Thread.run(java.base@9-ea/Thread.java:843)
   [junit4]   2> Caused by: java.lang.IllegalArgumentException: userName is NULL, empty or contains a '&'
   [junit4]   2> 	at org.apache.hadoop.security.authentication.util.AuthToken.checkForIllegalArgument(AuthToken.java:87)
   [junit4]   2> 	at org.apache.hadoop.security.authentication.util.AuthToken.<init>(AuthToken.java:70)
   [junit4]   2> 	at org.apache.hadoop.security.authentication.server.AuthenticationToken.<init>(AuthenticationToken.java:58)
   [junit4]   2> 	at org.apache.solr.security.HttpParamDelegationTokenPlugin$HttpParamDelegationTokenAuthenticationHandler$HttpParamAuthenticationHandler.authenticate(HttpParamDelegationTokenPlugin.java:213)
   [junit4]   2> 	at org.apache.hadoop.security.token.delegation.web.DelegationTokenAuthenticationHandler.authenticate(DelegationTokenAuthenticationHandler.java:348)
   [junit4]   2> 	at org.apache.solr.security.KerberosPlugin$RequestContinuesRecorderAuthenticationHandler.authenticate(KerberosPlugin.java:573)
   [junit4]   2> 	at org.apache.hadoop.security.authentication.server.AuthenticationFilter.doFilter(AuthenticationFilter.java:519)
   [junit4]   2> 	at org.apache.solr.security.DelegationTokenKerberosFilter.doFilter(DelegationTokenKerberosFilter.java:123)
   [junit4]   2> 	at org.apache.solr.security.HttpParamDelegationTokenPlugin$HttpParamToRequestFilter.doFilter(HttpParamDelegationTokenPlugin.java:245)
   [junit4]   2> 	at org.apache.solr.security.KerberosPlugin.doAuthenticate(KerberosPlugin.java:264)
   [junit4]   2> 	at org.apache.solr.servlet.SolrDispatchFilter.authenticateRequest(SolrDispatchFilter.java:312)
   [junit4]   2> 	... 28 more
   [junit4]   2> 238624 INFO  (TEST-TestSolrCloudWithSecureImpersonation.testProxyNullProxyUser-seed#[B596175E77DFB007]) [    ] o.a.s.SolrTestCaseJ4 ###Ending testProxyNullProxyUser
   [junit4]   2> 238634 INFO  (TEST-TestSolrCloudWithSecureImpersonation.testProxyNoConfigGroups-seed#[B596175E77DFB007]) [    ] o.a.s.SolrTestCaseJ4 ###Starting testProxyNoConfigGroups
   [junit4]   2> 238640 WARN  (TEST-TestSolrCloudWithSecureImpersonation.testProxyNoConfigGroups-seed#[B596175E77DFB007]) [    ] o.a.h.c.p.ResponseProcessCookies Invalid cookie header: "Set-Cookie: hadoop.auth="u=noGroups&p=noGroups&t=test&e=1470415997101&s=Vyr0UcZVTaI0kdcnVGJPxh1832I="; Path=/; Domain=127.0.0.1; Expires=Jim, 05-Sid-2016 16:53:17 GMT; Secure; HttpOnly". Invalid 'expires' attribute: Jim, 05-Sid-2016 16:53:17 GMT
   [junit4]   2> 238641 INFO  (TEST-TestSolrCloudWithSecureImpersonation.testProxyNoConfigGroups-seed#[B596175E77DFB007]) [    ] o.a.s.SolrTestCaseJ4 ###Ending testProxyNoConfigGroups
   [junit4]   2> 238652 INFO  (TEST-TestSolrCloudWithSecureImpersonation.testProxyValidateGroup-seed#[B596175E77DFB007]) [    ] o.a.s.SolrTestCaseJ4 ###Starting testProxyValidateGroup
   [junit4]   2> 238677 INFO  (qtp246761432-2017) [    ] o.a.s.h.a.CollectionsHandler Invoked Collection Action :list with params doAs=jenkins&action=LIST&wt=javabin&version=2 and sendToOCPQueue=true
   [junit4]   2> 238678 INFO  (qtp246761432-2017) [    ] o.a.s.s.HttpSolrCall [admin] webapp=null path=/admin/collections params={doAs=jenkins&action=LIST&wt=javabin&version=2} status=0 QTime=0
   [junit4]   2> 238678 WARN  (TEST-TestSolrCloudWithSecureImpersonation.testProxyValidateGroup-seed#[B596175E77DFB007]) [    ] o.a.h.c.p.ResponseProcessCookies Invalid cookie header: "Set-Cookie: hadoop.auth="u=anyHostUsersGroup&p=anyHostUsersGroup&t=test&e=1470415997120&s=gTM663efioJsr1elkxjqJiNUc3k="; Path=/; Domain=127.0.0.1; Expires=Jim, 05-Sid-2016 16:53:17 GMT; Secure; HttpOnly". Invalid 'expires' attribute: Jim, 05-Sid-2016 16:53:17 GMT
   [junit4]   2> 238678 INFO  (TEST-TestSolrCloudWithSecureImpersonation.testProxyValidateGroup-seed#[B596175E77DFB007]) [    ] o.a.s.SolrTestCaseJ4 ###Ending testProxyValidateGroup
   [junit4]   2> 238688 INFO  (TEST-TestSolrCloudWithSecureImpersonation.testProxyInvalidGroup-seed#[B596175E77DFB007]) [    ] o.a.s.SolrTestCaseJ4 ###Starting testProxyInvalidGroup
   [junit4]   2> 238694 WARN  (qtp246761432-2017) [    ] o.a.h.s.ShellBasedUnixGroupsMapping got exception trying to get groups for user bar: id: bar: no such user
   [junit4]   2> 
   [junit4]   2> 238694 WARN  (qtp246761432-2017) [    ] o.a.h.s.UserGroupInformation No groups available for user bar
   [junit4]   2> 238697 WARN  (TEST-TestSolrCloudWithSecureImpersonation.testProxyInvalidGroup-seed#[B596175E77DFB007]) [    ] o.a.h.c.p.ResponseProcessCookies Invalid cookie header: "Set-Cookie: hadoop.auth="u=bogusGroup&p=bogusGroup&t=test&e=1470415997154&s=wo6gCOjcu9+4jB/VcZK7Gt2NtnQ="; Path=/; Domain=127.0.0.1; Expires=Jim, 05-Sid-2016 16:53:17 GMT; Secure; HttpOnly". Invalid 'expires' attribute: Jim, 05-Sid-2016 16:53:17 GMT
   [junit4]   2> 238698 INFO  (TEST-TestSolrCloudWithSecureImpersonation.testProxyInvalidGroup-seed#[B596175E77DFB007]) [    ] o.a.s.SolrTestCaseJ4 ###Ending testProxyInvalidGroup
   [junit4]   2> 238707 INFO  (TEST-TestSolrCloudWithSecureImpersonation.testForwarding-seed#[B596175E77DFB007]) [    ] o.a.s.SolrTestCaseJ4 ###Starting testForwarding
   [junit4]   2> 238708 INFO  (TEST-TestSolrCloudWithSecureImpersonation.testForwarding-seed#[B596175E77DFB007]) [    ] o.a.s.c.c.SolrZkClient Using default ZkCredentialsProvider
   [junit4]   2> 238708 INFO  (TEST-TestSolrCloudWithSecureImpersonation.testForwarding-seed#[B596175E77DFB007]) [    ] o.a.s.c.c.ConnectionManager Waiting for client to connect to ZooKeeper
   [junit4]   2> 238709 INFO  (zkCallback-485-thread-1) [    ] o.a.s.c.c.ConnectionManager Watcher org.apache.solr.common.cloud.ConnectionManager@183af0c name:ZooKeeperConnection Watcher:127.0.0.1:33845/solr got event WatchedEvent state:SyncConnected type:None path:null path:null type:None
   [junit4]   2> 238709 INFO  (TEST-TestSolrCloudWithSecureImpersonation.testForwarding-seed#[B596175E77DFB007]) [    ] o.a.s.c.c.ConnectionManager Client is connected to ZooKeeper
   [junit4]   2> 238709 INFO  (TEST-TestSolrCloudWithSecureImpersonation.testForwarding-seed#[B596175E77DFB007]) [    ] o.a.s.c.c.SolrZkClient Using default ZkACLProvider
   [junit4]   2> 238710 INFO  (TEST-TestSolrCloudWithSecureImpersonation.testForwarding-seed#[B596175E77DFB007]) [    ] o.a.s.c.c.SolrZkClient makePath: /configs/conf1/protwords.txt
   [junit4]   2> 238711 INFO  (TEST-TestSolrCloudWithSecureImpersonation.testForwarding-seed#[B596175E77DFB007]) [    ] o.a.s.c.c.SolrZkClient makePath: /configs/conf1/solrconfig-delaying-component.xml
   [junit4]   2> 238712 INFO  (TEST-TestSolrCloudWithSecureImpersonation.testForwarding-seed#[B596175E77DFB007]) [    ] o.a.s.c.c.SolrZkClient makePath: /configs/conf1/bad_solrconfig.xml
   [junit4]   2> 238712 INFO  (TEST-TestSolrCloudWithSecureImpersonation.testForwarding-seed#[B596175E77DFB007]) [    ] o.a.s.c.c.SolrZkClient makePath: /configs/conf1/solrconfig-sortingmergepolicyfactory.xml
   [junit4]   2> 238713 INFO  (TEST-TestSolrCloudWithSecureImpersonation.testForwarding-seed#[B596175E77DFB007]) [    ] o.a.s.c.c.SolrZkClient makePath: /configs/conf1/solrconfig-nocache.xml
   [junit4]   2> 238714 INFO  (TEST-TestSolrCloudWithSecureImpersonation.testForwarding-seed#[B596175E77DFB007]) [    ] o.a.s.c.c.SolrZkClient makePath: /configs/conf1/solrconfig-implicitproperties.xml
   [junit4]   2> 238714 INFO  (TEST-TestSolrCloudWithSecureImpersonation.testForwarding-seed#[B596175E77DFB007]) [    ] o.a.s.c.c.SolrZkClient makePath: /configs/conf1/solrconfig-mergepolicy-legacy.xml
   [junit4]   2> 238716 INFO  (TEST-TestSolrCloudWithSecureImpersonation.testForwarding-seed#[B596175E77DFB007]) [    ] o.a.s.c.c.SolrZkClient makePath: /configs/conf1/bad-schema-uniquekey-uses-default.xml
   [junit4]   2> 238716 INFO  (TEST-TestSolrCloudWithSecureImpersonation.testForwarding-seed#[B596175E77DFB007]) [    ] o.a.s.c.c.SolrZkClient makePath: /configs/conf1/bad-schema-sim-default-has-no-explicit-sim.xml
   [junit4]   2> 238717 INFO  (TEST-TestSolrCloudWithSecureImpersonation.testForwarding-seed#[B596175E77DFB007]) [    ] o.a.s.c.c.SolrZkClient makePath: /configs/conf1/bad-schema-uniquekey-multivalued.xml
   [junit4]   2> 238718 INFO  (TEST-TestSolrCloudWithSecureImpersonation.testForwarding-seed#[B596175E77DFB007]) [    ] o.a.s.c.c.SolrZkClient makePath: /configs/conf1/analyzingInfixSuggest.txt
   [junit4]   2> 238718 INFO  (TEST-TestSolrCloudWithSecureImpersonation.testForwarding-seed#[B596175E77DFB007]) [    ] o.a.s.c.c.SolrZkClient makePath: /configs/conf1/solrconfig-testxmlparser.xml
   [junit4]   2> 238719 INFO  (TEST-TestSolrCloudWithSecureImpersonation.testForwarding-seed#[B596175E77DFB007]) [    ] o.a.s.c.c.SolrZkClient makePath: /configs/conf1/missleading.extension.updateprocessor.js.txt
   [junit4]   2> 238720 INFO  (TEST-TestSolrCloudWithSecureImpersonation.testForwarding-seed#[B596175E77DFB007]) [    ] o.a.s.c.c.SolrZkClient makePath: /configs/conf1/bad-schema-multiple-asterisk-copyfield-source-should-fail-test.xml
   [junit4]   2> 238721 INFO  (TEST-TestSolrCloudWithSecureImpersonation.testForwarding-seed#[B596175E77DFB007]) [    ] o.a.s.c.c.SolrZkClient makePath: /configs/conf1/schema-replication2.xml
   [junit4]   2> 238722 INFO  (TEST-TestSolrCloudWithSecureImpersonation.testForwarding-seed#[B596175E77DFB007]) [    ] o.a.s.c.c.SolrZkClient makePath: /configs/conf1/solrconfig-infostream-logging.xml
   [junit4]   2> 238722 INFO  (TEST-TestSolrCloudWithSecureImpersonation.testForwarding-seed#[B596175E77DFB007]) [    ] o.a.s.c.c.SolrZkClient makePath: /configs/conf1/solrconfig-collapseqparser.xml
   [junit4]   2> 238723 INFO  (TEST-TestSolrCloudWithSecureImpersonation.testForwarding-seed#[B596175E77DFB007]) [    ] o.a.s.c.c.SolrZkClient makePath: /configs/conf1/bad-schema-currency-ft-bogus-code-in-xml.xml
   [junit4]   2> 238724 INFO  (TEST-TestSolrCloudWithSecureImpersonation.testForwarding-seed#[B596175E77DFB007]) [    ] o.a.s.c.c.SolrZkClient makePath: /configs/conf1/old_synonyms.txt
   [junit4]   2> 238725 INFO  (TEST-TestSolrCloudWithSecureImpersonation.testForwarding-seed#[B596175E77DFB007]) [    ] o.a.s.c.c.SolrZkClient makePath: /configs/conf1/enumsConfig.xml
   [junit4]   2> 238726 INFO  (TEST-TestSolrCloudWithSecureImpersonation.testForwarding-seed#[B596175E77DFB007]) [    ] o.a.s.c.c.SolrZkClient makePath: /configs/conf1/solrconfig-script-updateprocessor.xml
   [junit4]   2> 238726 INFO  (TEST-TestSolrCloudWithSecureImpersonation.testForwarding-seed#[B596175E77DFB007]) [    ] o.a.s.c.c.SolrZkClient makePath: /configs/conf1/schema-add-schema-fields-update-processor.xml
   [junit4]   2> 238728 INFO  (TEST-TestSolrCloudWithSecureImpersonation.testForwarding-seed#[B596175E77DFB007]) [    ] o.a.s.c.c.SolrZkClient makePath: /configs/conf1/solrconfig-mergepolicyfactory-nocfs.xml
   [junit4]   2> 238729 INFO  (TEST-TestSolrCloudWithSecureImpersonation.testForwarding-seed#[B596175E77DFB007]) [    ] o.a.s.c.c.SolrZkClient makePath: /configs/conf1/bad-schema-sweetspot-both-tf.xml
   [junit4]   2> 238729 INFO  (TEST-TestSolrCloudWithSecureImpersonation.testForwarding-seed#[B596175E77DFB007]) [    ] o.a.s.c.c.SolrZkClient makePath: /configs/conf1/schema-phrasesuggest.xml
   [junit4]   2> 238730 INFO  (TEST-TestSolrCloudWithSecureImpersonation.testForwarding-seed#[B596175E77DFB007]) [    ] o.a.s.c.c.SolrZkClient makePath: /configs/conf1/solrconfig.xml
   [junit4]   2> 238731 INFO  (TEST-TestSolrCloudWithSecureImpersonation.testForwarding-seed#[B596175E77DFB007]) [    ] o.a.s.c.c.SolrZkClient makePath: /configs/conf1/solrconfig-delpolicy1.xml
   [junit4]   2> 238732 INFO  (TEST-TestSolrCloudWithSecureImpersonation.testForwarding-seed#[B596175E77DFB007]) [    ] o.a.s.c.c.SolrZkClient makePath: /configs/conf1/schema-sim.xml
   [junit4]   2> 238732 INFO  (TEST-TestSolrCloudWithSecureImpersonation.testForwarding-seed#[B596175E77DFB007]) [    ] o.a.s.c.c.SolrZkClient makePath: /configs/conf1/schema15.xml
   [junit4]   2> 238733 INFO  (TEST-TestSolrCloudWithSecureImpersonation.testForwarding-seed#[B596175E77DFB007]) [    ] o.a.s.c.c.SolrZkClient makePath: /configs/conf1/schema-sql.xml
   [junit4]   2> 238734 INFO  (TEST-TestSolrCloudWithSecureImpersonation.testForwarding-seed#[B596175E77DFB007]) [    ] o.a.s.c.c.SolrZkClient makePath: /configs/conf1/bad-schema-misplaced-asterisk-copyfield-source-should-fail-test.xml
   [junit4]   2> 238735 INFO  (TEST-TestSolrCloudWithSecureImpersonation.testForwarding-seed#[B596175E77DFB007]) [    ] o.a.s.c.c.SolrZkClient makePath: /configs/conf1/stemdict.txt
   [junit4]   2> 238735 INFO  (TEST-TestSolrCloudWithSecureImpersonation.testForwarding-seed#[B596175E77DFB007]) [    ] o.a.s.c.c.SolrZkClient makePath: /configs/conf1/hunspell-test.aff
   [junit4]   2> 238736 INFO  (TEST-TestSolrCloudWithSecureImpersonation.testForwarding-seed#[B596175E77DFB007]) [    ] o.a.s.c.c.SolrZkClient makePath: /configs/conf1/solrconfig-sql.xml
   [junit4]   2> 238736 INFO  (TEST-TestSolrCloudWithSecureImpersonation.testForwarding-seed#[B596175E77DFB007]) [    ] o.a.s.c.c.SolrZkClient makePath: /configs/conf1/solrconfig-spatial.xml
   [junit4]   2> 238737 INFO  (TEST-TestSolrCloudWithSecureImpersonation.testForwarding-seed#[B596175E77DFB007]) [    ] o.a.s.c.c.SolrZkClient makePath: /configs/conf1/solrconfig-slave1.xml
   [junit4]   2> 238738 INFO  (TEST-TestSolrCloudWithSecureImpersonation.testForwarding-seed#[B596175E77DFB007]) [    ] o.a.s.c.c.SolrZkClient makePath: /configs/conf1/bad-schema-dup-fieldType.xml
   [junit4]   2> 238738 INFO  (TEST-TestSolrCloudWithSecureImpersonation.testForwarding-seed#[B596175E77DFB007]) [    ] o.a.s.c.c.SolrZkClient makePath: /configs/conf1/bad-schema-external-filefield.xml
   [junit4]   2> 238740 INFO  (TEST-TestSolrCloudWithSecureImpersonation.testForwarding-seed#[B596175E77DFB007]) [    ] o.a.s.c.c.SolrZkClient makePath: /configs/conf1/solrconfig-query-parser-init.xml
   [junit4]   2> 238740 INFO  (TEST-TestSolrCloudWithSecureImpersonation.testForwarding-seed#[B596175E77DFB007]) [    ] o.a.s.c.c.SolrZkClient makePath: /configs/conf1/bad-solrconfig-nrtmode.xml
   [junit4]   2> 238741 INFO  (TEST-TestSolrCloudWithSecureImpersonation.testForwarding-seed#[B596175E77DFB007]) [    ] o.a.s.c.c.SolrZkClient makePath: /configs/conf1/schema-complex-phrase.xml
   [junit4]   2> 238742 INFO  (TEST-TestSolrCloudWithSecureImpersonation.testForwarding-seed#[B596175E77DFB007]) [    ] o.a.s.c.c.SolrZkClient makePath: /configs/conf1/conditional.updateprocessor.js
   [junit4]   2> 238742 INFO  (TEST-TestSolrCloudWithSecureImpersonation.testForwarding-seed#[B596175E77DFB007]) [    ] o.a.s.c.c.SolrZkClient makePath: /configs/conf1/bad-schema-analyzer-class-and-nested.xml
   [junit4]   2> 238743 INFO  (TEST-TestSolrCloudWithSecureImpersonation.testForwarding-seed#[B596175E77DFB007]) [    ] o.a.s.c.c.SolrZkClient makePath: /configs/conf1/schema-eff.xml
   [junit4]   2> 238744 INFO  (TEST-TestSolrCloudWithSecureImpersonation.testForwarding-seed#[B596175E77DFB007]) [    ] o.a.s.c.c.SolrZkClient makePath: /configs/conf1/schema-folding.xml
   [junit4]   2> 238744 INFO  (TEST-TestSolrCloudWithSecureImpersonation.testForwarding-seed#[B596175E77DFB007]) [    ] o.a.s.c.c.SolrZkClient makePath: /configs/conf1/solrconfig-tieredmergepolicyfactory.xml
   [junit4]   2> 238745 INFO  (TEST-TestSolrCloudWithSecureImpersonation.testForwarding-seed#[B596175E77DFB007]) [    ] o.a.s.c.c.SolrZkClient makePath: /configs/conf1/schema-simpleqpplugin.xml
   [junit4]   2> 238745 INFO  (TEST-TestSolrCloudWithSecureImpersonation.testForwarding-seed#[B596175E77DFB007]) [    ] o.a.s.c.c.SolrZkClient makePath: /configs/conf1/solrconfig-hash.xml
   [junit4]   2> 238746 INFO  (TEST-TestSolrCloudWithSecureImpersonation.testForwarding-seed#[B596175E77DFB007]) [    ] o.a.s.c.c.SolrZkClient makePath: /configs/conf1/stopwords.txt
   [junit4]   2> 238747 INFO  (TEST-TestSolrCloudWithSecureImpersonation.testForwarding-seed#[B596175E77DFB007]) [    ] o.a.s.c.c.SolrZkClient makePath: /configs/conf1/bad-schema-dynamicfield-required.xml
   [junit4]   2> 238747 INFO  (TEST-TestSolrCloudWithSecureImpersonation.testForwarding-seed#[B596175E77DFB007]) [    ] o.a.s.c.c.SolrZkClient makePath: /configs/conf1/solrconfig-mergepolicy-nocfs.xml
   [junit4]   2> 238748 INFO  (TEST-TestSolrCloudWithSecureImpersonation.testForwarding-seed#[B596175E77DFB007]) [    ] o.a.s.c.c.SolrZkClient makePath: /configs/conf1/bad-solrconfig-bogus-scriptengine-name.xml
   [junit4]   2> 238749 INFO  (TEST-TestSolrCloudWithSecureImpersonation.testForwarding-seed#[B596175E77DFB007]) [    ] o.a.s.c.c.SolrZkClient makePath: /configs/conf1/throw.error.on.add.updateprocessor.js
   [junit4]   2> 238749 INFO  (TEST-TestSolrCloudWithSecureImpersonation.testForwarding-seed#[B596175E77DFB007]) [    ] o.a.s.c.c.SolrZkClient makePath: /configs/conf1/solrconfig-minimal.xml
   [junit4]   2> 238750 INFO  (TEST-TestSolrCloudWithSecureImpersonation.testForwarding-seed#[B596175E77DFB007]) [    ] o.a.s.c.c.SolrZkClient makePath: /configs/conf1/solrconfig-defaults.xml
   [junit4]   2> 238751 INFO  (TEST-TestSolrCloudWithSecureImpersonation.testForwarding-seed#[B596175E77DFB007]) [    ] o.a.s.c.c.SolrZkClient makePath: /configs/conf1/blendedInfixSuggest.txt
   [junit4]   2> 238752 INFO  (TEST-TestSolrCloudWithSecureImpersonation.testForwarding-seed#[B596175E77DFB007]) [    ] o.a.s.c.c.SolrZkClient makePath: /configs/conf1/solrconfig-postingshighlight.xml
   [junit4]   2> 238753 INFO  (TEST-TestSolrCloudWithSecureImpersonation.testForwarding-seed#[B596175E77DFB007]) [    ] o.a.s.c.c.SolrZkClient makePath: /configs/conf1/schema-docValuesJoin.xml
   [junit4]   2> 238753 INFO  (TEST-TestSolrCloudWithSecureImpersonation.testForwarding-seed#[B596175E77DFB007]) [    ] o.a.s.c.c.SolrZkClient makePath: /configs/conf1/schema-docValues.xml
   [junit4]   2> 238754 INFO  (TEST-TestSolrCloudWithSecureImpersonation.testForwarding-seed#[B596175E77DFB007]) [    ] o.a.s.c.c.SolrZkClient makePath: /configs/conf1/bad-schema-misplaced-asterisk-copyfield-dest-should-fail-test.xml
   [junit4]   2> 238755 INFO  (TEST-TestSolrCloudWithSecureImpersonation.testForwarding-seed#[B596175E77DFB007]) [    ] o.a.s.c.c.SolrZkClient makePath: /configs/conf1/schema-snippet-types.incl
   [junit4]   2> 238755 INFO  (TEST-TestSolrCloudWithSecureImpersonation.testForwarding-seed#[B596175E77DFB007]) [    ] o.a.s.c.c.SolrZkClient makePath: /configs/conf1/schema-minimal.xml
   [junit4]   2> 238756 INFO  (TEST-TestSolrCloudWithSecureImpersonation.testForwarding-seed#[B596175E77DFB007]) [    ] o.a.s.c.c.SolrZkClient makePath: /configs/conf1/solrconfig.snippet.randomindexconfig.xml
   [junit4]   2> 238757 INFO  (TEST-TestSolrCloudWithSecureImpersonation.testForwarding-seed#[B596175E77DFB007]) [    ] o.a.s.c.c.SolrZkClient makePath: /configs/conf1/schema-collate.xml
   [junit4]   2> 238757 INFO  (TEST-TestSolrCloudWithSecureImpersonation.testForwarding-seed#[B596175E77DFB007]) [    ] o.a.s.c.c.SolrZkClient makePath: /configs/conf1/schema-rest.xml
   [junit4]   2> 238758 INFO  (TEST-TestSolrCloudWithSecureImpersonation.testForwarding-seed#[B596175E77DFB007]) [    ] o.a.s.c.c.SolrZkClient makePath: /configs/conf1/bad-schema-codec-global-vs-ft-mismatch.xml
   [junit4]   2> 238758 INFO  (TEST-TestSolrCloudWithSecureImpersonation.testForwarding-seed#[B596175E77DFB007]) [    ] o.a.s.c.c.SolrZkClient makePath: /configs/conf1/bad-schema-not-indexed-but-norms.xml
   [junit4]   2> 238759 INFO  (TEST-TestSolrCloudWithSecureImpersonation.testForwarding-seed#[B596175E77DFB007]) [    ] o.a.s.c.c.SolrZkClient makePath: /configs/conf1/phrasesuggest.txt
   [junit4]   2> 238760 INFO  (TEST-TestSolrCloudWithSecureImpersonation.testForwarding-seed#[B596175E77DFB007]) [    ] o.a.s.c.c.SolrZkClient makePath: /configs/conf1/stopwordsWrongEncoding.txt
   [junit4]   2> 238760 INFO  (TEST-TestSolrCloudWithSecureImpersonation.testForwarding-seed#[B596175E77DFB007]) [    ] o.a.s.c.c.SolrZkClient makePath: /configs/conf1/solrconfig-logmergepolicy.xml
   [junit4]   2> 238761 INFO  (TEST-TestSolrCloudWithSecureImpersonation.testForwarding-seed#[B596175E77DFB007]) [    ] o.a.s.c.c.SolrZkClient makePath: /configs/conf1/solrconfig-plugcollector.xml
   [junit4]   2> 238762 INFO  (TEST-TestSolrCloudWithSecureImpersonation.testForwarding-seed#[B596175E77DFB007]) [    ] o.a.s.c.c.SolrZkClient makePath: /configs/conf1/solrconfig-noopregen.xml
   [junit4]   2> 238762 INFO  (TEST-TestSolrCloudWithSecureImpersonation.testForwarding-seed#[B596175E77DFB007]) [    ] o.a.s.c.c.SolrZkClient makePath: /configs/conf1/solrconfig-analytics-query.xml
   [junit4]   2> 238764 INFO  (TEST-TestSolrCloudWithSecureImpersonation.testForwarding-seed#[B596175E77DFB007]) [    ] o.a.s.c.c.SolrZkClient makePath: /configs/conf1/stoptypes-1.txt
   [junit4]   2> 238765 INFO  (TEST-TestSolrCloudWithSecureImpersonation.testForwarding-seed#[B596175E77DFB007]) [    ] o.a.s.c.c.SolrZkClient makePath: /configs/conf1/solrconfig-warmer-randommergepolicyfactory.xml
   [junit4]   2> 238765 INFO  (TEST-TestSolrCloudWithSecureImpersonation.testForwarding-seed#[B596175E77DFB007]) [    ] o.a.s.c.c.SolrZkClient makePath: /configs/conf1/schema-spatial.xml
   [junit4]   2> 238766 INFO  (TEST-TestSolrCloudWithSecureImpersonation.testForwarding-seed#[B596175E77DFB007]) [    ] o.a.s.c.c.SolrZkClient makePath: /configs/conf1/schema-spellchecker.xml
   [junit4]   2> 238767 INFO  (TEST-TestSolrCloudWithSecureImpersonation.testForwarding-seed#[B596175E77DFB007]) [    ] o.a.s.c.c.SolrZkClient makePath: /configs/conf1/schema-minimal-atomic-stress.xml
   [junit4]   2> 238768 INFO  (TEST-TestSolrCloudWithSecureImpersonation.testForwarding-seed#[B596175E77DFB007]) [    ] o.a.s.c.c.SolrZkClient makePath: /configs/conf1/schema-non-stored-docvalues.xml
   [junit4]   2> 238768 INFO  (TEST-TestSolrCloudWithSecureImpersonation.testForwarding-seed#[B596175E77DFB007]) [    ] o.a.s.c.c.SolrZkClient makePath: /configs/conf1/schema-distrib-interval-faceting.xml
   [junit4]   2> 238769 INFO  (TEST-TestSolrCloudWithSecureImpersonation.testForwarding-seed#[B596175E77DFB007]) [    ] o.a.s.c.c.SolrZkClient makePath: /configs/conf1/stop-1.txt
   [junit4]   2> 238769 INFO  (TEST-TestSolrCloudWithSecureImpersonation.testForwarding-seed#[B596175E77DFB007]) [    ] o.a.s.c.c.SolrZkClient makePath: /configs/conf1/schema-docValuesMissing.xml
   [junit4]   2> 238770 INFO  (TEST-TestSolrCloudWithSecureImpersonation.testForwarding-seed#[B596175E77DFB007]) [    ] o.a.s.c.c.SolrZkClient makePath: /configs/conf1/solrconfig-caching.xml
   [junit4]   2> 238771 INFO  (TEST-TestSolrCloudWithSecureImpersonation.testForwarding-seed#[B596175E77DFB007]) [    ] o.a.s.c.c.SolrZkClient makePath: /configs/conf1/solrconfig-doctransformers.xml
   [junit4]   2> 238771 INFO  (TEST-TestSolrCloudWithSecureImpersonation.testForwarding-seed#[B596175E77DFB007]) [    ] o.a.s.c.c.SolrZkClient makePath: /configs/conf1/freeTextSuggest.txt
   [junit4]   2> 238772 INFO  (TEST-TestSolrCloudWithSecureImpersonation.testForwarding-seed#[B596175E77DFB007]) [    ] o.a.s.c.c.SolrZkClient makePath: /configs/conf1/solrconfig-tolerant-update-minimal.xml
   [junit4]   2> 238773 INFO  (TEST-TestSolrCloudWithSecureImpersonation.testForwarding-seed#[B596175E77DFB007]) [    ] o.a.s.c.c.SolrZkClient makePath: /configs/conf1/schema.xml
   [junit4]   2> 238773 INFO  (TEST-TestSolrCloudWithSecureImpersonation.testForwarding-seed#[B596175E77DFB007]) [    ] o.a.s.c.c.SolrZkClient makePath: /configs/conf1/solrconfig-querysender-noquery.xml
   [junit4]   2> 238774 INFO  (TEST-TestSolrCloudWithSecureImpersonation.testForwarding-seed#[B596175E77DFB007]) [    ] o.a.s.c.c.SolrZkClient makePath: /configs/conf1/schema-sortingresponse.xml
   [junit4]   2> 238775 INFO  (TEST-TestSolrCloudWithSecureImpersonation.testForwarding-seed#[B596175E77DFB007]) [    ] o.a.s.c.c.SolrZkClient makePath: /configs/conf1/trivial.updateprocessor1.js
   [junit4]   2> 238776 INFO  (TEST-TestSolrCloudWithSecureImpersonation.testForwarding-seed#[B596175E77DFB007]) [    ] o.a.s.c.c.SolrZkClient makePath: /configs/conf1/bad-solrconfig-managed-schema-named-schema.xml.xml
   [junit4]   2> 238777 INFO  (TEST-TestSolrCloudWithSecureImpersonation.testForwarding-seed#[B596175E77DFB007]) [    ] o.a.s.c.c.SolrZkClient makePath: /configs/conf1/solrconfig-paramset.xml
   [junit4]   2> 238777 INFO  (TEST-TestSolrCloudWithSecureImpersonation.testForwarding-seed#[B596175E77DFB007]) [    ] o.a.s.c.c.SolrZkClient makePath: /configs/conf1/schema-lmdirichlet.xml
   [junit4]   2> 238778 INFO  (TEST-TestSolrCloudWithSecureImpersonation.testForwarding-seed#[B596175E77DFB007]) [    ] o.a.s.c.c.SolrZkClient makePath: /configs/conf1/bad-solrconfig-multiple-dirfactory.xml
   [junit4]   2> 238779 INFO  (TEST-TestSolrCloudWithSecureImpersonation.testForwarding-seed#[B596175E77DFB007]) [    ] o.a.s.c.c.SolrZkClient makePath: /configs/conf1/bad-schema-init-error.xml
   [junit4]   2> 238780 INFO  (TEST-TestSolrCloudWithSecureImpersonation.testForwarding-seed#[B596175E77DFB007]) [    ] o.a.s.c.c.SolrZkClient makePath: /configs/conf1/solrconfig-altdirectory.xml
   [junit4]   2> 238780 INFO  (TEST-TestSolrCloudWithSecureImpersonation.testForwarding-seed#[B596175E77DFB007]) [    ] o.a.s.c.c.SolrZkClient makePath: /configs/conf1/solrconfig-tlog.xml
   [junit4]   2> 238781 INFO  (TEST-TestSolrCloudWithSecureImpersonation.testForwarding-seed#[B596175E77DFB007]) [    ] o.a.s.c.c.SolrZkClient makePath: /configs/conf1/hyphenation.dtd
   [junit4]   2> 238781 INFO  (TEST-TestSolrCloudWithSecureImpersonation.testForwarding-seed#[B596175E77DFB007]) [    ] o.a.s.c.c.SolrZkClient makePath: /configs/conf1/schema-classification.xml
   [junit4]   2> 238782 INFO  (TEST-TestSolrCloudWithSecureImpersonation.testForwarding-seed#[B596175E77DFB007]) [    ] o.a.s.c.c.SolrZkClient makePath: /configs/conf1/schema-sweetspot.xml
   [junit4]   2> 238783 INFO  (TEST-TestSolrCloudWithSecureImpersonation.testForwarding-seed#[B596175E77DFB007]) [    ] o.a.s.c.c.SolrZkClient makePath: /configs/conf1/solrconfig-xinclude.xml
   [junit4]   2> 238783 INFO  (TEST-TestSolrCloudWithSecureImpersonation.testForwarding-seed#[B596175E77DFB007]) [    ] o.a.s.c.c.SolrZkClient makePath: /configs/conf1/solrconfig-schemaless.xml
   [junit4]   2> 238784 INFO  (TEST-TestSolrCloudWithSecureImpersonation.testForwarding-seed#[B596175E77DFB007]) [    ] o.a.s.c.c.SolrZkClient makePath: /configs/conf1/schemasurround.xml
   [junit4]   2> 238785 INFO  (TEST-TestSolrCloudWithSecureImpersonation.testForwarding-seed#[B596175E77DFB007]) [    ] o.a.s.c.c.SolrZkClient makePath: /configs/conf1/schema-binaryfield.xml
   [junit4]   2> 238785 INFO  (TEST-TestSolrCloudWithSecureImpersonation.testForwarding-seed#[B596175E77DFB007]) [    ] o.a.s.c.c.SolrZkClient makePath: /configs/conf1/solrconfig-SOLR-749.xml
   [junit4]   2> 238786 INFO  (TEST-TestSolrCloudWithSecureImpersonation.testForwarding-seed#[B596175E77DFB007]) [    ] o.a.s.c.c.SolrZkClient makePath: /configs/conf1/compoundDictionary.txt
   [junit4]   2> 238787 INFO  (TEST-TestSolrCloudWithSecureImpersonation.testForwarding-seed#[B596175E77DFB007]) [    ] o.a.s.c.c.SolrZkClient makePath: /configs/conf1/fuzzysuggest.txt
   [junit4]   2> 238788 INFO  (TEST-TestSolrCloudWithSecureImpersonation.testForwarding-seed#[B596175E77DFB007]) [    ] o.a.s.c.c.SolrZkClient makePath: /configs/conf1/solrconfig-querysender.xml
   [junit4]   2> 238788 INFO  (TEST-TestSolrCloudWithSecureImpersonation.testForwarding-seed#[B596175E77DFB007]) [    ] o.a.s.c.c.SolrZkClient makePath: /configs/conf1/schema-ib.xml
   [junit4]   2> 238789 INFO  (TEST-TestSolrCloudWithSecureImpersonation.testForwarding-seed#[B596175E77DFB007]) [    ] o.a.s.c.c.SolrZkClient makePath: /configs/conf1/schema-snippet-type.xml
   [junit4]   2> 238789 INFO  (TEST-TestSolrCloudWithSecureImpersonation.testForwarding-seed#[B596175E77DFB007]) [    ] o.a.s.c.c.SolrZkClient makePath: /configs/conf1/solrconfig-blockjoinfacetcomponent.xml
   [junit4]   2> 238790 INFO  (TEST-TestSolrCloudWithSecureImpersonation.testForwarding-seed#[B596175E77DFB007]) [    ] o.a.s.c.c.SolrZkClient makePath: /configs/conf1/cross-compatible.js
   [junit4]   2> 238791 INFO  (TEST-TestSolrCloudWithSecureImpersonation.testForwarding-seed#[B596175E77DFB007]) [    ] o.a.s.c.c.SolrZkClient makePath: /configs/conf1/solrconfig-solcoreproperties.xml
   [junit4]   2> 238791 INFO  (TEST-TestSolrCloudWithSecureImpersonation.testForwarding-seed#[B596175E77DFB007]) [    ] o.a.s.c.c.SolrZkClient makePath: /configs/conf1/solrconfig-master-throttled.xml
   [junit4]   2> 238792 INFO  (TEST-TestSolrCloudWithSecureImpersonation.testForwarding-seed#[B596175E77DFB007]) [    ] o.a.s.c.c.SolrZkClient makePath: /configs/conf1/solrconfig-components-name.xml
   [junit4]   2> 238792 INFO  (TEST-TestSolrCloudWithSecureImpersonation.testForwarding-seed#[B596175E77DFB007]) [    ] o.a.s.c.c.SolrZkClient makePath: /configs/conf1/solrconfig-elevate.xml
   [junit4]   2> 238793 INFO  (TEST-TestSolrCloudWithSecureImpersonation.testForwarding-seed#[B596175E77DFB007]) [    ] o.a.s.c.c.SolrZkClient makePath: /configs/conf1/bad-schema-sim-global-vs-ft-mismatch.xml
   [junit4]   2> 238793 INFO  (TEST-TestSolrCloudWithSecureImpersonation.testForwarding-seed#[B596175E77DFB007]) [    ] o.a.s.c.c.SolrZkClient makePath: /configs/conf1/solrconfig-delpolicy2.xml
   [junit4]   2> 238794 INFO  (TEST-TestSolrCloudWithSecureImpersonation.testForwarding-seed#[B596175E77DFB007]) [    ] o.a.s.c.c.SolrZkClient makePath: /configs/conf1/stop-snowball.txt
   [junit4]   2> 238794 INFO  (TEST-TestSolrCloudWithSecureImpersonation.testForwarding-seed#[B596175E77DFB007]) [    ] o.a.s.c.c.SolrZkClient makePath: /configs/conf1/bad-solrconfig-unexpected-schema-attribute.xml
   [junit4]   2> 238795 INFO  (TEST-TestSolrCloudWithSecureImpersonation.testForwarding-seed#[B596175E77DFB007]) [    ] o.a.s.c.c.SolrZkClient makePath: /configs/conf1/solrconfig-indexconfig-mergepolicyfactory.xml
   [junit4]   2> 238796 INFO  (TEST-TestSolrCloudWithSecureImpersonation.testForwarding-seed#[B596175E77DFB007]) [    ] o.a.s.c.c.SolrZkClient makePath: /configs/conf1/bad-schema-currency-dynamic-multivalued.xml
   [junit4]   2> 238796 INFO  (TEST-TestSolrCloudWithSecureImpersonation.testForwarding-seed#[B596175E77DFB007]) [    ] o.a.s.c.c.SolrZkClient makePath: /configs/conf1/bad-schema-dup-dynamicField.xml
   [junit4]   2> 238797 INFO  (TEST-TestSolrCloudWithSecureImpersonation.testForwarding-seed#[B596175E77DFB007]) [    ] o.a.s.c.c.SolrZkClient makePath: /configs/conf1/bad-error-solrconfig.xml
   [junit4]   2> 238798 INFO  (TEST-TestSolrCloudWithSecureImpersonation.testForwarding-seed#[B596175E77DFB007]) [    ] o.a.s.c.c.SolrZkClient makePath: /configs/conf1/bad-schema-sweetspot-partial-baseline.xml
   [junit4]   2> 238798 INFO  (TEST-TestSolrCloudWithSecureImpersonation.testForwarding-seed#[B596175E77DFB007]) [    ] o.a.s.c.c.SolrZkClient makePath: /configs/conf1/hunspell-test.dic
   [junit4]   2> 238799 INFO  (TEST-TestSolrCloudWithSecureImpersonation.testForwarding-seed#[B596175E77DFB007]) [    ] o.a.s.c.c.SolrZkClient makePath: /configs/conf1/solrconfig-withgethandler.xml
   [junit4]   2> 238800 INFO  (TEST-TestSolrCloudWithSecureImpersonation.testForwarding-seed#[B596175E77DFB007]) [    ] o.a.s.c.c.SolrZkClient makePath: /configs/conf1/bad-schema-dup-field.xml
   [junit4]   2> 238801 INFO  (TEST-TestSolrCloudWithSecureImpersonation.testForwarding-seed#[B596175E77DFB007]) [    ] o.a.s.c.c.SolrZkClient makePath: /configs/conf1/solrconfig-master2.xml
   [junit4]   2> 238801 INFO  (TEST-TestSolrCloudWithSecureImpersonation.testForwarding-seed#[B596175E77DFB007]) [    ] o.a.s.c.c.SolrZkClient makePath: /configs/conf1/synonyms.txt
   [junit4]   2> 238802 INFO  (TEST-TestSolrCloudWithSecureImpersonation.testForwarding-seed#[B596175E77DFB007]) [    ] o.a.s.c.c.SolrZkClient makePath: /configs/conf1/bad-schema-non-glob-copyfield-source-matching-nothing-should-fail-test.xml
   [junit4]   2> 238802 INFO  (TEST-TestSolrCloudWithSecureImpersonation.testForwarding-seed#[B596175E77DFB007]) [    ] o.a.s.c.c.SolrZkClient makePath: /configs/conf1/mapping-ISOLatin1Accent.txt
   [junit4]   2> 238803 INFO  (TEST-TestSolrCloudWithSecureImpersonation.testForwarding-seed#[B596175E77DFB007]) [    ] o.a.s.c.c.SolrZkClient makePath: /configs/conf1/solrconfig-spellchecker.xml
   [junit4]   2> 238804 INFO  (TEST-TestSolrCloudWithSecureImpersonation.testForwarding-seed#[B596175E77DFB007]) [    ] o.a.s.c.c.SolrZkClient makePath: /configs/conf1/bad-solrconfig-multiple-cfs.xml
   [junit4]   2> 238804 INFO  (TEST-TestSolrCloudWithSecureImpersonation.testForwarding-seed#[B596175E77DFB007]) [    ] o.a.s.c.c.SolrZkClient makePath: /configs/conf1/solrconfig-phrasesuggest.xml
   [junit4]   2> 238805 INFO  (TEST-TestSolrCloudWithSecureImpersonation.testForwarding-seed#[B596175E77DFB007]) [    ] o.a.s.c.c.SolrZkClient makePath: /configs/conf1/solrconfig-parsing-update-processor-chains.xml
   [junit4]   2> 238806 INFO  (TEST-TestSolrCloudWithSecureImpersonation.testForwarding-seed#[B596175E77DFB007]) [    ] o.a.s.c.c.SolrZkClient makePath: /configs/conf1/solrconfig-snippet-processor.xml
   [junit4]   2> 238806 INFO  (TEST-TestSolrCloudWithSecureImpersonation.testForwarding-seed#[B596175E77DFB007]) [    ] o.a.s.c.c.SolrZkClient makePath: /configs/conf1/bad-solrconfig-invalid-scriptfile.xml
   [junit4]   2> 238807 INFO  (TEST-TestSolrCloudWithSecureImpersonation.testForwarding-seed#[B596175E77DFB007]) [    ] o.a.s.c.c.SolrZkClient makePath: /configs/conf1/bad-schema-unsupported-docValues.xml
   [junit4]   2> 238808 INFO  (TEST-TestSolrCloudWithSecureImpersonation.testForwarding-seed#[B596175E77DFB007]) [    ] o.a.s.c.c.SolrZkClient makePath: /configs/conf1/solrconfig-logmergepolicyfactory.xml
   [junit4]   2> 238808 INFO  (TEST-TestSolrCloudWithSecureImpersonation.testForwarding-seed#[B596175E77DFB007]) [    ] o.a.s.c.c.SolrZkClient makePath: /configs/conf1/schema-docValuesMulti.xml
   [junit4]   2> 238809 INFO  (TEST-TestSolrCloudWithSecureImpersonation.testForwarding-seed#[B596175E77DFB007]) [    ] o.a.s.c.c.SolrZkClient makePath: /configs/conf1/schema-docValuesFaceting.xml
   [junit4]   2> 238809 INFO  (TEST-TestSolrCloudWithSecureImpersonation.testForwarding-seed#[B596175E77DFB007]) [    ] o.a.s.c.c.SolrZkClient makePath: /configs/conf1/solrconfig-headers.xml
   [junit4]   2> 238810 INFO  (TEST-TestSolrCloudWithSecureImpersonation.testForwarding-seed#[B596175E77DFB007]) [    ] o.a.s.c.c.SolrZkClient makePath: /configs/conf1/schema-synonym-tokenizer.xml
   [junit4]   2> 238811 INFO  (TEST-TestSolrCloudWithSecureImpersonation.testForwarding-seed#[B596175E77DFB007]) [    ] o.a.s.c.c.SolrZkClient makePath: /configs/conf1/solrconfig-managed-schema-test.xml
   [junit4]   2> 238812 INFO  (TEST-TestSolrCloudWithSecureImpersonation.testForwarding-seed#[B596175E77DFB007]) [    ] o.a.s.c.c.SolrZkClient makePath: /configs/conf1/schema-custom-field.xml
   [junit4]   2> 238813 INFO  (TEST-TestSolrCloudWithSecureImpersonation.testForwarding-seed#[B596175E77DFB007]) [    ] o.a.s.c.c.SolrZkClient makePath: /configs/conf1/schema-psuedo-fields.xml
   [junit4]   2> 238813 INFO  (TEST-TestSolrCloudWithSecureImpersonation.testForwarding-seed#[B596175E77DFB007]) [    ] o.a.s.c.c.SolrZkClient makePath: /configs/conf1/solrconfig-classification.xml
   [junit4]   2> 238814 INFO  (TEST-TestSolrCloudWithSecureImpersonation.testForwarding-seed#[B596175E77DFB007]) [    ] o.a.s.c.c.SolrZkClient makePath: /configs/conf1/schema-one-field-no-dynamic-field-unique-key.xml
   [junit4]   2> 238814 INFO  (TEST-TestSolrCloudWithSecureImpersonation.testForwarding-seed#[B596175E77DFB007]) [    ] o.a.s.c.c.SolrZkClient makePath: /configs/conf1/solrconfig_codec.xml
   [junit4]   2> 238815 INFO  (TEST-TestSolrCloudWithSecureImpersonation.testForwarding-seed#[B596175E77DFB007]) [    ] o.a.s.c.c.SolrZkClient makePath: /configs/conf1/solrconfig-deeppaging.xml
   [junit4]   2> 238815 INFO  (TEST-TestSolrCloudWithSecureImpersonation.testForwarding-seed#[B596175E77DFB007]) [    ] o.a.s.c.c.SolrZkClient makePath: /configs/conf1/schema-null-charfilters-analyzer.xml
   [junit4]   2> 238816 INFO  (TEST-TestSolrCloudWithSecureImpersonation.testForwarding-seed#[B596175E77DFB007]) [    ] o.a.s.c.c.SolrZkClient makePath: /configs/conf1/solrconfig-distrib-update-processor-chains.xml
   [junit4]   2> 238817 INFO  (TEST-TestSolrCloudWithSecureImpersonation.testForwarding-seed#[B596175E77DFB007]) [    ] o.a.s.c.c.SolrZkClient makePath: /configs/conf1/schema-bm25.xml
   [junit4]   2> 238817 INFO  (TEST-TestSolrCloudWithSecureImpersonation.testForwarding-seed#[B596175E77DFB007]) [    ] o.a.s.c.c.SolrZkClient makePath: /configs/conf1/wdftypes.txt
   [junit4]   2> 238818 INFO  (TEST-TestSolrCloudWithSecureImpersonation.testForwarding-seed#[B596175E77DFB007]) [    ] o.a.s.c.c.SolrZkClient makePath: /configs/conf1/bad-mpf-solrconfig.xml
   [junit4]   2> 238818 INFO  (TEST-TestSolrCloudWithSecureImpersonation.testForwarding-seed#[B596175E77DFB007]) [    ] o.a.s.c.c.SolrZkClient makePath: /configs/conf1/schema-xinclude.xml
   [junit4]   2> 238819 INFO  (TEST-TestSolrCloudWithSecureImpersonation.testForwarding-seed#[B596175E77DFB007]) [    ] o.a.s.c.c.SolrZkClient makePath: /configs/conf1/schema-numeric.xml
   [junit4]   2> 238820 INFO  (TEST-TestSolrCloudWithSecureImpersonation.testForwarding-seed#[B596175E77DFB007]) [    ] o.a.s.c.c.SolrZkClient makePath: /configs/conf1/bad-solrconfig-schema-mutable-but-not-managed.xml
   [junit4]   2> 238820 INFO  (TEST-TestSolrCloudWithSecureImpersonation.testForwarding-seed#[B596175E77DFB007]) [    ] o.a.s.c.c.SolrZkClient makePath: /configs/conf1/missing.functions.updateprocessor.js
   [junit4]   2> 238821 INFO  (TEST-TestSolrCloudWithSecureImpersonation.testForwarding-seed#[B596175E77DFB007]) [    ] o.a.s.c.c.SolrZkClient makePath: /configs/conf1/schema-dfi.xml
   [junit4]   2> 238821 INFO  (TEST-TestSolrCloudWithSecureImpersonation.testForwarding-seed#[B596175E77DFB007]) [    ] o.a.s.c.c.SolrZkClient makePath: /configs/conf1/bad-schema-currency-ft-bogus-default-code.xml
   [junit4]   2> 238822 INFO  (TEST-TestSolrCloudWithSecureImpersonation.testForwarding-seed#[B596175E77DFB007]) [    ] o.a.s.c.c.SolrZkClient makePath: /configs/conf1/solrconfig-sortingresponse.xml
   [junit4]   2> 238823 INFO  (TEST-TestSolrCloudWithSecureImpersonation.testForwarding-seed#[B596175E77DFB007]) [    ] o.a.s.c.c.SolrZkClient makePath: /configs/conf1/schema_latest.xml
   [junit4]   2> 238824 INFO  (TEST-TestSolrCloudWithSecureImpersonation.testForwarding-seed#[B596175E77DFB007]) [    ] o.a.s.c.c.SolrZkClient makePath: /configs/conf1/schema-charfilters.xml
   [junit4]   2> 238825 INFO  (TEST-TestSolrCloudWithSecureImpersonation.testForwarding-seed#[B596175E77DFB007]) [    ] o.a.s.c.c.SolrZkClient makePath: /configs/conf1/schema-id-and-version-fields-only.xml
   [junit4]   2> 238826 INFO  (TEST-TestSolrCloudWithSecureImpersonation.testForwarding-seed#[B596175E77DFB007]) [    ] o.a.s.c.c.SolrZkClient makePath: /configs/conf1/elevate.xml
   [junit4]   2> 238828 INFO  (TEST-TestSolrCloudWithSecureImpersonation.testForwarding-seed#[B596175E77DFB007]) [    ] o.a.s.c.c.SolrZkClient makePath: /configs/conf1/schema-stop-keep.xml
   [junit4]   2> 238829 INFO  (TEST-TestSolrCloudWithSecureImpersonation.testForwarding-seed#[B596175E77DFB007]) [    ] o.a.s.c.c.SolrZkClient makePath: /configs/conf1/solrconfig-searcher-listeners1.xml
   [junit4]   2> 238830 INFO  (TEST-TestSolrCloudWithSecureImpersonation.testForwarding-seed#[B596175E77DFB007]) [    ] o.a.s.c.c.SolrZkClient makePath: /configs/conf1/schema-dfr.xml
   [junit4]   2> 238830 INFO  (TEST-TestSolrCloudWithSecureImpersonation.testForwarding-seed#[B596175E77DFB007]) [    ] o.a.s.c.c.SolrZkClient makePath: /configs/conf1/bad-schema-multiple-asterisk-copyfield-dest-should-fail-test.xml
   [junit4]   2> 238831 INFO  (TEST-TestSolrCloudWithSecureImpersonation.testForwarding-seed#[B596175E77DFB007]) [    ] o.a.s.c.c.SolrZkClient makePath: /configs/conf1/da_UTF8.xml
   [junit4]   2> 238832 INFO  (TEST-TestSolrCloudWithSecureImpersonation.testForwarding-seed#[B596175E77DFB007]) [    ] o.a.s.c.c.SolrZkClient makePath: /configs/conf1/bad-schema-bogus-analysis-parameters.xml
   [junit4]   2> 238832 INFO  (TEST-TestSolrCloudWithSecureImpersonation.testForwarding-seed#[B596175E77DFB007]) [    ] o.a.s.c.c.SolrZkClient makePath: /configs/conf1/bad-schema-currency-ft-multivalued.xml
   [junit4]   2> 238833 INFO  (TEST-TestSolrCloudWithSecureImpersonation.testForwarding-seed#[B596175E77DFB007]) [    ] o.a.s.c.c.SolrZkClient makePath: /configs/conf1/schema-trie.xml
   [junit4]   2> 238833 INFO  (TEST-TestSolrCloudWithSecureImpersonation.testForwarding-seed#[B596175E77DFB007]) [    ] o.a.s.c.c.SolrZkClient makePath: /configs/conf1/solrconfig-mergepolicy-defaults.xml
   [junit4]   2> 238834 INFO  (TEST-TestSolrCloudWithSecureImpersonation.testForwarding-seed#[B596175E77DFB007]) [    ] o.a.s.c.c.SolrZkClient makePath: /configs/conf1/solrconfig-indexconfig.xml
   [junit4]   2> 238835 INFO  (TEST-TestSolrCloudWithSecureImpersonation.testForwarding-seed#[B596175E77DFB007]) [    ] o.a.s.c.c.SolrZkClient makePath: /configs/conf1/solrconfig-suggestercomponent-context-filter-query.xml
   [junit4]   2> 238836 INFO  (TEST-TestSolrCloudWithSecureImpersonation.testForwarding-seed#[B596175E77DFB007]) [    ] o.a.s.c.c.SolrZkClient makePath: /configs/conf1/solrconfig-reqHandler.incl
   [junit4]   2> 238837 INFO  (TEST-TestSolrCloudWithSecureImpersonation.testForwarding-seed#[B596175E77DFB007]) [    ] o.a.s.c.c.SolrZkClient makePath: /configs/conf1/schema-sim-default-override.xml
   [junit4]   2> 238837 INFO  (TEST-TestSolrCloudWithSecureImpersonation.testForwarding-seed#[B596175E77DFB007]) [    ] o.a.s.c.c.SolrZkClient makePath: /configs/conf1/currency.xml
   [junit4]   2> 238838 INFO  (TEST-TestSolrCloudWithSecureImpersonation.testForwarding-seed#[B596175E77DFB007]) [    ] o.a.s.c.c.SolrZkClient makePath: /configs/conf1/schema-version-dv.xml
   [junit4]   2> 238839 INFO  (TEST-TestSolrCloudWithSecureImpersonation.testForwarding-seed#[B596175E77DFB007]) [    ] o.a.s.c.c.SolrZkClient makePath: /configs/conf1/schema12.xml
   [junit4]   2> 238846 INFO  (TEST-TestSolrCloudWithSecureImpersonation.testForwarding-seed#[B596175E77DFB007]) [    ] o.a.s.c.c.SolrZkClient makePath: /configs/conf1/solrconfig-externalversionconstraint.xml
   [junit4]   2> 238848 INFO  (TEST-TestSolrCloudWithSecureImpersonation.testForwarding-seed#[B596175E77DFB007]) [    ] o.a.s.c.c.SolrZkClient makePath: /configs/conf1/bad-schema-omit-tf-but-not-pos.xml
   [junit4]   2> 238848 INFO  (TEST-TestSolrCloudWithSecureImpersonation.testForwarding-seed#[B596175E77DFB007]) [    ] o.a.s.c.c.SolrZkClient makePath: /configs/conf1/solrconfig-suggestercomponent.xml
   [junit4]   2> 238849 INFO  (TEST-TestSolrCloudWithSecureImpersonation.testForwarding-seed#[B596175E77DFB007]) [    ] o.a.s.c.c.SolrZkClient makePath: /configs/conf1/schema-replication1.xml
   [junit4]   2> 238850 INFO  (TEST-TestSolrCloudWithSecureImpersonation.testForwarding-seed#[B596175E77DFB007]) [    ] o.a.s.c.c.SolrZkClient makePath: /configs/conf1/bad-schema-not-indexed-but-tf.xml
   [junit4]   2> 238850 INFO  (TEST-TestSolrCloudWithSecureImpersonation.testForwarding-seed#[B596175E77DFB007]) [    ] o.a.s.c.c.SolrZkClient makePath: /configs/conf1/solrconfig-warmer.xml
   [junit4]   2> 238851 INFO  (TEST-TestSolrCloudWithSecureImpersonation.testForwarding-seed#[B596175E77DFB007]) [    ] o.a.s.c.c.SolrZkClient makePath: /configs/conf1/stop-2.txt
   [junit4]   2> 238852 INFO  (TEST-TestSolrCloudWithSecureImpersonation.testForwarding-seed#[B596175E77DFB007]) [    ] o.a.s.c.c.SolrZkClient makePath: /configs/conf1/schema-field-sort-values.xml
   [junit4]   2> 238852 INFO  (TEST-TestSolrCloudWithSecureImpersonation.testForwarding-seed#[B596175E77DFB007]) [    ] o.a.s.c.c.SolrZkClient makePath: /configs/conf1/schema-single-dynamic-copy-field.xml
   [junit4]   2> 238853 INFO  (TEST-TestSolrCloudWithSecureImpersonation.testForwarding-seed#[B596175E77DFB007]) [    ] o.a.s.c.c.SolrZkClient makePath: /configs/conf1/schema-distributed-missing-sort.xml
   [junit4]   2> 238854 INFO  (TEST-TestSolrCloudWithSecureImpersonation.testForwarding-seed#[B596175E77DFB007]) [    ] o.a.s.c.c.SolrZkClient makePath: /configs/conf1/solrconfig-managed-schema.xml
   [junit4]   2> 238855 INFO  (TEST-TestSolrCloudWithSecureImpersonation.testForwarding-seed#[B596175E77DFB007]) [    ] o.a.s.c.c.SolrZkClient makePath: /configs/conf1/schema-copyfield-test.xml
   [junit4]   2> 238855 INFO  (TEST-TestSolrCloudWithSecureImpersonation.testForwarding-seed#[B596175E77DFB007]) [    ] o.a.s.c.c.SolrZkClient makePath: /configs/conf1/schema-one-field-no-dynamic-field.xml
   [junit4]   2> 238856 INFO  (TEST-TestSolrCloudWithSecureImpersonation.testForwarding-seed#[B596175E77DFB007]) [    ] o.a.s.c.c.SolrZkClient makePath: /configs/conf1/solrconfig-master1-keepOneBackup.xml
   [junit4]   2> 238857 INFO  (TEST-TestSolrCloudWithSecureImpersonation.testForwarding-seed#[B596175E77DFB007]) [    ] o.a.s.c.c.SolrZkClient makePath: /configs/conf1/solrconfig-highlight.xml
   [junit4]   2> 238857 INFO  (TEST-TestSolrCloudWithSecureImpersonation.testForwarding-seed#[B596175E77DFB007]) [    ] o.a.s.c.c.SolrZkClient makePath: /configs/conf1/schema_codec.xml
   [junit4]   2> 238858 INFO  (TEST-TestSolrCloudWithSecureImpersonation.testForwarding-seed#[B596175E77DFB007]) [    ] o.a.s.c.c.SolrZkClient makePath: /configs/conf1/bad-solrconfig-missing-scriptfile.xml
   [junit4]   2> 238859 INFO  (TEST-TestSolrCloudWithSecureImpersonation.testForwarding-seed#[B596175E77DFB007]) [    ] o.a.s.c.c.SolrZkClient makePath: /configs/conf1/bad-schema-bogus-field-

[...truncated too long message...]

e version: 0
   [junit4]   2> 241778 INFO  (OverseerStateUpdate-96362823441055749-127.0.0.1:37485_solr-n_0000000001) [    ] o.a.s.c.o.NodeMutator DownNode state invoked for node: 127.0.0.1:33372_solr
   [junit4]   2> 241779 INFO  (OverseerStateUpdate-96362823441055749-127.0.0.1:37485_solr-n_0000000001) [    ] o.a.s.c.Overseer processMessage: queueSize: 2, message = {
   [junit4]   2>   "operation":"downnode",
   [junit4]   2>   "node_name":"127.0.0.1:37485_solr"} current state version: 0
   [junit4]   2> 241780 INFO  (OverseerStateUpdate-96362823441055749-127.0.0.1:37485_solr-n_0000000001) [    ] o.a.s.c.o.NodeMutator DownNode state invoked for node: 127.0.0.1:37485_solr
   [junit4]   2> 241780 INFO  (OverseerStateUpdate-96362823441055749-127.0.0.1:37485_solr-n_0000000001) [    ] o.a.s.c.o.NodeMutator Update replica state for core_node1:{"core":"forwardingCollection_shard1_replica1","base_url":"https://127.0.0.1:37485/solr","node_name":"127.0.0.1:37485_solr","state":"active","leader":"true"} to down
   [junit4]   2> 241781 INFO  (jetty-launcher-469-thread-1) [    ] o.e.j.s.h.ContextHandler Stopped o.e.j.s.ServletContextHandler@2e262b{/solr,null,UNAVAILABLE}
   [junit4]   2> 241784 INFO  (coreCloseExecutor-772-thread-1) [    ] o.a.s.c.CachingDirectoryFactory Closing MockDirectoryFactory - 3 directories currently being tracked
   [junit4]   2> 241785 INFO  (coreCloseExecutor-772-thread-1) [    ] o.a.s.c.CachingDirectoryFactory looking to close /home/jenkins/workspace/Lucene-Solr-master-Linux/solr/build/solr-core/test/J2/temp/solr.cloud.TestSolrCloudWithSecureImpersonation_B596175E77DFB007-001/tempDir-001/node1/./forwardingCollection_shard1_replica1/data/snapshot_metadata [CachedDir<<refCount=0;path=/home/jenkins/workspace/Lucene-Solr-master-Linux/solr/build/solr-core/test/J2/temp/solr.cloud.TestSolrCloudWithSecureImpersonation_B596175E77DFB007-001/tempDir-001/node1/./forwardingCollection_shard1_replica1/data/snapshot_metadata;done=false>>]
   [junit4]   2> 241785 INFO  (coreCloseExecutor-772-thread-1) [    ] o.a.s.c.CachingDirectoryFactory Closing directory, CoreContainer#isShutdown=true
   [junit4]   2> 241785 INFO  (coreCloseExecutor-772-thread-1) [    ] o.a.s.c.CachingDirectoryFactory Closing directory: /home/jenkins/workspace/Lucene-Solr-master-Linux/solr/build/solr-core/test/J2/temp/solr.cloud.TestSolrCloudWithSecureImpersonation_B596175E77DFB007-001/tempDir-001/node1/./forwardingCollection_shard1_replica1/data/snapshot_metadata
   [junit4]   2> 241785 INFO  (coreCloseExecutor-772-thread-1) [    ] o.a.s.c.CachingDirectoryFactory looking to close /home/jenkins/workspace/Lucene-Solr-master-Linux/solr/build/solr-core/test/J2/temp/solr.cloud.TestSolrCloudWithSecureImpersonation_B596175E77DFB007-001/tempDir-001/node1/./forwardingCollection_shard1_replica1/data [CachedDir<<refCount=0;path=/home/jenkins/workspace/Lucene-Solr-master-Linux/solr/build/solr-core/test/J2/temp/solr.cloud.TestSolrCloudWithSecureImpersonation_B596175E77DFB007-001/tempDir-001/node1/./forwardingCollection_shard1_replica1/data;done=false>>]
   [junit4]   2> 241785 INFO  (coreCloseExecutor-772-thread-1) [    ] o.a.s.c.CachingDirectoryFactory Closing directory, CoreContainer#isShutdown=true
   [junit4]   2> 241785 INFO  (coreCloseExecutor-772-thread-1) [    ] o.a.s.c.CachingDirectoryFactory Closing directory: /home/jenkins/workspace/Lucene-Solr-master-Linux/solr/build/solr-core/test/J2/temp/solr.cloud.TestSolrCloudWithSecureImpersonation_B596175E77DFB007-001/tempDir-001/node1/./forwardingCollection_shard1_replica1/data
   [junit4]   2> 241785 INFO  (coreCloseExecutor-772-thread-1) [    ] o.a.s.c.CachingDirectoryFactory looking to close /home/jenkins/workspace/Lucene-Solr-master-Linux/solr/build/solr-core/test/J2/temp/solr.cloud.TestSolrCloudWithSecureImpersonation_B596175E77DFB007-001/tempDir-001/node1/./forwardingCollection_shard1_replica1/data/index [CachedDir<<refCount=0;path=/home/jenkins/workspace/Lucene-Solr-master-Linux/solr/build/solr-core/test/J2/temp/solr.cloud.TestSolrCloudWithSecureImpersonation_B596175E77DFB007-001/tempDir-001/node1/./forwardingCollection_shard1_replica1/data/index;done=false>>]
   [junit4]   2> 241785 INFO  (coreCloseExecutor-772-thread-1) [    ] o.a.s.c.CachingDirectoryFactory Closing directory, CoreContainer#isShutdown=true
   [junit4]   2> 241785 INFO  (coreCloseExecutor-772-thread-1) [    ] o.a.s.c.CachingDirectoryFactory Closing directory: /home/jenkins/workspace/Lucene-Solr-master-Linux/solr/build/solr-core/test/J2/temp/solr.cloud.TestSolrCloudWithSecureImpersonation_B596175E77DFB007-001/tempDir-001/node1/./forwardingCollection_shard1_replica1/data/index
   [junit4]   2> 241786 INFO  (jetty-launcher-469-thread-2) [    ] o.a.s.c.Overseer Overseer (id=96362823441055749-127.0.0.1:37485_solr-n_0000000001) closing
   [junit4]   2> 241786 INFO  (OverseerStateUpdate-96362823441055749-127.0.0.1:37485_solr-n_0000000001) [    ] o.a.s.c.Overseer Overseer Loop exiting : 127.0.0.1:37485_solr
   [junit4]   2> 241787 ERROR (jetty-launcher-469-thread-1-EventThread) [    ] o.a.z.ClientCnxn Error while calling watcher 
   [junit4]   2> java.util.concurrent.RejectedExecutionException: Task org.apache.solr.common.util.ExecutorUtil$MDCAwareThreadPoolExecutor$$Lambda$131/582882407@5065d601 rejected from org.apache.solr.common.util.ExecutorUtil$MDCAwareThreadPoolExecutor@15674269[Terminated, pool size = 0, active threads = 0, queued tasks = 0, completed tasks = 14]
   [junit4]   2> 	at java.util.concurrent.ThreadPoolExecutor$AbortPolicy.rejectedExecution(java.base@9-ea/ThreadPoolExecutor.java:2073)
   [junit4]   2> 	at java.util.concurrent.ThreadPoolExecutor.reject(java.base@9-ea/ThreadPoolExecutor.java:839)
   [junit4]   2> 	at java.util.concurrent.ThreadPoolExecutor.execute(java.base@9-ea/ThreadPoolExecutor.java:1385)
   [junit4]   2> 	at org.apache.solr.common.util.ExecutorUtil$MDCAwareThreadPoolExecutor.execute(ExecutorUtil.java:214)
   [junit4]   2> 	at java.util.concurrent.AbstractExecutorService.submit(java.base@9-ea/AbstractExecutorService.java:118)
   [junit4]   2> 	at org.apache.solr.common.cloud.SolrZkClient$3.process(SolrZkClient.java:266)
   [junit4]   2> 	at org.apache.zookeeper.ClientCnxn$EventThread.processEvent(ClientCnxn.java:522)
   [junit4]   2> 	at org.apache.zookeeper.ClientCnxn$EventThread.run(ClientCnxn.java:498)
   [junit4]   2> 241788 ERROR (Thread[Thread-415,5,TGRP-TestSolrCloudWithSecureImpersonation]) [    ] o.a.h.s.t.d.AbstractDelegationTokenSecretManager ExpiredTokenRemover received java.lang.InterruptedException: sleep interrupted
   [junit4]   2> 241790 INFO  (jetty-launcher-469-thread-2) [    ] o.e.j.s.h.ContextHandler Stopped o.e.j.s.ServletContextHandler@680732c0{/solr,null,UNAVAILABLE}
   [junit4]   2> 241792 INFO  (SUITE-TestSolrCloudWithSecureImpersonation-seed#[B596175E77DFB007]-worker) [    ] o.a.s.c.ZkTestServer connecting to 127.0.0.1:33845 33845
   [junit4]   2> 241911 INFO  (Thread-396) [    ] o.a.s.c.ZkTestServer connecting to 127.0.0.1:33845 33845
   [junit4]   2> 241912 WARN  (Thread-396) [    ] o.a.s.c.ZkTestServer Watch limit violations: 
   [junit4]   2> Maximum concurrent create/delete watches above limit:
   [junit4]   2> 
   [junit4]   2> 	3	/solr/aliases.json
   [junit4]   2> 	2	/solr/security.json
   [junit4]   2> 
   [junit4]   2> Maximum concurrent data watches above limit:
   [junit4]   2> 
   [junit4]   2> 	3	/solr/security/zkdtsm/ZKDTSMRoot/ZKDTSMKeyIdRoot
   [junit4]   2> 	3	/solr/clusterstate.json
   [junit4]   2> 	3	/solr/clusterprops.json
   [junit4]   2> 	2	/solr/security/zkdtsm/ZKDTSMRoot/ZKDTSMMasterKeyRoot/DK_1
   [junit4]   2> 	2	/solr/security/zkdtsm/ZKDTSMRoot/ZKDTSMMasterKeyRoot/DK_3
   [junit4]   2> 	2	/solr/security/zkdtsm/ZKDTSMRoot/ZKDTSMMasterKeyRoot/DK_2
   [junit4]   2> 	2	/solr/security/zkdtsm/ZKDTSMRoot/ZKDTSMMasterKeyRoot/DK_4
   [junit4]   2> 	2	/solr/security/zkdtsm/ZKDTSMRoot/ZKDTSMSeqNumRoot
   [junit4]   2> 
   [junit4]   2> Maximum concurrent children watches above limit:
   [junit4]   2> 
   [junit4]   2> 	9	/solr/overseer/queue
   [junit4]   2> 	4	/solr/overseer/collection-queue-work
   [junit4]   2> 	3	/solr/live_nodes
   [junit4]   2> 	3	/solr/collections
   [junit4]   2> 	3	/solr/overseer/queue-work
   [junit4]   2> 	2	/solr/security/zkdtsm/ZKDTSMRoot/ZKDTSMMasterKeyRoot
   [junit4]   2> 	2	/solr/security/zkdtsm/ZKDTSMRoot/ZKDTSMTokensRoot
   [junit4]   2> 
   [junit4]   2> 241930 INFO  (SUITE-TestSolrCloudWithSecureImpersonation-seed#[B596175E77DFB007]-worker) [    ] o.a.s.SolrTestCaseJ4 ###deleteCore
   [junit4]   2> NOTE: leaving temporary files on disk at: /home/jenkins/workspace/Lucene-Solr-master-Linux/solr/build/solr-core/test/J2/temp/solr.cloud.TestSolrCloudWithSecureImpersonation_B596175E77DFB007-001
   [junit4]   2> Aug 05, 2016 6:53:20 AM com.carrotsearch.randomizedtesting.ThreadLeakControl checkThreadLeaks
   [junit4]   2> WARNING: Will linger awaiting termination of 1 leaked thread(s).
   [junit4]   2> NOTE: test params are: codec=Asserting(Lucene62): {}, docValues:{}, maxPointsInLeafNode=1472, maxMBSortInHeap=5.267209803255399, sim=RandomSimilarity(queryNorm=false): {}, locale=so-DJ, timezone=Europe/Guernsey
   [junit4]   2> NOTE: Linux 4.4.0-31-generic amd64/Oracle Corporation 9-ea (64-bit)/cpus=12,threads=1,free=139576536,total=397934592
   [junit4]   2> NOTE: All tests run in this JVM: [BaseCdcrDistributedZkTest, DistributedVersionInfoTest, TermVectorComponentDistributedTest, CurrencyFieldXmlFileTest, OverseerTest, TestSolrIndexConfig, TestClassicSimilarityFactory, TestFieldSortValues, TestJsonRequest, TestTestInjection, CdcrRequestHandlerTest, CdcrUpdateLogTest, TestCollapseQParserPlugin, BlockDirectoryTest, CleanupOldIndexTest, DeleteInactiveReplicaTest, GraphQueryTest, TestBulkSchemaConcurrent, DirectUpdateHandlerOptimizeTest, TestUninvertingReader, TestCharFilters, TestSolrCloudWithSecureImpersonation]
   [junit4] Completed [79/626 (1!)] on J2 in 5.05s, 12 tests, 1 error <<< FAILURES!

[...truncated 51408 lines...]


Mime
View raw message