lucene-dev mailing list archives

Site index · List index
Message view « Date » · « Thread »
Top « Date » · « Thread »
From Policeman Jenkins Server <jenk...@thetaphi.de>
Subject [JENKINS] Lucene-Solr-master-Windows (64bit/jdk1.8.0_102) - Build # 6025 - Still Unstable!
Date Fri, 05 Aug 2016 03:58:51 GMT
Build: http://jenkins.thetaphi.de/job/Lucene-Solr-master-Windows/6025/
Java: 64bit/jdk1.8.0_102 -XX:-UseCompressedOops -XX:+UseG1GC

4 tests failed.
FAILED:  junit.framework.TestSuite.org.apache.solr.schema.TestManagedSchemaAPI

Error Message:
ObjectTracker found 10 object(s) that were not released!!! [MockDirectoryWrapper, TransactionLog, MockDirectoryWrapper, MockDirectoryWrapper, MDCAwareThreadPoolExecutor, TransactionLog, MockDirectoryWrapper, MockDirectoryWrapper, MockDirectoryWrapper, MDCAwareThreadPoolExecutor]

Stack Trace:
java.lang.AssertionError: ObjectTracker found 10 object(s) that were not released!!! [MockDirectoryWrapper, TransactionLog, MockDirectoryWrapper, MockDirectoryWrapper, MDCAwareThreadPoolExecutor, TransactionLog, MockDirectoryWrapper, MockDirectoryWrapper, MockDirectoryWrapper, MDCAwareThreadPoolExecutor]
	at __randomizedtesting.SeedInfo.seed([8FC0C721DAFEABEC]:0)
	at org.junit.Assert.fail(Assert.java:93)
	at org.junit.Assert.assertTrue(Assert.java:43)
	at org.junit.Assert.assertNull(Assert.java:551)
	at org.apache.solr.SolrTestCaseJ4.teardownTestCases(SolrTestCaseJ4.java:257)
	at sun.reflect.GeneratedMethodAccessor31.invoke(Unknown Source)
	at sun.reflect.DelegatingMethodAccessorImpl.invoke(DelegatingMethodAccessorImpl.java:43)
	at java.lang.reflect.Method.invoke(Method.java:498)
	at com.carrotsearch.randomizedtesting.RandomizedRunner.invoke(RandomizedRunner.java:1764)
	at com.carrotsearch.randomizedtesting.RandomizedRunner$7.evaluate(RandomizedRunner.java:834)
	at com.carrotsearch.randomizedtesting.rules.StatementAdapter.evaluate(StatementAdapter.java:36)
	at com.carrotsearch.randomizedtesting.rules.SystemPropertiesRestoreRule$1.evaluate(SystemPropertiesRestoreRule.java:57)
	at org.apache.lucene.util.AbstractBeforeAfterRule$1.evaluate(AbstractBeforeAfterRule.java:45)
	at com.carrotsearch.randomizedtesting.rules.StatementAdapter.evaluate(StatementAdapter.java:36)
	at org.apache.lucene.util.TestRuleStoreClassName$1.evaluate(TestRuleStoreClassName.java:41)
	at com.carrotsearch.randomizedtesting.rules.NoShadowingOrOverridesOnMethodsRule$1.evaluate(NoShadowingOrOverridesOnMethodsRule.java:40)
	at com.carrotsearch.randomizedtesting.rules.NoShadowingOrOverridesOnMethodsRule$1.evaluate(NoShadowingOrOverridesOnMethodsRule.java:40)
	at com.carrotsearch.randomizedtesting.rules.StatementAdapter.evaluate(StatementAdapter.java:36)
	at com.carrotsearch.randomizedtesting.rules.StatementAdapter.evaluate(StatementAdapter.java:36)
	at com.carrotsearch.randomizedtesting.rules.StatementAdapter.evaluate(StatementAdapter.java:36)
	at org.apache.lucene.util.TestRuleAssertionsRequired$1.evaluate(TestRuleAssertionsRequired.java:53)
	at org.apache.lucene.util.TestRuleMarkFailure$1.evaluate(TestRuleMarkFailure.java:47)
	at org.apache.lucene.util.TestRuleIgnoreAfterMaxFailures$1.evaluate(TestRuleIgnoreAfterMaxFailures.java:64)
	at org.apache.lucene.util.TestRuleIgnoreTestSuites$1.evaluate(TestRuleIgnoreTestSuites.java:54)
	at com.carrotsearch.randomizedtesting.rules.StatementAdapter.evaluate(StatementAdapter.java:36)
	at com.carrotsearch.randomizedtesting.ThreadLeakControl$StatementRunner.run(ThreadLeakControl.java:367)
	at java.lang.Thread.run(Thread.java:745)


FAILED:  junit.framework.TestSuite.org.apache.solr.schema.TestManagedSchemaAPI

Error Message:
Could not remove the following files (in the order of attempts):    C:\Users\jenkins\workspace\Lucene-Solr-master-Windows\solr\build\solr-core\test\J1\temp\solr.schema.TestManagedSchemaAPI_8FC0C721DAFEABEC-001\tempDir-001\node1\testschemaapi_shard1_replica1\data\tlog\tlog.0000000000000000001: java.nio.file.FileSystemException: C:\Users\jenkins\workspace\Lucene-Solr-master-Windows\solr\build\solr-core\test\J1\temp\solr.schema.TestManagedSchemaAPI_8FC0C721DAFEABEC-001\tempDir-001\node1\testschemaapi_shard1_replica1\data\tlog\tlog.0000000000000000001: The process cannot access the file because it is being used by another process.     C:\Users\jenkins\workspace\Lucene-Solr-master-Windows\solr\build\solr-core\test\J1\temp\solr.schema.TestManagedSchemaAPI_8FC0C721DAFEABEC-001\tempDir-001\node1\testschemaapi_shard1_replica1\data\tlog: java.nio.file.DirectoryNotEmptyException: C:\Users\jenkins\workspace\Lucene-Solr-master-Windows\solr\build\solr-core\test\J1\temp\solr.schema.TestManagedSchemaAPI_8FC0C721DAFEABEC-001\tempDir-001\node1\testschemaapi_shard1_replica1\data\tlog    C:\Users\jenkins\workspace\Lucene-Solr-master-Windows\solr\build\solr-core\test\J1\temp\solr.schema.TestManagedSchemaAPI_8FC0C721DAFEABEC-001\tempDir-001\node1\testschemaapi_shard1_replica1\data: java.nio.file.DirectoryNotEmptyException: C:\Users\jenkins\workspace\Lucene-Solr-master-Windows\solr\build\solr-core\test\J1\temp\solr.schema.TestManagedSchemaAPI_8FC0C721DAFEABEC-001\tempDir-001\node1\testschemaapi_shard1_replica1\data    C:\Users\jenkins\workspace\Lucene-Solr-master-Windows\solr\build\solr-core\test\J1\temp\solr.schema.TestManagedSchemaAPI_8FC0C721DAFEABEC-001\tempDir-001\node1\testschemaapi_shard1_replica1: java.nio.file.DirectoryNotEmptyException: C:\Users\jenkins\workspace\Lucene-Solr-master-Windows\solr\build\solr-core\test\J1\temp\solr.schema.TestManagedSchemaAPI_8FC0C721DAFEABEC-001\tempDir-001\node1\testschemaapi_shard1_replica1    C:\Users\jenkins\workspace\Lucene-Solr-master-Windows\solr\build\solr-core\test\J1\temp\solr.schema.TestManagedSchemaAPI_8FC0C721DAFEABEC-001\tempDir-001\node1: java.nio.file.DirectoryNotEmptyException: C:\Users\jenkins\workspace\Lucene-Solr-master-Windows\solr\build\solr-core\test\J1\temp\solr.schema.TestManagedSchemaAPI_8FC0C721DAFEABEC-001\tempDir-001\node1    C:\Users\jenkins\workspace\Lucene-Solr-master-Windows\solr\build\solr-core\test\J1\temp\solr.schema.TestManagedSchemaAPI_8FC0C721DAFEABEC-001\tempDir-001\node2\testschemaapi_shard1_replica2\data\tlog\tlog.0000000000000000000: java.nio.file.FileSystemException: C:\Users\jenkins\workspace\Lucene-Solr-master-Windows\solr\build\solr-core\test\J1\temp\solr.schema.TestManagedSchemaAPI_8FC0C721DAFEABEC-001\tempDir-001\node2\testschemaapi_shard1_replica2\data\tlog\tlog.0000000000000000000: The process cannot access the file because it is being used by another process.     C:\Users\jenkins\workspace\Lucene-Solr-master-Windows\solr\build\solr-core\test\J1\temp\solr.schema.TestManagedSchemaAPI_8FC0C721DAFEABEC-001\tempDir-001\node2\testschemaapi_shard1_replica2\data\tlog: java.nio.file.DirectoryNotEmptyException: C:\Users\jenkins\workspace\Lucene-Solr-master-Windows\solr\build\solr-core\test\J1\temp\solr.schema.TestManagedSchemaAPI_8FC0C721DAFEABEC-001\tempDir-001\node2\testschemaapi_shard1_replica2\data\tlog    C:\Users\jenkins\workspace\Lucene-Solr-master-Windows\solr\build\solr-core\test\J1\temp\solr.schema.TestManagedSchemaAPI_8FC0C721DAFEABEC-001\tempDir-001\node2\testschemaapi_shard1_replica2\data: java.nio.file.DirectoryNotEmptyException: C:\Users\jenkins\workspace\Lucene-Solr-master-Windows\solr\build\solr-core\test\J1\temp\solr.schema.TestManagedSchemaAPI_8FC0C721DAFEABEC-001\tempDir-001\node2\testschemaapi_shard1_replica2\data    C:\Users\jenkins\workspace\Lucene-Solr-master-Windows\solr\build\solr-core\test\J1\temp\solr.schema.TestManagedSchemaAPI_8FC0C721DAFEABEC-001\tempDir-001\node2\testschemaapi_shard1_replica2: java.nio.file.DirectoryNotEmptyException: C:\Users\jenkins\workspace\Lucene-Solr-master-Windows\solr\build\solr-core\test\J1\temp\solr.schema.TestManagedSchemaAPI_8FC0C721DAFEABEC-001\tempDir-001\node2\testschemaapi_shard1_replica2    C:\Users\jenkins\workspace\Lucene-Solr-master-Windows\solr\build\solr-core\test\J1\temp\solr.schema.TestManagedSchemaAPI_8FC0C721DAFEABEC-001\tempDir-001\node2: java.nio.file.DirectoryNotEmptyException: C:\Users\jenkins\workspace\Lucene-Solr-master-Windows\solr\build\solr-core\test\J1\temp\solr.schema.TestManagedSchemaAPI_8FC0C721DAFEABEC-001\tempDir-001\node2    C:\Users\jenkins\workspace\Lucene-Solr-master-Windows\solr\build\solr-core\test\J1\temp\solr.schema.TestManagedSchemaAPI_8FC0C721DAFEABEC-001\tempDir-001: java.nio.file.DirectoryNotEmptyException: C:\Users\jenkins\workspace\Lucene-Solr-master-Windows\solr\build\solr-core\test\J1\temp\solr.schema.TestManagedSchemaAPI_8FC0C721DAFEABEC-001\tempDir-001    C:\Users\jenkins\workspace\Lucene-Solr-master-Windows\solr\build\solr-core\test\J1\temp\solr.schema.TestManagedSchemaAPI_8FC0C721DAFEABEC-001: java.nio.file.DirectoryNotEmptyException: C:\Users\jenkins\workspace\Lucene-Solr-master-Windows\solr\build\solr-core\test\J1\temp\solr.schema.TestManagedSchemaAPI_8FC0C721DAFEABEC-001 

Stack Trace:
java.io.IOException: Could not remove the following files (in the order of attempts):
   C:\Users\jenkins\workspace\Lucene-Solr-master-Windows\solr\build\solr-core\test\J1\temp\solr.schema.TestManagedSchemaAPI_8FC0C721DAFEABEC-001\tempDir-001\node1\testschemaapi_shard1_replica1\data\tlog\tlog.0000000000000000001: java.nio.file.FileSystemException: C:\Users\jenkins\workspace\Lucene-Solr-master-Windows\solr\build\solr-core\test\J1\temp\solr.schema.TestManagedSchemaAPI_8FC0C721DAFEABEC-001\tempDir-001\node1\testschemaapi_shard1_replica1\data\tlog\tlog.0000000000000000001: The process cannot access the file because it is being used by another process.

   C:\Users\jenkins\workspace\Lucene-Solr-master-Windows\solr\build\solr-core\test\J1\temp\solr.schema.TestManagedSchemaAPI_8FC0C721DAFEABEC-001\tempDir-001\node1\testschemaapi_shard1_replica1\data\tlog: java.nio.file.DirectoryNotEmptyException: C:\Users\jenkins\workspace\Lucene-Solr-master-Windows\solr\build\solr-core\test\J1\temp\solr.schema.TestManagedSchemaAPI_8FC0C721DAFEABEC-001\tempDir-001\node1\testschemaapi_shard1_replica1\data\tlog
   C:\Users\jenkins\workspace\Lucene-Solr-master-Windows\solr\build\solr-core\test\J1\temp\solr.schema.TestManagedSchemaAPI_8FC0C721DAFEABEC-001\tempDir-001\node1\testschemaapi_shard1_replica1\data: java.nio.file.DirectoryNotEmptyException: C:\Users\jenkins\workspace\Lucene-Solr-master-Windows\solr\build\solr-core\test\J1\temp\solr.schema.TestManagedSchemaAPI_8FC0C721DAFEABEC-001\tempDir-001\node1\testschemaapi_shard1_replica1\data
   C:\Users\jenkins\workspace\Lucene-Solr-master-Windows\solr\build\solr-core\test\J1\temp\solr.schema.TestManagedSchemaAPI_8FC0C721DAFEABEC-001\tempDir-001\node1\testschemaapi_shard1_replica1: java.nio.file.DirectoryNotEmptyException: C:\Users\jenkins\workspace\Lucene-Solr-master-Windows\solr\build\solr-core\test\J1\temp\solr.schema.TestManagedSchemaAPI_8FC0C721DAFEABEC-001\tempDir-001\node1\testschemaapi_shard1_replica1
   C:\Users\jenkins\workspace\Lucene-Solr-master-Windows\solr\build\solr-core\test\J1\temp\solr.schema.TestManagedSchemaAPI_8FC0C721DAFEABEC-001\tempDir-001\node1: java.nio.file.DirectoryNotEmptyException: C:\Users\jenkins\workspace\Lucene-Solr-master-Windows\solr\build\solr-core\test\J1\temp\solr.schema.TestManagedSchemaAPI_8FC0C721DAFEABEC-001\tempDir-001\node1
   C:\Users\jenkins\workspace\Lucene-Solr-master-Windows\solr\build\solr-core\test\J1\temp\solr.schema.TestManagedSchemaAPI_8FC0C721DAFEABEC-001\tempDir-001\node2\testschemaapi_shard1_replica2\data\tlog\tlog.0000000000000000000: java.nio.file.FileSystemException: C:\Users\jenkins\workspace\Lucene-Solr-master-Windows\solr\build\solr-core\test\J1\temp\solr.schema.TestManagedSchemaAPI_8FC0C721DAFEABEC-001\tempDir-001\node2\testschemaapi_shard1_replica2\data\tlog\tlog.0000000000000000000: The process cannot access the file because it is being used by another process.

   C:\Users\jenkins\workspace\Lucene-Solr-master-Windows\solr\build\solr-core\test\J1\temp\solr.schema.TestManagedSchemaAPI_8FC0C721DAFEABEC-001\tempDir-001\node2\testschemaapi_shard1_replica2\data\tlog: java.nio.file.DirectoryNotEmptyException: C:\Users\jenkins\workspace\Lucene-Solr-master-Windows\solr\build\solr-core\test\J1\temp\solr.schema.TestManagedSchemaAPI_8FC0C721DAFEABEC-001\tempDir-001\node2\testschemaapi_shard1_replica2\data\tlog
   C:\Users\jenkins\workspace\Lucene-Solr-master-Windows\solr\build\solr-core\test\J1\temp\solr.schema.TestManagedSchemaAPI_8FC0C721DAFEABEC-001\tempDir-001\node2\testschemaapi_shard1_replica2\data: java.nio.file.DirectoryNotEmptyException: C:\Users\jenkins\workspace\Lucene-Solr-master-Windows\solr\build\solr-core\test\J1\temp\solr.schema.TestManagedSchemaAPI_8FC0C721DAFEABEC-001\tempDir-001\node2\testschemaapi_shard1_replica2\data
   C:\Users\jenkins\workspace\Lucene-Solr-master-Windows\solr\build\solr-core\test\J1\temp\solr.schema.TestManagedSchemaAPI_8FC0C721DAFEABEC-001\tempDir-001\node2\testschemaapi_shard1_replica2: java.nio.file.DirectoryNotEmptyException: C:\Users\jenkins\workspace\Lucene-Solr-master-Windows\solr\build\solr-core\test\J1\temp\solr.schema.TestManagedSchemaAPI_8FC0C721DAFEABEC-001\tempDir-001\node2\testschemaapi_shard1_replica2
   C:\Users\jenkins\workspace\Lucene-Solr-master-Windows\solr\build\solr-core\test\J1\temp\solr.schema.TestManagedSchemaAPI_8FC0C721DAFEABEC-001\tempDir-001\node2: java.nio.file.DirectoryNotEmptyException: C:\Users\jenkins\workspace\Lucene-Solr-master-Windows\solr\build\solr-core\test\J1\temp\solr.schema.TestManagedSchemaAPI_8FC0C721DAFEABEC-001\tempDir-001\node2
   C:\Users\jenkins\workspace\Lucene-Solr-master-Windows\solr\build\solr-core\test\J1\temp\solr.schema.TestManagedSchemaAPI_8FC0C721DAFEABEC-001\tempDir-001: java.nio.file.DirectoryNotEmptyException: C:\Users\jenkins\workspace\Lucene-Solr-master-Windows\solr\build\solr-core\test\J1\temp\solr.schema.TestManagedSchemaAPI_8FC0C721DAFEABEC-001\tempDir-001
   C:\Users\jenkins\workspace\Lucene-Solr-master-Windows\solr\build\solr-core\test\J1\temp\solr.schema.TestManagedSchemaAPI_8FC0C721DAFEABEC-001: java.nio.file.DirectoryNotEmptyException: C:\Users\jenkins\workspace\Lucene-Solr-master-Windows\solr\build\solr-core\test\J1\temp\solr.schema.TestManagedSchemaAPI_8FC0C721DAFEABEC-001

	at org.apache.lucene.util.IOUtils.rm(IOUtils.java:323)
	at org.apache.lucene.util.TestRuleTemporaryFilesCleanup.afterAlways(TestRuleTemporaryFilesCleanup.java:216)
	at com.carrotsearch.randomizedtesting.rules.TestRuleAdapter$1.afterAlways(TestRuleAdapter.java:31)
	at com.carrotsearch.randomizedtesting.rules.StatementAdapter.evaluate(StatementAdapter.java:43)
	at com.carrotsearch.randomizedtesting.rules.StatementAdapter.evaluate(StatementAdapter.java:36)
	at org.apache.lucene.util.TestRuleAssertionsRequired$1.evaluate(TestRuleAssertionsRequired.java:53)
	at org.apache.lucene.util.TestRuleMarkFailure$1.evaluate(TestRuleMarkFailure.java:47)
	at org.apache.lucene.util.TestRuleIgnoreAfterMaxFailures$1.evaluate(TestRuleIgnoreAfterMaxFailures.java:64)
	at org.apache.lucene.util.TestRuleIgnoreTestSuites$1.evaluate(TestRuleIgnoreTestSuites.java:54)
	at com.carrotsearch.randomizedtesting.rules.StatementAdapter.evaluate(StatementAdapter.java:36)
	at com.carrotsearch.randomizedtesting.ThreadLeakControl$StatementRunner.run(ThreadLeakControl.java:367)
	at java.lang.Thread.run(Thread.java:745)


FAILED:  junit.framework.TestSuite.org.apache.solr.cloud.TestSolrCloudWithSecureImpersonation

Error Message:
java.lang.NullPointerException

Stack Trace:
com.google.common.util.concurrent.UncheckedExecutionException: java.lang.NullPointerException
	at __randomizedtesting.SeedInfo.seed([8FC0C721DAFEABEC]:0)
	at com.google.common.cache.LocalCache$Segment.get(LocalCache.java:2263)
	at com.google.common.cache.LocalCache.get(LocalCache.java:4000)
	at com.google.common.cache.LocalCache.getOrLoad(LocalCache.java:4004)
	at com.google.common.cache.LocalCache$LocalLoadingCache.get(LocalCache.java:4874)
	at org.apache.hadoop.security.Groups.getGroups(Groups.java:182)
	at org.apache.solr.cloud.TestSolrCloudWithSecureImpersonation.getUsersFirstGroup(TestSolrCloudWithSecureImpersonation.java:60)
	at org.apache.solr.cloud.TestSolrCloudWithSecureImpersonation.getImpersonatorSettings(TestSolrCloudWithSecureImpersonation.java:74)
	at org.apache.solr.cloud.TestSolrCloudWithSecureImpersonation.startup(TestSolrCloudWithSecureImpersonation.java:87)
	at sun.reflect.NativeMethodAccessorImpl.invoke0(Native Method)
	at sun.reflect.NativeMethodAccessorImpl.invoke(NativeMethodAccessorImpl.java:62)
	at sun.reflect.DelegatingMethodAccessorImpl.invoke(DelegatingMethodAccessorImpl.java:43)
	at java.lang.reflect.Method.invoke(Method.java:498)
	at com.carrotsearch.randomizedtesting.RandomizedRunner.invoke(RandomizedRunner.java:1764)
	at com.carrotsearch.randomizedtesting.RandomizedRunner$6.evaluate(RandomizedRunner.java:811)
	at com.carrotsearch.randomizedtesting.RandomizedRunner$7.evaluate(RandomizedRunner.java:827)
	at com.carrotsearch.randomizedtesting.rules.StatementAdapter.evaluate(StatementAdapter.java:36)
	at com.carrotsearch.randomizedtesting.rules.SystemPropertiesRestoreRule$1.evaluate(SystemPropertiesRestoreRule.java:57)
	at org.apache.lucene.util.AbstractBeforeAfterRule$1.evaluate(AbstractBeforeAfterRule.java:45)
	at com.carrotsearch.randomizedtesting.rules.StatementAdapter.evaluate(StatementAdapter.java:36)
	at org.apache.lucene.util.TestRuleStoreClassName$1.evaluate(TestRuleStoreClassName.java:41)
	at com.carrotsearch.randomizedtesting.rules.NoShadowingOrOverridesOnMethodsRule$1.evaluate(NoShadowingOrOverridesOnMethodsRule.java:40)
	at com.carrotsearch.randomizedtesting.rules.NoShadowingOrOverridesOnMethodsRule$1.evaluate(NoShadowingOrOverridesOnMethodsRule.java:40)
	at com.carrotsearch.randomizedtesting.rules.StatementAdapter.evaluate(StatementAdapter.java:36)
	at com.carrotsearch.randomizedtesting.rules.StatementAdapter.evaluate(StatementAdapter.java:36)
	at com.carrotsearch.randomizedtesting.rules.StatementAdapter.evaluate(StatementAdapter.java:36)
	at org.apache.lucene.util.TestRuleAssertionsRequired$1.evaluate(TestRuleAssertionsRequired.java:53)
	at org.apache.lucene.util.TestRuleMarkFailure$1.evaluate(TestRuleMarkFailure.java:47)
	at org.apache.lucene.util.TestRuleIgnoreAfterMaxFailures$1.evaluate(TestRuleIgnoreAfterMaxFailures.java:64)
	at org.apache.lucene.util.TestRuleIgnoreTestSuites$1.evaluate(TestRuleIgnoreTestSuites.java:54)
	at com.carrotsearch.randomizedtesting.rules.StatementAdapter.evaluate(StatementAdapter.java:36)
	at com.carrotsearch.randomizedtesting.ThreadLeakControl$StatementRunner.run(ThreadLeakControl.java:367)
	at java.lang.Thread.run(Thread.java:745)
Caused by: java.lang.NullPointerException
	at java.lang.ProcessBuilder.start(ProcessBuilder.java:1012)
	at org.apache.hadoop.util.Shell.runCommand(Shell.java:483)
	at org.apache.hadoop.util.Shell.run(Shell.java:456)
	at org.apache.hadoop.util.Shell$ShellCommandExecutor.execute(Shell.java:722)
	at org.apache.hadoop.util.Shell.execCommand(Shell.java:815)
	at org.apache.hadoop.util.Shell.execCommand(Shell.java:798)
	at org.apache.hadoop.security.ShellBasedUnixGroupsMapping.getUnixGroups(ShellBasedUnixGroupsMapping.java:84)
	at org.apache.hadoop.security.ShellBasedUnixGroupsMapping.getGroups(ShellBasedUnixGroupsMapping.java:52)
	at org.apache.hadoop.security.JniBasedUnixGroupsMappingWithFallback.getGroups(JniBasedUnixGroupsMappingWithFallback.java:51)
	at org.apache.hadoop.security.Groups$GroupCacheLoader.fetchGroupList(Groups.java:239)
	at org.apache.hadoop.security.Groups$GroupCacheLoader.load(Groups.java:220)
	at org.apache.hadoop.security.Groups$GroupCacheLoader.load(Groups.java:208)
	at com.google.common.cache.LocalCache$LoadingValueReference.loadFuture(LocalCache.java:3599)
	at com.google.common.cache.LocalCache$Segment.loadSync(LocalCache.java:2379)
	at com.google.common.cache.LocalCache$Segment.lockedGetOrLoad(LocalCache.java:2342)
	at com.google.common.cache.LocalCache$Segment.get(LocalCache.java:2257)
	... 31 more


FAILED:  junit.framework.TestSuite.org.apache.solr.cloud.TestSolrCloudWithSecureImpersonation

Error Message:


Stack Trace:
java.lang.NullPointerException
	at __randomizedtesting.SeedInfo.seed([8FC0C721DAFEABEC]:0)
	at org.apache.solr.cloud.TestSolrCloudWithSecureImpersonation.shutdown(TestSolrCloudWithSecureImpersonation.java:137)
	at sun.reflect.NativeMethodAccessorImpl.invoke0(Native Method)
	at sun.reflect.NativeMethodAccessorImpl.invoke(NativeMethodAccessorImpl.java:62)
	at sun.reflect.DelegatingMethodAccessorImpl.invoke(DelegatingMethodAccessorImpl.java:43)
	at java.lang.reflect.Method.invoke(Method.java:498)
	at com.carrotsearch.randomizedtesting.RandomizedRunner.invoke(RandomizedRunner.java:1764)
	at com.carrotsearch.randomizedtesting.RandomizedRunner$7.evaluate(RandomizedRunner.java:834)
	at com.carrotsearch.randomizedtesting.rules.StatementAdapter.evaluate(StatementAdapter.java:36)
	at com.carrotsearch.randomizedtesting.rules.SystemPropertiesRestoreRule$1.evaluate(SystemPropertiesRestoreRule.java:57)
	at org.apache.lucene.util.AbstractBeforeAfterRule$1.evaluate(AbstractBeforeAfterRule.java:45)
	at com.carrotsearch.randomizedtesting.rules.StatementAdapter.evaluate(StatementAdapter.java:36)
	at org.apache.lucene.util.TestRuleStoreClassName$1.evaluate(TestRuleStoreClassName.java:41)
	at com.carrotsearch.randomizedtesting.rules.NoShadowingOrOverridesOnMethodsRule$1.evaluate(NoShadowingOrOverridesOnMethodsRule.java:40)
	at com.carrotsearch.randomizedtesting.rules.NoShadowingOrOverridesOnMethodsRule$1.evaluate(NoShadowingOrOverridesOnMethodsRule.java:40)
	at com.carrotsearch.randomizedtesting.rules.StatementAdapter.evaluate(StatementAdapter.java:36)
	at com.carrotsearch.randomizedtesting.rules.StatementAdapter.evaluate(StatementAdapter.java:36)
	at com.carrotsearch.randomizedtesting.rules.StatementAdapter.evaluate(StatementAdapter.java:36)
	at org.apache.lucene.util.TestRuleAssertionsRequired$1.evaluate(TestRuleAssertionsRequired.java:53)
	at org.apache.lucene.util.TestRuleMarkFailure$1.evaluate(TestRuleMarkFailure.java:47)
	at org.apache.lucene.util.TestRuleIgnoreAfterMaxFailures$1.evaluate(TestRuleIgnoreAfterMaxFailures.java:64)
	at org.apache.lucene.util.TestRuleIgnoreTestSuites$1.evaluate(TestRuleIgnoreTestSuites.java:54)
	at com.carrotsearch.randomizedtesting.rules.StatementAdapter.evaluate(StatementAdapter.java:36)
	at com.carrotsearch.randomizedtesting.ThreadLeakControl$StatementRunner.run(ThreadLeakControl.java:367)
	at java.lang.Thread.run(Thread.java:745)




Build Log:
[...truncated 12147 lines...]
   [junit4] Suite: org.apache.solr.cloud.TestSolrCloudWithSecureImpersonation
   [junit4]   2> Creating dataDir: C:\Users\jenkins\workspace\Lucene-Solr-master-Windows\solr\build\solr-core\test\J0\temp\solr.cloud.TestSolrCloudWithSecureImpersonation_8FC0C721DAFEABEC-001\init-core-data-001
   [junit4]   2> 2785703 INFO  (SUITE-TestSolrCloudWithSecureImpersonation-seed#[8FC0C721DAFEABEC]-worker) [    ] o.a.s.SolrTestCaseJ4 Randomized ssl (false) and clientAuth (false) via: @org.apache.solr.util.RandomizeSSL(reason=, value=NaN, ssl=NaN, clientAuth=NaN)
   [junit4]   2> 2785850 WARN  (SUITE-TestSolrCloudWithSecureImpersonation-seed#[8FC0C721DAFEABEC]-worker) [    ] o.a.h.u.NativeCodeLoader Unable to load native-hadoop library for your platform... using builtin-java classes where applicable
   [junit4]   2> 2785871 INFO  (SUITE-TestSolrCloudWithSecureImpersonation-seed#[8FC0C721DAFEABEC]-worker) [    ] o.a.s.SolrTestCaseJ4 ###deleteCore
   [junit4]   2> NOTE: test params are: codec=Asserting(Lucene62): {}, docValues:{}, maxPointsInLeafNode=686, maxMBSortInHeap=6.252429262195099, sim=ClassicSimilarity, locale=mt-MT, timezone=America/Rosario
   [junit4]   2> NOTE: Windows 10 10.0 amd64/Oracle Corporation 1.8.0_102 (64-bit)/cpus=3,threads=1,free=302754640,total=536870912
   [junit4]   2> NOTE: All tests run in this JVM: [SoftAutoCommitTest, ClusterStateUpdateTest, TestRequestForwarding, PrimUtilsTest, ConnectionManagerTest, TolerantUpdateProcessorTest, TestSolrDeletionPolicy1, OverseerTaskQueueTest, OverseerTest, MergeStrategyTest, PreAnalyzedFieldTest, TestReplicationHandlerBackup, HLLSerializationTest, StandardRequestHandlerTest, ConjunctionSolrSpellCheckerTest, TestInitParams, TestLeaderInitiatedRecoveryThread, TestPseudoReturnFields, TestBackupRepositoryFactory, PolyFieldTest, ExplicitHLLTest, AlternateDirectoryTest, TestSolrConfigHandlerCloud, TestTestInjection, TestCustomDocTransformer, PeerSyncTest, BlockJoinFacetSimpleTest, RuleEngineTest, DeleteShardTest, XmlUpdateRequestHandlerTest, DocumentAnalysisRequestHandlerTest, TestDocSet, TestManagedSchema, TestStressReorder, XsltUpdateRequestHandlerTest, TimeZoneUtilsTest, TestExceedMaxTermLength, TestSolr4Spatial2, TestStandardQParsers, ZkStateWriterTest, DisMaxRequestHandlerTest, TestEmbeddedSolrServerConstructors, TestScoreJoinQPNoScore, JsonLoaderTest, HdfsSyncSliceTest, UnloadDistributedZkTest, ShardRoutingTest, TestNumericTerms32, TestMiniSolrCloudClusterBase, CheckHdfsIndexTest, TestMergePolicyConfig, SmileWriterTest, MoreLikeThisHandlerTest, BasicDistributedZkTest, TestSortByMinMaxFunction, SampleTest, TestTrieFacet, TestDFISimilarityFactory, CoreMergeIndexesAdminHandlerTest, TestClusterStateMutator, SolrXmlInZkTest, TestSlowCompositeReaderWrapper, TestSolrCloudWithKerberosAlt, TestHighlightDedupGrouping, HdfsLockFactoryTest, AnalysisAfterCoreReloadTest, HdfsTlogReplayBufferedWhileIndexingTest, LeaderInitiatedRecoveryOnCommitTest, TestHdfsCloudBackupRestore, TestJsonRequest, BufferStoreTest, DistribCursorPagingTest, TestReloadDeadlock, TestRawTransformer, SharedFSAutoReplicaFailoverUtilsTest, TestDocumentBuilder, TestSchemaSimilarityResource, HdfsNNFailoverTest, DirectSolrSpellCheckerTest, TestBlendedInfixSuggestions, TestLRUStatsCache, SparseHLLTest, TestFastLRUCache, CollectionsAPIAsyncDistributedZkTest, TestLuceneMatchVersion, CloneFieldUpdateProcessorFactoryTest, BigEndianAscendingWordSerializerTest, TestManagedResourceStorage, CdcrRequestHandlerTest, TestCoreContainer, AnalysisErrorHandlingTest, MigrateRouteKeyTest, ScriptEngineTest, TestDefaultStatsCache, SOLR749Test, TestElisionMultitermQuery, TestMiniSolrCloudClusterSSL, TestReRankQParserPlugin, ClusterStateTest, TestOverriddenPrefixQueryForCustomFieldType, TestGraphTermsQParserPlugin, TestGroupingSearch, TestRandomDVFaceting, AssignTest, RemoteQueryErrorTest, TestReloadAndDeleteDocs, TestConfigReload, FacetPivotSmallTest, URLClassifyProcessorTest, HdfsRecoveryZkTest, DirectoryFactoryTest, TestQuerySenderNoQuery, ExternalFileFieldSortTest, PKIAuthenticationIntegrationTest, DistanceUnitsTest, TestSchemaNameResource, TestRemoteStreaming, CurrencyFieldXmlFileTest, DataDrivenBlockJoinTest, TestJmxMonitoredMap, TestPartialUpdateDeduplication, VersionInfoTest, UpdateParamsTest, DirectUpdateHandlerTest, TestLFUCache, SchemaVersionSpecificBehaviorTest, SimplePostToolTest, TestFieldCacheSortRandom, TestConfig, SimpleMLTQParserTest, OverseerRolesTest, SecurityConfHandlerTest, AnalyticsQueryTest, JavabinLoaderTest, HdfsBasicDistributedZkTest, TestHashPartitioner, RecoveryZkTest, HardAutoCommitTest, TestFieldCache, TestTolerantSearch, SuggesterFSTTest, FastVectorHighlighterTest, DistributedFacetPivotLargeTest, TestFreeTextSuggestions, TestCryptoKeys, TestAnalyzedSuggestions, TestLMDirichletSimilarityFactory, PreAnalyzedUpdateProcessorTest, RestartWhileUpdatingTest, PrimitiveFieldTypeTest, TestSurroundQueryParser, TestSubQueryTransformer, ActionThrottleTest, DistributedQueryComponentOptimizationTest, BadComponentTest, OverseerCollectionConfigSetProcessorTest, BasicDistributedZk2Test, SyncSliceTest, OpenCloseCoreStressTest, LeaderElectionIntegrationTest, BasicZkTest, TestReplicationHandler, LeaderElectionTest, ZkSolrClientTest, TestZkChroot, ZkCLITest, TestDistributedSearch, TestFaceting, TestRecovery, DistributedSpellCheckComponentTest, TermVectorComponentDistributedTest, ZkControllerTest, TestReload, TestStressVersions, DistributedTermsComponentTest, SimpleFacetsTest, SolrCoreTest, StatsComponentTest, SpellCheckComponentTest, QueryElevationComponentTest, BadIndexSchemaTest, ConvertedLegacyTest, TestSort, TestFiltering, TestFunctionQuery, TestLazyCores, TestBadConfig, TestIndexSearcher, HighlighterTest, ShowFileRequestHandlerTest, CurrencyFieldOpenExchangeTest, DistributedQueryElevationComponentTest, TestCoreDiscovery, SignatureUpdateProcessorFactoryTest, TestExtendedDismaxParser, SpellCheckCollatorTest, CoreAdminHandlerTest, SolrRequestParserTest, TestFoldingMultitermQuery, DocValuesTest, SuggesterTSTTest, TestStressLucene, TestTrie, SpatialFilterTest, TestCSVLoader, NoCacheHeaderTest, TestUpdate, FieldMutatingUpdateProcessorTest, TestWordDelimiterFilterFactory, QueryEqualityTest, DirectUpdateHandlerOptimizeTest, DefaultValueUpdateProcessorTest, StatelessScriptUpdateProcessorFactoryTest, SortByFunctionTest, DocValuesMultiTest, DistanceFunctionTest, SolrInfoMBeanTest, CacheHeaderTest, IndexBasedSpellCheckerTest, LukeRequestHandlerTest, TestQueryTypes, TermsComponentTest, RequestHandlersTest, DocumentBuilderTest, PathHierarchyTokenizerFactoryTest, TermVectorComponentTest, TestIndexingPerformance, RequiredFieldsTest, FieldAnalysisRequestHandlerTest, TestArbitraryIndexDir, IndexSchemaRuntimeFieldTest, RegexBoostProcessorTest, SolrPluginUtilsTest, IndexSchemaTest, TestJmxIntegration, ReturnFieldsTest, JSONWriterTest, TestCSVResponseWriter, MBeansHandlerTest, BinaryUpdateRequestHandlerTest, TestPHPSerializedResponseWriter, PingRequestHandlerTest, TestComponentsName, SearchHandlerTest, HighlighterConfigTest, TestQuerySenderListener, SolrIndexConfigTest, TestStressRecovery, TestSolrDeletionPolicy2, MultiTermTest, TestSearchPerf, NumericFieldsTest, MinimalSchemaTest, OutputWriterTest, TestFuzzyAnalyzedSuggestions, TestPostingsSolrHighlighter, TestPhraseSuggestions, SpellPossibilityIteratorTest, TestCodecSupport, SynonymTokenizerTest, TestXIncludeConfig, TestSweetSpotSimilarityFactory, TestDFRSimilarityFactory, TestIBSimilarityFactory, ResourceLoaderTest, OpenExchangeRatesOrgProviderTest, ChaosMonkeyNothingIsSafeTest, TestJettySolrRunner, AsyncCallRequestStatusResponseTest, CdcrReplicationDistributedZkTest, CdcrReplicationHandlerTest, CleanupOldIndexTest, CloudExitableDirectoryReaderTest, CollectionStateFormat2Test, CollectionsAPISolrJTest, DeleteLastCustomShardedReplicaTest, DeleteReplicaTest, DeleteStatusTest, DistribDocExpirationUpdateProcessorTest, DistributedVersionInfoTest, OutOfBoxZkACLAndCredentialsProvidersTest, ReplicationFactorTest, SSLMigrationTest, SaslZkACLProviderTest, ShardSplitTest, TestCloudDeleteByQuery, TestCloudInspectUtil, TestCloudPivotFacet, TestConfigSetsAPI, TestConfigSetsAPIExclusivity, TestConfigSetsAPIZkFailure, TestDownShardTolerantSearch, TestExclusionRuleCollectionAccess, TestReplicaProperties, TestRequestStatusCollectionAPI, TestSolrCloudWithDelegationTokens, TestSolrCloudWithSecureImpersonation]
   [junit4]   2> NOTE: reproduce with: ant test  -Dtestcase=TestSolrCloudWithSecureImpersonation -Dtests.seed=8FC0C721DAFEABEC -Dtests.slow=true -Dtests.locale=mt-MT -Dtests.timezone=America/Rosario -Dtests.asserts=true -Dtests.file.encoding=UTF-8
   [junit4] ERROR   0.00s J0 | TestSolrCloudWithSecureImpersonation (suite) <<<
   [junit4]    > Throwable #1: com.google.common.util.concurrent.UncheckedExecutionException: java.lang.NullPointerException
   [junit4]    > 	at __randomizedtesting.SeedInfo.seed([8FC0C721DAFEABEC]:0)
   [junit4]    > 	at com.google.common.cache.LocalCache$Segment.get(LocalCache.java:2263)
   [junit4]    > 	at com.google.common.cache.LocalCache.get(LocalCache.java:4000)
   [junit4]    > 	at com.google.common.cache.LocalCache.getOrLoad(LocalCache.java:4004)
   [junit4]    > 	at com.google.common.cache.LocalCache$LocalLoadingCache.get(LocalCache.java:4874)
   [junit4]    > 	at org.apache.hadoop.security.Groups.getGroups(Groups.java:182)
   [junit4]    > 	at org.apache.solr.cloud.TestSolrCloudWithSecureImpersonation.getUsersFirstGroup(TestSolrCloudWithSecureImpersonation.java:60)
   [junit4]    > 	at org.apache.solr.cloud.TestSolrCloudWithSecureImpersonation.getImpersonatorSettings(TestSolrCloudWithSecureImpersonation.java:74)
   [junit4]    > 	at org.apache.solr.cloud.TestSolrCloudWithSecureImpersonation.startup(TestSolrCloudWithSecureImpersonation.java:87)
   [junit4]    > 	at java.lang.Thread.run(Thread.java:745)
   [junit4]    > Caused by: java.lang.NullPointerException
   [junit4]    > 	at java.lang.ProcessBuilder.start(ProcessBuilder.java:1012)
   [junit4]    > 	at org.apache.hadoop.util.Shell.runCommand(Shell.java:483)
   [junit4]    > 	at org.apache.hadoop.util.Shell.run(Shell.java:456)
   [junit4]    > 	at org.apache.hadoop.util.Shell$ShellCommandExecutor.execute(Shell.java:722)
   [junit4]    > 	at org.apache.hadoop.util.Shell.execCommand(Shell.java:815)
   [junit4]    > 	at org.apache.hadoop.util.Shell.execCommand(Shell.java:798)
   [junit4]    > 	at org.apache.hadoop.security.ShellBasedUnixGroupsMapping.getUnixGroups(ShellBasedUnixGroupsMapping.java:84)
   [junit4]    > 	at org.apache.hadoop.security.ShellBasedUnixGroupsMapping.getGroups(ShellBasedUnixGroupsMapping.java:52)
   [junit4]    > 	at org.apache.hadoop.security.JniBasedUnixGroupsMappingWithFallback.getGroups(JniBasedUnixGroupsMappingWithFallback.java:51)
   [junit4]    > 	at org.apache.hadoop.security.Groups$GroupCacheLoader.fetchGroupList(Groups.java:239)
   [junit4]    > 	at org.apache.hadoop.security.Groups$GroupCacheLoader.load(Groups.java:220)
   [junit4]    > 	at org.apache.hadoop.security.Groups$GroupCacheLoader.load(Groups.java:208)
   [junit4]    > 	at com.google.common.cache.LocalCache$LoadingValueReference.loadFuture(LocalCache.java:3599)
   [junit4]    > 	at com.google.common.cache.LocalCache$Segment.loadSync(LocalCache.java:2379)
   [junit4]    > 	at com.google.common.cache.LocalCache$Segment.lockedGetOrLoad(LocalCache.java:2342)
   [junit4]    > 	at com.google.common.cache.LocalCache$Segment.get(LocalCache.java:2257)
   [junit4]    > 	... 31 moreThrowable #2: java.lang.NullPointerException
   [junit4]    > 	at __randomizedtesting.SeedInfo.seed([8FC0C721DAFEABEC]:0)
   [junit4]    > 	at org.apache.solr.cloud.TestSolrCloudWithSecureImpersonation.shutdown(TestSolrCloudWithSecureImpersonation.java:137)
   [junit4]    > 	at java.lang.Thread.run(Thread.java:745)
   [junit4] Completed [497/626 (1!)] on J0 in 0.20s, 0 tests, 2 errors <<< FAILURES!

[...truncated 233 lines...]
   [junit4] Suite: org.apache.solr.schema.TestManagedSchemaAPI
   [junit4]   2> Creating dataDir: C:\Users\jenkins\workspace\Lucene-Solr-master-Windows\solr\build\solr-core\test\J1\temp\solr.schema.TestManagedSchemaAPI_8FC0C721DAFEABEC-001\init-core-data-001
   [junit4]   2> 3006995 INFO  (SUITE-TestManagedSchemaAPI-seed#[8FC0C721DAFEABEC]-worker) [    ] o.a.s.SolrTestCaseJ4 Randomized ssl (false) and clientAuth (false) via: @org.apache.solr.util.RandomizeSSL(reason=, value=NaN, ssl=NaN, clientAuth=NaN)
   [junit4]   2> 3006997 INFO  (SUITE-TestManagedSchemaAPI-seed#[8FC0C721DAFEABEC]-worker) [    ] o.a.s.c.ZkTestServer STARTING ZK TEST SERVER
   [junit4]   2> 3006998 INFO  (Thread-5134) [    ] o.a.s.c.ZkTestServer client port:0.0.0.0/0.0.0.0:0
   [junit4]   2> 3006998 INFO  (Thread-5134) [    ] o.a.s.c.ZkTestServer Starting server
   [junit4]   2> 3007098 INFO  (SUITE-TestManagedSchemaAPI-seed#[8FC0C721DAFEABEC]-worker) [    ] o.a.s.c.ZkTestServer start zk server on port:54042
   [junit4]   2> 3007099 INFO  (SUITE-TestManagedSchemaAPI-seed#[8FC0C721DAFEABEC]-worker) [    ] o.a.s.c.c.SolrZkClient Using default ZkCredentialsProvider
   [junit4]   2> 3007100 INFO  (SUITE-TestManagedSchemaAPI-seed#[8FC0C721DAFEABEC]-worker) [    ] o.a.s.c.c.ConnectionManager Waiting for client to connect to ZooKeeper
   [junit4]   2> 3007104 INFO  (zkCallback-9737-thread-1) [    ] o.a.s.c.c.ConnectionManager Watcher org.apache.solr.common.cloud.ConnectionManager@13698dcd name:ZooKeeperConnection Watcher:127.0.0.1:54042 got event WatchedEvent state:SyncConnected type:None path:null path:null type:None
   [junit4]   2> 3007104 INFO  (SUITE-TestManagedSchemaAPI-seed#[8FC0C721DAFEABEC]-worker) [    ] o.a.s.c.c.ConnectionManager Client is connected to ZooKeeper
   [junit4]   2> 3007104 INFO  (SUITE-TestManagedSchemaAPI-seed#[8FC0C721DAFEABEC]-worker) [    ] o.a.s.c.c.SolrZkClient Using default ZkACLProvider
   [junit4]   2> 3007104 INFO  (SUITE-TestManagedSchemaAPI-seed#[8FC0C721DAFEABEC]-worker) [    ] o.a.s.c.c.SolrZkClient makePath: /solr/solr.xml
   [junit4]   2> 3007110 INFO  (jetty-launcher-9736-thread-1) [    ] o.e.j.s.Server jetty-9.3.8.v20160314
   [junit4]   2> 3007112 INFO  (jetty-launcher-9736-thread-2) [    ] o.e.j.s.Server jetty-9.3.8.v20160314
   [junit4]   2> 3007112 INFO  (jetty-launcher-9736-thread-1) [    ] o.e.j.s.h.ContextHandler Started o.e.j.s.ServletContextHandler@5aaf129d{/solr,null,AVAILABLE}
   [junit4]   2> 3007113 INFO  (jetty-launcher-9736-thread-2) [    ] o.e.j.s.h.ContextHandler Started o.e.j.s.ServletContextHandler@78d1e65a{/solr,null,AVAILABLE}
   [junit4]   2> 3007114 INFO  (jetty-launcher-9736-thread-1) [    ] o.e.j.s.ServerConnector Started ServerConnector@20cdfbd5{HTTP/1.1,[http/1.1]}{127.0.0.1:54046}
   [junit4]   2> 3007115 INFO  (jetty-launcher-9736-thread-1) [    ] o.e.j.s.Server Started @3012752ms
   [junit4]   2> 3007115 INFO  (jetty-launcher-9736-thread-1) [    ] o.a.s.c.s.e.JettySolrRunner Jetty properties: {hostContext=/solr, hostPort=54046}
   [junit4]   2> 3007116 INFO  (jetty-launcher-9736-thread-1) [    ] o.a.s.s.SolrDispatchFilter SolrDispatchFilter.init(): sun.misc.Launcher$AppClassLoader@73d16e93
   [junit4]   2> 3007116 INFO  (jetty-launcher-9736-thread-2) [    ] o.e.j.s.ServerConnector Started ServerConnector@4c3ece2b{HTTP/1.1,[http/1.1]}{127.0.0.1:54049}
   [junit4]   2> 3007116 INFO  (jetty-launcher-9736-thread-1) [    ] o.a.s.c.SolrResourceLoader new SolrResourceLoader for directory: 'C:\Users\jenkins\workspace\Lucene-Solr-master-Windows\solr\build\solr-core\test\J1\temp\solr.schema.TestManagedSchemaAPI_8FC0C721DAFEABEC-001\tempDir-001\node1'
   [junit4]   2> 3007116 INFO  (jetty-launcher-9736-thread-2) [    ] o.e.j.s.Server Started @3012752ms
   [junit4]   2> 3007116 INFO  (jetty-launcher-9736-thread-1) [    ] o.a.s.c.SolrResourceLoader JNDI not configured for solr (NoInitialContextEx)
   [junit4]   2> 3007116 INFO  (jetty-launcher-9736-thread-2) [    ] o.a.s.c.s.e.JettySolrRunner Jetty properties: {hostContext=/solr, hostPort=54049}
   [junit4]   2> 3007116 INFO  (jetty-launcher-9736-thread-1) [    ] o.a.s.c.SolrResourceLoader solr home defaulted to 'solr/' (could not find system property or JNDI)
   [junit4]   2> 3007116 INFO  (jetty-launcher-9736-thread-2) [    ] o.a.s.s.SolrDispatchFilter SolrDispatchFilter.init(): sun.misc.Launcher$AppClassLoader@73d16e93
   [junit4]   2> 3007116 INFO  (jetty-launcher-9736-thread-2) [    ] o.a.s.c.SolrResourceLoader new SolrResourceLoader for directory: 'C:\Users\jenkins\workspace\Lucene-Solr-master-Windows\solr\build\solr-core\test\J1\temp\solr.schema.TestManagedSchemaAPI_8FC0C721DAFEABEC-001\tempDir-001\node2'
   [junit4]   2> 3007117 INFO  (jetty-launcher-9736-thread-2) [    ] o.a.s.c.SolrResourceLoader JNDI not configured for solr (NoInitialContextEx)
   [junit4]   2> 3007117 INFO  (jetty-launcher-9736-thread-2) [    ] o.a.s.c.SolrResourceLoader solr home defaulted to 'solr/' (could not find system property or JNDI)
   [junit4]   2> 3007117 INFO  (jetty-launcher-9736-thread-1) [    ] o.a.s.c.c.SolrZkClient Using default ZkCredentialsProvider
   [junit4]   2> 3007117 INFO  (jetty-launcher-9736-thread-2) [    ] o.a.s.c.c.SolrZkClient Using default ZkCredentialsProvider
   [junit4]   2> 3007117 INFO  (jetty-launcher-9736-thread-1) [    ] o.a.s.c.c.ConnectionManager Waiting for client to connect to ZooKeeper
   [junit4]   2> 3007117 INFO  (jetty-launcher-9736-thread-2) [    ] o.a.s.c.c.ConnectionManager Waiting for client to connect to ZooKeeper
   [junit4]   2> 3007119 INFO  (zkCallback-9738-thread-1) [    ] o.a.s.c.c.ConnectionManager Watcher org.apache.solr.common.cloud.ConnectionManager@67e0c952 name:ZooKeeperConnection Watcher:127.0.0.1:54042/solr got event WatchedEvent state:SyncConnected type:None path:null path:null type:None
   [junit4]   2> 3007119 INFO  (jetty-launcher-9736-thread-1) [    ] o.a.s.c.c.ConnectionManager Client is connected to ZooKeeper
   [junit4]   2> 3007119 INFO  (jetty-launcher-9736-thread-1) [    ] o.a.s.c.c.SolrZkClient Using default ZkACLProvider
   [junit4]   2> 3007120 INFO  (zkCallback-9739-thread-1) [    ] o.a.s.c.c.ConnectionManager Watcher org.apache.solr.common.cloud.ConnectionManager@cf89fd9 name:ZooKeeperConnection Watcher:127.0.0.1:54042/solr got event WatchedEvent state:SyncConnected type:None path:null path:null type:None
   [junit4]   2> 3007120 INFO  (jetty-launcher-9736-thread-2) [    ] o.a.s.c.c.ConnectionManager Client is connected to ZooKeeper
   [junit4]   2> 3007120 INFO  (jetty-launcher-9736-thread-1) [    ] o.a.s.s.SolrDispatchFilter solr.xml found in ZooKeeper. Loading...
   [junit4]   2> 3007120 INFO  (jetty-launcher-9736-thread-2) [    ] o.a.s.c.c.SolrZkClient Using default ZkACLProvider
   [junit4]   2> 3007120 INFO  (jetty-launcher-9736-thread-2) [    ] o.a.s.s.SolrDispatchFilter solr.xml found in ZooKeeper. Loading...
   [junit4]   2> 3007134 INFO  (jetty-launcher-9736-thread-2) [    ] o.a.s.c.CorePropertiesLocator Config-defined core root directory: C:\Users\jenkins\workspace\Lucene-Solr-master-Windows\solr\build\solr-core\test\J1\temp\solr.schema.TestManagedSchemaAPI_8FC0C721DAFEABEC-001\tempDir-001\node2\.
   [junit4]   2> 3007134 INFO  (jetty-launcher-9736-thread-2) [    ] o.a.s.c.CoreContainer New CoreContainer 711432844
   [junit4]   2> 3007134 INFO  (jetty-launcher-9736-thread-2) [    ] o.a.s.c.CoreContainer Loading cores into CoreContainer [instanceDir=C:\Users\jenkins\workspace\Lucene-Solr-master-Windows\solr\build\solr-core\test\J1\temp\solr.schema.TestManagedSchemaAPI_8FC0C721DAFEABEC-001\tempDir-001\node2]
   [junit4]   2> 3007134 WARN  (jetty-launcher-9736-thread-2) [    ] o.a.s.c.CoreContainer Couldn't add files from C:\Users\jenkins\workspace\Lucene-Solr-master-Windows\solr\build\solr-core\test\J1\temp\solr.schema.TestManagedSchemaAPI_8FC0C721DAFEABEC-001\tempDir-001\node2\lib to classpath: C:\Users\jenkins\workspace\Lucene-Solr-master-Windows\solr\build\solr-core\test\J1\temp\solr.schema.TestManagedSchemaAPI_8FC0C721DAFEABEC-001\tempDir-001\node2\lib
   [junit4]   2> 3007134 INFO  (jetty-launcher-9736-thread-2) [    ] o.a.s.h.c.HttpShardHandlerFactory created with socketTimeout : 90000,urlScheme : ,connTimeout : 15000,maxConnectionsPerHost : 20,maxConnections : 10000,corePoolSize : 0,maximumPoolSize : 2147483647,maxThreadIdleTime : 5,sizeOfQueue : -1,fairnessPolicy : false,
   [junit4]   2> 3007139 INFO  (jetty-launcher-9736-thread-1) [    ] o.a.s.c.CorePropertiesLocator Config-defined core root directory: C:\Users\jenkins\workspace\Lucene-Solr-master-Windows\solr\build\solr-core\test\J1\temp\solr.schema.TestManagedSchemaAPI_8FC0C721DAFEABEC-001\tempDir-001\node1\.
   [junit4]   2> 3007139 INFO  (jetty-launcher-9736-thread-1) [    ] o.a.s.c.CoreContainer New CoreContainer 103929199
   [junit4]   2> 3007139 INFO  (jetty-launcher-9736-thread-1) [    ] o.a.s.c.CoreContainer Loading cores into CoreContainer [instanceDir=C:\Users\jenkins\workspace\Lucene-Solr-master-Windows\solr\build\solr-core\test\J1\temp\solr.schema.TestManagedSchemaAPI_8FC0C721DAFEABEC-001\tempDir-001\node1]
   [junit4]   2> 3007139 WARN  (jetty-launcher-9736-thread-1) [    ] o.a.s.c.CoreContainer Couldn't add files from C:\Users\jenkins\workspace\Lucene-Solr-master-Windows\solr\build\solr-core\test\J1\temp\solr.schema.TestManagedSchemaAPI_8FC0C721DAFEABEC-001\tempDir-001\node1\lib to classpath: C:\Users\jenkins\workspace\Lucene-Solr-master-Windows\solr\build\solr-core\test\J1\temp\solr.schema.TestManagedSchemaAPI_8FC0C721DAFEABEC-001\tempDir-001\node1\lib
   [junit4]   2> 3007139 INFO  (jetty-launcher-9736-thread-1) [    ] o.a.s.h.c.HttpShardHandlerFactory created with socketTimeout : 90000,urlScheme : ,connTimeout : 15000,maxConnectionsPerHost : 20,maxConnections : 10000,corePoolSize : 0,maximumPoolSize : 2147483647,maxThreadIdleTime : 5,sizeOfQueue : -1,fairnessPolicy : false,
   [junit4]   2> 3007141 INFO  (jetty-launcher-9736-thread-2) [    ] o.a.s.u.UpdateShardHandler Created UpdateShardHandler HTTP client with params: socketTimeout=340000&connTimeout=45000&maxConnections=100000&maxConnectionsPerHost=100000
   [junit4]   2> 3007141 INFO  (jetty-launcher-9736-thread-2) [    ] o.a.s.l.LogWatcher SLF4J impl is org.slf4j.impl.Log4jLoggerFactory
   [junit4]   2> 3007141 INFO  (jetty-launcher-9736-thread-2) [    ] o.a.s.l.LogWatcher Registering Log Listener [Log4j (org.slf4j.impl.Log4jLoggerFactory)]
   [junit4]   2> 3007141 INFO  (jetty-launcher-9736-thread-2) [    ] o.a.s.c.ZkContainer Zookeeper client=127.0.0.1:54042/solr
   [junit4]   2> 3007141 INFO  (jetty-launcher-9736-thread-2) [    ] o.a.s.c.ZkController zkHost includes chroot
   [junit4]   2> 3007141 INFO  (jetty-launcher-9736-thread-2) [    ] o.a.s.c.c.SolrZkClient Using default ZkCredentialsProvider
   [junit4]   2> 3007142 INFO  (jetty-launcher-9736-thread-1) [    ] o.a.s.u.UpdateShardHandler Created UpdateShardHandler HTTP client with params: socketTimeout=340000&connTimeout=45000&maxConnections=100000&maxConnectionsPerHost=100000
   [junit4]   2> 3007144 INFO  (jetty-launcher-9736-thread-1) [    ] o.a.s.l.LogWatcher SLF4J impl is org.slf4j.impl.Log4jLoggerFactory
   [junit4]   2> 3007144 INFO  (jetty-launcher-9736-thread-1) [    ] o.a.s.l.LogWatcher Registering Log Listener [Log4j (org.slf4j.impl.Log4jLoggerFactory)]
   [junit4]   2> 3007144 INFO  (jetty-launcher-9736-thread-1) [    ] o.a.s.c.ZkContainer Zookeeper client=127.0.0.1:54042/solr
   [junit4]   2> 3007144 INFO  (jetty-launcher-9736-thread-2) [    ] o.a.s.c.c.ConnectionManager Waiting for client to connect to ZooKeeper
   [junit4]   2> 3007144 INFO  (jetty-launcher-9736-thread-1) [    ] o.a.s.c.ZkController zkHost includes chroot
   [junit4]   2> 3007145 INFO  (jetty-launcher-9736-thread-1) [    ] o.a.s.c.c.SolrZkClient Using default ZkCredentialsProvider
   [junit4]   2> 3007146 INFO  (jetty-launcher-9736-thread-1) [    ] o.a.s.c.c.ConnectionManager Waiting for client to connect to ZooKeeper
   [junit4]   2> 3007146 INFO  (zkCallback-9744-thread-1) [    ] o.a.s.c.c.ConnectionManager Watcher org.apache.solr.common.cloud.ConnectionManager@5da40c0f name:ZooKeeperConnection Watcher:127.0.0.1:54042 got event WatchedEvent state:SyncConnected type:None path:null path:null type:None
   [junit4]   2> 3007146 INFO  (jetty-launcher-9736-thread-2) [    ] o.a.s.c.c.ConnectionManager Client is connected to ZooKeeper
   [junit4]   2> 3007146 INFO  (jetty-launcher-9736-thread-2) [    ] o.a.s.c.c.SolrZkClient Using default ZkACLProvider
   [junit4]   2> 3007147 INFO  (zkCallback-9745-thread-1) [    ] o.a.s.c.c.ConnectionManager Watcher org.apache.solr.common.cloud.ConnectionManager@3cf0a2be name:ZooKeeperConnection Watcher:127.0.0.1:54042 got event WatchedEvent state:SyncConnected type:None path:null path:null type:None
   [junit4]   2> 3007147 INFO  (jetty-launcher-9736-thread-1) [    ] o.a.s.c.c.ConnectionManager Client is connected to ZooKeeper
   [junit4]   2> 3007147 INFO  (jetty-launcher-9736-thread-1) [    ] o.a.s.c.c.SolrZkClient Using default ZkACLProvider
   [junit4]   2> 3007147 INFO  (jetty-launcher-9736-thread-2) [n:127.0.0.1:54049_solr    ] o.a.s.c.ZkController Added new OnReconnect listener org.apache.solr.cloud.ZkController$$Lambda$63/1479830670@1e94d22c
   [junit4]   2> 3007150 INFO  (jetty-launcher-9736-thread-1) [n:127.0.0.1:54046_solr    ] o.a.s.c.ZkController Added new OnReconnect listener org.apache.solr.cloud.ZkController$$Lambda$63/1479830670@4156c588
   [junit4]   2> 3007152 INFO  (jetty-launcher-9736-thread-2) [n:127.0.0.1:54049_solr    ] o.a.s.c.c.ConnectionManager Waiting for client to connect to ZooKeeper
   [junit4]   2> 3007153 INFO  (jetty-launcher-9736-thread-1) [n:127.0.0.1:54046_solr    ] o.a.s.c.c.ConnectionManager Waiting for client to connect to ZooKeeper
   [junit4]   2> 3007154 INFO  (zkCallback-9746-thread-1-processing-n:127.0.0.1:54049_solr) [n:127.0.0.1:54049_solr    ] o.a.s.c.c.ConnectionManager Watcher org.apache.solr.common.cloud.ConnectionManager@520be0a7 name:ZooKeeperConnection Watcher:127.0.0.1:54042/solr got event WatchedEvent state:SyncConnected type:None path:null path:null type:None
   [junit4]   2> 3007154 INFO  (jetty-launcher-9736-thread-2) [n:127.0.0.1:54049_solr    ] o.a.s.c.c.ConnectionManager Client is connected to ZooKeeper
   [junit4]   2> 3007154 INFO  (zkCallback-9747-thread-1-processing-n:127.0.0.1:54046_solr) [n:127.0.0.1:54046_solr    ] o.a.s.c.c.ConnectionManager Watcher org.apache.solr.common.cloud.ConnectionManager@5063462e name:ZooKeeperConnection Watcher:127.0.0.1:54042/solr got event WatchedEvent state:SyncConnected type:None path:null path:null type:None
   [junit4]   2> 3007154 INFO  (jetty-launcher-9736-thread-1) [n:127.0.0.1:54046_solr    ] o.a.s.c.c.ConnectionManager Client is connected to ZooKeeper
   [junit4]   2> 3007155 INFO  (jetty-launcher-9736-thread-2) [n:127.0.0.1:54049_solr    ] o.a.s.c.c.SolrZkClient makePath: /overseer/queue
   [junit4]   2> 3007156 INFO  (jetty-launcher-9736-thread-1) [n:127.0.0.1:54046_solr    ] o.a.s.c.c.SolrZkClient makePath: /overseer/queue
   [junit4]   2> 3007159 INFO  (jetty-launcher-9736-thread-2) [n:127.0.0.1:54049_solr    ] o.a.s.c.c.SolrZkClient makePath: /overseer/collection-queue-work
   [junit4]   2> 3007160 INFO  (jetty-launcher-9736-thread-1) [n:127.0.0.1:54046_solr    ] o.a.s.c.c.SolrZkClient makePath: /overseer/collection-queue-work
   [junit4]   2> 3007165 INFO  (jetty-launcher-9736-thread-2) [n:127.0.0.1:54049_solr    ] o.a.s.c.c.SolrZkClient makePath: /overseer/collection-map-running
   [junit4]   2> 3007165 INFO  (jetty-launcher-9736-thread-1) [n:127.0.0.1:54046_solr    ] o.a.s.c.c.SolrZkClient makePath: /overseer/collection-map-running
   [junit4]   2> 3007168 INFO  (jetty-launcher-9736-thread-1) [n:127.0.0.1:54046_solr    ] o.a.s.c.c.SolrZkClient makePath: /overseer/collection-map-completed
   [junit4]   2> 3007168 INFO  (jetty-launcher-9736-thread-2) [n:127.0.0.1:54049_solr    ] o.a.s.c.c.SolrZkClient makePath: /overseer/collection-map-completed
   [junit4]   2> 3007171 INFO  (jetty-launcher-9736-thread-2) [n:127.0.0.1:54049_solr    ] o.a.s.c.c.SolrZkClient makePath: /overseer/collection-map-failure
   [junit4]   2> 3007172 INFO  (jetty-launcher-9736-thread-1) [n:127.0.0.1:54046_solr    ] o.a.s.c.c.SolrZkClient makePath: /overseer/collection-map-failure
   [junit4]   2> 3007174 INFO  (jetty-launcher-9736-thread-2) [n:127.0.0.1:54049_solr    ] o.a.s.c.c.SolrZkClient makePath: /live_nodes
   [junit4]   2> 3007175 INFO  (jetty-launcher-9736-thread-1) [n:127.0.0.1:54046_solr    ] o.a.s.c.c.SolrZkClient makePath: /live_nodes
   [junit4]   2> 3007177 INFO  (jetty-launcher-9736-thread-1) [n:127.0.0.1:54046_solr    ] o.a.s.c.c.SolrZkClient makePath: /collections
   [junit4]   2> 3007177 INFO  (jetty-launcher-9736-thread-2) [n:127.0.0.1:54049_solr    ] o.a.s.c.c.SolrZkClient makePath: /collections
   [junit4]   2> 3007179 INFO  (jetty-launcher-9736-thread-1) [n:127.0.0.1:54046_solr    ] o.a.s.c.c.SolrZkClient makePath: /aliases.json
   [junit4]   2> 3007179 INFO  (jetty-launcher-9736-thread-2) [n:127.0.0.1:54049_solr    ] o.a.s.c.c.SolrZkClient makePath: /aliases.json
   [junit4]   2> 3007181 INFO  (jetty-launcher-9736-thread-1) [n:127.0.0.1:54046_solr    ] o.a.s.c.c.SolrZkClient makePath: /clusterstate.json
   [junit4]   2> 3007182 INFO  (jetty-launcher-9736-thread-2) [n:127.0.0.1:54049_solr    ] o.a.s.c.c.SolrZkClient makePath: /clusterstate.json
   [junit4]   2> 3007183 INFO  (jetty-launcher-9736-thread-1) [n:127.0.0.1:54046_solr    ] o.a.s.c.c.SolrZkClient makePath: /security.json
   [junit4]   2> 3007184 INFO  (jetty-launcher-9736-thread-2) [n:127.0.0.1:54049_solr    ] o.a.s.c.c.SolrZkClient makePath: /security.json
   [junit4]   2> 3007185 INFO  (jetty-launcher-9736-thread-2) [n:127.0.0.1:54049_solr    ] o.a.s.c.c.ZkStateReader Updating cluster state from ZooKeeper... 
   [junit4]   2> 3007185 INFO  (jetty-launcher-9736-thread-1) [n:127.0.0.1:54046_solr    ] o.a.s.c.c.ZkStateReader Updating cluster state from ZooKeeper... 
   [junit4]   2> 3007187 INFO  (jetty-launcher-9736-thread-2) [n:127.0.0.1:54049_solr    ] o.a.s.c.c.ZkStateReader Loaded empty cluster properties
   [junit4]   2> 3007187 INFO  (jetty-launcher-9736-thread-1) [n:127.0.0.1:54046_solr    ] o.a.s.c.c.ZkStateReader Loaded empty cluster properties
   [junit4]   2> 3007188 INFO  (jetty-launcher-9736-thread-2) [n:127.0.0.1:54049_solr    ] o.a.s.c.c.ZkStateReader Updated live nodes from ZooKeeper... (0) -> (0)
   [junit4]   2> 3007188 INFO  (jetty-launcher-9736-thread-1) [n:127.0.0.1:54046_solr    ] o.a.s.c.c.ZkStateReader Updated live nodes from ZooKeeper... (0) -> (0)
   [junit4]   2> 3007192 INFO  (jetty-launcher-9736-thread-2) [n:127.0.0.1:54049_solr    ] o.a.s.c.c.SolrZkClient makePath: /overseer_elect
   [junit4]   2> 3007194 INFO  (jetty-launcher-9736-thread-1) [n:127.0.0.1:54046_solr    ] o.a.s.c.c.SolrZkClient makePath: /overseer_elect/election
   [junit4]   2> 3007194 INFO  (jetty-launcher-9736-thread-2) [n:127.0.0.1:54049_solr    ] o.a.s.c.c.SolrZkClient makePath: /overseer_elect/election
   [junit4]   2> 3007195 INFO  (jetty-launcher-9736-thread-1) [n:127.0.0.1:54046_solr    ] o.a.s.c.Overseer Overseer (id=null) closing
   [junit4]   2> 3007195 INFO  (jetty-launcher-9736-thread-2) [n:127.0.0.1:54049_solr    ] o.a.s.c.Overseer Overseer (id=null) closing
   [junit4]   2> 3007197 INFO  (jetty-launcher-9736-thread-1) [n:127.0.0.1:54046_solr    ] o.a.s.c.LeaderElector Joined leadership election with path: /overseer_elect/election/96362002637979654-127.0.0.1:54046_solr-n_0000000000
   [junit4]   2> 3007197 INFO  (jetty-launcher-9736-thread-2) [n:127.0.0.1:54049_solr    ] o.a.s.c.LeaderElector Joined leadership election with path: /overseer_elect/election/96362002637979653-127.0.0.1:54049_solr-n_0000000001
   [junit4]   2> 3007197 INFO  (jetty-launcher-9736-thread-1) [n:127.0.0.1:54046_solr    ] o.a.s.c.OverseerElectionContext I am going to be the leader 127.0.0.1:54046_solr
   [junit4]   2> 3007197 INFO  (jetty-launcher-9736-thread-1) [n:127.0.0.1:54046_solr    ] o.a.s.c.c.SolrZkClient makePath: /overseer_elect/leader
   [junit4]   2> 3007198 INFO  (jetty-launcher-9736-thread-2) [n:127.0.0.1:54049_solr    ] o.a.s.c.LeaderElector Watching path /overseer_elect/election/96362002637979654-127.0.0.1:54046_solr-n_0000000000 to know if I could be the leader
   [junit4]   2> 3007198 INFO  (jetty-launcher-9736-thread-2) [n:127.0.0.1:54049_solr    ] o.a.s.c.ZkController Register node as live in ZooKeeper:/live_nodes/127.0.0.1:54049_solr
   [junit4]   2> 3007198 INFO  (jetty-launcher-9736-thread-2) [n:127.0.0.1:54049_solr    ] o.a.s.c.c.SolrZkClient makePath: /live_nodes/127.0.0.1:54049_solr
   [junit4]   2> 3007199 INFO  (jetty-launcher-9736-thread-1) [n:127.0.0.1:54046_solr    ] o.a.s.c.Overseer Overseer (id=96362002637979654-127.0.0.1:54046_solr-n_0000000000) starting
   [junit4]   2> 3007201 INFO  (zkCallback-9746-thread-1-processing-n:127.0.0.1:54049_solr) [n:127.0.0.1:54049_solr    ] o.a.s.c.c.ZkStateReader A live node change: [WatchedEvent state:SyncConnected type:NodeChildrenChanged path:/live_nodes], has occurred - updating... (live nodes size: [0])
   [junit4]   2> 3007201 INFO  (zkCallback-9747-thread-1-processing-n:127.0.0.1:54046_solr) [n:127.0.0.1:54046_solr    ] o.a.s.c.c.ZkStateReader A live node change: [WatchedEvent state:SyncConnected type:NodeChildrenChanged path:/live_nodes], has occurred - updating... (live nodes size: [0])
   [junit4]   2> 3007203 INFO  (zkCallback-9746-thread-1-processing-n:127.0.0.1:54049_solr) [n:127.0.0.1:54049_solr    ] o.a.s.c.c.ZkStateReader Updated live nodes from ZooKeeper... (0) -> (1)
   [junit4]   2> 3007204 INFO  (zkCallback-9747-thread-1-processing-n:127.0.0.1:54046_solr) [n:127.0.0.1:54046_solr    ] o.a.s.c.c.ZkStateReader Updated live nodes from ZooKeeper... (0) -> (1)
   [junit4]   2> 3007210 INFO  (jetty-launcher-9736-thread-1) [n:127.0.0.1:54046_solr    ] o.a.s.c.c.SolrZkClient makePath: /overseer/queue-work
   [junit4]   2> 3007220 INFO  (jetty-launcher-9736-thread-2) [n:127.0.0.1:54049_solr    ] o.a.s.c.CoreContainer Security conf doesn't exist. Skipping setup for authorization module.
   [junit4]   2> 3007220 INFO  (jetty-launcher-9736-thread-2) [n:127.0.0.1:54049_solr    ] o.a.s.c.CoreContainer No authentication plugin used.
   [junit4]   2> 3007222 INFO  (jetty-launcher-9736-thread-2) [n:127.0.0.1:54049_solr    ] o.a.s.c.CorePropertiesLocator Looking for core definitions underneath C:\Users\jenkins\workspace\Lucene-Solr-master-Windows\solr\build\solr-core\test\J1\temp\solr.schema.TestManagedSchemaAPI_8FC0C721DAFEABEC-001\tempDir-001\node2\.
   [junit4]   2> 3007222 INFO  (jetty-launcher-9736-thread-1) [n:127.0.0.1:54046_solr    ] o.a.s.c.OverseerAutoReplicaFailoverThread Starting OverseerAutoReplicaFailoverThread autoReplicaFailoverWorkLoopDelay=10000 autoReplicaFailoverWaitAfterExpiration=30000 autoReplicaFailoverBadNodeExpiration=60000
   [junit4]   2> 3007223 INFO  (jetty-launcher-9736-thread-2) [n:127.0.0.1:54049_solr    ] o.a.s.c.CorePropertiesLocator Found 0 core definitions
   [junit4]   2> 3007223 INFO  (jetty-launcher-9736-thread-1) [n:127.0.0.1:54046_solr    ] o.a.s.c.ZkController Publish node=127.0.0.1:54046_solr as DOWN
   [junit4]   2> 3007223 INFO  (OverseerCollectionConfigSetProcessor-96362002637979654-127.0.0.1:54046_solr-n_0000000000) [n:127.0.0.1:54046_solr    ] o.a.s.c.OverseerTaskProcessor Process current queue of overseer operations
   [junit4]   2> 3007224 INFO  (jetty-launcher-9736-thread-2) [n:127.0.0.1:54049_solr    ] o.a.s.s.SolrDispatchFilter user.dir=C:\Users\jenkins\workspace\Lucene-Solr-master-Windows\solr\build\solr-core\test\J1
   [junit4]   2> 3007224 INFO  (jetty-launcher-9736-thread-2) [n:127.0.0.1:54049_solr    ] o.a.s.s.SolrDispatchFilter SolrDispatchFilter.init() done
   [junit4]   2> 3007224 INFO  (OverseerStateUpdate-96362002637979654-127.0.0.1:54046_solr-n_0000000000) [n:127.0.0.1:54046_solr    ] o.a.s.c.Overseer Starting to work on the main queue
   [junit4]   2> 3007226 INFO  (jetty-launcher-9736-thread-1) [n:127.0.0.1:54046_solr    ] o.a.s.c.ZkController Register node as live in ZooKeeper:/live_nodes/127.0.0.1:54046_solr
   [junit4]   2> 3007226 INFO  (jetty-launcher-9736-thread-1) [n:127.0.0.1:54046_solr    ] o.a.s.c.c.SolrZkClient makePath: /live_nodes/127.0.0.1:54046_solr
   [junit4]   2> 3007226 INFO  (OverseerStateUpdate-96362002637979654-127.0.0.1:54046_solr-n_0000000000) [n:127.0.0.1:54046_solr    ] o.a.s.c.c.ZkStateReader Updated live nodes from ZooKeeper... (1) -> (1)
   [junit4]   2> 3007227 INFO  (zkCallback-9746-thread-1-processing-n:127.0.0.1:54049_solr) [n:127.0.0.1:54049_solr    ] o.a.s.c.c.ZkStateReader A live node change: [WatchedEvent state:SyncConnected type:NodeChildrenChanged path:/live_nodes], has occurred - updating... (live nodes size: [1])
   [junit4]   2> 3007227 INFO  (OverseerStateUpdate-96362002637979654-127.0.0.1:54046_solr-n_0000000000) [n:127.0.0.1:54046_solr    ] o.a.s.c.Overseer processMessage: queueSize: 1, message = {
   [junit4]   2>   "operation":"downnode",
   [junit4]   2>   "node_name":"127.0.0.1:54046_solr"} current state version: 0
   [junit4]   2> 3007227 INFO  (OverseerStateUpdate-96362002637979654-127.0.0.1:54046_solr-n_0000000000) [n:127.0.0.1:54046_solr    ] o.a.s.c.o.NodeMutator DownNode state invoked for node: 127.0.0.1:54046_solr
   [junit4]   2> 3007227 INFO  (zkCallback-9747-thread-1-processing-n:127.0.0.1:54046_solr) [n:127.0.0.1:54046_solr    ] o.a.s.c.c.ZkStateReader A live node change: [WatchedEvent state:SyncConnected type:NodeChildrenChanged path:/live_nodes], has occurred - updating... (live nodes size: [1])
   [junit4]   2> 3007229 INFO  (zkCallback-9746-thread-1-processing-n:127.0.0.1:54049_solr) [n:127.0.0.1:54049_solr    ] o.a.s.c.c.ZkStateReader Updated live nodes from ZooKeeper... (1) -> (2)
   [junit4]   2> 3007230 INFO  (zkCallback-9747-thread-1-processing-n:127.0.0.1:54046_solr) [n:127.0.0.1:54046_solr    ] o.a.s.c.c.ZkStateReader Updated live nodes from ZooKeeper... (1) -> (2)
   [junit4]   2> 3007235 INFO  (jetty-launcher-9736-thread-1) [n:127.0.0.1:54046_solr    ] o.a.s.c.CoreContainer Security conf doesn't exist. Skipping setup for authorization module.
   [junit4]   2> 3007235 INFO  (jetty-launcher-9736-thread-1) [n:127.0.0.1:54046_solr    ] o.a.s.c.CoreContainer No authentication plugin used.
   [junit4]   2> 3007237 INFO  (jetty-launcher-9736-thread-1) [n:127.0.0.1:54046_solr    ] o.a.s.c.CorePropertiesLocator Looking for core definitions underneath C:\Users\jenkins\workspace\Lucene-Solr-master-Windows\solr\build\solr-core\test\J1\temp\solr.schema.TestManagedSchemaAPI_8FC0C721DAFEABEC-001\tempDir-001\node1\.
   [junit4]   2> 3007237 INFO  (jetty-launcher-9736-thread-1) [n:127.0.0.1:54046_solr    ] o.a.s.c.CorePropertiesLocator Found 0 core definitions
   [junit4]   2> 3007238 INFO  (jetty-launcher-9736-thread-1) [n:127.0.0.1:54046_solr    ] o.a.s.s.SolrDispatchFilter user.dir=C:\Users\jenkins\workspace\Lucene-Solr-master-Windows\solr\build\solr-core\test\J1
   [junit4]   2> 3007238 INFO  (jetty-launcher-9736-thread-1) [n:127.0.0.1:54046_solr    ] o.a.s.s.SolrDispatchFilter SolrDispatchFilter.init() done
   [junit4]   2> 3007239 INFO  (SUITE-TestManagedSchemaAPI-seed#[8FC0C721DAFEABEC]-worker) [    ] o.a.s.c.c.SolrZkClient Using default ZkCredentialsProvider
   [junit4]   2> 3007239 INFO  (SUITE-TestManagedSchemaAPI-seed#[8FC0C721DAFEABEC]-worker) [    ] o.a.s.c.c.ConnectionManager Waiting for client to connect to ZooKeeper
   [junit4]   2> 3007240 INFO  (zkCallback-9750-thread-1) [    ] o.a.s.c.c.ConnectionManager Watcher org.apache.solr.common.cloud.ConnectionManager@1b8b179a name:ZooKeeperConnection Watcher:127.0.0.1:54042 got event WatchedEvent state:SyncConnected type:None path:null path:null type:None
   [junit4]   2> 3007241 INFO  (SUITE-TestManagedSchemaAPI-seed#[8FC0C721DAFEABEC]-worker) [    ] o.a.s.c.c.ConnectionManager Client is connected to ZooKeeper
   [junit4]   2> 3007241 INFO  (SUITE-TestManagedSchemaAPI-seed#[8FC0C721DAFEABEC]-worker) [    ] o.a.s.c.c.SolrZkClient Using default ZkACLProvider
   [junit4]   2> 3007243 INFO  (SUITE-TestManagedSchemaAPI-seed#[8FC0C721DAFEABEC]-worker) [    ] o.a.s.c.c.SolrZkClient Using default ZkCredentialsProvider
   [junit4]   2> 3007244 INFO  (SUITE-TestManagedSchemaAPI-seed#[8FC0C721DAFEABEC]-worker) [    ] o.a.s.c.c.ConnectionManager Waiting for client to connect to ZooKeeper
   [junit4]   2> 3007245 INFO  (zkCallback-9753-thread-1) [    ] o.a.s.c.c.ConnectionManager Watcher org.apache.solr.common.cloud.ConnectionManager@3afc135 name:ZooKeeperConnection Watcher:127.0.0.1:54042/solr got event WatchedEvent state:SyncConnected type:None path:null path:null type:None
   [junit4]   2> 3007247 INFO  (SUITE-TestManagedSchemaAPI-seed#[8FC0C721DAFEABEC]-worker) [    ] o.a.s.c.c.ConnectionManager Client is connected to ZooKeeper
   [junit4]   2> 3007247 INFO  (SUITE-TestManagedSchemaAPI-seed#[8FC0C721DAFEABEC]-worker) [    ] o.a.s.c.c.SolrZkClient Using default ZkACLProvider
   [junit4]   2> 3007247 INFO  (SUITE-TestManagedSchemaAPI-seed#[8FC0C721DAFEABEC]-worker) [    ] o.a.s.c.c.ZkStateReader Updating cluster state from ZooKeeper... 
   [junit4]   2> 3007248 INFO  (SUITE-TestManagedSchemaAPI-seed#[8FC0C721DAFEABEC]-worker) [    ] o.a.s.c.c.ZkStateReader Loaded empty cluster properties
   [junit4]   2> 3007248 INFO  (SUITE-TestManagedSchemaAPI-seed#[8FC0C721DAFEABEC]-worker) [    ] o.a.s.c.c.ZkStateReader Updated live nodes from ZooKeeper... (0) -> (2)
   [junit4]   2> 3007251 INFO  (SUITE-TestManagedSchemaAPI-seed#[8FC0C721DAFEABEC]-worker) [    ] o.a.s.c.c.SolrZkClient makePath: /configs/conf1/managed-schema
   [junit4]   2> 3007254 INFO  (SUITE-TestManagedSchemaAPI-seed#[8FC0C721DAFEABEC]-worker) [    ] o.a.s.c.c.SolrZkClient makePath: /configs/conf1/solrconfig.xml
   [junit4]   2> 3007292 INFO  (TEST-TestManagedSchemaAPI.test-seed#[8FC0C721DAFEABEC]) [    ] o.a.s.SolrTestCaseJ4 ###Starting test
   [junit4]   2> 3007298 INFO  (qtp595361354-44959) [n:127.0.0.1:54046_solr    ] o.a.s.h.a.CollectionsHandler Invoked Collection Action :create with params replicationFactor=2&collection.configName=conf1&name=testschemaapi&action=CREATE&numShards=1&wt=javabin&version=2 and sendToOCPQueue=true
   [junit4]   2> 3007302 INFO  (OverseerCollectionConfigSetProcessor-96362002637979654-127.0.0.1:54046_solr-n_0000000000) [n:127.0.0.1:54046_solr    ] o.a.s.c.OverseerTaskProcessor Overseer Collection Message Handler: Get the message id:/overseer/collection-queue-work/qn-0000000000 message:{
   [junit4]   2>   "name":"testschemaapi",
   [junit4]   2>   "fromApi":"true",
   [junit4]   2>   "replicationFactor":"2",
   [junit4]   2>   "collection.configName":"conf1",
   [junit4]   2>   "numShards":"1",
   [junit4]   2>   "stateFormat":"2",
   [junit4]   2>   "operation":"create"}
   [junit4]   2> 3007302 INFO  (OverseerThreadFactory-9777-thread-1-processing-n:127.0.0.1:54046_solr) [n:127.0.0.1:54046_solr    ] o.a.s.c.OverseerCollectionMessageHandler OverseerCollectionMessageHandler.processMessage : create , {
   [junit4]   2>   "name":"testschemaapi",
   [junit4]   2>   "fromApi":"true",
   [junit4]   2>   "replicationFactor":"2",
   [junit4]   2>   "collection.configName":"conf1",
   [junit4]   2>   "numShards":"1",
   [junit4]   2>   "stateFormat":"2",
   [junit4]   2>   "operation":"create"}
   [junit4]   2> 3007303 INFO  (OverseerThreadFactory-9777-thread-1-processing-n:127.0.0.1:54046_solr) [n:127.0.0.1:54046_solr    ] o.a.s.c.OverseerCollectionMessageHandler Create collection testschemaapi
   [junit4]   2> 3007304 INFO  (OverseerThreadFactory-9777-thread-1-processing-n:127.0.0.1:54046_solr) [n:127.0.0.1:54046_solr    ] o.a.s.c.OverseerCollectionMessageHandler creating collections conf node /collections/testschemaapi 
   [junit4]   2> 3007305 INFO  (OverseerThreadFactory-9777-thread-1-processing-n:127.0.0.1:54046_solr) [n:127.0.0.1:54046_solr    ] o.a.s.c.c.SolrZkClient makePath: /collections/testschemaapi
   [junit4]   2> 3007307 INFO  (zkCallback-9747-thread-1-processing-n:127.0.0.1:54046_solr) [n:127.0.0.1:54046_solr    ] o.a.s.c.c.ZkStateReader A collections change: [WatchedEvent state:SyncConnected type:NodeChildrenChanged path:/collections], has occurred - updating...
   [junit4]   2> 3007307 INFO  (zkCallback-9746-thread-1-processing-n:127.0.0.1:54049_solr) [n:127.0.0.1:54049_solr    ] o.a.s.c.c.ZkStateReader A collections change: [WatchedEvent state:SyncConnected type:NodeChildrenChanged path:/collections], has occurred - updating...
   [junit4]   2> 3007307 INFO  (zkCallback-9753-thread-1) [    ] o.a.s.c.c.ZkStateReader A collections change: [WatchedEvent state:SyncConnected type:NodeChildrenChanged path:/collections], has occurred - updating...
   [junit4]   2> 3007312 INFO  (OverseerStateUpdate-96362002637979654-127.0.0.1:54046_solr-n_0000000000) [n:127.0.0.1:54046_solr    ] o.a.s.c.Overseer processMessage: queueSize: 1, message = {
   [junit4]   2>   "name":"testschemaapi",
   [junit4]   2>   "fromApi":"true",
   [junit4]   2>   "replicationFactor":"2",
   [junit4]   2>   "collection.configName":"conf1",
   [junit4]   2>   "numShards":"1",
   [junit4]   2>   "stateFormat":"2",
   [junit4]   2>   "operation":"create"} current state version: 0
   [junit4]   2> 3007312 INFO  (OverseerStateUpdate-96362002637979654-127.0.0.1:54046_solr-n_0000000000) [n:127.0.0.1:54046_solr    ] o.a.s.c.o.ClusterStateMutator building a new cName: testschemaapi
   [junit4]   2> 3007313 INFO  (OverseerStateUpdate-96362002637979654-127.0.0.1:54046_solr-n_0000000000) [n:127.0.0.1:54046_solr    ] o.a.s.c.o.ZkStateWriter going to create_collection /collections/testschemaapi/state.json
   [junit4]   2> 3007413 INFO  (OverseerThreadFactory-9777-thread-1-processing-n:127.0.0.1:54046_solr) [n:127.0.0.1:54046_solr    ] o.a.s.c.OverseerCollectionMessageHandler Creating SolrCores for new collection testschemaapi, shardNames [shard1] , replicationFactor : 2
   [junit4]   2> 3007414 INFO  (OverseerThreadFactory-9777-thread-1-processing-n:127.0.0.1:54046_solr) [n:127.0.0.1:54046_solr    ] o.a.s.c.OverseerCollectionMessageHandler Creating core testschemaapi_shard1_replica2 as part of shard shard1 of collection testschemaapi on 127.0.0.1:54049_solr
   [junit4]   2> 3007414 INFO  (OverseerThreadFactory-9777-thread-1-processing-n:127.0.0.1:54046_solr) [n:127.0.0.1:54046_solr    ] o.a.s.c.OverseerCollectionMessageHandler Creating core testschemaapi_shard1_replica1 as part of shard shard1 of collection testschemaapi on 127.0.0.1:54046_solr
   [junit4]   2> 3007420 INFO  (qtp267573697-44971) [n:127.0.0.1:54049_solr    ] o.a.s.h.a.CoreAdminOperation core create command qt=/admin/cores&collection.configName=conf1&name=testschemaapi_shard1_replica2&action=CREATE&numShards=1&collection=testschemaapi&shard=shard1&wt=javabin&version=2
   [junit4]   2> 3007420 INFO  (qtp595361354-44963) [n:127.0.0.1:54046_solr    ] o.a.s.h.a.CoreAdminOperation core create command qt=/admin/cores&collection.configName=conf1&name=testschemaapi_shard1_replica1&action=CREATE&numShards=1&collection=testschemaapi&shard=shard1&wt=javabin&version=2
   [junit4]   2> 3007423 INFO  (qtp267573697-44971) [n:127.0.0.1:54049_solr    ] o.a.s.c.CoreDescriptor Created CoreDescriptor: {name=testschemaapi_shard1_replica2, collection.configName=conf1, config=solrconfig.xml, transient=false, schema=schema.xml, loadOnStartup=true, configSetProperties=configsetprops.json, collection=testschemaapi, numShards=1, dataDir=data\, shard=shard1}
   [junit4]   2> 3007425 INFO  (qtp595361354-44963) [n:127.0.0.1:54046_solr    ] o.a.s.c.CoreDescriptor Created CoreDescriptor: {name=testschemaapi_shard1_replica1, collection.configName=conf1, config=solrconfig.xml, transient=false, schema=schema.xml, loadOnStartup=true, configSetProperties=configsetprops.json, collection=testschemaapi, numShards=1, dataDir=data\, shard=shard1}
   [junit4]   2> 3007425 INFO  (qtp267573697-44971) [n:127.0.0.1:54049_solr c:testschemaapi s:shard1  x:testschemaapi_shard1_replica2] o.a.s.c.ZkController publishing state=down
   [junit4]   2> 3007426 INFO  (qtp595361354-44963) [n:127.0.0.1:54046_solr c:testschemaapi s:shard1  x:testschemaapi_shard1_replica1] o.a.s.c.ZkController publishing state=down
   [junit4]   2> 3007426 INFO  (qtp267573697-44971) [n:127.0.0.1:54049_solr c:testschemaapi s:shard1  x:testschemaapi_shard1_replica2] o.a.s.c.ZkController Registering watch for collection testschemaapi
   [junit4]   2> 3007426 INFO  (qtp267573697-44971) [n:127.0.0.1:54049_solr c:testschemaapi s:shard1  x:testschemaapi_shard1_replica2] o.a.s.c.c.ZkStateReader Add data for [testschemaapi] ver [0]
   [junit4]   2> 3007427 INFO  (qtp267573697-44971) [n:127.0.0.1:54049_solr c:testschemaapi s:shard1  x:testschemaapi_shard1_replica2] o.a.s.c.ZkController look for our core node name
   [junit4]   2> 3007427 INFO  (qtp595361354-44963) [n:127.0.0.1:54046_solr c:testschemaapi s:shard1  x:testschemaapi_shard1_replica1] o.a.s.c.ZkController Registering watch for collection testschemaapi
   [junit4]   2> 3007427 INFO  (OverseerStateUpdate-96362002637979654-127.0.0.1:54046_solr-n_0000000000) [n:127.0.0.1:54046_solr    ] o.a.s.c.Overseer processMessage: queueSize: 2, message = {
   [junit4]   2>   "core":"testschemaapi_shard1_replica2",
   [junit4]   2>   "roles":null,
   [junit4]   2>   "base_url":"http://127.0.0.1:54049/solr",
   [junit4]   2>   "node_name":"127.0.0.1:54049_solr",
   [junit4]   2>   "numShards":"1",
   [junit4]   2>   "state":"down",
   [junit4]   2>   "shard":"shard1",
   [junit4]   2>   "collection":"testschemaapi",
   [junit4]   2>   "operation":"state"} current state version: 0
   [junit4]   2> 3007427 INFO  (OverseerStateUpdate-96362002637979654-127.0.0.1:54046_solr-n_0000000000) [n:127.0.0.1:54046_solr    ] o.a.s.c.o.ReplicaMutator Update state numShards=1 message={
   [junit4]   2>   "core":"testschemaapi_shard1_replica2",
   [junit4]   2>   "roles":null,
   [junit4]   2>   "base_url":"http://127.0.0.1:54049/solr",
   [junit4]   2>   "node_name":"127.0.0.1:54049_solr",
   [junit4]   2>   "numShards":"1",
   [junit4]   2>   "state":"down",
   [junit4]   2>   "shard":"shard1",
   [junit4]   2>   "collection":"testschemaapi",
   [junit4]   2>   "operation":"state"}
   [junit4]   2> 3007428 INFO  (qtp595361354-44963) [n:127.0.0.1:54046_solr c:testschemaapi s:shard1  x:testschemaapi_shard1_replica1] o.a.s.c.c.ZkStateReader Add data for [testschemaapi] ver [0]
   [junit4]   2> 3007428 INFO  (qtp595361354-44963) [n:127.0.0.1:54046_solr c:testschemaapi s:shard1  x:testschemaapi_shard1_replica1] o.a.s.c.ZkController look for our core node name
   [junit4]   2> 3007430 INFO  (OverseerStateUpdate-96362002637979654-127.0.0.1:54046_solr-n_0000000000) [n:127.0.0.1:54046_solr    ] o.a.s.c.Overseer processMessage: queueSize: 1, message = {
   [junit4]   2>   "core":"testschemaapi_shard1_replica1",
   [junit4]   2>   "roles":null,
   [junit4]   2>   "base_url":"http://127.0.0.1:54046/solr",
   [junit4]   2>   "node_name":"127.0.0.1:54046_solr",
   [junit4]   2>   "numShards":"1",
   [junit4]   2>   "state":"down",
   [junit4]   2>   "shard":"shard1",
   [junit4]   2>   "collection":"testschemaapi",
   [junit4]   2>   "operation":"state"} current state version: 0
   [junit4]   2> 3007432 INFO  (OverseerStateUpdate-96362002637979654-127.0.0.1:54046_solr-n_0000000000) [n:127.0.0.1:54046_solr    ] o.a.s.c.o.ReplicaMutator Update state numShards=1 message={
   [junit4]   2>   "core":"testschemaapi_shard1_replica1",
   [junit4]   2>   "roles":null,
   [junit4]   2>   "base_url":"http://127.0.0.1:54046/solr",
   [junit4]   2>   "node_name":"127.0.0.1:54046_solr",
   [junit4]   2>   "numShards":"1",
   [junit4]   2>   "state":"down",
   [junit4]   2>   "shard":"shard1",
   [junit4]   2>   "collection":"testschemaapi",
   [junit4]   2>   "operation":"state"}
   [junit4]   2> 3007535 INFO  (OverseerStateUpdate-96362002637979654-127.0.0.1:54046_solr-n_0000000000) [n:127.0.0.1:54046_solr    ] o.a.s.c.o.ZkStateWriter going to update_collection /collections/testschemaapi/state.json version: 0
   [junit4]   2> 3007536 INFO  (zkCallback-9747-thread-1-processing-n:127.0.0.1:54046_solr) [n:127.0.0.1:54046_solr    ] o.a.s.c.c.ZkStateReader A cluster state change: [WatchedEvent state:SyncConnected type:NodeDataChanged path:/collections/testschemaapi/state.json] for collection [testschemaapi] has occurred - updating... (live nodes size: [2])
   [junit4]   2> 3007536 INFO  (zkCallback-9746-thread-1-processing-n:127.0.0.1:54049_solr) [n:127.0.0.1:54049_solr    ] o.a.s.c.c.ZkStateReader A cluster state change: [WatchedEvent state:SyncConnected type:NodeDataChanged path:/collections/testschemaapi/state.json] for collection [testschemaapi] has occurred - updating... (live nodes size: [2])
   [junit4]   2> 3007537 INFO  (zkCallback-9747-thread-1-processing-n:127.0.0.1:54046_solr) [n:127.0.0.1:54046_solr    ] o.a.s.c.c.ZkStateReader Updating data for [testschemaapi] from [0] to [1]
   [junit4]   2> 3007538 INFO  (zkCallback-9746-thread-1-processing-n:127.0.0.1:54049_solr) [n:127.0.0.1:54049_solr    ] o.a.s.c.c.ZkStateReader Updating data for [testschemaapi] from [0] to [1]
   [junit4]   2> 3008427 INFO  (qtp267573697-44971) [n:127.0.0.1:54049_solr c:testschemaapi s:shard1  x:testschemaapi_shard1_replica2] o.a.s.c.ZkController waiting to find shard id in clusterstate for testschemaapi_shard1_replica2
   [junit4]   2> 3008427 INFO  (qtp267573697-44971) [n:127.0.0.1:54049_solr c:testschemaapi s:shard1  x:testschemaapi_shard1_replica2] o.a.s.c.ZkController Check for collection zkNode:testschemaapi
   [junit4]   2> 3008427 INFO  (qtp267573697-44971) [n:127.0.0.1:54049_solr c:testschemaapi s:shard1  x:testschemaapi_shard1_replica2] o.a.s.c.ZkController Collection zkNode exists
   [junit4]   2> 3008427 INFO  (qtp267573697-44971) [n:127.0.0.1:54049_solr c:testschemaapi s:shard1  x:testschemaapi_shard1_replica2] o.a.s.c.c.ZkStateReader Load collection config from: [/collections/testschemaapi]
   [junit4]   2> 3008428 INFO  (qtp595361354-44963) [n:127.0.0.1:54046_solr c:testschemaapi s:shard1  x:testschemaapi_shard1_replica1] o.a.s.c.ZkController waiting to find shard id in clusterstate for testschemaapi_shard1_replica1
   [junit4]   2> 3008428 INFO  (qtp595361354-44963) [n:127.0.0.1:54046_solr c:testschemaapi s:shard1  x:testschemaapi_shard1_replica1] o.a.s.c.ZkController Check for collection zkNode:testschemaapi
   [junit4]   2> 3008428 INFO  (qtp595361354-44963) [n:127.0.0.1:54046_solr c:testschemaapi s:shard1  x:testschemaapi_shard1_replica1] o.a.s.c.ZkController Collection zkNode exists
   [junit4]   2> 3008428 INFO  (qtp595361354-44963) [n:127.0.0.1:54046_solr c:testschemaapi s:shard1  x:testschemaapi_shard1_replica1] o.a.s.c.c.ZkStateReader Load collection config from: [/collections/testschemaapi]
   [junit4]   2> 3008429 INFO  (qtp267573697-44971) [n:127.0.0.1:54049_solr c:testschemaapi s:shard1  x:testschemaapi_shard1_replica2] o.a.s.c.c.ZkStateReader path=[/collections/testschemaapi] [configName]=[conf1] specified config exists in ZooKeeper
   [junit4]   2> 3008429 INFO  (qtp267573697-44971) [n:127.0.0.1:54049_solr c:testschemaapi s:shard1  x:testschemaapi_shard1_replica2] o.a.s.c.SolrResourceLoader new SolrResourceLoader for directory: 'C:\Users\jenkins\workspace\Lucene-Solr-master-Windows\solr\build\solr-core\test\J1\temp\solr.schema.TestManagedSchemaAPI_8FC0C721DAFEABEC-001\tempDir-001\node2\testschemaapi_shard1_replica2'
   [junit4]   2> 3008429 INFO  (qtp267573697-44971) [n:127.0.0.1:54049_solr c:testschemaapi s:shard1  x:testschemaapi_shard1_replica2] o.a.s.c.SolrResourceLoader JNDI not configured for solr (NoInitialContextEx)
   [junit4]   2> 3008429 INFO  (qtp267573697-44971) [n:127.0.0.1:54049_solr c:testschemaapi s:shard1  x:testschemaapi_shard1_replica2] o.a.s.c.SolrResourceLoader solr home defaulted to 'solr/' (could not find system property or JNDI)
   [junit4]   2> 3008433 INFO  (qtp595361354-44963) [n:127.0.0.1:54046_solr c:testschemaapi s:shard1  x:testschemaapi_shard1_replica1] o.a.s.c.c.ZkStateReader path=[/collections/testschemaapi] [configName]=[conf1] specified config exists in ZooKeeper
   [junit4]   2> 3008433 INFO  (qtp595361354-44963) [n:127.0.0.1:54046_solr c:testschemaapi s:shard1  x:testschemaapi_shard1_replica1] o.a.s.c.SolrResourceLoader new SolrResourceLoader for directory: 'C:\Users\jenkins\workspace\Lucene-Solr-master-Windows\solr\build\solr-core\test\J1\temp\solr.schema.TestManagedSchemaAPI_8FC0C721DAFEABEC-001\tempDir-001\node1\testschemaapi_shard1_replica1'
   [junit4]   2> 3008434 INFO  (qtp595361354-44963) [n:127.0.0.1:54046_solr c:testschemaapi s:shard1  x:testschemaapi_shard1_replica1] o.a.s.c.SolrResourceLoader JNDI not configured for solr (NoInitialContextEx)
   [junit4]   2> 3008434 INFO  (qtp595361354-44963) [n:127.0.0.1:54046_solr c:testschemaapi s:shard1  x:testschemaapi_shard1_replica1] o.a.s.c.SolrResourceLoader solr home defaulted to 'solr/' (could not find system property or JNDI)
   [junit4]   2> 3008436 INFO  (qtp267573697-44971) [n:127.0.0.1:54049_solr c:testschemaapi s:shard1  x:testschemaapi_shard1_replica2] o.a.s.c.Config loaded config solrconfig.xml with version 0 
   [junit4]   2> 3008437 INFO  (qtp595361354-44963) [n:127.0.0.1:54046_solr c:testschemaapi s:shard1  x:testschemaapi_shard1_replica1] o.a.s.c.Config loaded config solrconfig.xml with version 0 
   [junit4]   2> 3008449 INFO  (qtp267573697-44971) [n:127.0.0.1:54049_solr c:testschemaapi s:shard1  x:testschemaapi_shard1_replica2] o.a.s.c.SolrConfig current version of requestparams : -1
   [junit4]   2> 3008449 INFO  (qtp595361354-44963) [n:127.0.0.1:54046_solr c:testschemaapi s:shard1  x:testschemaapi_shard1_replica1] o.a.s.c.SolrConfig current version of requestparams : -1
   [junit4]   2> 3008452 INFO  (qtp595361354-44963) [n:127.0.0.1:54046_solr c:testschemaapi s:shard1  x:testschemaapi_shard1_replica1] o.a.s.c.SolrConfig Using Lucene MatchVersion: 7.0.0
   [junit4]   2> 3008454 INFO  (qtp267573697-44971) [n:127.0.0.1:54049_solr c:testschemaapi s:shard1  x:testschemaapi_shard1_replica2] o.a.s.c.SolrConfig Using Lucene MatchVersion: 7.0.0
   [junit4]   2> 3008461 INFO  (qtp267573697-44971) [n:127.0.0.1:54049_solr c:testschemaapi s:shard1  x:testschemaapi_shard1_replica2] o.a.s.c.SolrConfig Loaded SolrConfig: solrconfig.xml
   [junit4]   2> 3008461 INFO  (qtp595361354-44963) [n:127.0.0.1:54046_solr c:testschemaapi s:shard1  x:testschemaapi_shard1_replica1] o.a.s.c.SolrConfig Loaded SolrConfig: solrconfig.xml
   [junit4]   2> 3008465 INFO  (qtp267573697-44971) [n:127.0.0.1:54049_solr c:testschemaapi s:shard1  x:testschemaapi_shard1_replica2] o.a.s.s.IndexSchema [testschemaapi_shard1_replica2] Schema name=minimal
   [junit4]   2> 3008466 INFO  (qtp595361354-44963) [n:127.0.0.1:54046_solr c:testschemaapi s:shard1  x:testschemaapi_shard1_replica1] o.a.s.s.IndexSchema [testschemaapi_shard1_replica1] Schema name=minimal
   [junit4]   2> 3008476 INFO  (qtp595361354-44963) [n:127.0.0.1:54046_solr c:testschemaapi s:shard1  x:testschemaapi_shard1_replica1] o.a.s.s.IndexSchema unique key field: id
   [junit4]   2> 3008476 INFO  (qtp267573697-44971) [n:127.0.0.1:54049_solr c:testschemaapi s:shard1  x:testschemaapi_shard1_replica2] o.a.s.s.IndexSchema unique key field: id
   [junit4]   2> 3008484 INFO  (qtp267573697-44971) [n:127.0.0.1:54049_solr c:testschemaapi s:shard1  x:testschemaapi_shard1_replica2] o.a.s.c.ConfigSetProperties Did not find ConfigSet properties, assuming default properties: Can't find resource 'configsetprops.json' in classpath or '/configs/conf1', cwd=C:\Users\jenkins\workspace\Lucene-Solr-master-Windows\solr\build\solr-core\test\J1
   [junit4]   2> 3008484 INFO  (qtp267573697-44971) [n:127.0.0.1:54049_solr c:testschemaapi s:shard1  x:testschemaapi_shard1_replica2] o.a.s.c.CoreContainer Creating SolrCore 'testschemaapi_shard1_replica2' using configuration from collection testschemaapi
   [junit4]   2> 3008484 INFO  (qtp595361354-44963) [n:127.0.0.1:54046_solr c:testschemaapi s:shard1  x:testschemaapi_shard1_replica1] o.a.s.c.ConfigSetProperties Did not find ConfigSet properties, assuming default properties: Can't find resource 'configsetprops.json' in classpath or '/configs/conf1', cwd=C:\Users\jenkins\workspace\Lucene-Solr-master-Windows\solr\build\solr-core\test\J1
   [junit4]   2> 3008484 INFO  (qtp267573697-44971) [n:127.0.0.1:54049_solr c:testschemaapi s:shard1 r:core_node1 x:testschemaapi_shard1_replica2] o.a.s.c.SolrCore org.apache.solr.core.MockDirectoryFactory
   [junit4]   2> 3008484 INFO  (qtp595361354-44963) [n:127.0.0.1:54046_solr c:testschemaapi s:shard1  x:testschemaapi_shard1_replica1] o.a.s.c.CoreContainer Creating SolrCore 'testschemaapi_shard1_replica1' using configuration from collection testschemaapi
   [junit4]   2> 3008484 INFO  (qtp267573697-44971) [n:127.0.0.1:54049_solr c:testschemaapi s:shard1 r:core_node1 x:testschemaapi_shard1_replica2] o.a.s.c.SolrCore [[testschemaapi_shard1_replica2] ] Opening new SolrCore at [C:\Users\jenkins\workspace\Lucene-Solr-master-Windows\solr\build\solr-core\test\J1\temp\solr.schema.TestManagedSchemaAPI_8FC0C721DAFEABEC-001\tempDir-001\node2\testschemaapi_shard1_replica2], dataDir=[C:\Users\jenkins\workspace\Lucene-Solr-master-Windows\solr\build\solr-core\test\J1\temp\solr.schema.TestManagedSchemaAPI_8FC0C721DAFEABEC-001\tempDir-001\node2\.\testschemaapi_shard1_replica2\data\]
   [junit4]   2> 3008484 INFO  (qtp267573697-44971) [n:127.0.0.1:54049_solr c:testschemaapi s:shard1 r:core_node1 x:testschemaapi_shard1_replica2] o.a.s.c.SolrCore JMX monitoring not detected for core: testschemaapi_shard1_replica2
   [junit4]   2> 3008484 INFO  (qtp595361354-44963) [n:127.0.0.1:54046_solr c:testschemaapi s:shard1 r:core_node2 x:testschemaapi_shard1_replica1] o.a.s.c.SolrCore org.apache.solr.core.MockDirectoryFactory
   [junit4]   2> 3008485 INFO  (qtp595361354-44963) [n:127.0.0.1:54046_solr c:testschemaapi s:shard1 r:core_node2 x:testschemaapi_shard1_replica1] o.a.s.c.SolrCore [[testschemaapi_shard1_replica1] ] Opening new SolrCore at [C:\Users\jenkins\workspace\Lucene-Solr-master-Windows\solr\build\solr-core\test\J1\temp\solr.schema.TestManagedSchemaAPI_8FC0C721DAFEABEC-001\tempDir-001\node1\testschemaapi_shard1_replica1], dataDir=[C:\Users\jenkins\workspace\Lucene-Solr-master-Windows\solr\build\solr-core\test\J1\temp\solr.schema.TestManagedSchemaAPI_8FC0C721DAFEABEC-001\tempDir-001\node1\.\testschemaapi_shard1_replica1\data\]
   [junit4]   2> 3008485 INFO  (qtp595361354-44963) [n:127.0.0.1:54046_solr c:testschemaapi s:shard1 r:core_node2 x:testschemaapi_shard1_replica1] o.a.s.c.SolrCore JMX monitoring not detected for core: testschemaapi_shard1_replica1
   [junit4]   2> 3008485 INFO  (qtp267573697-44971) [n:127.0.0.1:54049_solr c:testschemaapi s:shard1 r:core_node1 x:testschemaapi_shard1_replica2] o.a.s.c.CachingDirectoryFactory return new directory for C:\Users\jenkins\workspace\Lucene-Solr-master-Windows\solr\build\solr-core\test\J1\temp\solr.schema.TestManagedSchemaAPI_8FC0C721DAFEABEC-001\tempDir-001\node2\.\testschemaapi_shard1_replica2\data\snapshot_metadata
   [junit4]   2> 3008485 INFO  (qtp267573697-44971) [n:127.0.0.1:54049_solr c:testschemaapi s:shard1 r:core_node1 x:testschemaapi_shard1_replica2] o.a.s.c.s.SolrSnapshotMetaDataManager Loading from snapshot metadata file...
   [junit4]   2> 3008485 INFO  (qtp267573697-44971) [n:127.0.0.1:54049_solr c:testschemaapi s:shard1 r:core_node1 x:testschemaapi_shard1_replica2] o.a.s.c.CachingDirectoryFactory return new directory for C:\Users\jenkins\workspace\Lucene-Solr-master-Windows\solr\build\solr-core\test\J1\temp\solr.schema.TestManagedSchemaAPI_8FC0C721DAFEABEC-001\tempDir-001\node2\.\testschemaapi_shard1_replica2\data\
   [junit4]   2> 3008485 INFO  (qtp595361354-44963) [n:127.0.0.1:54046_solr c:testschemaapi s:shard1 r:core_node2 x:testschemaapi_shard1_replica1] o.a.s.c.CachingDirectoryFactory return new directory for C:\Users\jenkins\workspace\Lucene-Solr-master-Windows\solr\build\solr-core\test\J1\temp\solr.schema.TestManagedSchemaAPI_8FC0C721DAFEABEC-001\tempDir-001\node1\.\testschemaapi_shard1_replica1\data\snapshot_metadata
   [junit4]   2> 3008486 INFO  (qtp595361354-44963) [n:127.0.0.1:54046_solr c:testschemaapi s:shard1 r:core_node2 x:testschemaapi_shard1_replica1] o.a.s.c.s.SolrSnapshotMetaDataManager Loading from snapshot metadata file...
   [junit4]   2> 3008486 INFO  (qtp595361354-44963) [n:127.0.0.1:54046_solr c:testschemaapi s:shard1 r:core_node2 x:testschemaapi_shard1_replica1] o.a.s.c.CachingDirectoryFactory return new directory for C:\Users\jenkins\workspace\Lucene-Solr-master-Windows\solr\build\solr-core\test\J1\temp\solr.schema.TestManagedSchemaAPI_8FC0C721DAFEABEC-001\tempDir-001\node1\.\testschemaapi_shard1_replica1\data\
   [junit4]   2> 3008487 INFO  (qtp267573697-44971) [n:127.0.0.1:54049_solr c:testschemaapi s:shard1 r:core_node1 x:testschemaapi_shard1_replica2] o.a.s.c.SolrCore New index directory detected: old=null new=C:\Users\jenkins\workspace\Lucene-Solr-master-Windows\solr\build\solr-core\test\J1\temp\solr.schema.TestManagedSchemaAPI_8FC0C721DAFEABEC-001\tempDir-001\node2\.\testschemaapi_shard1_replica2\data\index/
   [junit4]   2> 3008487 WARN  (qtp267573697-44971) [n:127.0.0.1:54049_solr c:testschemaapi s:shard1 r:core_node1 x:testschemaapi_shard1_replica2] o.a.s.c.SolrCore [testschemaapi_shard1_replica2] Solr index directory 'C:\Users\jenkins\workspace\Lucene-Solr-master-Windows\solr\build\solr-core\test\J1\temp\solr.schema.TestManagedSchemaAPI_8FC0C721DAFEABEC-001\tempDir-001\node2\.\testschemaapi_shard1_replica2\data\index' doesn't exist. Creating new index...
   [junit4]   2> 3008488 INFO  (qtp267573697-44971) [n:127.0.0.1:54049_solr c:testschemaapi s:shard1 r:core_node1 x:testschemaapi_shard1_replica2] o.a.s.c.CachingDirectoryFactory return new directory for C:\Users\jenkins\workspace\Lucene-Solr-master-Windows\solr\build\solr-core\test\J1\temp\solr.schema.TestManagedSchemaAPI_8FC0C721DAFEABEC-001\tempDir-001\node2\.\testschemaapi_shard1_replica2\data\index
   [junit4]   2> 3008488 INFO  (qtp595361354-44963) [n:127.0.0.1:54046_solr c:testschemaapi s:shard1 r:core_node2 x:testschemaapi_shard1_replica1] o.a.s.c.SolrCore New index directory detected: old=null new=C:\Users\jenkins\workspace\Lucene-Solr-master-Windows\solr\build\solr-core\test\J1\temp\solr.schema.TestManagedSchemaAPI_8FC0C721DAFEABEC-001\tempDir-001\node1\.\testschemaapi_shard1_replica1\data\index/
   [junit4]   2> 3008488 WARN  (qtp595361354-44963) [n:127.0.0.1:54046_solr c:testschemaapi s:shard1 r:core_node2 x:testschemaapi_shard1_replica1] o.a.s.c.SolrCore [testschemaapi_shard1_replica1] Solr index directory 'C:\Users\jenkins\workspace\Lucene-Solr-master-Windows\solr\build\solr-core\test\J1\temp\solr.schema.TestManagedSchemaAPI_8FC0C721DAFEABEC-001\tempDir-001\node1\.\testschemaapi_shard1_replica1\data\index' doesn't exist. Creating new index...
   [junit4]   2> 3008491 INFO  (qtp595361354-44963) [n:127.0.0.1:54046_solr c:testschemaapi s:shard1 r:core_node2 x:testschemaapi_shard1_replica1] o.a.s.c.CachingDirectoryFactory return new directory for C:\Users\jenkins\workspace\Lucene-Solr-master-Windows\solr\build\solr-core\test\J1\temp\solr.schema.TestManagedSchemaAPI_8FC0C721DAFEABEC-001\tempDir-001\node1\.\testschemaapi_shard1_replica1\data\index
   [junit4]   2> 3008492 INFO  (qtp267573697-44971) [n:127.0.0.1:54049_solr c:testschemaapi s:shard1 r:core_node1 x:testschemaapi_shard1_replica2] o.a.s.

[...truncated too long message...]

TestRangeQuery, CollectionReloadTest, TestSolrCoreProperties, DocExpirationUpdateProcessorFactoryTest, BigEndianAscendingWordDeserializerTest, TestSchemaResource, BaseCdcrDistributedZkTest, TestDynamicLoading, AddBlockUpdateTest, FullSolrCloudDistribCmdsTest, TestNamedUpdateProcessors, DirectSolrConnectionTest, RAMDirectoryFactoryTest, TestQueryWrapperFilter, TestRandomRequestDistribution, TestSolrJ, CdcrVersionReplicationTest, TestSmileRequest, TestRealTimeGet, TestWriterPerf, TestDistributedGrouping, TestJoin, ConnectionReuseTest, OverseerStatusTest, TestSolrCoreSnapshots, LoggingHandlerTest, TestExpandComponent, DateMathParserTest, HdfsThreadLeakTest, PluginInfoTest, TestSolrIndexConfig, TestBinaryField, FileBasedSpellCheckerTest, TestFastOutputStream, BooleanFieldTest, TestManagedResource, NotRequiredUniqueKeyTest, AutoCommitTest, TestShardHandlerFactory, UniqFieldsUpdateProcessorFactoryTest, ClassificationUpdateProcessorFactoryTest, AddSchemaFieldsUpdateProcessorFactoryTest, CdcrUpdateLogTest, TestRecoveryHdfs, TestOmitPositions, TestObjectReleaseTracker, TestFieldCacheSort, TestConfigOverlay, LeaderInitiatedRecoveryOnShardRestartTest, DistributedSuggestComponentTest, TestCustomSort, HdfsCollectionsAPIDistributedZkTest, TestLeaderElectionZkExpiry, OverseerModifyCollectionTest, SolrCmdDistributorTest, TestDocTermOrds, TestRandomFaceting, SuggesterTest, SpatialHeatmapFacetsTest, TestFileDictionaryLookup, TestDistribDocBasedVersion, SuggesterWFSTTest, TestAuthorizationFramework, ParsingFieldUpdateProcessorsTest, RecoveryAfterSoftCommitTest, TestCollationFieldDocValues, BJQParserTest, TestFieldResource, TestReversedWildcardFilterFactory, SuggestComponentTest, ResponseLogComponentTest, LeaderFailoverAfterPartitionTest, DateFieldTest, SpellingQueryConverterTest, DOMUtilTest, TestLRUCache, SliceStateTest, SystemInfoHandlerTest, UUIDFieldTest, FileUtilsTest, CircularListTest, TestRTGBase, CursorPagingTest, SolrTestCaseJ4Test, TestCursorMarkWithoutUniqueKey, TestSimpleTrackingShardHandler, AsyncMigrateRouteKeyTest, CollectionTooManyReplicasTest, ConcurrentDeleteAndCreateCollectionTest, ConfigSetsAPITest, CustomCollectionTest, DistribJoinFromCollectionTest, DistributedQueueTest, HttpPartitionTest, SharedFSAutoReplicaFailoverTest, SimpleCollectionCreateDeleteTest, SolrCLIZkUtilsTest, TestAuthenticationFramework, TestCloudPseudoReturnFields, TestCollectionAPI, TestLockTree, TestRandomFlRTGCloud, TestRebalanceLeaders, TestSSLRandomization, TestSizeLimitedDistributedMap, TestTolerantUpdateProcessorCloud, TlogReplayBufferedWhileIndexingTest, TriLevelCompositeIdRoutingTest, ExitableDirectoryReaderTest, HdfsDirectoryFactoryTest, QueryResultKeyTest, TestConfigSetImmutable, TestSolrConfigHandler, TestRestoreCore, TestSolrConfigHandlerConcurrent, DistributedFacetPivotWhiteBoxTest, SuggestComponentContextFilterQueryTest, TestPivotHelperCode, TestTrackingShardHandlerFactory, HighlighterMaxOffsetTest, WrapperMergePolicyFactoryTest, TestIntervalFaceting, TestMacros, TestGeoJSONResponseWriter, TestGraphMLResponseWriter, TestRawResponseWriter, TestSortingResponseWriter, TestChildDocTransformer, TestSubQueryTransformerCrossCore, TestSubQueryTransformerDistrib, TestManagedSynonymFilterFactory, BadCopyFieldTest, ChangedSchemaMergeTest, DateRangeFieldTest, EnumFieldTest, SpatialRPTFieldTypeTest, TestCloudManagedSchema, TestManagedSchemaAPI]
   [junit4]   2> NOTE: reproduce with: ant test  -Dtestcase=TestManagedSchemaAPI -Dtests.seed=8FC0C721DAFEABEC -Dtests.slow=true -Dtests.locale=sr-Latn-ME -Dtests.timezone=America/Belem -Dtests.asserts=true -Dtests.file.encoding=UTF-8
   [junit4] ERROR   0.00s J1 | TestManagedSchemaAPI (suite) <<<
   [junit4]    > Throwable #1: java.lang.AssertionError: ObjectTracker found 10 object(s) that were not released!!! [MockDirectoryWrapper, TransactionLog, MockDirectoryWrapper, MockDirectoryWrapper, MDCAwareThreadPoolExecutor, TransactionLog, MockDirectoryWrapper, MockDirectoryWrapper, MockDirectoryWrapper, MDCAwareThreadPoolExecutor]
   [junit4]    > 	at __randomizedtesting.SeedInfo.seed([8FC0C721DAFEABEC]:0)
   [junit4]    > 	at org.apache.solr.SolrTestCaseJ4.teardownTestCases(SolrTestCaseJ4.java:257)
   [junit4]    > 	at java.lang.Thread.run(Thread.java:745)Throwable #2: java.io.IOException: Could not remove the following files (in the order of attempts):
   [junit4]    >    C:\Users\jenkins\workspace\Lucene-Solr-master-Windows\solr\build\solr-core\test\J1\temp\solr.schema.TestManagedSchemaAPI_8FC0C721DAFEABEC-001\tempDir-001\node1\testschemaapi_shard1_replica1\data\tlog\tlog.0000000000000000001: java.nio.file.FileSystemException: C:\Users\jenkins\workspace\Lucene-Solr-master-Windows\solr\build\solr-core\test\J1\temp\solr.schema.TestManagedSchemaAPI_8FC0C721DAFEABEC-001\tempDir-001\node1\testschemaapi_shard1_replica1\data\tlog\tlog.0000000000000000001: The process cannot access the file because it is being used by another process.
   [junit4]    >    C:\Users\jenkins\workspace\Lucene-Solr-master-Windows\solr\build\solr-core\test\J1\temp\solr.schema.TestManagedSchemaAPI_8FC0C721DAFEABEC-001\tempDir-001\node1\testschemaapi_shard1_replica1\data\tlog: java.nio.file.DirectoryNotEmptyException: C:\Users\jenkins\workspace\Lucene-Solr-master-Windows\solr\build\solr-core\test\J1\temp\solr.schema.TestManagedSchemaAPI_8FC0C721DAFEABEC-001\tempDir-001\node1\testschemaapi_shard1_replica1\data\tlog
   [junit4]    >    C:\Users\jenkins\workspace\Lucene-Solr-master-Windows\solr\build\solr-core\test\J1\temp\solr.schema.TestManagedSchemaAPI_8FC0C721DAFEABEC-001\tempDir-001\node1\testschemaapi_shard1_replica1\data: java.nio.file.DirectoryNotEmptyException: C:\Users\jenkins\workspace\Lucene-Solr-master-Windows\solr\build\solr-core\test\J1\temp\solr.schema.TestManagedSchemaAPI_8FC0C721DAFEABEC-001\tempDir-001\node1\testschemaapi_shard1_replica1\data
   [junit4]    >    C:\Users\jenkins\workspace\Lucene-Solr-master-Windows\solr\build\solr-core\test\J1\temp\solr.schema.TestManagedSchemaAPI_8FC0C721DAFEABEC-001\tempDir-001\node1\testschemaapi_shard1_replica1: java.nio.file.DirectoryNotEmptyException: C:\Users\jenkins\workspace\Lucene-Solr-master-Windows\solr\build\solr-core\test\J1\temp\solr.schema.TestManagedSchemaAPI_8FC0C721DAFEABEC-001\tempDir-001\node1\testschemaapi_shard1_replica1
   [junit4]    >    C:\Users\jenkins\workspace\Lucene-Solr-master-Windows\solr\build\solr-core\test\J1\temp\solr.schema.TestManagedSchemaAPI_8FC0C721DAFEABEC-001\tempDir-001\node1: java.nio.file.DirectoryNotEmptyException: C:\Users\jenkins\workspace\Lucene-Solr-master-Windows\solr\build\solr-core\test\J1\temp\solr.schema.TestManagedSchemaAPI_8FC0C721DAFEABEC-001\tempDir-001\node1
   [junit4]    >    C:\Users\jenkins\workspace\Lucene-Solr-master-Windows\solr\build\solr-core\test\J1\temp\solr.schema.TestManagedSchemaAPI_8FC0C721DAFEABEC-001\tempDir-001\node2\testschemaapi_shard1_replica2\data\tlog\tlog.0000000000000000000: java.nio.file.FileSystemException: C:\Users\jenkins\workspace\Lucene-Solr-master-Windows\solr\build\solr-core\test\J1\temp\solr.schema.TestManagedSchemaAPI_8FC0C721DAFEABEC-001\tempDir-001\node2\testschemaapi_shard1_replica2\data\tlog\tlog.0000000000000000000: The process cannot access the file because it is being used by another process.
   [junit4]    >    C:\Users\jenkins\workspace\Lucene-Solr-master-Windows\solr\build\solr-core\test\J1\temp\solr.schema.TestManagedSchemaAPI_8FC0C721DAFEABEC-001\tempDir-001\node2\testschemaapi_shard1_replica2\data\tlog: java.nio.file.DirectoryNotEmptyException: C:\Users\jenkins\workspace\Lucene-Solr-master-Windows\solr\build\solr-core\test\J1\temp\solr.schema.TestManagedSchemaAPI_8FC0C721DAFEABEC-001\tempDir-001\node2\testschemaapi_shard1_replica2\data\tlog
   [junit4]    >    C:\Users\jenkins\workspace\Lucene-Solr-master-Windows\solr\build\solr-core\test\J1\temp\solr.schema.TestManagedSchemaAPI_8FC0C721DAFEABEC-001\tempDir-001\node2\testschemaapi_shard1_replica2\data: java.nio.file.DirectoryNotEmptyException: C:\Users\jenkins\workspace\Lucene-Solr-master-Windows\solr\build\solr-core\test\J1\temp\solr.schema.TestManagedSchemaAPI_8FC0C721DAFEABEC-001\tempDir-001\node2\testschemaapi_shard1_replica2\data
   [junit4]    >    C:\Users\jenkins\workspace\Lucene-Solr-master-Windows\solr\build\solr-core\test\J1\temp\solr.schema.TestManagedSchemaAPI_8FC0C721DAFEABEC-001\tempDir-001\node2\testschemaapi_shard1_replica2: java.nio.file.DirectoryNotEmptyException: C:\Users\jenkins\workspace\Lucene-Solr-master-Windows\solr\build\solr-core\test\J1\temp\solr.schema.TestManagedSchemaAPI_8FC0C721DAFEABEC-001\tempDir-001\node2\testschemaapi_shard1_replica2
   [junit4]    >    C:\Users\jenkins\workspace\Lucene-Solr-master-Windows\solr\build\solr-core\test\J1\temp\solr.schema.TestManagedSchemaAPI_8FC0C721DAFEABEC-001\tempDir-001\node2: java.nio.file.DirectoryNotEmptyException: C:\Users\jenkins\workspace\Lucene-Solr-master-Windows\solr\build\solr-core\test\J1\temp\solr.schema.TestManagedSchemaAPI_8FC0C721DAFEABEC-001\tempDir-001\node2
   [junit4]    >    C:\Users\jenkins\workspace\Lucene-Solr-master-Windows\solr\build\solr-core\test\J1\temp\solr.schema.TestManagedSchemaAPI_8FC0C721DAFEABEC-001\tempDir-001: java.nio.file.DirectoryNotEmptyException: C:\Users\jenkins\workspace\Lucene-Solr-master-Windows\solr\build\solr-core\test\J1\temp\solr.schema.TestManagedSchemaAPI_8FC0C721DAFEABEC-001\tempDir-001
   [junit4]    >    C:\Users\jenkins\workspace\Lucene-Solr-master-Windows\solr\build\solr-core\test\J1\temp\solr.schema.TestManagedSchemaAPI_8FC0C721DAFEABEC-001: java.nio.file.DirectoryNotEmptyException: C:\Users\jenkins\workspace\Lucene-Solr-master-Windows\solr\build\solr-core\test\J1\temp\solr.schema.TestManagedSchemaAPI_8FC0C721DAFEABEC-001
   [junit4]    > 	at org.apache.lucene.util.IOUtils.rm(IOUtils.java:323)
   [junit4]    > 	at java.lang.Thread.run(Thread.java:745)
   [junit4] Completed [573/626 (2!)] on J1 in 12.26s, 1 test, 1 failure, 1 error <<< FAILURES!

[...truncated 60263 lines...]


Mime
View raw message