lucene-dev mailing list archives

Site index · List index
Message view « Date » · « Thread »
Top « Date » · « Thread »
From Steve Rowe <sar...@gmail.com>
Subject Re: [JENKINS-EA] Lucene-Solr-master-Linux (32bit/jdk-9-ea+132) - Build # 17644 - Unstable!
Date Mon, 22 Aug 2016 18:04:17 GMT
This reproduces for me on Linux with Oracle JDK 1.8.0_77

> On Aug 22, 2016, at 1:40 PM, Policeman Jenkins Server <jenkins@thetaphi.de> wrote:
> 
> Build: http://jenkins.thetaphi.de/job/Lucene-Solr-master-Linux/17644/
> Java: 32bit/jdk-9-ea+132 -server -XX:+UseParallelGC
> 
> 1 tests failed.
> FAILED:  org.apache.lucene.index.TestAllFilesCheckIndexHeader.test
> 
> Error Message:
> file "_e.tvx" was already written to
> 
> Stack Trace:
> java.io.IOException: file "_e.tvx" was already written to
> 	at __randomizedtesting.SeedInfo.seed([8133F5B315A4BBBA:967CA69BB58D642]:0)
> 	at org.apache.lucene.store.MockDirectoryWrapper.createOutput(MockDirectoryWrapper.java:654)
> 	at org.apache.lucene.index.TestAllFilesCheckIndexHeader.checkOneFile(TestAllFilesCheckIndexHeader.java:106)
> 	at org.apache.lucene.index.TestAllFilesCheckIndexHeader.checkIndexHeader(TestAllFilesCheckIndexHeader.java:81)
> 	at org.apache.lucene.index.TestAllFilesCheckIndexHeader.test(TestAllFilesCheckIndexHeader.java:74)
> 	at jdk.internal.reflect.NativeMethodAccessorImpl.invoke0(java.base@9-ea/Native Method)
> 	at jdk.internal.reflect.NativeMethodAccessorImpl.invoke(java.base@9-ea/NativeMethodAccessorImpl.java:62)
> 	at jdk.internal.reflect.DelegatingMethodAccessorImpl.invoke(java.base@9-ea/DelegatingMethodAccessorImpl.java:43)
> 	at java.lang.reflect.Method.invoke(java.base@9-ea/Method.java:535)
> 	at com.carrotsearch.randomizedtesting.RandomizedRunner.invoke(RandomizedRunner.java:1764)
> 	at com.carrotsearch.randomizedtesting.RandomizedRunner$8.evaluate(RandomizedRunner.java:871)
> 	at com.carrotsearch.randomizedtesting.RandomizedRunner$9.evaluate(RandomizedRunner.java:907)
> 	at com.carrotsearch.randomizedtesting.RandomizedRunner$10.evaluate(RandomizedRunner.java:921)
> 	at org.apache.lucene.util.TestRuleSetupTeardownChained$1.evaluate(TestRuleSetupTeardownChained.java:49)
> 	at org.apache.lucene.util.AbstractBeforeAfterRule$1.evaluate(AbstractBeforeAfterRule.java:45)
> 	at org.apache.lucene.util.TestRuleThreadAndTestName$1.evaluate(TestRuleThreadAndTestName.java:48)
> 	at org.apache.lucene.util.TestRuleIgnoreAfterMaxFailures$1.evaluate(TestRuleIgnoreAfterMaxFailures.java:64)
> 	at org.apache.lucene.util.TestRuleMarkFailure$1.evaluate(TestRuleMarkFailure.java:47)
> 	at com.carrotsearch.randomizedtesting.rules.StatementAdapter.evaluate(StatementAdapter.java:36)
> 	at com.carrotsearch.randomizedtesting.ThreadLeakControl$StatementRunner.run(ThreadLeakControl.java:367)
> 	at com.carrotsearch.randomizedtesting.ThreadLeakControl.forkTimeoutingTask(ThreadLeakControl.java:809)
> 	at com.carrotsearch.randomizedtesting.ThreadLeakControl$3.evaluate(ThreadLeakControl.java:460)
> 	at com.carrotsearch.randomizedtesting.RandomizedRunner.runSingleTest(RandomizedRunner.java:880)
> 	at com.carrotsearch.randomizedtesting.RandomizedRunner$5.evaluate(RandomizedRunner.java:781)
> 	at com.carrotsearch.randomizedtesting.RandomizedRunner$6.evaluate(RandomizedRunner.java:816)
> 	at com.carrotsearch.randomizedtesting.RandomizedRunner$7.evaluate(RandomizedRunner.java:827)
> 	at org.apache.lucene.util.AbstractBeforeAfterRule$1.evaluate(AbstractBeforeAfterRule.java:45)
> 	at com.carrotsearch.randomizedtesting.rules.StatementAdapter.evaluate(StatementAdapter.java:36)
> 	at org.apache.lucene.util.TestRuleStoreClassName$1.evaluate(TestRuleStoreClassName.java:41)
> 	at com.carrotsearch.randomizedtesting.rules.NoShadowingOrOverridesOnMethodsRule$1.evaluate(NoShadowingOrOverridesOnMethodsRule.java:40)
> 	at com.carrotsearch.randomizedtesting.rules.NoShadowingOrOverridesOnMethodsRule$1.evaluate(NoShadowingOrOverridesOnMethodsRule.java:40)
> 	at com.carrotsearch.randomizedtesting.rules.StatementAdapter.evaluate(StatementAdapter.java:36)
> 	at com.carrotsearch.randomizedtesting.rules.StatementAdapter.evaluate(StatementAdapter.java:36)
> 	at com.carrotsearch.randomizedtesting.rules.StatementAdapter.evaluate(StatementAdapter.java:36)
> 	at org.apache.lucene.util.TestRuleAssertionsRequired$1.evaluate(TestRuleAssertionsRequired.java:53)
> 	at org.apache.lucene.util.TestRuleMarkFailure$1.evaluate(TestRuleMarkFailure.java:47)
> 	at org.apache.lucene.util.TestRuleIgnoreAfterMaxFailures$1.evaluate(TestRuleIgnoreAfterMaxFailures.java:64)
> 	at org.apache.lucene.util.TestRuleIgnoreTestSuites$1.evaluate(TestRuleIgnoreTestSuites.java:54)
> 	at com.carrotsearch.randomizedtesting.rules.StatementAdapter.evaluate(StatementAdapter.java:36)
> 	at com.carrotsearch.randomizedtesting.ThreadLeakControl$StatementRunner.run(ThreadLeakControl.java:367)
> 	at java.lang.Thread.run(java.base@9-ea/Thread.java:843)
> 
> 
> 
> 
> Build Log:
> [...truncated 467 lines...]
>   [junit4] Suite: org.apache.lucene.index.TestAllFilesCheckIndexHeader
>   [junit4]   2> NOTE: reproduce with: ant test  -Dtestcase=TestAllFilesCheckIndexHeader
-Dtests.method=test -Dtests.seed=8133F5B315A4BBBA -Dtests.multiplier=3 -Dtests.slow=true -Dtests.locale=vai-Latn
-Dtests.timezone=America/Fortaleza -Dtests.asserts=true -Dtests.file.encoding=UTF-8
>   [junit4] ERROR   0.32s J2 | TestAllFilesCheckIndexHeader.test <<<
>   [junit4]    > Throwable #1: java.io.IOException: file "_e.tvx" was already written
to
>   [junit4]    > 	at __randomizedtesting.SeedInfo.seed([8133F5B315A4BBBA:967CA69BB58D642]:0)
>   [junit4]    > 	at org.apache.lucene.store.MockDirectoryWrapper.createOutput(MockDirectoryWrapper.java:654)
>   [junit4]    > 	at org.apache.lucene.index.TestAllFilesCheckIndexHeader.checkOneFile(TestAllFilesCheckIndexHeader.java:106)
>   [junit4]    > 	at org.apache.lucene.index.TestAllFilesCheckIndexHeader.checkIndexHeader(TestAllFilesCheckIndexHeader.java:81)
>   [junit4]    > 	at org.apache.lucene.index.TestAllFilesCheckIndexHeader.test(TestAllFilesCheckIndexHeader.java:74)
>   [junit4]    > 	at jdk.internal.reflect.NativeMethodAccessorImpl.invoke0(java.base@9-ea/Native
Method)
>   [junit4]    > 	at jdk.internal.reflect.NativeMethodAccessorImpl.invoke(java.base@9-ea/NativeMethodAccessorImpl.java:62)
>   [junit4]    > 	at jdk.internal.reflect.DelegatingMethodAccessorImpl.invoke(java.base@9-ea/DelegatingMethodAccessorImpl.java:43)
>   [junit4]    > 	at java.lang.Thread.run(java.base@9-ea/Thread.java:843)
>   [junit4]   2> NOTE: test params are: codec=Asserting(Lucene62): {}, docValues:{},
maxPointsInLeafNode=690, maxMBSortInHeap=6.334662757981386, sim=ClassicSimilarity, locale=vai-Latn,
timezone=America/Fortaleza
>   [junit4]   2> NOTE: Linux 4.4.0-31-generic i386/Oracle Corporation 9-ea (32-bit)/cpus=12,threads=1,free=141938112,total=221249536
>   [junit4]   2> NOTE: All tests run in this JVM: [Test2BBinaryDocValues, TestLucene62SegmentInfoFormat,
TestDeterminizeLexicon, Test2BPagedBytes, TestLucene53NormsFormat, TestMultiTermsEnum, TestIndexWriterCommit,
TestVersion, TestSpanExplanations, TestRamUsageEstimator, TestIndexWriterReader, TestSparseFixedBitSet,
LimitedFiniteStringsIteratorTest, TestDirectMonotonic, Test2BPostingsBytes, TestFuzzyQuery,
TestFastCompressionMode, TestPerSegmentDeletes, TestLazyProxSkipping, TestSameScoresWithThreads,
TestCollectionUtil, TestBinaryDocValuesUpdates, TestAllFilesCheckIndexHeader]
>   [junit4] Completed [76/432 (1!)] on J2 in 0.33s, 1 test, 1 error <<< FAILURES!
> 
> [...truncated 61796 lines...]
> 
> 
> ---------------------------------------------------------------------
> To unsubscribe, e-mail: dev-unsubscribe@lucene.apache.org
> For additional commands, e-mail: dev-help@lucene.apache.org


---------------------------------------------------------------------
To unsubscribe, e-mail: dev-unsubscribe@lucene.apache.org
For additional commands, e-mail: dev-help@lucene.apache.org


Mime
View raw message