lucene-dev mailing list archives

Site index · List index
Message view « Date » · « Thread »
Top « Date » · « Thread »
From Policeman Jenkins Server <jenk...@thetaphi.de>
Subject [JENKINS] Lucene-Solr-6.x-Solaris (64bit/jdk1.8.0) - Build # 320 - Unstable!
Date Thu, 11 Aug 2016 05:37:34 GMT
Build: http://jenkins.thetaphi.de/job/Lucene-Solr-6.x-Solaris/320/
Java: 64bit/jdk1.8.0 -XX:+UseCompressedOops -XX:+UseConcMarkSweepGC

2 tests failed.
FAILED:  org.apache.solr.cloud.LeaderFailoverAfterPartitionTest.test

Error Message:
org.apache.solr.client.solrj.SolrServerException: No live SolrServers available to handle this request:[http://127.0.0.1:53657/ny_nfs/c8n_1x3_lf_shard1_replica1]

Stack Trace:
org.apache.solr.client.solrj.SolrServerException: org.apache.solr.client.solrj.SolrServerException: No live SolrServers available to handle this request:[http://127.0.0.1:53657/ny_nfs/c8n_1x3_lf_shard1_replica1]
	at __randomizedtesting.SeedInfo.seed([5EA5C491DD462F85:D6F1FB4B73BA427D]:0)
	at org.apache.solr.client.solrj.impl.CloudSolrClient.directUpdate(CloudSolrClient.java:774)
	at org.apache.solr.client.solrj.impl.CloudSolrClient.sendRequest(CloudSolrClient.java:1172)
	at org.apache.solr.client.solrj.impl.CloudSolrClient.requestWithRetryOnStaleState(CloudSolrClient.java:1061)
	at org.apache.solr.client.solrj.impl.CloudSolrClient.request(CloudSolrClient.java:997)
	at org.apache.solr.client.solrj.SolrClient.request(SolrClient.java:1219)
	at org.apache.solr.cloud.HttpPartitionTest.sendDoc(HttpPartitionTest.java:592)
	at org.apache.solr.cloud.HttpPartitionTest.sendDoc(HttpPartitionTest.java:578)
	at org.apache.solr.cloud.LeaderFailoverAfterPartitionTest.testRf3WithLeaderFailover(LeaderFailoverAfterPartitionTest.java:174)
	at org.apache.solr.cloud.LeaderFailoverAfterPartitionTest.test(LeaderFailoverAfterPartitionTest.java:55)
	at sun.reflect.NativeMethodAccessorImpl.invoke0(Native Method)
	at sun.reflect.NativeMethodAccessorImpl.invoke(NativeMethodAccessorImpl.java:62)
	at sun.reflect.DelegatingMethodAccessorImpl.invoke(DelegatingMethodAccessorImpl.java:43)
	at java.lang.reflect.Method.invoke(Method.java:498)
	at com.carrotsearch.randomizedtesting.RandomizedRunner.invoke(RandomizedRunner.java:1764)
	at com.carrotsearch.randomizedtesting.RandomizedRunner$8.evaluate(RandomizedRunner.java:871)
	at com.carrotsearch.randomizedtesting.RandomizedRunner$9.evaluate(RandomizedRunner.java:907)
	at com.carrotsearch.randomizedtesting.RandomizedRunner$10.evaluate(RandomizedRunner.java:921)
	at org.apache.solr.BaseDistributedSearchTestCase$ShardsRepeatRule$ShardsFixedStatement.callStatement(BaseDistributedSearchTestCase.java:992)
	at org.apache.solr.BaseDistributedSearchTestCase$ShardsRepeatRule$ShardsStatement.evaluate(BaseDistributedSearchTestCase.java:967)
	at com.carrotsearch.randomizedtesting.rules.SystemPropertiesRestoreRule$1.evaluate(SystemPropertiesRestoreRule.java:57)
	at org.apache.lucene.util.TestRuleSetupTeardownChained$1.evaluate(TestRuleSetupTeardownChained.java:49)
	at org.apache.lucene.util.AbstractBeforeAfterRule$1.evaluate(AbstractBeforeAfterRule.java:45)
	at org.apache.lucene.util.TestRuleThreadAndTestName$1.evaluate(TestRuleThreadAndTestName.java:48)
	at org.apache.lucene.util.TestRuleIgnoreAfterMaxFailures$1.evaluate(TestRuleIgnoreAfterMaxFailures.java:64)
	at org.apache.lucene.util.TestRuleMarkFailure$1.evaluate(TestRuleMarkFailure.java:47)
	at com.carrotsearch.randomizedtesting.rules.StatementAdapter.evaluate(StatementAdapter.java:36)
	at com.carrotsearch.randomizedtesting.ThreadLeakControl$StatementRunner.run(ThreadLeakControl.java:367)
	at com.carrotsearch.randomizedtesting.ThreadLeakControl.forkTimeoutingTask(ThreadLeakControl.java:809)
	at com.carrotsearch.randomizedtesting.ThreadLeakControl$3.evaluate(ThreadLeakControl.java:460)
	at com.carrotsearch.randomizedtesting.RandomizedRunner.runSingleTest(RandomizedRunner.java:880)
	at com.carrotsearch.randomizedtesting.RandomizedRunner$5.evaluate(RandomizedRunner.java:781)
	at com.carrotsearch.randomizedtesting.RandomizedRunner$6.evaluate(RandomizedRunner.java:816)
	at com.carrotsearch.randomizedtesting.RandomizedRunner$7.evaluate(RandomizedRunner.java:827)
	at com.carrotsearch.randomizedtesting.rules.StatementAdapter.evaluate(StatementAdapter.java:36)
	at com.carrotsearch.randomizedtesting.rules.SystemPropertiesRestoreRule$1.evaluate(SystemPropertiesRestoreRule.java:57)
	at org.apache.lucene.util.AbstractBeforeAfterRule$1.evaluate(AbstractBeforeAfterRule.java:45)
	at com.carrotsearch.randomizedtesting.rules.StatementAdapter.evaluate(StatementAdapter.java:36)
	at org.apache.lucene.util.TestRuleStoreClassName$1.evaluate(TestRuleStoreClassName.java:41)
	at com.carrotsearch.randomizedtesting.rules.NoShadowingOrOverridesOnMethodsRule$1.evaluate(NoShadowingOrOverridesOnMethodsRule.java:40)
	at com.carrotsearch.randomizedtesting.rules.NoShadowingOrOverridesOnMethodsRule$1.evaluate(NoShadowingOrOverridesOnMethodsRule.java:40)
	at com.carrotsearch.randomizedtesting.rules.StatementAdapter.evaluate(StatementAdapter.java:36)
	at com.carrotsearch.randomizedtesting.rules.StatementAdapter.evaluate(StatementAdapter.java:36)
	at com.carrotsearch.randomizedtesting.rules.StatementAdapter.evaluate(StatementAdapter.java:36)
	at org.apache.lucene.util.TestRuleAssertionsRequired$1.evaluate(TestRuleAssertionsRequired.java:53)
	at org.apache.lucene.util.TestRuleMarkFailure$1.evaluate(TestRuleMarkFailure.java:47)
	at org.apache.lucene.util.TestRuleIgnoreAfterMaxFailures$1.evaluate(TestRuleIgnoreAfterMaxFailures.java:64)
	at org.apache.lucene.util.TestRuleIgnoreTestSuites$1.evaluate(TestRuleIgnoreTestSuites.java:54)
	at com.carrotsearch.randomizedtesting.rules.StatementAdapter.evaluate(StatementAdapter.java:36)
	at com.carrotsearch.randomizedtesting.ThreadLeakControl$StatementRunner.run(ThreadLeakControl.java:367)
	at java.lang.Thread.run(Thread.java:745)
Caused by: org.apache.solr.client.solrj.SolrServerException: No live SolrServers available to handle this request:[http://127.0.0.1:53657/ny_nfs/c8n_1x3_lf_shard1_replica1]
	at org.apache.solr.client.solrj.impl.LBHttpSolrClient.request(LBHttpSolrClient.java:383)
	at org.apache.solr.client.solrj.impl.CloudSolrClient.directUpdate(CloudSolrClient.java:768)
	... 49 more
Caused by: org.apache.solr.client.solrj.SolrServerException: Server refused connection at: http://127.0.0.1:53657/ny_nfs/c8n_1x3_lf_shard1_replica1
	at org.apache.solr.client.solrj.impl.HttpSolrClient.executeMethod(HttpSolrClient.java:599)
	at org.apache.solr.client.solrj.impl.HttpSolrClient.request(HttpSolrClient.java:261)
	at org.apache.solr.client.solrj.impl.HttpSolrClient.request(HttpSolrClient.java:250)
	at org.apache.solr.client.solrj.impl.LBHttpSolrClient.doRequest(LBHttpSolrClient.java:403)
	at org.apache.solr.client.solrj.impl.LBHttpSolrClient.request(LBHttpSolrClient.java:356)
	... 50 more
Caused by: java.net.ConnectException: Connection refused
	at java.net.PlainSocketImpl.socketConnect(Native Method)
	at java.net.AbstractPlainSocketImpl.doConnect(AbstractPlainSocketImpl.java:350)
	at java.net.AbstractPlainSocketImpl.connectToAddress(AbstractPlainSocketImpl.java:206)
	at java.net.AbstractPlainSocketImpl.connect(AbstractPlainSocketImpl.java:188)
	at java.net.SocksSocketImpl.connect(SocksSocketImpl.java:392)
	at java.net.Socket.connect(Socket.java:589)
	at org.apache.http.conn.scheme.PlainSocketFactory.connectSocket(PlainSocketFactory.java:117)
	at org.apache.http.impl.conn.DefaultClientConnectionOperator.openConnection(DefaultClientConnectionOperator.java:177)
	at org.apache.http.impl.conn.ManagedClientConnectionImpl.open(ManagedClientConnectionImpl.java:304)
	at org.apache.http.impl.client.DefaultRequestDirector.tryConnect(DefaultRequestDirector.java:611)
	at org.apache.http.impl.client.DefaultRequestDirector.execute(DefaultRequestDirector.java:446)
	at org.apache.http.impl.client.AbstractHttpClient.doExecute(AbstractHttpClient.java:882)
	at org.apache.http.impl.client.CloseableHttpClient.execute(CloseableHttpClient.java:82)
	at org.apache.http.impl.client.CloseableHttpClient.execute(CloseableHttpClient.java:107)
	at org.apache.http.impl.client.CloseableHttpClient.execute(CloseableHttpClient.java:55)
	at org.apache.solr.client.solrj.impl.HttpSolrClient.executeMethod(HttpSolrClient.java:497)
	... 54 more


FAILED:  org.apache.solr.core.TestArbitraryIndexDir.testLoadNewIndexDir

Error Message:
Exception during query

Stack Trace:
java.lang.RuntimeException: Exception during query
	at __randomizedtesting.SeedInfo.seed([5EA5C491DD462F85:B7FF7FA943DFBF2D]:0)
	at org.apache.solr.SolrTestCaseJ4.assertQ(SolrTestCaseJ4.java:783)
	at org.apache.solr.core.TestArbitraryIndexDir.testLoadNewIndexDir(TestArbitraryIndexDir.java:107)
	at sun.reflect.NativeMethodAccessorImpl.invoke0(Native Method)
	at sun.reflect.NativeMethodAccessorImpl.invoke(NativeMethodAccessorImpl.java:62)
	at sun.reflect.DelegatingMethodAccessorImpl.invoke(DelegatingMethodAccessorImpl.java:43)
	at java.lang.reflect.Method.invoke(Method.java:498)
	at com.carrotsearch.randomizedtesting.RandomizedRunner.invoke(RandomizedRunner.java:1764)
	at com.carrotsearch.randomizedtesting.RandomizedRunner$8.evaluate(RandomizedRunner.java:871)
	at com.carrotsearch.randomizedtesting.RandomizedRunner$9.evaluate(RandomizedRunner.java:907)
	at com.carrotsearch.randomizedtesting.RandomizedRunner$10.evaluate(RandomizedRunner.java:921)
	at com.carrotsearch.randomizedtesting.rules.SystemPropertiesRestoreRule$1.evaluate(SystemPropertiesRestoreRule.java:57)
	at com.carrotsearch.randomizedtesting.rules.SystemPropertiesRestoreRule$1.evaluate(SystemPropertiesRestoreRule.java:57)
	at org.apache.lucene.util.TestRuleSetupTeardownChained$1.evaluate(TestRuleSetupTeardownChained.java:49)
	at org.apache.lucene.util.AbstractBeforeAfterRule$1.evaluate(AbstractBeforeAfterRule.java:45)
	at org.apache.lucene.util.TestRuleThreadAndTestName$1.evaluate(TestRuleThreadAndTestName.java:48)
	at org.apache.lucene.util.TestRuleIgnoreAfterMaxFailures$1.evaluate(TestRuleIgnoreAfterMaxFailures.java:64)
	at org.apache.lucene.util.TestRuleMarkFailure$1.evaluate(TestRuleMarkFailure.java:47)
	at com.carrotsearch.randomizedtesting.rules.StatementAdapter.evaluate(StatementAdapter.java:36)
	at com.carrotsearch.randomizedtesting.ThreadLeakControl$StatementRunner.run(ThreadLeakControl.java:367)
	at com.carrotsearch.randomizedtesting.ThreadLeakControl.forkTimeoutingTask(ThreadLeakControl.java:809)
	at com.carrotsearch.randomizedtesting.ThreadLeakControl$3.evaluate(ThreadLeakControl.java:460)
	at com.carrotsearch.randomizedtesting.RandomizedRunner.runSingleTest(RandomizedRunner.java:880)
	at com.carrotsearch.randomizedtesting.RandomizedRunner$5.evaluate(RandomizedRunner.java:781)
	at com.carrotsearch.randomizedtesting.RandomizedRunner$6.evaluate(RandomizedRunner.java:816)
	at com.carrotsearch.randomizedtesting.RandomizedRunner$7.evaluate(RandomizedRunner.java:827)
	at com.carrotsearch.randomizedtesting.rules.StatementAdapter.evaluate(StatementAdapter.java:36)
	at com.carrotsearch.randomizedtesting.rules.SystemPropertiesRestoreRule$1.evaluate(SystemPropertiesRestoreRule.java:57)
	at org.apache.lucene.util.AbstractBeforeAfterRule$1.evaluate(AbstractBeforeAfterRule.java:45)
	at com.carrotsearch.randomizedtesting.rules.StatementAdapter.evaluate(StatementAdapter.java:36)
	at org.apache.lucene.util.TestRuleStoreClassName$1.evaluate(TestRuleStoreClassName.java:41)
	at com.carrotsearch.randomizedtesting.rules.NoShadowingOrOverridesOnMethodsRule$1.evaluate(NoShadowingOrOverridesOnMethodsRule.java:40)
	at com.carrotsearch.randomizedtesting.rules.NoShadowingOrOverridesOnMethodsRule$1.evaluate(NoShadowingOrOverridesOnMethodsRule.java:40)
	at com.carrotsearch.randomizedtesting.rules.StatementAdapter.evaluate(StatementAdapter.java:36)
	at com.carrotsearch.randomizedtesting.rules.StatementAdapter.evaluate(StatementAdapter.java:36)
	at com.carrotsearch.randomizedtesting.rules.StatementAdapter.evaluate(StatementAdapter.java:36)
	at org.apache.lucene.util.TestRuleAssertionsRequired$1.evaluate(TestRuleAssertionsRequired.java:53)
	at org.apache.lucene.util.TestRuleMarkFailure$1.evaluate(TestRuleMarkFailure.java:47)
	at org.apache.lucene.util.TestRuleIgnoreAfterMaxFailures$1.evaluate(TestRuleIgnoreAfterMaxFailures.java:64)
	at org.apache.lucene.util.TestRuleIgnoreTestSuites$1.evaluate(TestRuleIgnoreTestSuites.java:54)
	at com.carrotsearch.randomizedtesting.rules.StatementAdapter.evaluate(StatementAdapter.java:36)
	at com.carrotsearch.randomizedtesting.ThreadLeakControl$StatementRunner.run(ThreadLeakControl.java:367)
	at java.lang.Thread.run(Thread.java:745)
Caused by: java.lang.RuntimeException: REQUEST FAILED: xpath=*[count(//doc)=1]
	xml response was: <?xml version="1.0" encoding="UTF-8"?>
<response>
<lst name="responseHeader"><int name="status">0</int><int name="QTime">0</int></lst><result name="response" numFound="0" start="0"></result>
</response>

	request was:q=id:2&qt=standard&start=0&rows=20&version=2.2
	at org.apache.solr.SolrTestCaseJ4.assertQ(SolrTestCaseJ4.java:776)
	... 41 more




Build Log:
[...truncated 11027 lines...]
   [junit4] Suite: org.apache.solr.core.TestArbitraryIndexDir
   [junit4]   2> Creating dataDir: /export/home/jenkins/workspace/Lucene-Solr-6.x-Solaris/solr/build/solr-core/test/J0/temp/solr.core.TestArbitraryIndexDir_5EA5C491DD462F85-001/init-core-data-001
   [junit4]   2> 923272 INFO  (SUITE-TestArbitraryIndexDir-seed#[5EA5C491DD462F85]-worker) [    ] o.a.s.SolrTestCaseJ4 Randomized ssl (true) and clientAuth (false) via: @org.apache.solr.util.RandomizeSSL(reason=, value=NaN, ssl=NaN, clientAuth=NaN)
   [junit4]   2> 923274 INFO  (TEST-TestArbitraryIndexDir.testLoadNewIndexDir-seed#[5EA5C491DD462F85]) [    ] o.a.s.SolrTestCaseJ4 ###Starting testLoadNewIndexDir
   [junit4]   2> 923275 INFO  (TEST-TestArbitraryIndexDir.testLoadNewIndexDir-seed#[5EA5C491DD462F85]) [    ] o.a.s.SolrTestCaseJ4 ####initCore
   [junit4]   2> 923275 INFO  (TEST-TestArbitraryIndexDir.testLoadNewIndexDir-seed#[5EA5C491DD462F85]) [    ] o.a.s.c.SolrResourceLoader new SolrResourceLoader for directory: '/export/home/jenkins/workspace/Lucene-Solr-6.x-Solaris/solr/core/src/test-files/solr/collection1'
   [junit4]   2> 923275 INFO  (TEST-TestArbitraryIndexDir.testLoadNewIndexDir-seed#[5EA5C491DD462F85]) [    ] o.a.s.c.SolrResourceLoader JNDI not configured for solr (NoInitialContextEx)
   [junit4]   2> 923275 INFO  (TEST-TestArbitraryIndexDir.testLoadNewIndexDir-seed#[5EA5C491DD462F85]) [    ] o.a.s.c.SolrResourceLoader using system property solr.solr.home: /export/home/jenkins/workspace/Lucene-Solr-6.x-Solaris/solr/core/src/test-files/solr
   [junit4]   2> 923275 INFO  (TEST-TestArbitraryIndexDir.testLoadNewIndexDir-seed#[5EA5C491DD462F85]) [    ] o.a.s.c.SolrResourceLoader Adding 'file:/export/home/jenkins/workspace/Lucene-Solr-6.x-Solaris/solr/core/src/test-files/solr/collection1/lib/README' to classloader
   [junit4]   2> 923275 INFO  (TEST-TestArbitraryIndexDir.testLoadNewIndexDir-seed#[5EA5C491DD462F85]) [    ] o.a.s.c.SolrResourceLoader Adding 'file:/export/home/jenkins/workspace/Lucene-Solr-6.x-Solaris/solr/core/src/test-files/solr/collection1/lib/classes/' to classloader
   [junit4]   2> 923296 INFO  (TEST-TestArbitraryIndexDir.testLoadNewIndexDir-seed#[5EA5C491DD462F85]) [    ] o.a.s.c.SolrConfig current version of requestparams : -1
   [junit4]   2> 923302 INFO  (TEST-TestArbitraryIndexDir.testLoadNewIndexDir-seed#[5EA5C491DD462F85]) [    ] o.a.s.c.SolrConfig Using Lucene MatchVersion: 6.2.0
   [junit4]   2> 923316 INFO  (TEST-TestArbitraryIndexDir.testLoadNewIndexDir-seed#[5EA5C491DD462F85]) [    ] o.a.s.c.SolrConfig Loaded SolrConfig: solrconfig.xml
   [junit4]   2> 923319 INFO  (TEST-TestArbitraryIndexDir.testLoadNewIndexDir-seed#[5EA5C491DD462F85]) [    ] o.a.s.s.IndexSchema [null] Schema name=test
   [junit4]   2> 923373 INFO  (TEST-TestArbitraryIndexDir.testLoadNewIndexDir-seed#[5EA5C491DD462F85]) [    ] o.a.s.s.IndexSchema default search field in schema is text
   [junit4]   2> 923374 INFO  (TEST-TestArbitraryIndexDir.testLoadNewIndexDir-seed#[5EA5C491DD462F85]) [    ] o.a.s.s.IndexSchema unique key field: id
   [junit4]   2> 923374 WARN  (TEST-TestArbitraryIndexDir.testLoadNewIndexDir-seed#[5EA5C491DD462F85]) [    ] o.a.s.s.IndexSchema Field text is not multivalued and destination for multiple copyFields (2)
   [junit4]   2> 923379 INFO  (TEST-TestArbitraryIndexDir.testLoadNewIndexDir-seed#[5EA5C491DD462F85]) [    ] o.a.s.s.FileExchangeRateProvider Reloading exchange rates from file currency.xml
   [junit4]   2> 923381 INFO  (TEST-TestArbitraryIndexDir.testLoadNewIndexDir-seed#[5EA5C491DD462F85]) [    ] o.a.s.s.FileExchangeRateProvider Reloading exchange rates from file currency.xml
   [junit4]   2> 923382 INFO  (TEST-TestArbitraryIndexDir.testLoadNewIndexDir-seed#[5EA5C491DD462F85]) [    ] o.a.s.c.SolrResourceLoader JNDI not configured for solr (NoInitialContextEx)
   [junit4]   2> 923382 INFO  (TEST-TestArbitraryIndexDir.testLoadNewIndexDir-seed#[5EA5C491DD462F85]) [    ] o.a.s.c.SolrResourceLoader using system property solr.solr.home: /export/home/jenkins/workspace/Lucene-Solr-6.x-Solaris/solr/core/src/test-files/solr
   [junit4]   2> 923382 INFO  (TEST-TestArbitraryIndexDir.testLoadNewIndexDir-seed#[5EA5C491DD462F85]) [    ] o.a.s.c.SolrResourceLoader new SolrResourceLoader for directory: '/export/home/jenkins/workspace/Lucene-Solr-6.x-Solaris/solr/core/src/test-files/solr'
   [junit4]   2> 923382 INFO  (TEST-TestArbitraryIndexDir.testLoadNewIndexDir-seed#[5EA5C491DD462F85]) [    ] o.a.s.c.SolrResourceLoader JNDI not configured for solr (NoInitialContextEx)
   [junit4]   2> 923382 INFO  (TEST-TestArbitraryIndexDir.testLoadNewIndexDir-seed#[5EA5C491DD462F85]) [    ] o.a.s.c.SolrResourceLoader using system property solr.solr.home: /export/home/jenkins/workspace/Lucene-Solr-6.x-Solaris/solr/core/src/test-files/solr
   [junit4]   2> 923382 INFO  (TEST-TestArbitraryIndexDir.testLoadNewIndexDir-seed#[5EA5C491DD462F85]) [    ] o.a.s.c.CoreContainer New CoreContainer 307124222
   [junit4]   2> 923382 INFO  (TEST-TestArbitraryIndexDir.testLoadNewIndexDir-seed#[5EA5C491DD462F85]) [    ] o.a.s.c.CoreContainer Loading cores into CoreContainer [instanceDir=/export/home/jenkins/workspace/Lucene-Solr-6.x-Solaris/solr/core/src/test-files/solr]
   [junit4]   2> 923382 WARN  (TEST-TestArbitraryIndexDir.testLoadNewIndexDir-seed#[5EA5C491DD462F85]) [    ] o.a.s.c.CoreContainer Couldn't add files from /export/home/jenkins/workspace/Lucene-Solr-6.x-Solaris/solr/core/src/test-files/solr/lib to classpath: /export/home/jenkins/workspace/Lucene-Solr-6.x-Solaris/solr/core/src/test-files/solr/lib
   [junit4]   2> 923382 INFO  (TEST-TestArbitraryIndexDir.testLoadNewIndexDir-seed#[5EA5C491DD462F85]) [    ] o.a.s.h.c.HttpShardHandlerFactory created with socketTimeout : 600000,connTimeout : 60000,maxConnectionsPerHost : 20,maxConnections : 10000,corePoolSize : 0,maximumPoolSize : 2147483647,maxThreadIdleTime : 5,sizeOfQueue : -1,fairnessPolicy : false,useRetries : false,connectionsEvictorSleepDelay : 5000,maxConnectionIdleTime : 40000,
   [junit4]   2> 923384 INFO  (TEST-TestArbitraryIndexDir.testLoadNewIndexDir-seed#[5EA5C491DD462F85]) [    ] o.a.s.u.UpdateShardHandler Creating UpdateShardHandler HTTP client with params: socketTimeout=30000&connTimeout=30000&retry=true
   [junit4]   2> 923385 INFO  (TEST-TestArbitraryIndexDir.testLoadNewIndexDir-seed#[5EA5C491DD462F85]) [    ] o.a.s.l.LogWatcher SLF4J impl is org.slf4j.impl.Log4jLoggerFactory
   [junit4]   2> 923385 INFO  (TEST-TestArbitraryIndexDir.testLoadNewIndexDir-seed#[5EA5C491DD462F85]) [    ] o.a.s.l.LogWatcher Registering Log Listener [Log4j (org.slf4j.impl.Log4jLoggerFactory)]
   [junit4]   2> 923385 INFO  (TEST-TestArbitraryIndexDir.testLoadNewIndexDir-seed#[5EA5C491DD462F85]) [    ] o.a.s.c.CoreContainer Security conf doesn't exist. Skipping setup for authorization module.
   [junit4]   2> 923385 INFO  (TEST-TestArbitraryIndexDir.testLoadNewIndexDir-seed#[5EA5C491DD462F85]) [    ] o.a.s.c.CoreContainer No authentication plugin used.
   [junit4]   2> 923386 INFO  (TEST-TestArbitraryIndexDir.testLoadNewIndexDir-seed#[5EA5C491DD462F85]) [    ] o.a.s.c.CoreDescriptor Created CoreDescriptor: {name=collection1, config=solrconfig.xml, transient=false, schema=schema12.xml, loadOnStartup=true, configSetProperties=configsetprops.json, collection=collection1, dataDir=/export/home/jenkins/workspace/Lucene-Solr-6.x-Solaris/solr/build/solr-core/test/J0/temp/solr.core.TestArbitraryIndexDir_5EA5C491DD462F85-001/init-core-data-001, shard=shard1}
   [junit4]   2> 923386 INFO  (coreLoadExecutor-3410-thread-1) [    ] o.a.s.c.SolrResourceLoader new SolrResourceLoader for directory: '/export/home/jenkins/workspace/Lucene-Solr-6.x-Solaris/solr/core/src/test-files/solr/collection1'
   [junit4]   2> 923388 INFO  (coreLoadExecutor-3410-thread-1) [    ] o.a.s.c.SolrResourceLoader JNDI not configured for solr (NoInitialContextEx)
   [junit4]   2> 923388 INFO  (coreLoadExecutor-3410-thread-1) [    ] o.a.s.c.SolrResourceLoader using system property solr.solr.home: /export/home/jenkins/workspace/Lucene-Solr-6.x-Solaris/solr/core/src/test-files/solr
   [junit4]   2> 923388 INFO  (coreLoadExecutor-3410-thread-1) [    ] o.a.s.c.SolrResourceLoader Adding 'file:/export/home/jenkins/workspace/Lucene-Solr-6.x-Solaris/solr/core/src/test-files/solr/collection1/lib/README' to classloader
   [junit4]   2> 923388 INFO  (coreLoadExecutor-3410-thread-1) [    ] o.a.s.c.SolrResourceLoader Adding 'file:/export/home/jenkins/workspace/Lucene-Solr-6.x-Solaris/solr/core/src/test-files/solr/collection1/lib/classes/' to classloader
   [junit4]   2> 923406 INFO  (coreLoadExecutor-3410-thread-1) [    ] o.a.s.c.SolrConfig current version of requestparams : -1
   [junit4]   2> 923416 INFO  (coreLoadExecutor-3410-thread-1) [    ] o.a.s.c.SolrConfig Using Lucene MatchVersion: 6.2.0
   [junit4]   2> 923429 INFO  (coreLoadExecutor-3410-thread-1) [    ] o.a.s.c.SolrConfig Loaded SolrConfig: solrconfig.xml
   [junit4]   2> 923432 INFO  (coreLoadExecutor-3410-thread-1) [    ] o.a.s.s.IndexSchema [collection1] Schema name=test
   [junit4]   2> 923490 INFO  (coreLoadExecutor-3410-thread-1) [    ] o.a.s.s.IndexSchema default search field in schema is text
   [junit4]   2> 923491 INFO  (coreLoadExecutor-3410-thread-1) [    ] o.a.s.s.IndexSchema unique key field: id
   [junit4]   2> 923491 WARN  (coreLoadExecutor-3410-thread-1) [    ] o.a.s.s.IndexSchema Field text is not multivalued and destination for multiple copyFields (2)
   [junit4]   2> 923495 INFO  (coreLoadExecutor-3410-thread-1) [    ] o.a.s.s.FileExchangeRateProvider Reloading exchange rates from file currency.xml
   [junit4]   2> 923497 INFO  (coreLoadExecutor-3410-thread-1) [    ] o.a.s.s.FileExchangeRateProvider Reloading exchange rates from file currency.xml
   [junit4]   2> 923500 INFO  (coreLoadExecutor-3410-thread-1) [    ] o.a.s.c.ConfigSetProperties Did not find ConfigSet properties, assuming default properties: Can't find resource 'configsetprops.json' in classpath or '/export/home/jenkins/workspace/Lucene-Solr-6.x-Solaris/solr/core/src/test-files/solr/collection1'
   [junit4]   2> 923500 INFO  (coreLoadExecutor-3410-thread-1) [    ] o.a.s.c.CoreContainer Creating SolrCore 'collection1' using configuration from instancedir /export/home/jenkins/workspace/Lucene-Solr-6.x-Solaris/solr/core/src/test-files/solr/collection1
   [junit4]   2> 923500 INFO  (coreLoadExecutor-3410-thread-1) [    x:collection1] o.a.s.c.SolrCore org.apache.solr.core.MockFSDirectoryFactory
   [junit4]   2> 923500 INFO  (coreLoadExecutor-3410-thread-1) [    x:collection1] o.a.s.c.SolrCore [[collection1] ] Opening new SolrCore at [/export/home/jenkins/workspace/Lucene-Solr-6.x-Solaris/solr/core/src/test-files/solr/collection1], dataDir=[/export/home/jenkins/workspace/Lucene-Solr-6.x-Solaris/solr/build/solr-core/test/J0/temp/solr.core.TestArbitraryIndexDir_5EA5C491DD462F85-001/init-core-data-001/]
   [junit4]   2> 923500 INFO  (coreLoadExecutor-3410-thread-1) [    x:collection1] o.a.s.c.JmxMonitoredMap JMX monitoring is enabled. Adding Solr mbeans to JMX Server: com.sun.jmx.mbeanserver.JmxMBeanServer@489dbdfa
   [junit4]   2> 923501 INFO  (coreLoadExecutor-3410-thread-1) [    x:collection1] o.a.s.c.CachingDirectoryFactory return new directory for /export/home/jenkins/workspace/Lucene-Solr-6.x-Solaris/solr/build/solr-core/test/J0/temp/solr.core.TestArbitraryIndexDir_5EA5C491DD462F85-001/init-core-data-001/snapshot_metadata
   [junit4]   2> 923501 INFO  (coreLoadExecutor-3410-thread-1) [    x:collection1] o.a.s.c.s.SolrSnapshotMetaDataManager Loading from snapshot metadata file...
   [junit4]   2> 923501 INFO  (coreLoadExecutor-3410-thread-1) [    x:collection1] o.a.s.c.CachingDirectoryFactory return new directory for /export/home/jenkins/workspace/Lucene-Solr-6.x-Solaris/solr/build/solr-core/test/J0/temp/solr.core.TestArbitraryIndexDir_5EA5C491DD462F85-001/init-core-data-001
   [junit4]   2> 923501 INFO  (coreLoadExecutor-3410-thread-1) [    x:collection1] o.a.s.c.SolrCore New index directory detected: old=null new=/export/home/jenkins/workspace/Lucene-Solr-6.x-Solaris/solr/build/solr-core/test/J0/temp/solr.core.TestArbitraryIndexDir_5EA5C491DD462F85-001/init-core-data-001/index/
   [junit4]   2> 923502 WARN  (coreLoadExecutor-3410-thread-1) [    x:collection1] o.a.s.c.SolrCore [collection1] Solr index directory '/export/home/jenkins/workspace/Lucene-Solr-6.x-Solaris/solr/build/solr-core/test/J0/temp/solr.core.TestArbitraryIndexDir_5EA5C491DD462F85-001/init-core-data-001/index' doesn't exist. Creating new index...
   [junit4]   2> 923502 INFO  (coreLoadExecutor-3410-thread-1) [    x:collection1] o.a.s.c.CachingDirectoryFactory return new directory for /export/home/jenkins/workspace/Lucene-Solr-6.x-Solaris/solr/build/solr-core/test/J0/temp/solr.core.TestArbitraryIndexDir_5EA5C491DD462F85-001/init-core-data-001/index
   [junit4]   2> 923502 INFO  (coreLoadExecutor-3410-thread-1) [    x:collection1] o.a.s.u.RandomMergePolicy RandomMergePolicy wrapping class org.apache.lucene.index.LogDocMergePolicy: [LogDocMergePolicy: minMergeSize=1000, mergeFactor=49, maxMergeSize=9223372036854775807, maxMergeSizeForForcedMerge=9223372036854775807, calibrateSizeByDeletes=false, maxMergeDocs=2147483647, maxCFSSegmentSizeMB=8.796093022207999E12, noCFSRatio=0.2812615231417558]
   [junit4]   2> 923504 INFO  (coreLoadExecutor-3410-thread-1) [    x:collection1] o.a.s.c.SolrDeletionPolicy SolrDeletionPolicy.onCommit: commits: num=1
   [junit4]   2> 	commit{dir=MockDirectoryWrapper(MMapDirectory@/export/home/jenkins/workspace/Lucene-Solr-6.x-Solaris/solr/build/solr-core/test/J0/temp/solr.core.TestArbitraryIndexDir_5EA5C491DD462F85-001/init-core-data-001/index lockFactory=org.apache.lucene.store.SingleInstanceLockFactory@5ac2d925),segFN=segments_1,generation=1}
   [junit4]   2> 923504 INFO  (coreLoadExecutor-3410-thread-1) [    x:collection1] o.a.s.c.SolrDeletionPolicy newest commit generation = 1
   [junit4]   2> 923504 INFO  (OldIndexDirectoryCleanupThreadForCore-collection1) [    x:collection1] o.a.s.c.SolrCore Looking for old index directories to cleanup for core collection1 in /export/home/jenkins/workspace/Lucene-Solr-6.x-Solaris/solr/build/solr-core/test/J0/temp/solr.core.TestArbitraryIndexDir_5EA5C491DD462F85-001/init-core-data-001/
   [junit4]   2> 923507 INFO  (coreLoadExecutor-3410-thread-1) [    x:collection1] o.a.s.u.p.UpdateRequestProcessorChain creating updateRequestProcessorChain "dedupe"
   [junit4]   2> 923507 INFO  (coreLoadExecutor-3410-thread-1) [    x:collection1] o.a.s.u.p.UpdateRequestProcessorChain inserting DistributedUpdateProcessorFactory into updateRequestProcessorChain "dedupe"
   [junit4]   2> 923507 INFO  (coreLoadExecutor-3410-thread-1) [    x:collection1] o.a.s.u.p.UpdateRequestProcessorChain creating updateRequestProcessorChain "dedupe-allfields"
   [junit4]   2> 923507 INFO  (coreLoadExecutor-3410-thread-1) [    x:collection1] o.a.s.u.p.UpdateRequestProcessorChain inserting DistributedUpdateProcessorFactory into updateRequestProcessorChain "dedupe-allfields"
   [junit4]   2> 923507 INFO  (coreLoadExecutor-3410-thread-1) [    x:collection1] o.a.s.u.p.UpdateRequestProcessorChain creating updateRequestProcessorChain "stored_sig"
   [junit4]   2> 923507 INFO  (coreLoadExecutor-3410-thread-1) [    x:collection1] o.a.s.u.p.UpdateRequestProcessorChain inserting DistributedUpdateProcessorFactory into updateRequestProcessorChain "stored_sig"
   [junit4]   2> 923507 INFO  (coreLoadExecutor-3410-thread-1) [    x:collection1] o.a.s.u.p.UpdateRequestProcessorChain creating updateRequestProcessorChain "uniq-fields"
   [junit4]   2> 923507 INFO  (coreLoadExecutor-3410-thread-1) [    x:collection1] o.a.s.u.p.UpdateRequestProcessorChain inserting DistributedUpdateProcessorFactory into updateRequestProcessorChain "uniq-fields"
   [junit4]   2> 923507 INFO  (coreLoadExecutor-3410-thread-1) [    x:collection1] o.a.s.u.p.UpdateRequestProcessorChain creating updateRequestProcessorChain "distrib-dup-test-chain-explicit"
   [junit4]   2> 923507 INFO  (coreLoadExecutor-3410-thread-1) [    x:collection1] o.a.s.u.p.UpdateRequestProcessorChain creating updateRequestProcessorChain "distrib-dup-test-chain-implicit"
   [junit4]   2> 923508 INFO  (coreLoadExecutor-3410-thread-1) [    x:collection1] o.a.s.u.p.UpdateRequestProcessorChain inserting DistributedUpdateProcessorFactory into updateRequestProcessorChain "distrib-dup-test-chain-implicit"
   [junit4]   2> 923508 INFO  (coreLoadExecutor-3410-thread-1) [    x:collection1] o.a.s.c.SolrCore no updateRequestProcessorChain defined as default, creating implicit default
   [junit4]   2> 923509 INFO  (coreLoadExecutor-3410-thread-1) [    x:collection1] o.a.s.h.l.XMLLoader xsltCacheLifetimeSeconds=60
   [junit4]   2> 923510 INFO  (coreLoadExecutor-3410-thread-1) [    x:collection1] o.a.s.h.l.XMLLoader xsltCacheLifetimeSeconds=60
   [junit4]   2> 923511 INFO  (coreLoadExecutor-3410-thread-1) [    x:collection1] o.a.s.h.l.XMLLoader xsltCacheLifetimeSeconds=60
   [junit4]   2> 923511 INFO  (coreLoadExecutor-3410-thread-1) [    x:collection1] o.a.s.h.l.XMLLoader xsltCacheLifetimeSeconds=60
   [junit4]   2> 923514 INFO  (coreLoadExecutor-3410-thread-1) [    x:collection1] o.a.s.c.PluginBag requestHandler : 'lazy' created with startup=lazy 
   [junit4]   2> 923515 INFO  (coreLoadExecutor-3410-thread-1) [    x:collection1] o.a.s.c.RequestHandlers Registered paths: /admin/mbeans,standard,spellCheckCompRH,lazy,/update/json/docs,/admin/luke,/export,spellCheckWithWordbreak_Direct,tvrh,/get,/admin/properties,/update/json,mltrh,/admin/threads,/search-facet-def,/update/csv,/sql,/graph,/search-facet-invariants,/admin/segments,spellCheckCompRH1,/mlt,/admin/system,/replication,dismax,defaults,/config,/stream,/schema,/admin/plugins,/admin/logging,spellCheckWithWordbreak,mock,/admin/ping,/update,/admin/file,/terms,spellCheckCompRH_Direct,/debug/dump
   [junit4]   2> 923515 INFO  (coreLoadExecutor-3410-thread-1) [    x:collection1] o.a.s.c.SolrCore Using default statsCache cache: org.apache.solr.search.stats.LocalStatsCache
   [junit4]   2> 923515 INFO  (coreLoadExecutor-3410-thread-1) [    x:collection1] o.a.s.u.CommitTracker Hard AutoCommit: disabled
   [junit4]   2> 923515 INFO  (coreLoadExecutor-3410-thread-1) [    x:collection1] o.a.s.u.CommitTracker Soft AutoCommit: disabled
   [junit4]   2> 923516 INFO  (coreLoadExecutor-3410-thread-1) [    x:collection1] o.a.s.u.RandomMergePolicy RandomMergePolicy wrapping class org.apache.lucene.index.TieredMergePolicy: [TieredMergePolicy: maxMergeAtOnce=30, maxMergeAtOnceExplicit=47, maxMergedSegmentMB=61.6708984375, floorSegmentMB=0.7978515625, forceMergeDeletesPctAllowed=19.914116234997504, segmentsPerTier=31.0, maxCFSSegmentSizeMB=8.796093022207999E12, noCFSRatio=0.5884444796255756
   [junit4]   2> 923517 INFO  (coreLoadExecutor-3410-thread-1) [    x:collection1] o.a.s.c.SolrDeletionPolicy SolrDeletionPolicy.onInit: commits: num=1
   [junit4]   2> 	commit{dir=MockDirectoryWrapper(MMapDirectory@/export/home/jenkins/workspace/Lucene-Solr-6.x-Solaris/solr/build/solr-core/test/J0/temp/solr.core.TestArbitraryIndexDir_5EA5C491DD462F85-001/init-core-data-001/index lockFactory=org.apache.lucene.store.SingleInstanceLockFactory@5ac2d925),segFN=segments_1,generation=1}
   [junit4]   2> 923517 INFO  (coreLoadExecutor-3410-thread-1) [    x:collection1] o.a.s.c.SolrDeletionPolicy newest commit generation = 1
   [junit4]   2> 923517 INFO  (coreLoadExecutor-3410-thread-1) [    x:collection1] o.a.s.s.SolrIndexSearcher Opening [Searcher@7540c543[collection1] main]
   [junit4]   2> 923517 INFO  (coreLoadExecutor-3410-thread-1) [    x:collection1] o.a.s.r.RestManager Initializing RestManager with initArgs: {storageIO=org.apache.solr.rest.ManagedResourceStorage$InMemoryStorageIO}
   [junit4]   2> 923517 INFO  (coreLoadExecutor-3410-thread-1) [    x:collection1] o.a.s.r.ManagedResourceStorage Reading _rest_managed.json using InMemoryStorage
   [junit4]   2> 923517 INFO  (coreLoadExecutor-3410-thread-1) [    x:collection1] o.a.s.r.RestManager Initializing 0 registered ManagedResources
   [junit4]   2> 923517 INFO  (coreLoadExecutor-3410-thread-1) [    x:collection1] o.a.s.h.c.SpellCheckComponent Initializing spell checkers
   [junit4]   2> 923521 INFO  (coreLoadExecutor-3410-thread-1) [    x:collection1] o.a.s.s.DirectSolrSpellChecker init: {name=direct,classname=DirectSolrSpellChecker,field=lowerfilt,minQueryLength=3}
   [junit4]   2> 923537 INFO  (coreLoadExecutor-3410-thread-1) [    x:collection1] o.a.s.h.ReplicationHandler Commits will be reserved for  10000
   [junit4]   2> 923537 INFO  (coreLoadExecutor-3410-thread-1) [    x:collection1] o.a.s.c.CoreContainer registering core: collection1
   [junit4]   2> 923539 INFO  (TEST-TestArbitraryIndexDir.testLoadNewIndexDir-seed#[5EA5C491DD462F85]) [    ] o.a.s.SolrTestCaseJ4 ####initCore end
   [junit4]   2> 923539 INFO  (searcherExecutor-3411-thread-1-processing-x:collection1) [    x:collection1] o.a.s.h.c.SpellCheckComponent Loading spell index for spellchecker: default
   [junit4]   2> 923543 INFO  (searcherExecutor-3411-thread-1-processing-x:collection1) [    x:collection1] o.a.s.h.c.SpellCheckComponent Loading spell index for spellchecker: direct
   [junit4]   2> 923543 INFO  (searcherExecutor-3411-thread-1-processing-x:collection1) [    x:collection1] o.a.s.h.c.SpellCheckComponent Loading spell index for spellchecker: wordbreak
   [junit4]   2> 923544 INFO  (searcherExecutor-3411-thread-1-processing-x:collection1) [    x:collection1] o.a.s.h.c.SpellCheckComponent Loading spell index for spellchecker: multipleFields
   [junit4]   2> 923544 INFO  (TEST-TestArbitraryIndexDir.testLoadNewIndexDir-seed#[5EA5C491DD462F85]) [    ] o.a.s.u.p.LogUpdateProcessorFactory [collection1]  webapp=null path=null params={}{add=[1]} 0 5
   [junit4]   2> 923544 INFO  (searcherExecutor-3411-thread-1-processing-x:collection1) [    x:collection1] o.a.s.h.c.SpellCheckComponent Loading spell index for spellchecker: jarowinkler
   [junit4]   2> 923546 INFO  (searcherExecutor-3411-thread-1-processing-x:collection1) [    x:collection1] o.a.s.h.c.SpellCheckComponent Loading spell index for spellchecker: external
   [junit4]   2> 923550 INFO  (searcherExecutor-3411-thread-1-processing-x:collection1) [    x:collection1] o.a.s.h.c.SpellCheckComponent Loading spell index for spellchecker: freq
   [junit4]   2> 923550 INFO  (searcherExecutor-3411-thread-1-processing-x:collection1) [    x:collection1] o.a.s.h.c.SpellCheckComponent Loading spell index for spellchecker: fqcn
   [junit4]   2> 923554 INFO  (searcherExecutor-3411-thread-1-processing-x:collection1) [    x:collection1] o.a.s.h.c.SpellCheckComponent Loading spell index for spellchecker: perDict
   [junit4]   2> 923555 INFO  (searcherExecutor-3411-thread-1-processing-x:collection1) [    x:collection1] o.a.s.c.SolrCore [collection1] Registered new searcher Searcher@7540c543[collection1] main{ExitableDirectoryReader(UninvertingDirectoryReader())}
   [junit4]   2> 923556 INFO  (TEST-TestArbitraryIndexDir.testLoadNewIndexDir-seed#[5EA5C491DD462F85]) [    ] o.a.s.u.DirectUpdateHandler2 start commit{,optimize=false,openSearcher=true,waitSearcher=true,expungeDeletes=false,softCommit=false,prepareCommit=false}
   [junit4]   2> 923564 INFO  (TEST-TestArbitraryIndexDir.testLoadNewIndexDir-seed#[5EA5C491DD462F85]) [    ] o.a.s.c.SolrDeletionPolicy SolrDeletionPolicy.onCommit: commits: num=2
   [junit4]   2> 	commit{dir=MockDirectoryWrapper(MMapDirectory@/export/home/jenkins/workspace/Lucene-Solr-6.x-Solaris/solr/build/solr-core/test/J0/temp/solr.core.TestArbitraryIndexDir_5EA5C491DD462F85-001/init-core-data-001/index lockFactory=org.apache.lucene.store.SingleInstanceLockFactory@5ac2d925),segFN=segments_1,generation=1}
   [junit4]   2> 	commit{dir=MockDirectoryWrapper(MMapDirectory@/export/home/jenkins/workspace/Lucene-Solr-6.x-Solaris/solr/build/solr-core/test/J0/temp/solr.core.TestArbitraryIndexDir_5EA5C491DD462F85-001/init-core-data-001/index lockFactory=org.apache.lucene.store.SingleInstanceLockFactory@5ac2d925),segFN=segments_2,generation=2}
   [junit4]   2> 923566 INFO  (TEST-TestArbitraryIndexDir.testLoadNewIndexDir-seed#[5EA5C491DD462F85]) [    ] o.a.s.c.SolrDeletionPolicy newest commit generation = 2
   [junit4]   2> 923570 INFO  (TEST-TestArbitraryIndexDir.testLoadNewIndexDir-seed#[5EA5C491DD462F85]) [    ] o.a.s.c.SolrCore New index directory detected: old=/export/home/jenkins/workspace/Lucene-Solr-6.x-Solaris/solr/build/solr-core/test/J0/temp/solr.core.TestArbitraryIndexDir_5EA5C491DD462F85-001/init-core-data-001/index/ new=/export/home/jenkins/workspace/Lucene-Solr-6.x-Solaris/solr/build/solr-core/test/J0/temp/solr.core.TestArbitraryIndexDir_5EA5C491DD462F85-001/init-core-data-001/index_temp
   [junit4]   2> 923578 INFO  (TEST-TestArbitraryIndexDir.testLoadNewIndexDir-seed#[5EA5C491DD462F85]) [    ] o.a.s.s.SolrIndexSearcher Opening [Searcher@5bc38d9f[collection1] main]
   [junit4]   2> 923578 INFO  (TEST-TestArbitraryIndexDir.testLoadNewIndexDir-seed#[5EA5C491DD462F85]) [    ] o.a.s.u.DirectUpdateHandler2 end_commit_flush
   [junit4]   2> 923579 INFO  (searcherExecutor-3411-thread-1) [    ] o.a.s.c.SolrCore [collection1] Registered new searcher Searcher@5bc38d9f[collection1] main{ExitableDirectoryReader(UninvertingDirectoryReader(Uninverting(_0(6.2.0):C1)))}
   [junit4]   2> 923579 INFO  (TEST-TestArbitraryIndexDir.testLoadNewIndexDir-seed#[5EA5C491DD462F85]) [    ] o.a.s.u.p.LogUpdateProcessorFactory [collection1]  webapp=null path=null params={}{commit=} 0 23
   [junit4]   2> 923579 INFO  (TEST-TestArbitraryIndexDir.testLoadNewIndexDir-seed#[5EA5C491DD462F85]) [    ] o.a.s.c.SolrResourceLoader new SolrResourceLoader for directory: '/export/home/jenkins/workspace/Lucene-Solr-6.x-Solaris/solr/core/src/test-files/solr/collection1'
   [junit4]   2> 923579 INFO  (TEST-TestArbitraryIndexDir.testLoadNewIndexDir-seed#[5EA5C491DD462F85]) [    ] o.a.s.c.SolrResourceLoader JNDI not configured for solr (NoInitialContextEx)
   [junit4]   2> 923579 INFO  (TEST-TestArbitraryIndexDir.testLoadNewIndexDir-seed#[5EA5C491DD462F85]) [    ] o.a.s.c.SolrResourceLoader using system property solr.solr.home: /export/home/jenkins/workspace/Lucene-Solr-6.x-Solaris/solr/core/src/test-files/solr
   [junit4]   2> 923580 INFO  (TEST-TestArbitraryIndexDir.testLoadNewIndexDir-seed#[5EA5C491DD462F85]) [    ] o.a.s.c.SolrResourceLoader Adding 'file:/export/home/jenkins/workspace/Lucene-Solr-6.x-Solaris/solr/core/src/test-files/solr/collection1/lib/README' to classloader
   [junit4]   2> 923580 INFO  (TEST-TestArbitraryIndexDir.testLoadNewIndexDir-seed#[5EA5C491DD462F85]) [    ] o.a.s.c.SolrResourceLoader Adding 'file:/export/home/jenkins/workspace/Lucene-Solr-6.x-Solaris/solr/core/src/test-files/solr/collection1/lib/classes/' to classloader
   [junit4]   2> 923603 INFO  (TEST-TestArbitraryIndexDir.testLoadNewIndexDir-seed#[5EA5C491DD462F85]) [    ] o.a.s.c.SolrConfig current version of requestparams : -1
   [junit4]   2> 923608 INFO  (TEST-TestArbitraryIndexDir.testLoadNewIndexDir-seed#[5EA5C491DD462F85]) [    ] o.a.s.c.SolrConfig Using Lucene MatchVersion: 6.2.0
   [junit4]   2> 923622 INFO  (TEST-TestArbitraryIndexDir.testLoadNewIndexDir-seed#[5EA5C491DD462F85]) [    ] o.a.s.c.SolrConfig Loaded SolrConfig: solrconfig.xml
   [junit4]   2> 923625 INFO  (TEST-TestArbitraryIndexDir.testLoadNewIndexDir-seed#[5EA5C491DD462F85]) [    ] o.a.s.s.IndexSchema [collection1] Schema name=test
   [junit4]   2> 923676 INFO  (TEST-TestArbitraryIndexDir.testLoadNewIndexDir-seed#[5EA5C491DD462F85]) [    ] o.a.s.s.IndexSchema default search field in schema is text
   [junit4]   2> 923676 INFO  (TEST-TestArbitraryIndexDir.testLoadNewIndexDir-seed#[5EA5C491DD462F85]) [    ] o.a.s.s.IndexSchema unique key field: id
   [junit4]   2> 923677 WARN  (TEST-TestArbitraryIndexDir.testLoadNewIndexDir-seed#[5EA5C491DD462F85]) [    ] o.a.s.s.IndexSchema Field text is not multivalued and destination for multiple copyFields (2)
   [junit4]   2> 923682 INFO  (TEST-TestArbitraryIndexDir.testLoadNewIndexDir-seed#[5EA5C491DD462F85]) [    ] o.a.s.s.FileExchangeRateProvider Reloading exchange rates from file currency.xml
   [junit4]   2> 923683 INFO  (TEST-TestArbitraryIndexDir.testLoadNewIndexDir-seed#[5EA5C491DD462F85]) [    ] o.a.s.s.FileExchangeRateProvider Reloading exchange rates from file currency.xml
   [junit4]   2> 923687 INFO  (TEST-TestArbitraryIndexDir.testLoadNewIndexDir-seed#[5EA5C491DD462F85]) [    ] o.a.s.c.ConfigSetProperties Did not find ConfigSet properties, assuming default properties: Can't find resource 'configsetprops.json' in classpath or '/export/home/jenkins/workspace/Lucene-Solr-6.x-Solaris/solr/core/src/test-files/solr/collection1'
   [junit4]   2> 923687 INFO  (TEST-TestArbitraryIndexDir.testLoadNewIndexDir-seed#[5EA5C491DD462F85]) [    ] o.a.s.c.CoreContainer Reloading SolrCore 'collection1' using configuration from instancedir /export/home/jenkins/workspace/Lucene-Solr-6.x-Solaris/solr/core/src/test-files/solr/collection1
   [junit4]   2> 923687 INFO  (TEST-TestArbitraryIndexDir.testLoadNewIndexDir-seed#[5EA5C491DD462F85]) [    x:collection1] o.a.s.c.SolrCore [[collection1] ] Opening new SolrCore at [/export/home/jenkins/workspace/Lucene-Solr-6.x-Solaris/solr/core/src/test-files/solr/collection1], dataDir=[/export/home/jenkins/workspace/Lucene-Solr-6.x-Solaris/solr/build/solr-core/test/J0/temp/solr.core.TestArbitraryIndexDir_5EA5C491DD462F85-001/init-core-data-001/]
   [junit4]   2> 923687 INFO  (TEST-TestArbitraryIndexDir.testLoadNewIndexDir-seed#[5EA5C491DD462F85]) [    x:collection1] o.a.s.c.JmxMonitoredMap JMX monitoring is enabled. Adding Solr mbeans to JMX Server: com.sun.jmx.mbeanserver.JmxMBeanServer@489dbdfa
   [junit4]   2> 923687 INFO  (TEST-TestArbitraryIndexDir.testLoadNewIndexDir-seed#[5EA5C491DD462F85]) [    x:collection1] o.a.s.c.s.SolrSnapshotMetaDataManager Loading from snapshot metadata file...
   [junit4]   2> 923688 INFO  (TEST-TestArbitraryIndexDir.testLoadNewIndexDir-seed#[5EA5C491DD462F85]) [    x:collection1] o.a.s.c.SolrCore New index directory detected: old=null new=/export/home/jenkins/workspace/Lucene-Solr-6.x-Solaris/solr/build/solr-core/test/J0/temp/solr.core.TestArbitraryIndexDir_5EA5C491DD462F85-001/init-core-data-001/index_temp
   [junit4]   2> 923688 INFO  (OldIndexDirectoryCleanupThreadForCore-collection1) [    x:collection1] o.a.s.c.SolrCore Looking for old index directories to cleanup for core collection1 in /export/home/jenkins/workspace/Lucene-Solr-6.x-Solaris/solr/build/solr-core/test/J0/temp/solr.core.TestArbitraryIndexDir_5EA5C491DD462F85-001/init-core-data-001/
   [junit4]   2> 923689 INFO  (OldIndexDirectoryCleanupThreadForCore-collection1) [    x:collection1] o.a.s.c.DirectoryFactory Found 1 old index directories to clean-up under /export/home/jenkins/workspace/Lucene-Solr-6.x-Solaris/solr/build/solr-core/test/J0/temp/solr.core.TestArbitraryIndexDir_5EA5C491DD462F85-001/init-core-data-001/
   [junit4]   2> 923689 WARN  (OldIndexDirectoryCleanupThreadForCore-collection1) [    x:collection1] o.a.s.c.CachingDirectoryFactory Cannot delete directory /export/home/jenkins/workspace/Lucene-Solr-6.x-Solaris/solr/build/solr-core/test/J0/temp/solr.core.TestArbitraryIndexDir_5EA5C491DD462F85-001/init-core-data-001/index as it is still being referenced in the cache!
   [junit4]   2> 923689 WARN  (OldIndexDirectoryCleanupThreadForCore-collection1) [    x:collection1] o.a.s.c.DirectoryFactory Delete old index directory /export/home/jenkins/workspace/Lucene-Solr-6.x-Solaris/solr/build/solr-core/test/J0/temp/solr.core.TestArbitraryIndexDir_5EA5C491DD462F85-001/init-core-data-001/index failed.
   [junit4]   2> 923691 INFO  (TEST-TestArbitraryIndexDir.testLoadNewIndexDir-seed#[5EA5C491DD462F85]) [    x:collection1] o.a.s.u.p.UpdateRequestProcessorChain creating updateRequestProcessorChain "dedupe"
   [junit4]   2> 923691 INFO  (TEST-TestArbitraryIndexDir.testLoadNewIndexDir-seed#[5EA5C491DD462F85]) [    x:collection1] o.a.s.u.p.UpdateRequestProcessorChain inserting DistributedUpdateProcessorFactory into updateRequestProcessorChain "dedupe"
   [junit4]   2> 923691 INFO  (TEST-TestArbitraryIndexDir.testLoadNewIndexDir-seed#[5EA5C491DD462F85]) [    x:collection1] o.a.s.u.p.UpdateRequestProcessorChain creating updateRequestProcessorChain "dedupe-allfields"
   [junit4]   2> 923691 INFO  (TEST-TestArbitraryIndexDir.testLoadNewIndexDir-seed#[5EA5C491DD462F85]) [    x:collection1] o.a.s.u.p.UpdateRequestProcessorChain inserting DistributedUpdateProcessorFactory into updateRequestProcessorChain "dedupe-allfields"
   [junit4]   2> 923691 INFO  (TEST-TestArbitraryIndexDir.testLoadNewIndexDir-seed#[5EA5C491DD462F85]) [    x:collection1] o.a.s.u.p.UpdateRequestProcessorChain creating updateRequestProcessorChain "stored_sig"
   [junit4]   2> 923691 INFO  (TEST-TestArbitraryIndexDir.testLoadNewIndexDir-seed#[5EA5C491DD462F85]) [    x:collection1] o.a.s.u.p.UpdateRequestProcessorChain inserting DistributedUpdateProcessorFactory into updateRequestProcessorChain "stored_sig"
   [junit4]   2> 923691 INFO  (TEST-TestArbitraryIndexDir.testLoadNewIndexDir-seed#[5EA5C491DD462F85]) [    x:collection1] o.a.s.u.p.UpdateRequestProcessorChain creating updateRequestProcessorChain "uniq-fields"
   [junit4]   2> 923692 INFO  (TEST-TestArbitraryIndexDir.testLoadNewIndexDir-seed#[5EA5C491DD462F85]) [    x:collection1] o.a.s.u.p.UpdateRequestProcessorChain inserting DistributedUpdateProcessorFactory into updateRequestProcessorChain "uniq-fields"
   [junit4]   2> 923692 INFO  (TEST-TestArbitraryIndexDir.testLoadNewIndexDir-seed#[5EA5C491DD462F85]) [    x:collection1] o.a.s.u.p.UpdateRequestProcessorChain creating updateRequestProcessorChain "distrib-dup-test-chain-explicit"
   [junit4]   2> 923692 INFO  (TEST-TestArbitraryIndexDir.testLoadNewIndexDir-seed#[5EA5C491DD462F85]) [    x:collection1] o.a.s.u.p.UpdateRequestProcessorChain creating updateRequestProcessorChain "distrib-dup-test-chain-implicit"
   [junit4]   2> 923692 INFO  (TEST-TestArbitraryIndexDir.testLoadNewIndexDir-seed#[5EA5C491DD462F85]) [    x:collection1] o.a.s.u.p.UpdateRequestProcessorChain inserting DistributedUpdateProcessorFactory into updateRequestProcessorChain "distrib-dup-test-chain-implicit"
   [junit4]   2> 923692 INFO  (TEST-TestArbitraryIndexDir.testLoadNewIndexDir-seed#[5EA5C491DD462F85]) [    x:collection1] o.a.s.c.SolrCore no updateRequestProcessorChain defined as default, creating implicit default
   [junit4]   2> 923693 INFO  (TEST-TestArbitraryIndexDir.testLoadNewIndexDir-seed#[5EA5C491DD462F85]) [    x:collection1] o.a.s.h.l.XMLLoader xsltCacheLifetimeSeconds=60
   [junit4]   2> 923694 INFO  (TEST-TestArbitraryIndexDir.testLoadNewIndexDir-seed#[5EA5C491DD462F85]) [    x:collection1] o.a.s.h.l.XMLLoader xsltCacheLifetimeSeconds=60
   [junit4]   2> 923695 INFO  (TEST-TestArbitraryIndexDir.testLoadNewIndexDir-seed#[5EA5C491DD462F85]) [    x:collection1] o.a.s.h.l.XMLLoader xsltCacheLifetimeSeconds=60
   [junit4]   2> 923696 INFO  (TEST-TestArbitraryIndexDir.testLoadNewIndexDir-seed#[5EA5C491DD462F85]) [    x:collection1] o.a.s.h.l.XMLLoader xsltCacheLifetimeSeconds=60
   [junit4]   2> 923697 INFO  (TEST-TestArbitraryIndexDir.testLoadNewIndexDir-seed#[5EA5C491DD462F85]) [    x:collection1] o.a.s.c.CachingDirectoryFactory return new directory for /export/home/jenkins/workspace/Lucene-Solr-6.x-Solaris/solr/build/solr-core/test/J0/temp/solr.core.TestArbitraryIndexDir_5EA5C491DD462F85-001/init-core-data-001/index_temp
   [junit4]   2> 923701 INFO  (TEST-TestArbitraryIndexDir.testLoadNewIndexDir-seed#[5EA5C491DD462F85]) [    x:collection1] o.a.s.c.PluginBag requestHandler : 'lazy' created with startup=lazy 
   [junit4]   2> 923702 INFO  (TEST-TestArbitraryIndexDir.testLoadNewIndexDir-seed#[5EA5C491DD462F85]) [    x:collection1] o.a.s.c.RequestHandlers Registered paths: /admin/mbeans,standard,spellCheckCompRH,lazy,/update/json/docs,/admin/luke,/export,spellCheckWithWordbreak_Direct,tvrh,/get,/admin/properties,/update/json,mltrh,/admin/threads,/search-facet-def,/update/csv,/sql,/graph,/search-facet-invariants,/admin/segments,spellCheckCompRH1,/mlt,/admin/system,/replication,dismax,defaults,/config,/stream,/schema,/admin/plugins,/admin/logging,spellCheckWithWordbreak,mock,/admin/ping,/update,/admin/file,/terms,spellCheckCompRH_Direct,/debug/dump
   [junit4]   2> 923702 INFO  (TEST-TestArbitraryIndexDir.testLoadNewIndexDir-seed#[5EA5C491DD462F85]) [    x:collection1] o.a.s.c.SolrCore Using default statsCache cache: org.apache.solr.search.stats.LocalStatsCache
   [junit4]   2> 923702 INFO  (TEST-TestArbitraryIndexDir.testLoadNewIndexDir-seed#[5EA5C491DD462F85]) [    x:collection1] o.a.s.u.CommitTracker Hard AutoCommit: disabled
   [junit4]   2> 923702 INFO  (TEST-TestArbitraryIndexDir.testLoadNewIndexDir-seed#[5EA5C491DD462F85]) [    x:collection1] o.a.s.u.CommitTracker Soft AutoCommit: disabled
   [junit4]   2> 923703 INFO  (TEST-TestArbitraryIndexDir.testLoadNewIndexDir-seed#[5EA5C491DD462F85]) [    x:collection1] o.a.s.s.SolrIndexSearcher Opening [Searcher@36de3424[collection1] main]
   [junit4]   2> 923703 INFO  (TEST-TestArbitraryIndexDir.testLoadNewIndexDir-seed#[5EA5C491DD462F85]) [    x:collection1] o.a.s.r.RestManager Initializing RestManager with initArgs: {storageIO=org.apache.solr.rest.ManagedResourceStorage$InMemoryStorageIO}
   [junit4]   2> 923703 INFO  (TEST-TestArbitraryIndexDir.testLoadNewIndexDir-seed#[5EA5C491DD462F85]) [    x:collection1] o.a.s.r.ManagedResourceStorage Reading _rest_managed.json using InMemoryStorage
   [junit4]   2> 923703 INFO  (TEST-TestArbitraryIndexDir.testLoadNewIndexDir-seed#[5EA5C491DD462F85]) [    x:collection1] o.a.s.r.RestManager Initializing 0 registered ManagedResources
   [junit4]   2> 923703 INFO  (TEST-TestArbitraryIndexDir.testLoadNewIndexDir-seed#[5EA5C491DD462F85]) [    x:collection1] o.a.s.h.c.SpellCheckComponent Initializing spell checkers
   [junit4]   2> 923704 INFO  (TEST-TestArbitraryIndexDir.testLoadNewIndexDir-seed#[5EA5C491DD462F85]) [    x:collection1] o.a.s.s.DirectSolrSpellChecker init: {name=direct,classname=DirectSolrSpellChecker,field=lowerfilt,minQueryLength=3}
   [junit4]   2> 923708 INFO  (TEST-TestArbitraryIndexDir.testLoadNewIndexDir-seed#[5EA5C491DD462F85]) [    x:collection1] o.a.s.h.ReplicationHandler Commits will be reserved for  10000
   [junit4]   2> 923708 INFO  (searcherExecutor-3415-thread-1-processing-x:collection1) [    x:collection1] o.a.s.h.c.SpellCheckComponent Loading spell index for spellchecker: default
   [junit4]   2> 923709 INFO  (TEST-TestArbitraryIndexDir.testLoadNewIndexDir-seed#[5EA5C491DD462F85]) [    x:collection1] o.a.s.u.DefaultSolrCoreState Closing old IndexWriter... core=collection1
   [junit4]   2> 923709 INFO  (searcherExecutor-3415-thread-1-processing-x:collection1) [    x:collection1] o.a.s.h.c.SpellCheckComponent Loading spell index for spellchecker: direct
   [junit4]   2> 923709 INFO  (searcherExecutor-3415-thread-1-processing-x:collection1) [    x:collection1] o.a.s.h.c.SpellCheckComponent Loading spell index for spellchecker: wordbreak
   [junit4]   2> 923709 INFO  (searcherExecutor-3415-thread-1-processing-x:collection1) [    x:collection1] o.a.s.h.c.SpellCheckComponent Loading spell index for spellchecker: multipleFields
   [junit4]   2> 923709 INFO  (TEST-TestArbitraryIndexDir.testLoadNewIndexDir-seed#[5EA5C491DD462F85]) [    x:collection1] o.a.s.u.RandomMergePolicy RandomMergePolicy wrapping class org.apache.lucene.index.TieredMergePolicy: [TieredMergePolicy: maxMergeAtOnce=50, maxMergeAtOnceExplicit=17, maxMergedSegmentMB=38.3203125, floorSegmentMB=1.267578125, forceMergeDeletesPctAllowed=12.491248330558257, segmentsPerTier=37.0, maxCFSSegmentSizeMB=8.796093022207999E12, noCFSRatio=0.0
   [junit4]   2> 923710 INFO  (searcherExecutor-3415-thread-1-processing-x:collection1) [    x:collection1] o.a.s.h.c.SpellCheckComponent Loading spell index for spellchecker: jarowinkler
   [junit4]   2> 923711 INFO  (TEST-TestArbitraryIndexDir.testLoadNewIndexDir-seed#[5EA5C491DD462F85]) [    x:collection1] o.a.s.c.SolrDeletionPolicy SolrDeletionPolicy.onInit: commits: num=1
   [junit4]   2> 	commit{dir=MockDirectoryWrapper(SimpleFSDirectory@/export/home/jenkins/workspace/Lucene-Solr-6.x-Solaris/solr/build/solr-core/test/J0/temp/solr.core.TestArbitraryIndexDir_5EA5C491DD462F85-001/init-core-data-001/index_temp lockFactory=org.apache.lucene.store.SingleInstanceLockFactory@2008dc70),segFN=segments_1,generation=1}
   [junit4]   2> 923711 INFO  (TEST-TestArbitraryIndexDir.testLoadNewIndexDir-seed#[5EA5C491DD462F85]) [    x:collection1] o.a.s.c.SolrDeletionPolicy newest commit generation = 1
   [junit4]   2> 923711 INFO  (TEST-TestArbitraryIndexDir.testLoadNewIndexDir-seed#[5EA5C491DD462F85]) [    x:collection1] o.a.s.u.DefaultSolrCoreState New IndexWriter is ready to be used.
   [junit4]   2> 923711 WARN  (TEST-TestArbitraryIndexDir.testLoadNewIndexDir-seed#[5EA5C491DD462F85]) [    x:collection1] o.a.s.c.SolrCore [collection1] PERFORMANCE WARNING: Overlapping onDeckSearchers=2
   [junit4]   2> 923712 INFO  (searcherExecutor-3415-thread-1-processing-x:collection1) [    x:collection1] o.a.s.h.c.SpellCheckComponent Loading spell index for spellchecker: external
   [junit4]   2> 923712 INFO  (TEST-TestArbitraryIndexDir.testLoadNewIndexDir-seed#[5EA5C491DD462F85]) [    x:collection1] o.a.s.s.SolrIndexSearcher Opening [Searcher@9726ceb[collection1] main]
   [junit4]   2> 923712 INFO  (TEST-TestArbitraryIndexDir.testLoadNewIndexDir-seed#[5EA5C491DD462F85]) [    x:collection1] o.a.s.c.CoreContainer replacing core: collection1
   [junit4]   2> 923712 INFO  (TEST-TestArbitraryIndexDir.testLoadNewIndexDir-seed#[5EA5C491DD462F85]) [    x:collection1] o.a.s.c.SolrCore [collection1]  CLOSING SolrCore org.apache.solr.core.SolrCore@2b1d8904
   [junit4]   2> 923712 INFO  (TEST-TestArbitraryIndexDir.testLoadNewIndexDir-seed#[5EA5C491DD462F85]) [    x:collection1] o.a.s.u.DirectUpdateHandler2 closing DirectUpdateHandler2{commits=1,autocommits=0,soft autocommits=0,optimizes=0,rollbacks=0,expungeDeletes=0,docsPending=0,adds=0,deletesById=0,deletesByQuery=0,errors=0,cumulative_adds=1,cumulative_deletesById=0,cumulative_deletesByQuery=0,cumulative_errors=0}
   [junit4]   2> 923713 INFO  (TEST-TestArbitraryIndexDir.testLoadNewIndexDir-seed#[5EA5C491DD462F85]) [    x:collection1] o.a.s.c.SolrCore [collection1] Closing main searcher on request.
   [junit4]   2> 923714 INFO  (searcherExecutor-3415-thread-1-processing-x:collection1) [    x:collection1] o.a.s.h.c.SpellCheckComponent Loading spell index for spellchecker: freq
   [junit4]   2> 923714 INFO  (searcherExecutor-3415-thread-1-processing-x:collection1) [    x:collection1] o.a.s.h.c.SpellCheckComponent Loading spell index for spellchecker: fqcn
   [junit4]   2> 923716 INFO  (searcherExecutor-3415-thread-1-processing-x:collection1) [    x:collection1] o.a.s.h.c.SpellCheckComponent Loading spell index for spellchecker: perDict
   [junit4]   2> 923717 INFO  (searcherExecutor-3415-thread-1-processing-x:collection1) [    x:collection1] o.a.s.c.SolrCore [collection1] Registered new searcher Searcher@36de3424[collection1] main{ExitableDirectoryReader(UninvertingDirectoryReader(Uninverting(_0(6.2.0):C1)))}
   [junit4]   2> 923717 INFO  (searcherExecutor-3415-thread-1-processing-x:collection1) [    x:collection1] o.a.s.h.c.SpellCheckComponent Loading spell index for spellchecker: default
   [junit4]   2> 923717 INFO  (searcherExecutor-3415-thread-1-processing-x:collection1) [    x:collection1] o.a.s.h.c.SpellCheckComponent Loading spell index for spellchecker: direct
   [junit4]   2> 923717 INFO  (searcherExecutor-3415-thread-1-processing-x:collection1) [    x:collection1] o.a.s.h.c.SpellCheckComponent Loading spell index for spellchecker: wordbreak
   [junit4]   2> 923728 INFO  (searcherExecutor-3415-thread-1-processing-x:collection1) [    x:collection1] o.a.s.h.c.SpellCheckComponent Loading spell index for spellchecker: multipleFields
   [junit4]   2> 923729 INFO  (searcherExecutor-3415-thread-1-processing-x:collection1) [    x:collection1] o.a.s.h.c.SpellCheckComponent Loading spell index for spellchecker: jarowinkler
   [junit4]   2> 923729 INFO  (searcherExecutor-3415-thread-1-processing-x:collection1) [    x:collection1] o.a.s.h.c.SpellCheckComponent Loading spell index for spellchecker: external
   [junit4]   2> 923733 INFO  (TEST-TestArbitraryIndexDir.testLoadNewIndexDir-seed#[5EA5C491DD462F85]) [    x:collection1] o.a.s.c.S.Request [collection1]  webapp=null path=null params={q=id:2&qt=standard&start=0&rows=20&version=2.2} hits=0 status=0 QTime=0
   [junit4]   2> 923733 ERROR (TEST-TestArbitraryIndexDir.testLoadNewIndexDir-seed#[5EA5C491DD462F85]) [    x:collection1] o.a.s.SolrTestCaseJ4 REQUEST FAILED: xpath=*[count(//doc)=1]
   [junit4]   2> 	xml response was: <?xml version="1.0" encoding="UTF-8"?>
   [junit4]   2> <response>
   [junit4]   2> <lst name="responseHeader"><int name="status">0</int><int name="QTime">0</int></lst><result name="response" numFound="0" start="0"></result>
   [junit4]   2> </response>
   [junit4]   2> 
   [junit4]   2> 	request was:q=id:2&qt=standard&start=0&rows=20&version=2.2
   [junit4]   2> 923733 ERROR (TEST-TestArbitraryIndexDir.testLoadNewIndexDir-seed#[5EA5C491DD462F85]) [    x:collection1] o.a.s.SolrTestCaseJ4 REQUEST FAILED: q=id:2&qt=standard&start=0&rows=20&version=2.2:java.lang.RuntimeException: REQUEST FAILED: xpath=*[count(//doc)=1]
   [junit4]   2> 	xml response was: <?xml version="1.0" encoding="UTF-8"?>
   [junit4]   2> <response>
   [junit4]   2> <lst name="responseHeader"><int name="status">0</int><int name="QTime">0</int></lst><result name="response" numFound="0" start="0"></result>
   [junit4]   2> </response>
   [junit4]   2> 
   [junit4]   2> 	request was:q=id:2&qt=standard&start=0&rows=20&version=2.2
   [junit4]   2> 	at org.apache.solr.SolrTestCaseJ4.assertQ(SolrTestCaseJ4.java:776)
   [junit4]   2> 	at org.apache.solr.core.TestArbitraryIndexDir.testLoadNewIndexDir(TestArbitraryIndexDir.java:107)
   [junit4]   2> 	at sun.reflect.NativeMethodAccessorImpl.invoke0(Native Method)
   [junit4]   2> 	at sun.reflect.NativeMethodAccessorImpl.invoke(NativeMethodAccessorImpl.java:62)
   [junit4]   2> 	at sun.reflect.DelegatingMethodAccessorImpl.invoke(DelegatingMethodAccessorImpl.java:43)
   [junit4]   2> 	at java.lang.reflect.Method.invoke(Method.java:498)
   [junit4]   2> 	at com.carrotsearch.randomizedtesting.RandomizedRunner.invoke(RandomizedRunner.java:1764)
   [junit4]   2> 	at com.carrotsearch.randomizedtesting.RandomizedRunner$8.evaluate(RandomizedRunner.java:871)
   [junit4]   2> 	at com.carrotsearch.randomizedtesting.RandomizedRunner$9.evaluate(RandomizedRunner.java:907)
   [junit4]   2> 	at com.carrotsearch.randomizedtesting.RandomizedRunner$10.evaluate(RandomizedRunner.java:921)
   [junit4]   2> 	at com.carrotsearch.randomizedtesting.rules.SystemPropertiesRestoreRule$1.evaluate(SystemPropertiesRestoreRule.java:57)
   [junit4]   2> 	at com.carrotsearch.randomizedtesting.rules.SystemPropertiesRestoreRule$1.evaluate(SystemPropertiesRestoreRule.java:57)
   [junit4]   2> 	at org.apache.lucene.util.TestRuleSetupTeardownChained$1.evaluate(TestRuleSetupTeardownChained.java:49)
   [junit4]   2> 	at org.apache.lucene.util.AbstractBeforeAfterRule$1.evaluate(AbstractBeforeAfterRule.java:45)
   [junit4]   2> 	at org.apache.lucene.util.TestRuleThreadAndTestName$1.evaluate(TestRuleThreadAndTestName.java:48)
   [junit4]   2> 	at org.apache.lucene.util.TestRuleIgnoreAfterMaxFailures$1.evaluate(TestRuleIgnoreAfterMaxFailures.java:64)
   [junit4]   2> 	at org.apache.lucene.util.TestRuleMarkFailure$1.evaluate(TestRuleMarkFailure.java:47)
   [junit4]   2> 	at com.carrotsearch.randomizedtesting.rules.StatementAdapter.evaluate(StatementAdapter.java:36)
   [junit4]   2> 	at com.carrotsearch.randomizedtesting.ThreadLeakControl$StatementRunner.run(ThreadLeakControl.java:367)
   [junit4]   2> 	at com.carrotsearch.randomizedtesting.ThreadLeakControl.forkTimeoutingTask(ThreadLeakControl.java:809)
   [junit4]   2> 	at com.carrotsearch.randomizedtesting.ThreadLeakControl$3.evaluate(ThreadLeakControl.java:460)
   [junit4]   2> 	at com.carrotsearch.randomizedtesting.RandomizedRunner.runSingleTest(RandomizedRunner.java:880)
   [junit4]   2> 	at com.carrotsearch.randomizedtesting.RandomizedRunner$5.evaluate(RandomizedRunner.java:781)
   [junit4]   2> 	at com.carrotsearch.randomizedtesting.RandomizedRunner$6.evaluate(RandomizedRunner.java:816)
   [junit4]   2> 	at com.carrotsearch.randomizedtesting.RandomizedRunner$7.evaluate(RandomizedRunner.java:827)
   [junit4]   2> 	at com.carrotsearch.randomizedtesting.rules.StatementAdapter.evaluate(StatementAdapter.java:36)
   [junit4]   2> 	at com.carrotsearch.randomizedtesting.rules.SystemPropertiesRestoreRule$1.evaluate(SystemPropertiesRestoreRule.java:57)
   [junit4]   2> 	at org.apache.lucene.util.AbstractBeforeAfterRule$1.evaluate(AbstractBeforeAfterRule.java:45)
   [junit4]   2> 	at com.carrotsearch.randomizedtesting.rules.StatementAdapter.evaluate(StatementAdapter.java:36)
   [junit4]   2> 	at org.apache.lucene.util.TestRuleStoreClassName$1.evaluate(TestRuleStoreClassName.java:41)
   [junit4]   2> 	at com.carrotsearch.randomizedtesting.rules.NoShadowingOrOverridesOnMethodsRule$1.evaluate(NoShadowingOrOverridesOnMethodsRule.java:40)
   [junit4]   2> 	at com.carrotsearch.randomizedtesting.rules.NoShadowingOrOverridesOnMethodsRule$1.evaluate(NoShadowingOrOverridesOnMethodsRule.java:40)
   [junit4]   2> 	at com.carrotsearch.randomizedtesting.rules.StatementAdapter.evaluate(StatementAdapter.java:36)
   [junit4]   2> 	at com.carrotsearch.randomizedtesting.rules.StatementAdapter.evaluate(StatementAdapter.java:36)
   [junit4]   2> 	at com.carrotsearch.randomizedtesting.rules.StatementAdapter.evaluate(StatementAdapter.java:36)
   [junit4]   2> 	at org.apache.lucene.util.TestRuleAssertionsRequired$1.evaluate(TestRuleAssertionsRequired.java:53)
   [junit4]   2> 	at org.apache.lucene.util.TestRuleMarkFailure$1.evaluate(TestRuleMarkFailure.java:47)
   [junit4]   2> 	at org.apache.lucene.util.TestRuleIgnoreAfterMaxFailures$1.evaluate(TestRuleIgnoreAfterMaxFailures.java:64)
   [junit4]   2> 	at org.apache.lucene.util.TestRuleIgnoreTestSuites$1.evaluate(TestRuleIgnoreTestSuites.java:54)
   [junit4]   2> 	at com.carrotsearch.randomizedtesting.rules.StatementAdapter.evaluate(StatementAdapter.java:36)
   [junit4]   2> 	at com.carrotsearch.randomizedtesting.ThreadLeakControl$StatementRunner.run(ThreadLeakControl.java:367)
   [junit4]   2> 	at java.lang.Thread.run(Thread.java:745)
   [junit4]   2> 
   [junit4]   2> 923733 INFO  (searcherExecutor-3415-thread-1-processing-x:collection1) [    x:collection1] o.a.s.h.c.SpellCheckComponent Loading spell index for spellchecker: freq
   [junit4]   2> 923734 INFO  (TEST-TestArbitraryIndexDir.testLoadNewIndexDir-seed#[5EA5C491DD462F85]) [    x:collection1] o.a.s.SolrTestCaseJ4 ###Ending testLoadNewIndexDir
   [junit4]   2> 923734 INFO  (searcherExecutor-3415-thread-1-processing-x:collection1) [    x:collection1] o.a.s.h.c.SpellCheckComponent Loading spell index for spellchecker: fqcn
   [junit4]   2> 923736 INFO  (searcherExecutor-3415-thread-1-processing-x:collection1) [    x:collection1] o.a.s.h.c.SpellCheckComponent Loading spell index for spellchecker: perDict
   [junit4]   2> NOTE: reproduce with: ant test  -Dtestcase=TestArbitraryIndexDir -Dtests.method=testLoadNewIndexDir -Dtests.seed=5EA5C491DD462F85 -Dtests.slow=true -Dtests.locale=el-GR -Dtests.timezone=Africa/Cairo -Dtests.asserts=true -Dtests.file.encoding=UTF-8
   [junit4] ERROR   0.47s J0 | TestArbitraryIndexDir.testLoadNewIndexDir <<<
   [junit4]    > Throwable #1: java.lang.RuntimeException: Exception during query
   [junit4]    > 	at __randomizedtesting.SeedInfo.seed([5EA5C491DD462F85:B7FF7FA943DFBF2D]:0)
   [junit4]    > 	at org.apache.solr.SolrTestCaseJ4.assertQ(SolrTestCaseJ4.java:783)
   [junit4]    > 	at org.apache.solr.core.TestArbitraryIndexDir.testLoadNewIndexDir(TestArbitraryIndexDir.java:107)
   [junit4]    > 	at java.lang.Thread.run(Thread.java:745)
   [junit4]    > Caused by: java.lang.RuntimeException: REQUEST FAILED: xpath=*[count(//doc)=1]
   [junit4]    > 	xml response was: <?xml version="1.0" encoding="UTF-8"?>
   [junit4]    > <response>
   [junit4]    > <lst name="responseHeader"><int name="status">0</int><int name="QTime">0</int></lst><result name="response" numFound="0" start="0"></result>
   [junit4]    > </response>
   [junit4]    > 	request was:q=id:2&qt=standard&start=0&rows=20&version=2.2
   [junit4]    > 	at org.apache.solr.SolrTestCaseJ4.assertQ(SolrTestCaseJ4.java:776)
   [junit4]    > 	... 41 more
   [junit4]   2> 923737 INFO  (SUITE-TestArbitraryIndexDir-seed#[5EA5C491DD462F85]-worker) [    x:collection1] o.a.s.SolrTestCaseJ4 ###deleteCore
   [junit4]   2> 923737 INFO  (SUITE-TestArbitraryIndexDir-seed#[5EA5C491DD462F85]-worker) [    x:collection1] o.a.s.c.CoreContainer Shutting down CoreContainer instance=307124222
   [junit4]   2> 923738 INFO  (coreCloseExecutor-3419-thread-1-processing-x:collection1) [    x:collection1] o.a.s.c.SolrCore [collection1]  CLOSING SolrCore org.apache.solr.core.SolrCore@31a7d5c4
   [junit4]   2> 923738 INFO  (coreCloseExecutor-3419-thread-1-processing-x:collection1) [    x:collection1] o.a.s.u.DirectUpdateHandler2 closing DirectUpdateHandler2{commits=0,autocommits=0,soft autocommits=0,optimizes=0,rollbacks=0,expungeDeletes=0,docsPending=0,adds=0,deletesById=0,deletesByQuery=0,errors=0,cumulative_adds=0,cumulative_deletesById=0,cumulative_deletesByQuery=0,cumulative_errors=0}
   [junit4]   2> 923738 INFO  (coreCloseExecutor-3419-thread-1-processing-x:collection1) [    x:collection1] o.a.s.u.SolrCoreState Closing SolrCoreState
   [junit4]   2> 923738 INFO  (coreCloseExecutor-3419-thread-1-processing-x:collection1) [    x:collection1] o.a.s.u.DefaultSolrCoreState SolrCoreState ref count has reached 0 - closing IndexWriter
   [junit4]   2> 923738 INFO  (coreCloseExecutor-3419-thread-1-processing-x:collection1) [    x:collection1] o.a.s.u.DefaultSolrCoreState closing IndexWriter with IndexWriterCloser
   [junit4]   2> 923738 INFO  (searcherExecutor-3415-thread-1-processing-x:collection1) [    x:collection1] o.a.s.c.SolrCore [collection1] Registered new searcher Searcher@9726ceb[collection1] main{ExitableDirectoryReader(UninvertingDirectoryReader(Uninverting(_0(6.2.0):c1)))}
   [junit4]   2> 923742 INFO  (coreCloseExecutor-3419-thread-1-processing-x:collection1) [    x:collection1] o.a.s.c.SolrCore [collection1] Closing main searcher on request.
   [junit4]   2> 923756 INFO  (coreCloseExecutor-3419-thread-1-processing-x:collection1) [    x:collection1] o.a.s.c.CachingDirectoryFactory Closing MockFSDirectoryFactory - 4 directories currently being tracked
   [junit4]   2> 923756 INFO  (coreCloseExecutor-3419-thread-1-processing-x:collection1) [    x:collection1] o.a.s.c.CachingDirectoryFactory looking to close /export/home/jenkins/workspace/Lucene-Solr-6.x-Solaris/solr/build/solr-core/test/J0/temp/solr.core.TestArbitraryIndexDir_5EA5C491DD462F85-001/init-core-data-001/index_temp [CachedDir<<refCount=0;path=/export/home/jenkins/workspace/Lucene-Solr-6.x-Solaris/solr/build/solr-core/test/J0/temp/solr.core.TestArbitraryIndexDir_5EA5C491DD462F85-001/init-core-data-001/index_temp;done=false>>]
   [junit4]   2> 923756 INFO  (coreCloseExecutor-3419-thread-1-processing-x:collection1) [    x:collection1] o.a.s.c.CachingDirectoryFactory Closing directory, CoreContainer#isShutdown=true
   [junit4]   2> 923756 INFO  (coreCloseExecutor-3419-thread-1-processing-x:collection1) [    x:collection1] o.a.s.c.CachingDirectoryFactory Closing directory: /export/home/jenkins/workspace/Lucene-Solr-6.x-Solaris/solr/build/solr-core/test/J0/temp/solr.core.TestArbitraryIndexDir_5EA5C491DD462F85-001/init-core-data-001/index_temp
   [junit4]   2> 923761 INFO  (coreCloseExecutor-3419-thread-1-processing-x:collection1) [    x:collection1] o.a.s.c.CachingDirectoryFactory looking to close /export/home/jenkins/workspace/Lucene-Solr-6.x-Solaris/solr/build/solr-core/test/J0/temp/solr.core.TestArbitraryIndexDir_5EA5C491DD462F85-001/init-core-data-001 [CachedDir<<refCount=0;path=/export/home/jenkins/workspace/Lucene-Solr-6.x-Solaris/solr/build/solr-core/test/J0/temp/solr.core.TestArbitraryIndexDir_5EA5C491DD462F85-001/init-core-data-001;done=false>>]
   [junit4]   2> 923761 INFO  (coreCloseExecutor-3419-thread-1-processing-x:collection1) [    x:collection1] o.a.s.c.CachingDirectoryFactory Closing directory, CoreContainer#isShutdown=true
   [junit4]   2> 923761 INFO  (coreCloseExecutor-3419-thread-1-processing-x:collection1) [    x:collection1] o.a.s.c.CachingDirectoryFactory Closing directory: /export/home/jenkins/workspace/Lucene-Solr-6.x-Solaris/solr/build/solr-core/test/J0/temp/solr.core.TestArbitraryIndexDir_5EA5C491DD462F85-001/init-core-data-001
   [junit4]   2> 923761 INFO  (coreCloseExecutor-3419-thread-1-processing-x:collection1) [    x:collection1] o.a.s.c.CachingDirectoryFactory looking to close /export/home/jenkins/workspace/Lucene-Solr-6.x-Solaris/solr/build/solr-core/test/J0/temp/solr.core.TestArbitraryIndexDir_5EA5C491DD462F85-001/init-core-data-001/snapshot_metadata [CachedDir<<refCount=0;path=/export/home/jenkins/workspace/Lucene-Solr-6.x-Solaris/solr/build/solr-core/test/J0/temp/solr.core.TestArbitraryIndexDir_5EA5C491DD462F85-001/init-core-data-001/snapshot_metadata;done=false>>]
   [junit4]   2> 923761 INFO  (coreCloseExecutor-3419-thread-1-processing-x:collection1) [    x:collection1] o.a.s.c.CachingDirectoryFactory Closing directory, CoreContainer#isShutdown=true
   [junit4]   2> 923761 INFO  (coreCloseExecutor-3419-thread-1-processing-x:collection1) [    x:collection1] o.a.s.c.CachingDirectoryFactory Closing directory: /export/home/jenkins/workspace/Lucene-Solr-6.x-Solaris/solr/build/solr-core/test/J0/temp/solr.core.TestArbitraryIndexDir_5EA5C491DD462F85-001/init-core-data-001/snapshot_metadata
   [junit4]   2> 923761 INFO  (coreCloseExecutor-3419-thread-1-processing-x:collection1) [    x:collection1] o.a.s.c.CachingDirectoryFactory looking to close /export/home/jenkins/workspace/Lucene-Solr-6.x-Solaris/solr/build/solr-core/test/J0/temp/solr.core.TestArbitraryIndexDir_5EA5C491DD462F85-001/init-core-data-001/index [CachedDir<<refCount=0;path=/export/home/jenkins/workspace/Lucene-Solr-6.x-Solaris/solr/build/solr-core/test/J0/temp/solr.core.TestArbitraryIndexDir_5EA5C491DD462F85-001/init-core-data-001/index;done=false>>]
   [junit4]   2> 923761 INFO  (coreCloseExecutor-3419-thread-1-processing-x:collection1) [    x:collection1] o.a.s.c.CachingDirectoryFactory Closing directory, CoreContainer#isShutdown=true
   [junit4]   2> 923761 INFO  (coreCloseExecutor-3419-thread-1-processing-x:collection1) [    x:collection1] o.a.s.c.CachingDirectoryFactory Closing directory: /export/home/jenkins/workspace/Lucene-Solr-6.x-Solaris/solr/build/solr-core/test/J0/temp/solr.core.TestArbitraryIndexDir_5EA5C491DD462F85-001/init-core-data-001/index
   [junit4]   2> NOTE: leaving temporary files on disk at: /export/home/jenkins/workspace/Lucene-Solr-6.x-Solaris/solr/build/solr-core/test/J0/temp/solr.core.TestArbitraryIndexDir_5EA5C491DD462F85-001
   [junit4]   2> NOTE: test params are: codec=Asserting(Lucene62): {name=PostingsFormat(name=Direct), id=PostingsFormat(name=Direct)}, docValues:{}, maxPointsInLeafNode=639, maxMBSortInHeap=5.742802912512191, sim=RandomSimilarity(queryNorm=false,coord=yes): {}, locale=el-GR, timezone=Africa/Cairo
   [junit4]   2> NOTE: SunOS 5.11 amd64/Oracle Corporation 1.8.0_102 (64-bit)/cpus=3,threads=1,free=179514640,total=425144320
   [junit4]   2> NOTE: All tests run in this JVM: [ResponseHeaderTest, TestOverriddenPrefixQueryForCustomFieldType, TestRemoteStreaming, DistributedDebugComponentTest, TestWordDelimiterFilterFactory, DistributedQueryElevationComponentTest, BadComponentTest, DocValuesTest, TestLocalFSCloudBackupRestore, SolrRequestParserTest, CoreAdminCreateDiscoverTest, DistributedSpellCheckComponentTest, DirectSolrSpellCheckerTest, DistributedQueueTest, AddBlockUpdateTest, AnalyticsQueryTest, SliceStateTest, TestRandomRequestDistribution, MergeStrategyTest, TestFastLRUCache, StatelessScriptUpdateProcessorFactoryTest, TestPivotHelperCode, SaslZkACLProviderTest, RecoveryZkTest, TestSurroundQueryParser, TestSerializedLuceneMatchVersion, XsltUpdateRequestHandlerTest, TestReRankQParserPlugin, TestDocSet, TestNamedUpdateProcessors, CdcrBootstrapTest, SharedFSAutoReplicaFailoverTest, HLLUtilTest, HdfsChaosMonkeySafeLeaderTest, TestStressVersions, SpatialFilterTest, TestExclusionRuleCollectionAccess, TestStandardQParsers, TestInitQParser, TestSolrConfigHandlerCloud, AsyncMigrateRouteKeyTest, TestGraphMLResponseWriter, QueryElevationComponentTest, TestReplicaProperties, MultiThreadedOCPTest, TestGroupingSearch, DirectUpdateHandlerTest, TestLMDirichletSimilarityFactory, CollectionReloadTest, AlternateDirectoryTest, TestSolr4Spatial2, ChangedSchemaMergeTest, ActionThrottleTest, CdcrUpdateLogTest, TestSolrQueryParserResource, PingRequestHandlerTest, ShardRoutingTest, TestPartialUpdateDeduplication, ParsingFieldUpdateProcessorsTest, DistribDocExpirationUpdateProcessorTest, JsonLoaderTest, PolyFieldTest, OverseerTest, TestSolrCloudWithDelegationTokens, TestHighlightDedupGrouping, TestStressReorder, TestScoreJoinQPNoScore, TestHighFrequencyDictionaryFactory, SoftAutoCommitTest, UnloadDistributedZkTest, SecurityConfHandlerTest, RegexBoostProcessorTest, TestCloudSchemaless, TestAnalyzedSuggestions, ReturnFieldsTest, HighlighterTest, StandardRequestHandlerTest, TestCursorMarkWithoutUniqueKey, TestLFUCache, TestEmbeddedSolrServerConstructors, BlockDirectoryTest, CursorPagingTest, TestTrieFacet, MoreLikeThisHandlerTest, JavabinLoaderTest, TestPseudoReturnFields, TestArbitraryIndexDir]
   [junit4] Completed [143/627 (1!)] on J0 in 0.54s, 1 test, 1 error <<< FAILURES!

[...truncated 161 lines...]
   [junit4] Suite: org.apache.solr.cloud.LeaderFailoverAfterPartitionTest
   [junit4]   2> Creating dataDir: /export/home/jenkins/workspace/Lucene-Solr-6.x-Solaris/solr/build/solr-core/test/J0/temp/solr.cloud.LeaderFailoverAfterPartitionTest_5EA5C491DD462F85-001/init-core-data-001
   [junit4]   2> 1241017 INFO  (SUITE-LeaderFailoverAfterPartitionTest-seed#[5EA5C491DD462F85]-worker) [    ] o.a.s.SolrTestCaseJ4 Randomized ssl (false) and clientAuth (false) via: @org.apache.solr.SolrTestCaseJ4$SuppressSSL(bugUrl=https://issues.apache.org/jira/browse/SOLR-5776)
   [junit4]   2> 1241017 INFO  (SUITE-LeaderFailoverAfterPartitionTest-seed#[5EA5C491DD462F85]-worker) [    ] o.a.s.BaseDistributedSearchTestCase Setting hostContext system property: /ny_nfs/
   [junit4]   2> 1241020 INFO  (TEST-LeaderFailoverAfterPartitionTest.test-seed#[5EA5C491DD462F85]) [    ] o.a.s.c.ZkTestServer STARTING ZK TEST SERVER
   [junit4]   2> 1241020 INFO  (Thread-1908) [    ] o.a.s.c.ZkTestServer client port:0.0.0.0/0.0.0.0:0
   [junit4]   2> 1241020 INFO  (Thread-1908) [    ] o.a.s.c.ZkTestServer Starting server
   [junit4]   2> 1241120 INFO  (TEST-LeaderFailoverAfterPartitionTest.test-seed#[5EA5C491DD462F85]) [    ] o.a.s.c.ZkTestServer start zk server on port:42083
   [junit4]   2> 1241120 INFO  (TEST-LeaderFailoverAfterPartitionTest.test-seed#[5EA5C491DD462F85]) [    ] o.a.s.c.c.SolrZkClient Using default ZkCredentialsProvider
   [junit4]   2> 1241120 INFO  (TEST-LeaderFailoverAfterPartitionTest.test-seed#[5EA5C491DD462F85]) [    ] o.a.s.c.c.ConnectionManager Waiting for client to connect to ZooKeeper
   [junit4]   2> 1241123 INFO  (zkCallback-2218-thread-1) [    ] o.a.s.c.c.ConnectionManager Watcher org.apache.solr.common.cloud.ConnectionManager@5ef31cd3 name:ZooKeeperConnection Watcher:127.0.0.1:42083 got event WatchedEvent state:SyncConnected type:None path:null path:null type:None
   [junit4]   2> 1241123 INFO  (TEST-LeaderFailoverAfterPartitionTest.test-seed#[5EA5C491DD462F85]) [    ] o.a.s.c.c.ConnectionManager Client is connected to ZooKeeper
   [junit4]   2> 1241123 INFO  (TEST-LeaderFailoverAfterPartitionTest.test-seed#[5EA5C491DD462F85]) [    ] o.a.s.c.c.SolrZkClient Using default ZkACLProvider
   [junit4]   2> 1241123 INFO  (TEST-LeaderFailoverAfterPartitionTest.test-seed#[5EA5C491DD462F85]) [    ] o.a.s.c.c.SolrZkClient makePath: /solr
   [junit4]   2> 1241126 INFO  (TEST-LeaderFailoverAfterPartitionTest.test-seed#[5EA5C491DD462F85]) [    ] o.a.s.c.c.SolrZkClient Using default ZkCredentialsProvider
   [junit4]   2> 1241127 INFO  (TEST-LeaderFailoverAfterPartitionTest.test-seed#[5EA5C491DD462F85]) [    ] o.a.s.c.c.ConnectionManager Waiting for client to connect to ZooKeeper
   [junit4]   2> 1241128 INFO  (zkCallback-2219-thread-1) [    ] o.a.s.c.c.ConnectionManager Watcher org.apache.solr.common.cloud.ConnectionManager@66415797 name:ZooKeeperConnection Watcher:127.0.0.1:42083/solr got event WatchedEvent state:SyncConnected type:None path:null path:null type:None
   [junit4]   2> 1241128 INFO  (TEST-LeaderFailoverAfterPartitionTest.test-seed#[5EA5C491DD462F85]) [    ] o.a.s.c.c.ConnectionManager Client is connected to ZooKeeper
   [junit4]   2> 1241128 INFO  (TEST-LeaderFailoverAfterPartitionTest.test-seed#[5EA5C491DD462F85]) [    ] o.a.s.c.c.SolrZkClient Using default ZkACLProvider
   [junit4]   2> 1241128 INFO  (TEST-LeaderFailoverAfterPartitionTest.test-seed#[5EA5C491DD462F85]) [    ] o.a.s.c.c.SolrZkClient makePath: /collections/collection1
   [junit4]   2> 1241130 INFO  (TEST-LeaderFailoverAfterPartitionTest.test-seed#[5EA5C491DD462F85]) [    ] o.a.s.c.c.SolrZkClient makePath: /collections/collection1/shards
   [junit4]   2> 1241133 INFO  (TEST-LeaderFailoverAfterPartitionTest.test-seed#[5EA5C491DD462F85]) [    ] o.a.s.c.c.SolrZkClient makePath: /collections/control_collection
   [junit4]   2> 1241134 INFO  (TEST-LeaderFailoverAfterPartitionTest.test-seed#[5EA5C491DD462F85]) [    ] o.a.s.c.c.SolrZkClient makePath: /collections/control_collection/shards
   [junit4]   2> 1241136 INFO  (TEST-LeaderFailoverAfterPartitionTest.test-seed#[5EA5C491DD462F85]) [    ] o.a.s.c.AbstractZkTestCase put /export/home/jenkins/workspace/Lucene-Solr-6.x-Solaris/solr/core/src/test-files/solr/collection1/conf/solrconfig-tlog.xml to /configs/conf1/solrconfig.xml
   [junit4]   2> 1241137 INFO  (TEST-LeaderFailoverAfterPartitionTest.test-seed#[5EA5C491DD462F85]) [    ] o.a.s.c.c.SolrZkClient makePath: /configs/conf1/solrconfig.xml
   [junit4]   2> 1241141 INFO  (TEST-LeaderFailoverAfterPartitionTest.test-seed#[5EA5C491DD462F85]) [    ] o.a.s.c.AbstractZkTestCase put /export/home/jenkins/workspace/Lucene-Solr-6.x-Solaris/solr/core/src/test-files/solr/collection1/conf/schema.xml to /configs/conf1/schema.xml
   [junit4]   2> 1241141 INFO  (TEST-LeaderFailoverAfterPartitionTest.test-seed#[5EA5C491DD462F85]) [    ] o.a.s.c.c.SolrZkClient makePath: /configs/conf1/schema.xml
   [junit4]   2> 1241143 INFO  (TEST-LeaderFailoverAfterPartitionTest.test-seed#[5EA5C491DD462F85]) [    ] o.a.s.c.AbstractZkTestCase put /export/home/jenkins/workspace/Lucene-Solr-6.x-Solaris/solr/core/src/test-files/solr/collection1/conf/solrconfig.snippet.randomindexconfig.xml to /configs/conf1/solrconfig.snippet.randomindexconfig.xml
   [junit4]   2> 1241144 INFO  (TEST-LeaderFailoverAfterPartitionTest.test-seed#[5EA5C491DD462F85]) [    ] o.a.s.c.c.SolrZkClient makePath: /configs/conf1/solrconfig.snippet.randomindexconfig.xml
   [junit4]   2> 1241146 INFO  (TEST-LeaderFailoverAfterPartitionTest.test-seed#[5EA5C491DD462F85]) [    ] o.a.s.c.AbstractZkTestCase put /export/home/jenkins/workspace/Lucene-Solr-6.x-Solaris/solr/core/src/test-files/solr/collection1/conf/stopwords.txt to /configs/conf1/stopwords.txt
   [junit4]   2> 1241146 INFO  (TEST-LeaderFailoverAfterPartitionTest.test-seed#[5EA5C491DD462F85]) [    ] o.a.s.c.c.SolrZkClient makePath: /configs/conf1/stopwords.txt
   [junit4]   2> 1241148 INFO  (TEST-LeaderFailoverAfterPartitionTest.test-seed#[5EA5C491DD462F85]) [    ] o.a.s.c.AbstractZkTestCase put /export/home/jenkins/workspace/Lucene-Solr-6.x-Solaris/solr/core/src/test-files/solr/collection1/conf/protwords.txt to /configs/conf1/protwords.txt
   [junit4]   2> 1241148 INFO  (TEST-LeaderFailoverAfterPartitionTest.test-seed#[5EA5C491DD462F85]) [    ] o.a.s.c.c.SolrZkClient makePath: /configs/conf1/protwords.txt
   [junit4]   2> 1241151 INFO  (TEST-LeaderFailoverAfterPartitionTest.test-seed#[5EA5C491DD462F85]) [    ] o.a.s.c.AbstractZkTestCase put /export/home/jenkins/workspace/Lucene-Solr-6.x-Solaris/solr/core/src/test-files/solr/collection1/conf/currency.xml to /configs/conf1/currency.xml
   [junit4]   2> 1241151 INFO  (TEST-LeaderFailoverAfterPartitionTest.test-seed#[5EA5C491DD462F85]) [    ] o.a.s.c.c.SolrZkClient makePath: /configs/conf1/currency.xml
   [junit4]   2> 1241153 INFO  (TEST-LeaderFailoverAfterPartitionTest.test-seed#[5EA5C491DD462F85]) [    ] o.a.s.c.AbstractZkTestCase put /export/home/jenkins/workspace/Lucene-Solr-6.x-Solaris/solr/core/src/test-files/solr/collection1/conf/enumsConfig.xml to /configs/conf1/enumsConfig.xml
   [junit4]   2> 1241154 INFO  (TEST-LeaderFailoverAfterPartitionTest.test-seed#[5EA5C491DD462F85]) [    ] o.a.s.c.c.SolrZkClient makePath: /configs/conf1/enumsConfig.xml
   [junit4]   2> 1241156 INFO  (TEST-LeaderFailoverAfterPartitionTest.test-seed#[5EA5C491DD462F85]) [    ] o.a.s.c.AbstractZkTestCase put /export/home/jenkins/workspace/Lucene-Solr-6.x-Solaris/solr/core/src/test-files/solr/collection1/conf/open-exchange-rates.json to /configs/conf1/open-exchange-rates.json
   [junit4]   2> 1241156 INFO  (TEST-LeaderFailoverAfterPartitionTest.test-seed#[5EA5C491DD462F85]) [    ] o.a.s.c.c.SolrZkClient makePath: /configs/conf1/open-exchange-rates.json
   [junit4]   2> 1241158 INFO  (TEST-LeaderFailoverAfterPartitionTest.test-seed#[5EA5C491DD462F85]) [    ] o.a.s.c.AbstractZkTestCase put /export/home/jenkins/workspace/Lucene-Solr-6.x-Solaris/solr/core/src/test-files/solr/collection1/conf/mapping-ISOLatin1Accent.txt to /configs/conf1/mapping-ISOLatin1Accent.txt
   [junit4]   2> 1241159 INFO  (TEST-LeaderFailoverAfterPartitionTest.test-seed#[5EA5C491DD462F85]) [    ] o.a.s.c.c.SolrZkClient makePath: /configs/conf1/mapping-ISOLatin1Accent.txt
   [junit4]   2> 1241161 INFO  (TEST-LeaderFailoverAfterPartitionTest.test-seed#[5EA5C491DD462F85]) [    ] o.a.s.c.AbstractZkTestCase put /export/home/jenkins/workspace/Lucene-Solr-6.x-Solaris/solr/core/src/test-files/solr/collection1/conf/old_synonyms.txt to /configs/conf1/old_synonyms.txt
   [junit4]   2> 1241162 INFO  (TEST-LeaderFailoverAfterPartitionTest.test-seed#[5EA5C491DD462F85]) [    ] o.a.s.c.c.SolrZkClient makePath: /configs/conf1/old_synonyms.txt
   [junit4]   2> 1241164 INFO  (TEST-LeaderFailoverAfterPartitionTest.test-seed#[5EA5C491DD462F85]) [    ] o.a.s.c.AbstractZkTestCase put /export/home/jenkins/workspace/Lucene-Solr-6.x-Solaris/solr/core/src/test-files/solr/collection1/conf/synonyms.txt to /configs/conf1/synonyms.txt
   [junit4]   2> 1241164 INFO  (TEST-LeaderFailoverAfterPartitionTest.test-seed#[5EA5C491DD462F85]) [    ] o.a.s.c.c.SolrZkClient makePath: /configs/conf1/synonyms.txt
   [junit4]   2> 1241284 INFO  (TEST-LeaderFailoverAfterPartitionTest.test-seed#[5EA5C491DD462F85]) [    ] o.a.s.SolrTestCaseJ4 Writing core.properties file to /export/home/jenkins/workspace/Lucene-Solr-6.x-Solaris/solr/build/solr-core/test/J0/temp/solr.cloud.LeaderFailoverAfterPartitionTest_5EA5C491DD462F85-001/control-001/cores/collection1
   [junit4]   2> 1241285 INFO  (TEST-LeaderFailoverAfterPartitionTest.test-seed#[5EA5C491DD462F85]) [    ] o.e.j.s.Server jetty-9.3.8.v20160314
   [junit4]   2> 1241286 INFO  (TEST-LeaderFailoverAfterPartitionTest.test-seed#[5EA5C491DD462F85]) [    ] o.e.j.s.h.ContextHandler Started o.e.j.s.ServletContextHandler@6f4d3244{/ny_nfs,null,AVAILABLE}
   [junit4]   2> 1241289 INFO  (TEST-LeaderFailoverAfterPartitionTest.test-seed#[5EA5C491DD462F85]) [    ] o.e.j.s.ServerConnector Started ServerConnector@77458e09{HTTP/1.1,[http/1.1]}{127.0.0.1:34786}
   [junit4]   2> 1241289 INFO  (TEST-LeaderFailoverAfterPartitionTest.test-seed#[5EA5C491DD462F85]) [    ] o.e.j.s.Server Started @1245349ms
   [junit4]   2> 1241289 INFO  (TEST-LeaderFailoverAfterPartitionTest.test-seed#[5EA5C491DD462F85]) [    ] o.a.s.c.s.e.JettySolrRunner Jetty properties: {solr.data.dir=/export/home/jenkins/workspace/Lucene-Solr-6.x-Solaris/solr/build/solr-core/test/J0/temp/solr.cloud.LeaderFailoverAfterPartitionTest_5EA5C491DD462F85-001/tempDir-001/control/data, hostContext=/ny_nfs, hostPort=53657, coreRootDirectory=/export/home/jenkins/workspace/Lucene-Solr-6.x-Solaris/solr/build/solr-core/test/J0/temp/solr.cloud.LeaderFailoverAfterPartitionTest_5EA5C491DD462F85-001/control-001/cores}
   [junit4]   2> 1241289 INFO  (TEST-LeaderFailoverAfterPartitionTest.test-seed#[5EA5C491DD462F85]) [    ] o.a.s.s.SolrDispatchFilter SolrDispatchFilter.init(): sun.misc.Launcher$AppClassLoader@6d06d69c
   [junit4]   2> 1241289 INFO  (TEST-LeaderFailoverAfterPartitionTest.test-seed#[5EA5C491DD462F85]) [    ] o.a.s.c.SolrResourceLoader new SolrResourceLoader for directory: '/export/home/jenkins/workspace/Lucene-Solr-6.x-Solaris/solr/build/solr-core/test/J0/temp/solr.cloud.LeaderFailoverAfterPartitionTest_5EA5C491DD462F85-001/control-001'
   [junit4]   2> 1241289 INFO  (TEST-LeaderFailoverAfterPartitionTest.test-seed#[5EA5C491DD462F85]) [    ] o.a.s.c.SolrResourceLoader JNDI not configured for solr (NoInitialContextEx)
   [junit4]   2> 1241289 INFO  (TEST-LeaderFailoverAfterPartitionTest.test-seed#[5EA5C491DD462F85]) [    ] o.a.s.c.SolrResourceLoader solr home defaulted to 'solr/' (could not find system property or JNDI)
   [junit4]   2> 1241290 INFO  (TEST-LeaderFailoverAfterPartitionTest.test-seed#[5EA5C491DD462F85]) [    ] o.a.s.c.c.SolrZkClient Using default ZkCredentialsProvider
   [junit4]   2> 1241290 INFO  (TEST-LeaderFailoverAfterPartitionTest.test-seed#[5EA5C491DD462F85]) [    ] o.a.s.c.c.ConnectionManager Waiting for client to connect to ZooKeeper
   [junit4]   2> 1241291 INFO  (zkCallback-2220-thread-1) [    ] o.a.s.c.c.ConnectionManager Watcher org.apache.solr.common.cloud.ConnectionManager@67324d09 name:ZooKeeperConnection Watcher:127.0.0.1:42083/solr got event WatchedEvent state:SyncConnected type:None path:null path:null type:None
   [junit4]   2> 1241291 INFO  (TEST-LeaderFailoverAfterPartitionTest.test-seed#[5EA5C491DD462F85]) [    ] o.a.s.c.c.ConnectionManager Client is connected to ZooKeeper
   [junit4]   2> 1241292 INFO  (TEST-LeaderFailoverAfterPartitionTest.test-seed#[5EA5C491DD462F85]) [    ] o.a.s.c.c.SolrZkClient Using default ZkACLProvider
   [junit4]   2> 1241293 INFO  (TEST-LeaderFailoverAfterPartitionTest.test-seed#[5EA5C491DD462F85]) [    ] o.a.s.s.SolrDispatchFilter Loading solr.xml from SolrHome (not found in ZooKeeper)
   [junit4]   2> 1241293 INFO  (TEST-LeaderFailoverAfterPartitionTest.test-seed#[5EA5C491DD462F85]) [    ] o.a.s.c.SolrXmlConfig Loading container configuration from /export/home/jenkins/workspace/Lucene-Solr-6.x-Solaris/solr/build/solr-core/test/J0/temp/solr.cloud.LeaderFailoverAfterPartitionTest_5EA5C491DD462F85-001/control-001/solr.xml
   [junit4]   2> 1241297 INFO  (TEST-LeaderFailoverAfterPartitionTest.test-seed#[5EA5C491DD462F85]) [    ] o.a.s.c.CorePropertiesLocator Config-defined core root directory: /export/home/jenkins/workspace/Lucene-Solr-6.x-Solaris/solr/build/solr-core/test/J0/temp/solr.cloud.LeaderFailoverAfterPartitionTest_5EA5C491DD462F85-001/control-001/cores
   [junit4]   2> 1241297 INFO  (TEST-LeaderFailoverAfterPartitionTest.test-seed#[5EA5C491DD462F85]) [    ] o.a.s.c.CoreContainer New CoreContainer 1479207933
   [junit4]   2> 1241297 INFO  (TEST-LeaderFailoverAfterPartitionTest.test-seed#[5EA5C491DD462F85]) [    ] o.a.s.c.CoreContainer Loading cores into CoreContainer [instanceDir=/export/home/jenkins/workspace/Lucene-Solr-6.x-Solaris/solr/build/solr-core/test/J0/temp/solr.cloud.LeaderFailoverAfterPartitionTest_5EA5C491DD462F85-001/control-001]
   [junit4]   2> 1241297 WARN  (TEST-LeaderFailoverAfterPartitionTest.test-seed#[5EA5C491DD462F85]) [    ] o.a.s.c.CoreContainer Couldn't add files from /export/home/jenkins/workspace/Lucene-Solr-6.x-Solaris/solr/build/solr-core/test/J0/temp/solr.cloud.LeaderFailoverAfterPartitionTest_5EA5C491DD462F85-001/control-001/lib to classpath: /export/home/jenkins/workspace/Lucene-Solr-6.x-Solaris/solr/build/solr-core/test/J0/temp/solr.cloud.LeaderFailoverAfterPartitionTest_5EA5C491DD462F85-001/control-001/lib
   [junit4]   2> 1241297 INFO  (TEST-LeaderFailoverAfterPartitionTest.test-seed#[5EA5C491DD462F85]) [    ] o.a.s.h.c.HttpShardHandlerFactory created with socketTimeout : 90000,urlScheme : ,connTimeout : 15000,maxConnectionsPerHost : 20,maxConnections : 10000,corePoolSize : 0,maximumPoolSize : 2147483647,maxThreadIdleTime : 5,sizeOfQueue : -1,fairnessPolicy : false,useRetries : false,connectionsEvictorSleepDelay : 5000,maxConnectionIdleTime : 40000,
   [junit4]   2> 1241298 INFO  (TEST-LeaderFailoverAfterPartitionTest.test-seed#[5EA5C491DD462F85]) [    ] o.a.s.u.U

[...truncated too long message...]

iloverAfterPartitionTest -Dtests.method=test -Dtests.seed=5EA5C491DD462F85 -Dtests.slow=true -Dtests.locale=uk -Dtests.timezone=Antarctica/Casey -Dtests.asserts=true -Dtests.file.encoding=UTF-8
   [junit4] ERROR    116s J0 | LeaderFailoverAfterPartitionTest.test <<<
   [junit4]    > Throwable #1: org.apache.solr.client.solrj.SolrServerException: org.apache.solr.client.solrj.SolrServerException: No live SolrServers available to handle this request:[http://127.0.0.1:53657/ny_nfs/c8n_1x3_lf_shard1_replica1]
   [junit4]    > 	at __randomizedtesting.SeedInfo.seed([5EA5C491DD462F85:D6F1FB4B73BA427D]:0)
   [junit4]    > 	at org.apache.solr.client.solrj.impl.CloudSolrClient.directUpdate(CloudSolrClient.java:774)
   [junit4]    > 	at org.apache.solr.client.solrj.impl.CloudSolrClient.sendRequest(CloudSolrClient.java:1172)
   [junit4]    > 	at org.apache.solr.client.solrj.impl.CloudSolrClient.requestWithRetryOnStaleState(CloudSolrClient.java:1061)
   [junit4]    > 	at org.apache.solr.client.solrj.impl.CloudSolrClient.request(CloudSolrClient.java:997)
   [junit4]    > 	at org.apache.solr.client.solrj.SolrClient.request(SolrClient.java:1219)
   [junit4]    > 	at org.apache.solr.cloud.HttpPartitionTest.sendDoc(HttpPartitionTest.java:592)
   [junit4]    > 	at org.apache.solr.cloud.HttpPartitionTest.sendDoc(HttpPartitionTest.java:578)
   [junit4]    > 	at org.apache.solr.cloud.LeaderFailoverAfterPartitionTest.testRf3WithLeaderFailover(LeaderFailoverAfterPartitionTest.java:174)
   [junit4]    > 	at org.apache.solr.cloud.LeaderFailoverAfterPartitionTest.test(LeaderFailoverAfterPartitionTest.java:55)
   [junit4]    > 	at org.apache.solr.BaseDistributedSearchTestCase$ShardsRepeatRule$ShardsFixedStatement.callStatement(BaseDistributedSearchTestCase.java:992)
   [junit4]    > 	at org.apache.solr.BaseDistributedSearchTestCase$ShardsRepeatRule$ShardsStatement.evaluate(BaseDistributedSearchTestCase.java:967)
   [junit4]    > 	at java.lang.Thread.run(Thread.java:745)
   [junit4]    > Caused by: org.apache.solr.client.solrj.SolrServerException: No live SolrServers available to handle this request:[http://127.0.0.1:53657/ny_nfs/c8n_1x3_lf_shard1_replica1]
   [junit4]    > 	at org.apache.solr.client.solrj.impl.LBHttpSolrClient.request(LBHttpSolrClient.java:383)
   [junit4]    > 	at org.apache.solr.client.solrj.impl.CloudSolrClient.directUpdate(CloudSolrClient.java:768)
   [junit4]    > 	... 49 more
   [junit4]    > Caused by: org.apache.solr.client.solrj.SolrServerException: Server refused connection at: http://127.0.0.1:53657/ny_nfs/c8n_1x3_lf_shard1_replica1
   [junit4]    > 	at org.apache.solr.client.solrj.impl.HttpSolrClient.executeMethod(HttpSolrClient.java:599)
   [junit4]    > 	at org.apache.solr.client.solrj.impl.HttpSolrClient.request(HttpSolrClient.java:261)
   [junit4]    > 	at org.apache.solr.client.solrj.impl.HttpSolrClient.request(HttpSolrClient.java:250)
   [junit4]    > 	at org.apache.solr.client.solrj.impl.LBHttpSolrClient.doRequest(LBHttpSolrClient.java:403)
   [junit4]    > 	at org.apache.solr.client.solrj.impl.LBHttpSolrClient.request(LBHttpSolrClient.java:356)
   [junit4]    > 	... 50 more
   [junit4]    > Caused by: java.net.ConnectException: Connection refused
   [junit4]    > 	at java.net.PlainSocketImpl.socketConnect(Native Method)
   [junit4]    > 	at java.net.AbstractPlainSocketImpl.doConnect(AbstractPlainSocketImpl.java:350)
   [junit4]    > 	at java.net.AbstractPlainSocketImpl.connectToAddress(AbstractPlainSocketImpl.java:206)
   [junit4]    > 	at java.net.AbstractPlainSocketImpl.connect(AbstractPlainSocketImpl.java:188)
   [junit4]    > 	at java.net.SocksSocketImpl.connect(SocksSocketImpl.java:392)
   [junit4]    > 	at java.net.Socket.connect(Socket.java:589)
   [junit4]    > 	at org.apache.http.conn.scheme.PlainSocketFactory.connectSocket(PlainSocketFactory.java:117)
   [junit4]    > 	at org.apache.http.impl.conn.DefaultClientConnectionOperator.openConnection(DefaultClientConnectionOperator.java:177)
   [junit4]    > 	at org.apache.http.impl.conn.ManagedClientConnectionImpl.open(ManagedClientConnectionImpl.java:304)
   [junit4]    > 	at org.apache.http.impl.client.DefaultRequestDirector.tryConnect(DefaultRequestDirector.java:611)
   [junit4]    > 	at org.apache.http.impl.client.DefaultRequestDirector.execute(DefaultRequestDirector.java:446)
   [junit4]    > 	at org.apache.http.impl.client.AbstractHttpClient.doExecute(AbstractHttpClient.java:882)
   [junit4]    > 	at org.apache.http.impl.client.CloseableHttpClient.execute(CloseableHttpClient.java:82)
   [junit4]    > 	at org.apache.http.impl.client.CloseableHttpClient.execute(CloseableHttpClient.java:107)
   [junit4]    > 	at org.apache.http.impl.client.CloseableHttpClient.execute(CloseableHttpClient.java:55)
   [junit4]    > 	at org.apache.solr.client.solrj.impl.HttpSolrClient.executeMethod(HttpSolrClient.java:497)
   [junit4]    > 	... 54 more
   [junit4]   2> 1357217 INFO  (SUITE-LeaderFailoverAfterPartitionTest-seed#[5EA5C491DD462F85]-worker) [    ] o.a.s.SolrTestCaseJ4 ###deleteCore
   [junit4]   2> NOTE: leaving temporary files on disk at: /export/home/jenkins/workspace/Lucene-Solr-6.x-Solaris/solr/build/solr-core/test/J0/temp/solr.cloud.LeaderFailoverAfterPartitionTest_5EA5C491DD462F85-001
   [junit4]   2> Aug 11, 2016 4:45:11 AM com.carrotsearch.randomizedtesting.ThreadLeakControl checkThreadLeaks
   [junit4]   2> WARNING: Will linger awaiting termination of 2 leaked thread(s).
   [junit4]   2> NOTE: test params are: codec=Asserting(Lucene62): {range_facet_l_dv=PostingsFormat(name=Memory doPackFST= true), _version_=PostingsFormat(name=LuceneVarGapFixedInterval), multiDefault=PostingsFormat(name=LuceneVarGapDocFreqInterval), a_t=PostingsFormat(name=LuceneVarGapDocFreqInterval), intDefault=PostingsFormat(name=LuceneVarGapFixedInterval), id=PostingsFormat(name=Memory doPackFST= true), range_facet_i_dv=PostingsFormat(name=LuceneVarGapDocFreqInterval), text=TestBloomFilteredLucenePostings(BloomFilteringPostingsFormat(Lucene50(blocksize=128))), range_facet_l=PostingsFormat(name=LuceneVarGapDocFreqInterval), timestamp=PostingsFormat(name=LuceneVarGapDocFreqInterval)}, docValues:{range_facet_l_dv=DocValuesFormat(name=Lucene54), range_facet_i_dv=DocValuesFormat(name=Asserting), timestamp=DocValuesFormat(name=Asserting)}, maxPointsInLeafNode=1679, maxMBSortInHeap=5.300386283913394, sim=RandomSimilarity(queryNorm=true,coord=no): {}, locale=uk, timezone=Antarctica/Casey
   [junit4]   2> NOTE: SunOS 5.11 amd64/Oracle Corporation 1.8.0_102 (64-bit)/cpus=3,threads=1,free=185655656,total=518979584
   [junit4]   2> NOTE: All tests run in this JVM: [ResponseHeaderTest, TestOverriddenPrefixQueryForCustomFieldType, TestRemoteStreaming, DistributedDebugComponentTest, TestWordDelimiterFilterFactory, DistributedQueryElevationComponentTest, BadComponentTest, DocValuesTest, TestLocalFSCloudBackupRestore, SolrRequestParserTest, CoreAdminCreateDiscoverTest, DistributedSpellCheckComponentTest, DirectSolrSpellCheckerTest, DistributedQueueTest, AddBlockUpdateTest, AnalyticsQueryTest, SliceStateTest, TestRandomRequestDistribution, MergeStrategyTest, TestFastLRUCache, StatelessScriptUpdateProcessorFactoryTest, TestPivotHelperCode, SaslZkACLProviderTest, RecoveryZkTest, TestSurroundQueryParser, TestSerializedLuceneMatchVersion, XsltUpdateRequestHandlerTest, TestReRankQParserPlugin, TestDocSet, TestNamedUpdateProcessors, CdcrBootstrapTest, SharedFSAutoReplicaFailoverTest, HLLUtilTest, HdfsChaosMonkeySafeLeaderTest, TestStressVersions, SpatialFilterTest, TestExclusionRuleCollectionAccess, TestStandardQParsers, TestInitQParser, TestSolrConfigHandlerCloud, AsyncMigrateRouteKeyTest, TestGraphMLResponseWriter, QueryElevationComponentTest, TestReplicaProperties, MultiThreadedOCPTest, TestGroupingSearch, DirectUpdateHandlerTest, TestLMDirichletSimilarityFactory, CollectionReloadTest, AlternateDirectoryTest, TestSolr4Spatial2, ChangedSchemaMergeTest, ActionThrottleTest, CdcrUpdateLogTest, TestSolrQueryParserResource, PingRequestHandlerTest, ShardRoutingTest, TestPartialUpdateDeduplication, ParsingFieldUpdateProcessorsTest, DistribDocExpirationUpdateProcessorTest, JsonLoaderTest, PolyFieldTest, OverseerTest, TestSolrCloudWithDelegationTokens, TestHighlightDedupGrouping, TestStressReorder, TestScoreJoinQPNoScore, TestHighFrequencyDictionaryFactory, SoftAutoCommitTest, UnloadDistributedZkTest, SecurityConfHandlerTest, RegexBoostProcessorTest, TestCloudSchemaless, TestAnalyzedSuggestions, ReturnFieldsTest, HighlighterTest, StandardRequestHandlerTest, TestCursorMarkWithoutUniqueKey, TestLFUCache, TestEmbeddedSolrServerConstructors, BlockDirectoryTest, CursorPagingTest, TestTrieFacet, MoreLikeThisHandlerTest, JavabinLoaderTest, TestPseudoReturnFields, TestArbitraryIndexDir, TestFileDictionaryLookup, CircularListTest, DeleteReplicaTest, DirectoryFactoryTest, UUIDUpdateProcessorFallbackTest, SolrCoreTest, SimpleCollectionCreateDeleteTest, TestLRUCache, HdfsSyncSliceTest, UUIDFieldTest, TestLegacyFieldCache, OverseerModifyCollectionTest, DistributedFacetPivotLargeTest, TestSubQueryTransformer, TestComplexPhraseQParserPlugin, TestDocumentBuilder, CoreMergeIndexesAdminHandlerTest, TlogReplayBufferedWhileIndexingTest, TestFunctionQuery, TestSimpleQParserPlugin, TestConfigReload, LeaderInitiatedRecoveryOnShardRestartTest, LeaderElectionTest, HdfsWriteToMultipleCollectionsTest, TestRestoreCore, TestXIncludeConfig, DocumentBuilderTest, PrimitiveFieldTypeTest, TestRawTransformer, DisMaxRequestHandlerTest, TestUseDocValuesAsStored2, BigEndianAscendingWordDeserializerTest, DocValuesMultiTest, TestBackupRepositoryFactory, SolrIndexConfigTest, TestMissingGroups, ClusterStateUpdateTest, TestConfigSets, PeerSyncTest, TestCustomDocTransformer, BlockJoinFacetDistribTest, TestConfigSetsAPIZkFailure, RecoveryAfterSoftCommitTest, HdfsTlogReplayBufferedWhileIndexingTest, LeaderFailoverAfterPartitionTest]
   [junit4] Completed [191/627 (2!)] on J0 in 116.98s, 1 test, 1 error <<< FAILURES!

[...truncated 61512 lines...]


Mime
View raw message