lucene-dev mailing list archives

Site index · List index
Message view « Date » · « Thread »
Top « Date » · « Thread »
From Policeman Jenkins Server <jenk...@thetaphi.de>
Subject [JENKINS] Lucene-Solr-master-Windows (64bit/jdk1.8.0_102) - Build # 6085 - Still Unstable!
Date Mon, 29 Aug 2016 09:58:30 GMT
Build: http://jenkins.thetaphi.de/job/Lucene-Solr-master-Windows/6085/
Java: 64bit/jdk1.8.0_102 -XX:-UseCompressedOops -XX:+UseSerialGC

3 tests failed.
FAILED:  org.apache.solr.cloud.ForceLeaderTest.testReplicasInLIRNoLeader

Error Message:
org.apache.solr.client.solrj.SolrServerException: No live SolrServers available to handle this request:[http://127.0.0.1:59535/forceleader_test_collection_shard1_replica1]

Stack Trace:
org.apache.solr.client.solrj.SolrServerException: org.apache.solr.client.solrj.SolrServerException: No live SolrServers available to handle this request:[http://127.0.0.1:59535/forceleader_test_collection_shard1_replica1]
	at __randomizedtesting.SeedInfo.seed([534B6471BC1CA2F1:B5DC50B1859E5B90]:0)
	at org.apache.solr.client.solrj.impl.CloudSolrClient.directUpdate(CloudSolrClient.java:769)
	at org.apache.solr.client.solrj.impl.CloudSolrClient.sendRequest(CloudSolrClient.java:1161)
	at org.apache.solr.client.solrj.impl.CloudSolrClient.requestWithRetryOnStaleState(CloudSolrClient.java:1050)
	at org.apache.solr.client.solrj.impl.CloudSolrClient.request(CloudSolrClient.java:992)
	at org.apache.solr.cloud.AbstractFullDistribZkTestBase.sendDocsWithRetry(AbstractFullDistribZkTestBase.java:753)
	at org.apache.solr.cloud.AbstractFullDistribZkTestBase.sendDocsWithRetry(AbstractFullDistribZkTestBase.java:741)
	at org.apache.solr.cloud.ForceLeaderTest.sendDoc(ForceLeaderTest.java:424)
	at org.apache.solr.cloud.ForceLeaderTest.assertSendDocFails(ForceLeaderTest.java:315)
	at org.apache.solr.cloud.ForceLeaderTest.testReplicasInLIRNoLeader(ForceLeaderTest.java:110)
	at sun.reflect.NativeMethodAccessorImpl.invoke0(Native Method)
	at sun.reflect.NativeMethodAccessorImpl.invoke(NativeMethodAccessorImpl.java:62)
	at sun.reflect.DelegatingMethodAccessorImpl.invoke(DelegatingMethodAccessorImpl.java:43)
	at java.lang.reflect.Method.invoke(Method.java:498)
	at com.carrotsearch.randomizedtesting.RandomizedRunner.invoke(RandomizedRunner.java:1764)
	at com.carrotsearch.randomizedtesting.RandomizedRunner$8.evaluate(RandomizedRunner.java:871)
	at com.carrotsearch.randomizedtesting.RandomizedRunner$9.evaluate(RandomizedRunner.java:907)
	at com.carrotsearch.randomizedtesting.RandomizedRunner$10.evaluate(RandomizedRunner.java:921)
	at org.apache.solr.BaseDistributedSearchTestCase$ShardsRepeatRule$ShardsFixedStatement.callStatement(BaseDistributedSearchTestCase.java:985)
	at org.apache.solr.BaseDistributedSearchTestCase$ShardsRepeatRule$ShardsStatement.evaluate(BaseDistributedSearchTestCase.java:960)
	at com.carrotsearch.randomizedtesting.rules.SystemPropertiesRestoreRule$1.evaluate(SystemPropertiesRestoreRule.java:57)
	at org.apache.lucene.util.TestRuleSetupTeardownChained$1.evaluate(TestRuleSetupTeardownChained.java:49)
	at org.apache.lucene.util.AbstractBeforeAfterRule$1.evaluate(AbstractBeforeAfterRule.java:45)
	at org.apache.lucene.util.TestRuleThreadAndTestName$1.evaluate(TestRuleThreadAndTestName.java:48)
	at org.apache.lucene.util.TestRuleIgnoreAfterMaxFailures$1.evaluate(TestRuleIgnoreAfterMaxFailures.java:64)
	at org.apache.lucene.util.TestRuleMarkFailure$1.evaluate(TestRuleMarkFailure.java:47)
	at com.carrotsearch.randomizedtesting.rules.StatementAdapter.evaluate(StatementAdapter.java:36)
	at com.carrotsearch.randomizedtesting.ThreadLeakControl$StatementRunner.run(ThreadLeakControl.java:367)
	at com.carrotsearch.randomizedtesting.ThreadLeakControl.forkTimeoutingTask(ThreadLeakControl.java:809)
	at com.carrotsearch.randomizedtesting.ThreadLeakControl$3.evaluate(ThreadLeakControl.java:460)
	at com.carrotsearch.randomizedtesting.RandomizedRunner.runSingleTest(RandomizedRunner.java:880)
	at com.carrotsearch.randomizedtesting.RandomizedRunner$5.evaluate(RandomizedRunner.java:781)
	at com.carrotsearch.randomizedtesting.RandomizedRunner$6.evaluate(RandomizedRunner.java:816)
	at com.carrotsearch.randomizedtesting.RandomizedRunner$7.evaluate(RandomizedRunner.java:827)
	at com.carrotsearch.randomizedtesting.rules.StatementAdapter.evaluate(StatementAdapter.java:36)
	at com.carrotsearch.randomizedtesting.rules.SystemPropertiesRestoreRule$1.evaluate(SystemPropertiesRestoreRule.java:57)
	at org.apache.lucene.util.AbstractBeforeAfterRule$1.evaluate(AbstractBeforeAfterRule.java:45)
	at com.carrotsearch.randomizedtesting.rules.StatementAdapter.evaluate(StatementAdapter.java:36)
	at org.apache.lucene.util.TestRuleStoreClassName$1.evaluate(TestRuleStoreClassName.java:41)
	at com.carrotsearch.randomizedtesting.rules.NoShadowingOrOverridesOnMethodsRule$1.evaluate(NoShadowingOrOverridesOnMethodsRule.java:40)
	at com.carrotsearch.randomizedtesting.rules.NoShadowingOrOverridesOnMethodsRule$1.evaluate(NoShadowingOrOverridesOnMethodsRule.java:40)
	at com.carrotsearch.randomizedtesting.rules.StatementAdapter.evaluate(StatementAdapter.java:36)
	at com.carrotsearch.randomizedtesting.rules.StatementAdapter.evaluate(StatementAdapter.java:36)
	at com.carrotsearch.randomizedtesting.rules.StatementAdapter.evaluate(StatementAdapter.java:36)
	at org.apache.lucene.util.TestRuleAssertionsRequired$1.evaluate(TestRuleAssertionsRequired.java:53)
	at org.apache.lucene.util.TestRuleMarkFailure$1.evaluate(TestRuleMarkFailure.java:47)
	at org.apache.lucene.util.TestRuleIgnoreAfterMaxFailures$1.evaluate(TestRuleIgnoreAfterMaxFailures.java:64)
	at org.apache.lucene.util.TestRuleIgnoreTestSuites$1.evaluate(TestRuleIgnoreTestSuites.java:54)
	at com.carrotsearch.randomizedtesting.rules.StatementAdapter.evaluate(StatementAdapter.java:36)
	at com.carrotsearch.randomizedtesting.ThreadLeakControl$StatementRunner.run(ThreadLeakControl.java:367)
	at java.lang.Thread.run(Thread.java:745)
Caused by: org.apache.solr.client.solrj.SolrServerException: No live SolrServers available to handle this request:[http://127.0.0.1:59535/forceleader_test_collection_shard1_replica1]
	at org.apache.solr.client.solrj.impl.LBHttpSolrClient.request(LBHttpSolrClient.java:394)
	at org.apache.solr.client.solrj.impl.CloudSolrClient.directUpdate(CloudSolrClient.java:763)
	... 49 more
Caused by: org.apache.solr.client.solrj.SolrServerException: Server refused connection at: http://127.0.0.1:59535/forceleader_test_collection_shard1_replica1
	at org.apache.solr.client.solrj.impl.HttpSolrClient.executeMethod(HttpSolrClient.java:615)
	at org.apache.solr.client.solrj.impl.HttpSolrClient.request(HttpSolrClient.java:261)
	at org.apache.solr.client.solrj.impl.HttpSolrClient.request(HttpSolrClient.java:250)
	at org.apache.solr.client.solrj.impl.LBHttpSolrClient.doRequest(LBHttpSolrClient.java:415)
	at org.apache.solr.client.solrj.impl.LBHttpSolrClient.request(LBHttpSolrClient.java:383)
	... 50 more
Caused by: org.apache.http.conn.HttpHostConnectException: Connect to 127.0.0.1:59535 [/127.0.0.1] failed: Connection refused: connect
	at org.apache.http.impl.conn.DefaultHttpClientConnectionOperator.connect(DefaultHttpClientConnectionOperator.java:151)
	at org.apache.http.impl.conn.PoolingHttpClientConnectionManager.connect(PoolingHttpClientConnectionManager.java:353)
	at org.apache.http.impl.execchain.MainClientExec.establishRoute(MainClientExec.java:380)
	at org.apache.http.impl.execchain.MainClientExec.execute(MainClientExec.java:236)
	at org.apache.http.impl.execchain.ProtocolExec.execute(ProtocolExec.java:184)
	at org.apache.http.impl.execchain.RetryExec.execute(RetryExec.java:88)
	at org.apache.http.impl.execchain.RedirectExec.execute(RedirectExec.java:110)
	at org.apache.http.impl.client.InternalHttpClient.doExecute(InternalHttpClient.java:184)
	at org.apache.http.impl.client.CloseableHttpClient.execute(CloseableHttpClient.java:82)
	at org.apache.http.impl.client.CloseableHttpClient.execute(CloseableHttpClient.java:55)
	at org.apache.solr.client.solrj.impl.HttpSolrClient.executeMethod(HttpSolrClient.java:513)
	... 54 more
Caused by: java.net.ConnectException: Connection refused: connect
	at java.net.DualStackPlainSocketImpl.waitForConnect(Native Method)
	at java.net.DualStackPlainSocketImpl.socketConnect(DualStackPlainSocketImpl.java:85)
	at java.net.AbstractPlainSocketImpl.doConnect(AbstractPlainSocketImpl.java:350)
	at java.net.AbstractPlainSocketImpl.connectToAddress(AbstractPlainSocketImpl.java:206)
	at java.net.AbstractPlainSocketImpl.connect(AbstractPlainSocketImpl.java:188)
	at java.net.PlainSocketImpl.connect(PlainSocketImpl.java:172)
	at java.net.SocksSocketImpl.connect(SocksSocketImpl.java:392)
	at java.net.Socket.connect(Socket.java:589)
	at org.apache.http.conn.socket.PlainConnectionSocketFactory.connectSocket(PlainConnectionSocketFactory.java:74)
	at org.apache.http.impl.conn.DefaultHttpClientConnectionOperator.connect(DefaultHttpClientConnectionOperator.java:134)
	... 64 more


FAILED:  junit.framework.TestSuite.org.apache.solr.cloud.TestSolrCloudWithSecureImpersonation

Error Message:
java.lang.NullPointerException

Stack Trace:
com.google.common.util.concurrent.UncheckedExecutionException: java.lang.NullPointerException
	at __randomizedtesting.SeedInfo.seed([534B6471BC1CA2F1]:0)
	at com.google.common.cache.LocalCache$Segment.get(LocalCache.java:2263)
	at com.google.common.cache.LocalCache.get(LocalCache.java:4000)
	at com.google.common.cache.LocalCache.getOrLoad(LocalCache.java:4004)
	at com.google.common.cache.LocalCache$LocalLoadingCache.get(LocalCache.java:4874)
	at org.apache.hadoop.security.Groups.getGroups(Groups.java:182)
	at org.apache.solr.cloud.TestSolrCloudWithSecureImpersonation.getUsersFirstGroup(TestSolrCloudWithSecureImpersonation.java:64)
	at org.apache.solr.cloud.TestSolrCloudWithSecureImpersonation.getImpersonatorSettings(TestSolrCloudWithSecureImpersonation.java:86)
	at org.apache.solr.cloud.TestSolrCloudWithSecureImpersonation.startup(TestSolrCloudWithSecureImpersonation.java:99)
	at sun.reflect.NativeMethodAccessorImpl.invoke0(Native Method)
	at sun.reflect.NativeMethodAccessorImpl.invoke(NativeMethodAccessorImpl.java:62)
	at sun.reflect.DelegatingMethodAccessorImpl.invoke(DelegatingMethodAccessorImpl.java:43)
	at java.lang.reflect.Method.invoke(Method.java:498)
	at com.carrotsearch.randomizedtesting.RandomizedRunner.invoke(RandomizedRunner.java:1764)
	at com.carrotsearch.randomizedtesting.RandomizedRunner$6.evaluate(RandomizedRunner.java:811)
	at com.carrotsearch.randomizedtesting.RandomizedRunner$7.evaluate(RandomizedRunner.java:827)
	at com.carrotsearch.randomizedtesting.rules.StatementAdapter.evaluate(StatementAdapter.java:36)
	at com.carrotsearch.randomizedtesting.rules.SystemPropertiesRestoreRule$1.evaluate(SystemPropertiesRestoreRule.java:57)
	at org.apache.lucene.util.AbstractBeforeAfterRule$1.evaluate(AbstractBeforeAfterRule.java:45)
	at com.carrotsearch.randomizedtesting.rules.StatementAdapter.evaluate(StatementAdapter.java:36)
	at org.apache.lucene.util.TestRuleStoreClassName$1.evaluate(TestRuleStoreClassName.java:41)
	at com.carrotsearch.randomizedtesting.rules.NoShadowingOrOverridesOnMethodsRule$1.evaluate(NoShadowingOrOverridesOnMethodsRule.java:40)
	at com.carrotsearch.randomizedtesting.rules.NoShadowingOrOverridesOnMethodsRule$1.evaluate(NoShadowingOrOverridesOnMethodsRule.java:40)
	at com.carrotsearch.randomizedtesting.rules.StatementAdapter.evaluate(StatementAdapter.java:36)
	at com.carrotsearch.randomizedtesting.rules.StatementAdapter.evaluate(StatementAdapter.java:36)
	at com.carrotsearch.randomizedtesting.rules.StatementAdapter.evaluate(StatementAdapter.java:36)
	at org.apache.lucene.util.TestRuleAssertionsRequired$1.evaluate(TestRuleAssertionsRequired.java:53)
	at org.apache.lucene.util.TestRuleMarkFailure$1.evaluate(TestRuleMarkFailure.java:47)
	at org.apache.lucene.util.TestRuleIgnoreAfterMaxFailures$1.evaluate(TestRuleIgnoreAfterMaxFailures.java:64)
	at org.apache.lucene.util.TestRuleIgnoreTestSuites$1.evaluate(TestRuleIgnoreTestSuites.java:54)
	at com.carrotsearch.randomizedtesting.rules.StatementAdapter.evaluate(StatementAdapter.java:36)
	at com.carrotsearch.randomizedtesting.ThreadLeakControl$StatementRunner.run(ThreadLeakControl.java:367)
	at java.lang.Thread.run(Thread.java:745)
Caused by: java.lang.NullPointerException
	at java.lang.ProcessBuilder.start(ProcessBuilder.java:1012)
	at org.apache.hadoop.util.Shell.runCommand(Shell.java:483)
	at org.apache.hadoop.util.Shell.run(Shell.java:456)
	at org.apache.hadoop.util.Shell$ShellCommandExecutor.execute(Shell.java:722)
	at org.apache.hadoop.util.Shell.execCommand(Shell.java:815)
	at org.apache.hadoop.util.Shell.execCommand(Shell.java:798)
	at org.apache.hadoop.security.ShellBasedUnixGroupsMapping.getUnixGroups(ShellBasedUnixGroupsMapping.java:84)
	at org.apache.hadoop.security.ShellBasedUnixGroupsMapping.getGroups(ShellBasedUnixGroupsMapping.java:52)
	at org.apache.hadoop.security.JniBasedUnixGroupsMappingWithFallback.getGroups(JniBasedUnixGroupsMappingWithFallback.java:51)
	at org.apache.hadoop.security.Groups$GroupCacheLoader.fetchGroupList(Groups.java:239)
	at org.apache.hadoop.security.Groups$GroupCacheLoader.load(Groups.java:220)
	at org.apache.hadoop.security.Groups$GroupCacheLoader.load(Groups.java:208)
	at com.google.common.cache.LocalCache$LoadingValueReference.loadFuture(LocalCache.java:3599)
	at com.google.common.cache.LocalCache$Segment.loadSync(LocalCache.java:2379)
	at com.google.common.cache.LocalCache$Segment.lockedGetOrLoad(LocalCache.java:2342)
	at com.google.common.cache.LocalCache$Segment.get(LocalCache.java:2257)
	... 31 more


FAILED:  junit.framework.TestSuite.org.apache.solr.cloud.TestSolrCloudWithSecureImpersonation

Error Message:


Stack Trace:
java.lang.NullPointerException
	at __randomizedtesting.SeedInfo.seed([534B6471BC1CA2F1]:0)
	at org.apache.solr.cloud.TestSolrCloudWithSecureImpersonation.shutdown(TestSolrCloudWithSecureImpersonation.java:154)
	at sun.reflect.NativeMethodAccessorImpl.invoke0(Native Method)
	at sun.reflect.NativeMethodAccessorImpl.invoke(NativeMethodAccessorImpl.java:62)
	at sun.reflect.DelegatingMethodAccessorImpl.invoke(DelegatingMethodAccessorImpl.java:43)
	at java.lang.reflect.Method.invoke(Method.java:498)
	at com.carrotsearch.randomizedtesting.RandomizedRunner.invoke(RandomizedRunner.java:1764)
	at com.carrotsearch.randomizedtesting.RandomizedRunner$7.evaluate(RandomizedRunner.java:834)
	at com.carrotsearch.randomizedtesting.rules.StatementAdapter.evaluate(StatementAdapter.java:36)
	at com.carrotsearch.randomizedtesting.rules.SystemPropertiesRestoreRule$1.evaluate(SystemPropertiesRestoreRule.java:57)
	at org.apache.lucene.util.AbstractBeforeAfterRule$1.evaluate(AbstractBeforeAfterRule.java:45)
	at com.carrotsearch.randomizedtesting.rules.StatementAdapter.evaluate(StatementAdapter.java:36)
	at org.apache.lucene.util.TestRuleStoreClassName$1.evaluate(TestRuleStoreClassName.java:41)
	at com.carrotsearch.randomizedtesting.rules.NoShadowingOrOverridesOnMethodsRule$1.evaluate(NoShadowingOrOverridesOnMethodsRule.java:40)
	at com.carrotsearch.randomizedtesting.rules.NoShadowingOrOverridesOnMethodsRule$1.evaluate(NoShadowingOrOverridesOnMethodsRule.java:40)
	at com.carrotsearch.randomizedtesting.rules.StatementAdapter.evaluate(StatementAdapter.java:36)
	at com.carrotsearch.randomizedtesting.rules.StatementAdapter.evaluate(StatementAdapter.java:36)
	at com.carrotsearch.randomizedtesting.rules.StatementAdapter.evaluate(StatementAdapter.java:36)
	at org.apache.lucene.util.TestRuleAssertionsRequired$1.evaluate(TestRuleAssertionsRequired.java:53)
	at org.apache.lucene.util.TestRuleMarkFailure$1.evaluate(TestRuleMarkFailure.java:47)
	at org.apache.lucene.util.TestRuleIgnoreAfterMaxFailures$1.evaluate(TestRuleIgnoreAfterMaxFailures.java:64)
	at org.apache.lucene.util.TestRuleIgnoreTestSuites$1.evaluate(TestRuleIgnoreTestSuites.java:54)
	at com.carrotsearch.randomizedtesting.rules.StatementAdapter.evaluate(StatementAdapter.java:36)
	at com.carrotsearch.randomizedtesting.ThreadLeakControl$StatementRunner.run(ThreadLeakControl.java:367)
	at java.lang.Thread.run(Thread.java:745)




Build Log:
[...truncated 11072 lines...]
   [junit4] Suite: org.apache.solr.cloud.ForceLeaderTest
   [junit4]   2> Creating dataDir: C:\Users\jenkins\workspace\Lucene-Solr-master-Windows\solr\build\solr-core\test\J1\temp\solr.cloud.ForceLeaderTest_534B6471BC1CA2F1-001\init-core-data-001
   [junit4]   2> 964200 INFO  (SUITE-ForceLeaderTest-seed#[534B6471BC1CA2F1]-worker) [    ] o.a.s.SolrTestCaseJ4 Randomized ssl (false) and clientAuth (false) via: @org.apache.solr.SolrTestCaseJ4$SuppressSSL(bugUrl=https://issues.apache.org/jira/browse/SOLR-5776)
   [junit4]   2> 964200 INFO  (SUITE-ForceLeaderTest-seed#[534B6471BC1CA2F1]-worker) [    ] o.a.s.BaseDistributedSearchTestCase Setting hostContext system property: /
   [junit4]   2> 964203 INFO  (TEST-ForceLeaderTest.testLastPublishedStateIsActive-seed#[534B6471BC1CA2F1]) [    ] o.a.s.c.ZkTestServer STARTING ZK TEST SERVER
   [junit4]   2> 964205 INFO  (Thread-2296) [    ] o.a.s.c.ZkTestServer client port:0.0.0.0/0.0.0.0:0
   [junit4]   2> 964205 INFO  (Thread-2296) [    ] o.a.s.c.ZkTestServer Starting server
   [junit4]   2> 964327 INFO  (TEST-ForceLeaderTest.testLastPublishedStateIsActive-seed#[534B6471BC1CA2F1]) [    ] o.a.s.c.ZkTestServer start zk server on port:59342
   [junit4]   2> 964327 INFO  (TEST-ForceLeaderTest.testLastPublishedStateIsActive-seed#[534B6471BC1CA2F1]) [    ] o.a.s.c.c.SolrZkClient Using default ZkCredentialsProvider
   [junit4]   2> 964328 INFO  (TEST-ForceLeaderTest.testLastPublishedStateIsActive-seed#[534B6471BC1CA2F1]) [    ] o.a.s.c.c.ConnectionManager Waiting for client to connect to ZooKeeper
   [junit4]   2> 964352 INFO  (zkCallback-1613-thread-1) [    ] o.a.s.c.c.ConnectionManager Watcher org.apache.solr.common.cloud.ConnectionManager@3b31b604 name:ZooKeeperConnection Watcher:127.0.0.1:59342 got event WatchedEvent state:SyncConnected type:None path:null path:null type:None
   [junit4]   2> 964352 INFO  (TEST-ForceLeaderTest.testLastPublishedStateIsActive-seed#[534B6471BC1CA2F1]) [    ] o.a.s.c.c.ConnectionManager Client is connected to ZooKeeper
   [junit4]   2> 964352 INFO  (TEST-ForceLeaderTest.testLastPublishedStateIsActive-seed#[534B6471BC1CA2F1]) [    ] o.a.s.c.c.SolrZkClient Using default ZkACLProvider
   [junit4]   2> 964352 INFO  (TEST-ForceLeaderTest.testLastPublishedStateIsActive-seed#[534B6471BC1CA2F1]) [    ] o.a.s.c.c.SolrZkClient makePath: /solr
   [junit4]   2> 964358 INFO  (TEST-ForceLeaderTest.testLastPublishedStateIsActive-seed#[534B6471BC1CA2F1]) [    ] o.a.s.c.c.SolrZkClient Using default ZkCredentialsProvider
   [junit4]   2> 964360 INFO  (TEST-ForceLeaderTest.testLastPublishedStateIsActive-seed#[534B6471BC1CA2F1]) [    ] o.a.s.c.c.ConnectionManager Waiting for client to connect to ZooKeeper
   [junit4]   2> 964364 INFO  (zkCallback-1614-thread-1) [    ] o.a.s.c.c.ConnectionManager Watcher org.apache.solr.common.cloud.ConnectionManager@27fb49c2 name:ZooKeeperConnection Watcher:127.0.0.1:59342/solr got event WatchedEvent state:SyncConnected type:None path:null path:null type:None
   [junit4]   2> 964364 INFO  (TEST-ForceLeaderTest.testLastPublishedStateIsActive-seed#[534B6471BC1CA2F1]) [    ] o.a.s.c.c.ConnectionManager Client is connected to ZooKeeper
   [junit4]   2> 964364 INFO  (TEST-ForceLeaderTest.testLastPublishedStateIsActive-seed#[534B6471BC1CA2F1]) [    ] o.a.s.c.c.SolrZkClient Using default ZkACLProvider
   [junit4]   2> 964364 INFO  (TEST-ForceLeaderTest.testLastPublishedStateIsActive-seed#[534B6471BC1CA2F1]) [    ] o.a.s.c.c.SolrZkClient makePath: /collections/collection1
   [junit4]   2> 964367 INFO  (TEST-ForceLeaderTest.testLastPublishedStateIsActive-seed#[534B6471BC1CA2F1]) [    ] o.a.s.c.c.SolrZkClient makePath: /collections/collection1/shards
   [junit4]   2> 964368 INFO  (TEST-ForceLeaderTest.testLastPublishedStateIsActive-seed#[534B6471BC1CA2F1]) [    ] o.a.s.c.c.SolrZkClient makePath: /collections/control_collection
   [junit4]   2> 964370 INFO  (TEST-ForceLeaderTest.testLastPublishedStateIsActive-seed#[534B6471BC1CA2F1]) [    ] o.a.s.c.c.SolrZkClient makePath: /collections/control_collection/shards
   [junit4]   2> 964371 INFO  (TEST-ForceLeaderTest.testLastPublishedStateIsActive-seed#[534B6471BC1CA2F1]) [    ] o.a.s.c.AbstractZkTestCase put C:\Users\jenkins\workspace\Lucene-Solr-master-Windows\solr\core\src\test-files\solr\collection1\conf\solrconfig-tlog.xml to /configs/conf1/solrconfig.xml
   [junit4]   2> 964371 INFO  (TEST-ForceLeaderTest.testLastPublishedStateIsActive-seed#[534B6471BC1CA2F1]) [    ] o.a.s.c.c.SolrZkClient makePath: /configs/conf1/solrconfig.xml
   [junit4]   2> 964375 INFO  (TEST-ForceLeaderTest.testLastPublishedStateIsActive-seed#[534B6471BC1CA2F1]) [    ] o.a.s.c.AbstractZkTestCase put C:\Users\jenkins\workspace\Lucene-Solr-master-Windows\solr\core\src\test-files\solr\collection1\conf\schema.xml to /configs/conf1/schema.xml
   [junit4]   2> 964375 INFO  (TEST-ForceLeaderTest.testLastPublishedStateIsActive-seed#[534B6471BC1CA2F1]) [    ] o.a.s.c.c.SolrZkClient makePath: /configs/conf1/schema.xml
   [junit4]   2> 964377 INFO  (TEST-ForceLeaderTest.testLastPublishedStateIsActive-seed#[534B6471BC1CA2F1]) [    ] o.a.s.c.AbstractZkTestCase put C:\Users\jenkins\workspace\Lucene-Solr-master-Windows\solr\core\src\test-files\solr\collection1\conf\solrconfig.snippet.randomindexconfig.xml to /configs/conf1/solrconfig.snippet.randomindexconfig.xml
   [junit4]   2> 964377 INFO  (TEST-ForceLeaderTest.testLastPublishedStateIsActive-seed#[534B6471BC1CA2F1]) [    ] o.a.s.c.c.SolrZkClient makePath: /configs/conf1/solrconfig.snippet.randomindexconfig.xml
   [junit4]   2> 964379 INFO  (TEST-ForceLeaderTest.testLastPublishedStateIsActive-seed#[534B6471BC1CA2F1]) [    ] o.a.s.c.AbstractZkTestCase put C:\Users\jenkins\workspace\Lucene-Solr-master-Windows\solr\core\src\test-files\solr\collection1\conf\stopwords.txt to /configs/conf1/stopwords.txt
   [junit4]   2> 964380 INFO  (TEST-ForceLeaderTest.testLastPublishedStateIsActive-seed#[534B6471BC1CA2F1]) [    ] o.a.s.c.c.SolrZkClient makePath: /configs/conf1/stopwords.txt
   [junit4]   2> 964382 INFO  (TEST-ForceLeaderTest.testLastPublishedStateIsActive-seed#[534B6471BC1CA2F1]) [    ] o.a.s.c.AbstractZkTestCase put C:\Users\jenkins\workspace\Lucene-Solr-master-Windows\solr\core\src\test-files\solr\collection1\conf\protwords.txt to /configs/conf1/protwords.txt
   [junit4]   2> 964383 INFO  (TEST-ForceLeaderTest.testLastPublishedStateIsActive-seed#[534B6471BC1CA2F1]) [    ] o.a.s.c.c.SolrZkClient makePath: /configs/conf1/protwords.txt
   [junit4]   2> 964385 INFO  (TEST-ForceLeaderTest.testLastPublishedStateIsActive-seed#[534B6471BC1CA2F1]) [    ] o.a.s.c.AbstractZkTestCase put C:\Users\jenkins\workspace\Lucene-Solr-master-Windows\solr\core\src\test-files\solr\collection1\conf\currency.xml to /configs/conf1/currency.xml
   [junit4]   2> 964385 INFO  (TEST-ForceLeaderTest.testLastPublishedStateIsActive-seed#[534B6471BC1CA2F1]) [    ] o.a.s.c.c.SolrZkClient makePath: /configs/conf1/currency.xml
   [junit4]   2> 964388 INFO  (TEST-ForceLeaderTest.testLastPublishedStateIsActive-seed#[534B6471BC1CA2F1]) [    ] o.a.s.c.AbstractZkTestCase put C:\Users\jenkins\workspace\Lucene-Solr-master-Windows\solr\core\src\test-files\solr\collection1\conf\enumsConfig.xml to /configs/conf1/enumsConfig.xml
   [junit4]   2> 964388 INFO  (TEST-ForceLeaderTest.testLastPublishedStateIsActive-seed#[534B6471BC1CA2F1]) [    ] o.a.s.c.c.SolrZkClient makePath: /configs/conf1/enumsConfig.xml
   [junit4]   2> 964390 INFO  (TEST-ForceLeaderTest.testLastPublishedStateIsActive-seed#[534B6471BC1CA2F1]) [    ] o.a.s.c.AbstractZkTestCase put C:\Users\jenkins\workspace\Lucene-Solr-master-Windows\solr\core\src\test-files\solr\collection1\conf\open-exchange-rates.json to /configs/conf1/open-exchange-rates.json
   [junit4]   2> 964390 INFO  (TEST-ForceLeaderTest.testLastPublishedStateIsActive-seed#[534B6471BC1CA2F1]) [    ] o.a.s.c.c.SolrZkClient makePath: /configs/conf1/open-exchange-rates.json
   [junit4]   2> 964392 INFO  (TEST-ForceLeaderTest.testLastPublishedStateIsActive-seed#[534B6471BC1CA2F1]) [    ] o.a.s.c.AbstractZkTestCase put C:\Users\jenkins\workspace\Lucene-Solr-master-Windows\solr\core\src\test-files\solr\collection1\conf\mapping-ISOLatin1Accent.txt to /configs/conf1/mapping-ISOLatin1Accent.txt
   [junit4]   2> 964392 INFO  (TEST-ForceLeaderTest.testLastPublishedStateIsActive-seed#[534B6471BC1CA2F1]) [    ] o.a.s.c.c.SolrZkClient makePath: /configs/conf1/mapping-ISOLatin1Accent.txt
   [junit4]   2> 964393 INFO  (TEST-ForceLeaderTest.testLastPublishedStateIsActive-seed#[534B6471BC1CA2F1]) [    ] o.a.s.c.AbstractZkTestCase put C:\Users\jenkins\workspace\Lucene-Solr-master-Windows\solr\core\src\test-files\solr\collection1\conf\old_synonyms.txt to /configs/conf1/old_synonyms.txt
   [junit4]   2> 964393 INFO  (TEST-ForceLeaderTest.testLastPublishedStateIsActive-seed#[534B6471BC1CA2F1]) [    ] o.a.s.c.c.SolrZkClient makePath: /configs/conf1/old_synonyms.txt
   [junit4]   2> 964395 INFO  (TEST-ForceLeaderTest.testLastPublishedStateIsActive-seed#[534B6471BC1CA2F1]) [    ] o.a.s.c.AbstractZkTestCase put C:\Users\jenkins\workspace\Lucene-Solr-master-Windows\solr\core\src\test-files\solr\collection1\conf\synonyms.txt to /configs/conf1/synonyms.txt
   [junit4]   2> 964395 INFO  (TEST-ForceLeaderTest.testLastPublishedStateIsActive-seed#[534B6471BC1CA2F1]) [    ] o.a.s.c.c.SolrZkClient makePath: /configs/conf1/synonyms.txt
   [junit4]   2> 964846 INFO  (TEST-ForceLeaderTest.testLastPublishedStateIsActive-seed#[534B6471BC1CA2F1]) [    ] o.a.s.SolrTestCaseJ4 Writing core.properties file to C:\Users\jenkins\workspace\Lucene-Solr-master-Windows\solr\build\solr-core\test\J1\temp\solr.cloud.ForceLeaderTest_534B6471BC1CA2F1-001\control-001\cores\collection1
   [junit4]   2> 964852 INFO  (TEST-ForceLeaderTest.testLastPublishedStateIsActive-seed#[534B6471BC1CA2F1]) [    ] o.e.j.s.Server jetty-9.3.8.v20160314
   [junit4]   2> 964853 INFO  (TEST-ForceLeaderTest.testLastPublishedStateIsActive-seed#[534B6471BC1CA2F1]) [    ] o.e.j.s.h.ContextHandler Started o.e.j.s.ServletContextHandler@aae0efe{/,null,AVAILABLE}
   [junit4]   2> 964858 INFO  (TEST-ForceLeaderTest.testLastPublishedStateIsActive-seed#[534B6471BC1CA2F1]) [    ] o.e.j.s.ServerConnector Started ServerConnector@569bb51d{HTTP/1.1,[http/1.1]}{127.0.0.1:59355}
   [junit4]   2> 964858 INFO  (TEST-ForceLeaderTest.testLastPublishedStateIsActive-seed#[534B6471BC1CA2F1]) [    ] o.e.j.s.Server Started @969615ms
   [junit4]   2> 964858 INFO  (TEST-ForceLeaderTest.testLastPublishedStateIsActive-seed#[534B6471BC1CA2F1]) [    ] o.a.s.c.s.e.JettySolrRunner Jetty properties: {solr.data.dir=C:\Users\jenkins\workspace\Lucene-Solr-master-Windows\solr\build\solr-core\test\J1\temp\solr.cloud.ForceLeaderTest_534B6471BC1CA2F1-001\tempDir-001/control/data, hostContext=/, hostPort=59354, coreRootDirectory=C:\Users\jenkins\workspace\Lucene-Solr-master-Windows\solr\build\solr-core\test\J1\temp\solr.cloud.ForceLeaderTest_534B6471BC1CA2F1-001\control-001\cores}
   [junit4]   2> 964858 INFO  (TEST-ForceLeaderTest.testLastPublishedStateIsActive-seed#[534B6471BC1CA2F1]) [    ] o.a.s.s.SolrDispatchFilter SolrDispatchFilter.init(): sun.misc.Launcher$AppClassLoader@73d16e93
   [junit4]   2> 964858 INFO  (TEST-ForceLeaderTest.testLastPublishedStateIsActive-seed#[534B6471BC1CA2F1]) [    ] o.a.s.c.SolrResourceLoader new SolrResourceLoader for directory: 'C:\Users\jenkins\workspace\Lucene-Solr-master-Windows\solr\build\solr-core\test\J1\temp\solr.cloud.ForceLeaderTest_534B6471BC1CA2F1-001\control-001'
   [junit4]   2> 964859 INFO  (TEST-ForceLeaderTest.testLastPublishedStateIsActive-seed#[534B6471BC1CA2F1]) [    ] o.a.s.c.SolrResourceLoader JNDI not configured for solr (NoInitialContextEx)
   [junit4]   2> 964859 INFO  (TEST-ForceLeaderTest.testLastPublishedStateIsActive-seed#[534B6471BC1CA2F1]) [    ] o.a.s.c.SolrResourceLoader solr home defaulted to 'solr/' (could not find system property or JNDI)
   [junit4]   2> 964859 INFO  (TEST-ForceLeaderTest.testLastPublishedStateIsActive-seed#[534B6471BC1CA2F1]) [    ] o.a.s.c.c.SolrZkClient Using default ZkCredentialsProvider
   [junit4]   2> 964860 INFO  (TEST-ForceLeaderTest.testLastPublishedStateIsActive-seed#[534B6471BC1CA2F1]) [    ] o.a.s.c.c.ConnectionManager Waiting for client to connect to ZooKeeper
   [junit4]   2> 964861 INFO  (zkCallback-1615-thread-1) [    ] o.a.s.c.c.ConnectionManager Watcher org.apache.solr.common.cloud.ConnectionManager@2411f5c7 name:ZooKeeperConnection Watcher:127.0.0.1:59342/solr got event WatchedEvent state:SyncConnected type:None path:null path:null type:None
   [junit4]   2> 964861 INFO  (TEST-ForceLeaderTest.testLastPublishedStateIsActive-seed#[534B6471BC1CA2F1]) [    ] o.a.s.c.c.ConnectionManager Client is connected to ZooKeeper
   [junit4]   2> 964862 INFO  (TEST-ForceLeaderTest.testLastPublishedStateIsActive-seed#[534B6471BC1CA2F1]) [    ] o.a.s.c.c.SolrZkClient Using default ZkACLProvider
   [junit4]   2> 964863 WARN  (NIOServerCxn.Factory:0.0.0.0/0.0.0.0:0) [    ] o.a.z.s.NIOServerCnxn caught end of stream exception
   [junit4]   2> EndOfStreamException: Unable to read additional data from client sessionid 0x156d581f3890002, likely client has closed socket
   [junit4]   2> 	at org.apache.zookeeper.server.NIOServerCnxn.doIO(NIOServerCnxn.java:228)
   [junit4]   2> 	at org.apache.zookeeper.server.NIOServerCnxnFactory.run(NIOServerCnxnFactory.java:208)
   [junit4]   2> 	at java.lang.Thread.run(Thread.java:745)
   [junit4]   2> 964863 INFO  (TEST-ForceLeaderTest.testLastPublishedStateIsActive-seed#[534B6471BC1CA2F1]) [    ] o.a.s.s.SolrDispatchFilter Loading solr.xml from SolrHome (not found in ZooKeeper)
   [junit4]   2> 964863 INFO  (TEST-ForceLeaderTest.testLastPublishedStateIsActive-seed#[534B6471BC1CA2F1]) [    ] o.a.s.c.SolrXmlConfig Loading container configuration from C:\Users\jenkins\workspace\Lucene-Solr-master-Windows\solr\build\solr-core\test\J1\temp\solr.cloud.ForceLeaderTest_534B6471BC1CA2F1-001\control-001\solr.xml
   [junit4]   2> 964872 INFO  (TEST-ForceLeaderTest.testLastPublishedStateIsActive-seed#[534B6471BC1CA2F1]) [    ] o.a.s.c.CorePropertiesLocator Config-defined core root directory: C:\Users\jenkins\workspace\Lucene-Solr-master-Windows\solr\build\solr-core\test\J1\temp\solr.cloud.ForceLeaderTest_534B6471BC1CA2F1-001\control-001\cores
   [junit4]   2> 964872 INFO  (TEST-ForceLeaderTest.testLastPublishedStateIsActive-seed#[534B6471BC1CA2F1]) [    ] o.a.s.c.CoreContainer New CoreContainer 775548151
   [junit4]   2> 964872 INFO  (TEST-ForceLeaderTest.testLastPublishedStateIsActive-seed#[534B6471BC1CA2F1]) [    ] o.a.s.c.CoreContainer Loading cores into CoreContainer [instanceDir=C:\Users\jenkins\workspace\Lucene-Solr-master-Windows\solr\build\solr-core\test\J1\temp\solr.cloud.ForceLeaderTest_534B6471BC1CA2F1-001\control-001]
   [junit4]   2> 964872 WARN  (TEST-ForceLeaderTest.testLastPublishedStateIsActive-seed#[534B6471BC1CA2F1]) [    ] o.a.s.c.CoreContainer Couldn't add files from C:\Users\jenkins\workspace\Lucene-Solr-master-Windows\solr\build\solr-core\test\J1\temp\solr.cloud.ForceLeaderTest_534B6471BC1CA2F1-001\control-001\lib to classpath: C:\Users\jenkins\workspace\Lucene-Solr-master-Windows\solr\build\solr-core\test\J1\temp\solr.cloud.ForceLeaderTest_534B6471BC1CA2F1-001\control-001\lib
   [junit4]   2> 964872 INFO  (TEST-ForceLeaderTest.testLastPublishedStateIsActive-seed#[534B6471BC1CA2F1]) [    ] o.a.s.h.c.HttpShardHandlerFactory created with socketTimeout : 90000,urlScheme : ,connTimeout : 15000,maxConnectionsPerHost : 20,maxConnections : 10000,corePoolSize : 0,maximumPoolSize : 2147483647,maxThreadIdleTime : 5,sizeOfQueue : -1,fairnessPolicy : false,
   [junit4]   2> 964877 INFO  (TEST-ForceLeaderTest.testLastPublishedStateIsActive-seed#[534B6471BC1CA2F1]) [    ] o.a.s.u.UpdateShardHandler Created UpdateShardHandler HTTP client with params: socketTimeout=340000&connTimeout=45000&maxConnections=100000&maxConnectionsPerHost=100000
   [junit4]   2> 964877 INFO  (TEST-ForceLeaderTest.testLastPublishedStateIsActive-seed#[534B6471BC1CA2F1]) [    ] o.a.s.l.LogWatcher SLF4J impl is org.slf4j.impl.Log4jLoggerFactory
   [junit4]   2> 964877 INFO  (TEST-ForceLeaderTest.testLastPublishedStateIsActive-seed#[534B6471BC1CA2F1]) [    ] o.a.s.l.LogWatcher Registering Log Listener [Log4j (org.slf4j.impl.Log4jLoggerFactory)]
   [junit4]   2> 964877 INFO  (TEST-ForceLeaderTest.testLastPublishedStateIsActive-seed#[534B6471BC1CA2F1]) [    ] o.a.s.c.ZkContainer Zookeeper client=127.0.0.1:59342/solr
   [junit4]   2> 964877 INFO  (TEST-ForceLeaderTest.testLastPublishedStateIsActive-seed#[534B6471BC1CA2F1]) [    ] o.a.s.c.ZkController zkHost includes chroot
   [junit4]   2> 964877 INFO  (TEST-ForceLeaderTest.testLastPublishedStateIsActive-seed#[534B6471BC1CA2F1]) [    ] o.a.s.c.c.SolrZkClient Using default ZkCredentialsProvider
   [junit4]   2> 964878 INFO  (TEST-ForceLeaderTest.testLastPublishedStateIsActive-seed#[534B6471BC1CA2F1]) [    ] o.a.s.c.c.ConnectionManager Waiting for client to connect to ZooKeeper
   [junit4]   2> 964880 INFO  (zkCallback-1618-thread-1) [    ] o.a.s.c.c.ConnectionManager Watcher org.apache.solr.common.cloud.ConnectionManager@17a516e2 name:ZooKeeperConnection Watcher:127.0.0.1:59342 got event WatchedEvent state:SyncConnected type:None path:null path:null type:None
   [junit4]   2> 964880 INFO  (TEST-ForceLeaderTest.testLastPublishedStateIsActive-seed#[534B6471BC1CA2F1]) [    ] o.a.s.c.c.ConnectionManager Client is connected to ZooKeeper
   [junit4]   2> 964880 INFO  (TEST-ForceLeaderTest.testLastPublishedStateIsActive-seed#[534B6471BC1CA2F1]) [    ] o.a.s.c.c.SolrZkClient Using default ZkACLProvider
   [junit4]   2> 964881 WARN  (NIOServerCxn.Factory:0.0.0.0/0.0.0.0:0) [    ] o.a.z.s.NIOServerCnxn caught end of stream exception
   [junit4]   2> EndOfStreamException: Unable to read additional data from client sessionid 0x156d581f3890003, likely client has closed socket
   [junit4]   2> 	at org.apache.zookeeper.server.NIOServerCnxn.doIO(NIOServerCnxn.java:228)
   [junit4]   2> 	at org.apache.zookeeper.server.NIOServerCnxnFactory.run(NIOServerCnxnFactory.java:208)
   [junit4]   2> 	at java.lang.Thread.run(Thread.java:745)
   [junit4]   2> 964881 INFO  (TEST-ForceLeaderTest.testLastPublishedStateIsActive-seed#[534B6471BC1CA2F1]) [n:127.0.0.1:59354_    ] o.a.s.c.ZkController Added new OnReconnect listener org.apache.solr.cloud.ZkController$$Lambda$96/845451887@3c150cfd
   [junit4]   2> 964882 INFO  (TEST-ForceLeaderTest.testLastPublishedStateIsActive-seed#[534B6471BC1CA2F1]) [n:127.0.0.1:59354_    ] o.a.s.c.c.ConnectionManager Waiting for client to connect to ZooKeeper
   [junit4]   2> 964886 INFO  (zkCallback-1619-thread-1-processing-n:127.0.0.1:59354_) [n:127.0.0.1:59354_    ] o.a.s.c.c.ConnectionManager Watcher org.apache.solr.common.cloud.ConnectionManager@4d261c2c name:ZooKeeperConnection Watcher:127.0.0.1:59342/solr got event WatchedEvent state:SyncConnected type:None path:null path:null type:None
   [junit4]   2> 964886 INFO  (TEST-ForceLeaderTest.testLastPublishedStateIsActive-seed#[534B6471BC1CA2F1]) [n:127.0.0.1:59354_    ] o.a.s.c.c.ConnectionManager Client is connected to ZooKeeper
   [junit4]   2> 964887 INFO  (TEST-ForceLeaderTest.testLastPublishedStateIsActive-seed#[534B6471BC1CA2F1]) [n:127.0.0.1:59354_    ] o.a.s.c.c.SolrZkClient makePath: /overseer/queue
   [junit4]   2> 964889 INFO  (TEST-ForceLeaderTest.testLastPublishedStateIsActive-seed#[534B6471BC1CA2F1]) [n:127.0.0.1:59354_    ] o.a.s.c.c.SolrZkClient makePath: /overseer/collection-queue-work
   [junit4]   2> 964892 INFO  (TEST-ForceLeaderTest.testLastPublishedStateIsActive-seed#[534B6471BC1CA2F1]) [n:127.0.0.1:59354_    ] o.a.s.c.c.SolrZkClient makePath: /overseer/collection-map-running
   [junit4]   2> 964895 INFO  (TEST-ForceLeaderTest.testLastPublishedStateIsActive-seed#[534B6471BC1CA2F1]) [n:127.0.0.1:59354_    ] o.a.s.c.c.SolrZkClient makePath: /overseer/collection-map-completed
   [junit4]   2> 964896 INFO  (TEST-ForceLeaderTest.testLastPublishedStateIsActive-seed#[534B6471BC1CA2F1]) [n:127.0.0.1:59354_    ] o.a.s.c.c.SolrZkClient makePath: /overseer/collection-map-failure
   [junit4]   2> 964898 INFO  (TEST-ForceLeaderTest.testLastPublishedStateIsActive-seed#[534B6471BC1CA2F1]) [n:127.0.0.1:59354_    ] o.a.s.c.c.SolrZkClient makePath: /live_nodes
   [junit4]   2> 964900 INFO  (TEST-ForceLeaderTest.testLastPublishedStateIsActive-seed#[534B6471BC1CA2F1]) [n:127.0.0.1:59354_    ] o.a.s.c.c.SolrZkClient makePath: /aliases.json
   [junit4]   2> 964901 INFO  (TEST-ForceLeaderTest.testLastPublishedStateIsActive-seed#[534B6471BC1CA2F1]) [n:127.0.0.1:59354_    ] o.a.s.c.c.SolrZkClient makePath: /clusterstate.json
   [junit4]   2> 964902 INFO  (TEST-ForceLeaderTest.testLastPublishedStateIsActive-seed#[534B6471BC1CA2F1]) [n:127.0.0.1:59354_    ] o.a.s.c.c.SolrZkClient makePath: /security.json
   [junit4]   2> 964903 INFO  (TEST-ForceLeaderTest.testLastPublishedStateIsActive-seed#[534B6471BC1CA2F1]) [n:127.0.0.1:59354_    ] o.a.s.c.c.ZkStateReader Updating cluster state from ZooKeeper... 
   [junit4]   2> 964903 INFO  (TEST-ForceLeaderTest.testLastPublishedStateIsActive-seed#[534B6471BC1CA2F1]) [n:127.0.0.1:59354_    ] o.a.s.c.c.ZkStateReader Loaded empty cluster properties
   [junit4]   2> 964904 INFO  (TEST-ForceLeaderTest.testLastPublishedStateIsActive-seed#[534B6471BC1CA2F1]) [n:127.0.0.1:59354_    ] o.a.s.c.c.ZkStateReader Updated live nodes from ZooKeeper... (0) -> (0)
   [junit4]   2> 964907 INFO  (TEST-ForceLeaderTest.testLastPublishedStateIsActive-seed#[534B6471BC1CA2F1]) [n:127.0.0.1:59354_    ] o.a.s.c.c.SolrZkClient makePath: /overseer_elect
   [junit4]   2> 964908 INFO  (TEST-ForceLeaderTest.testLastPublishedStateIsActive-seed#[534B6471BC1CA2F1]) [n:127.0.0.1:59354_    ] o.a.s.c.c.SolrZkClient makePath: /overseer_elect/election
   [junit4]   2> 964909 INFO  (TEST-ForceLeaderTest.testLastPublishedStateIsActive-seed#[534B6471BC1CA2F1]) [n:127.0.0.1:59354_    ] o.a.s.c.Overseer Overseer (id=null) closing
   [junit4]   2> 964909 INFO  (TEST-ForceLeaderTest.testLastPublishedStateIsActive-seed#[534B6471BC1CA2F1]) [n:127.0.0.1:59354_    ] o.a.s.c.LeaderElector Joined leadership election with path: /overseer_elect/election/96499196148383748-127.0.0.1:59354_-n_0000000000
   [junit4]   2> 964910 INFO  (TEST-ForceLeaderTest.testLastPublishedStateIsActive-seed#[534B6471BC1CA2F1]) [n:127.0.0.1:59354_    ] o.a.s.c.OverseerElectionContext I am going to be the leader 127.0.0.1:59354_
   [junit4]   2> 964910 INFO  (TEST-ForceLeaderTest.testLastPublishedStateIsActive-seed#[534B6471BC1CA2F1]) [n:127.0.0.1:59354_    ] o.a.s.c.c.SolrZkClient makePath: /overseer_elect/leader
   [junit4]   2> 964912 INFO  (TEST-ForceLeaderTest.testLastPublishedStateIsActive-seed#[534B6471BC1CA2F1]) [n:127.0.0.1:59354_    ] o.a.s.c.Overseer Overseer (id=96499196148383748-127.0.0.1:59354_-n_0000000000) starting
   [junit4]   2> 964913 INFO  (TEST-ForceLeaderTest.testLastPublishedStateIsActive-seed#[534B6471BC1CA2F1]) [n:127.0.0.1:59354_    ] o.a.s.c.c.SolrZkClient makePath: /overseer/queue-work
   [junit4]   2> 964920 INFO  (TEST-ForceLeaderTest.testLastPublishedStateIsActive-seed#[534B6471BC1CA2F1]) [n:127.0.0.1:59354_    ] o.a.s.c.OverseerAutoReplicaFailoverThread Starting OverseerAutoReplicaFailoverThread autoReplicaFailoverWorkLoopDelay=10000 autoReplicaFailoverWaitAfterExpiration=10000 autoReplicaFailoverBadNodeExpiration=60000
   [junit4]   2> 964920 INFO  (OverseerCollectionConfigSetProcessor-96499196148383748-127.0.0.1:59354_-n_0000000000) [n:127.0.0.1:59354_    ] o.a.s.c.OverseerTaskProcessor Process current queue of overseer operations
   [junit4]   2> 964920 INFO  (TEST-ForceLeaderTest.testLastPublishedStateIsActive-seed#[534B6471BC1CA2F1]) [n:127.0.0.1:59354_    ] o.a.s.c.ZkController Register node as live in ZooKeeper:/live_nodes/127.0.0.1:59354_
   [junit4]   2> 964921 INFO  (TEST-ForceLeaderTest.testLastPublishedStateIsActive-seed#[534B6471BC1CA2F1]) [n:127.0.0.1:59354_    ] o.a.s.c.c.SolrZkClient makePath: /live_nodes/127.0.0.1:59354_
   [junit4]   2> 964921 INFO  (OverseerStateUpdate-96499196148383748-127.0.0.1:59354_-n_0000000000) [n:127.0.0.1:59354_    ] o.a.s.c.Overseer Starting to work on the main queue
   [junit4]   2> 964923 INFO  (zkCallback-1619-thread-1-processing-n:127.0.0.1:59354_) [n:127.0.0.1:59354_    ] o.a.s.c.c.ZkStateReader A live node change: [WatchedEvent state:SyncConnected type:NodeChildrenChanged path:/live_nodes], has occurred - updating... (live nodes size: [0])
   [junit4]   2> 964924 INFO  (OverseerStateUpdate-96499196148383748-127.0.0.1:59354_-n_0000000000) [n:127.0.0.1:59354_    ] o.a.s.c.c.ZkStateReader Updated live nodes from ZooKeeper... (0) -> (1)
   [junit4]   2> 964925 INFO  (zkCallback-1619-thread-1-processing-n:127.0.0.1:59354_) [n:127.0.0.1:59354_    ] o.a.s.c.c.ZkStateReader Updated live nodes from ZooKeeper... (1) -> (1)
   [junit4]   2> 964930 INFO  (TEST-ForceLeaderTest.testLastPublishedStateIsActive-seed#[534B6471BC1CA2F1]) [n:127.0.0.1:59354_    ] o.a.s.c.CoreContainer Security conf doesn't exist. Skipping setup for authorization module.
   [junit4]   2> 964930 INFO  (TEST-ForceLeaderTest.testLastPublishedStateIsActive-seed#[534B6471BC1CA2F1]) [n:127.0.0.1:59354_    ] o.a.s.c.CoreContainer No authentication plugin used.
   [junit4]   2> 964931 INFO  (TEST-ForceLeaderTest.testLastPublishedStateIsActive-seed#[534B6471BC1CA2F1]) [n:127.0.0.1:59354_    ] o.a.s.c.CorePropertiesLocator Looking for core definitions underneath C:\Users\jenkins\workspace\Lucene-Solr-master-Windows\solr\build\solr-core\test\J1\temp\solr.cloud.ForceLeaderTest_534B6471BC1CA2F1-001\control-001\cores
   [junit4]   2> 964932 INFO  (TEST-ForceLeaderTest.testLastPublishedStateIsActive-seed#[534B6471BC1CA2F1]) [n:127.0.0.1:59354_    ] o.a.s.c.CoreDescriptor Created CoreDescriptor: {name=collection1, config=solrconfig.xml, transient=false, schema=schema.xml, loadOnStartup=true, configSetProperties=configsetprops.json, collection=control_collection, coreNodeName=, dataDir=data\, shard=}
   [junit4]   2> 964932 INFO  (TEST-ForceLeaderTest.testLastPublishedStateIsActive-seed#[534B6471BC1CA2F1]) [n:127.0.0.1:59354_    ] o.a.s.c.CorePropertiesLocator Found core collection1 in C:\Users\jenkins\workspace\Lucene-Solr-master-Windows\solr\build\solr-core\test\J1\temp\solr.cloud.ForceLeaderTest_534B6471BC1CA2F1-001\control-001\cores\collection1
   [junit4]   2> 964933 INFO  (TEST-ForceLeaderTest.testLastPublishedStateIsActive-seed#[534B6471BC1CA2F1]) [n:127.0.0.1:59354_    ] o.a.s.c.CorePropertiesLocator Found 1 core definitions
   [junit4]   2> 964933 INFO  (TEST-ForceLeaderTest.testLastPublishedStateIsActive-seed#[534B6471BC1CA2F1]) [n:127.0.0.1:59354_    ] o.a.s.s.SolrDispatchFilter user.dir=C:\Users\jenkins\workspace\Lucene-Solr-master-Windows\solr\build\solr-core\test\J1
   [junit4]   2> 964933 INFO  (TEST-ForceLeaderTest.testLastPublishedStateIsActive-seed#[534B6471BC1CA2F1]) [n:127.0.0.1:59354_    ] o.a.s.s.SolrDispatchFilter SolrDispatchFilter.init() done
   [junit4]   2> 964933 INFO  (coreLoadExecutor-3957-thread-1-processing-n:127.0.0.1:59354_) [n:127.0.0.1:59354_ c:control_collection   x:collection1] o.a.s.c.ZkController publishing state=down
   [junit4]   2> 964934 INFO  (coreLoadExecutor-3957-thread-1-processing-n:127.0.0.1:59354_) [n:127.0.0.1:59354_ c:control_collection   x:collection1] o.a.s.c.ZkController numShards not found on descriptor - reading it from system property
   [junit4]   2> 964935 INFO  (coreLoadExecutor-3957-thread-1-processing-n:127.0.0.1:59354_) [n:127.0.0.1:59354_ c:control_collection   x:collection1] o.a.s.c.ZkController Collection control_collection not visible yet, but flagging it so a watch is registered when it becomes visible
   [junit4]   2> 964936 INFO  (OverseerStateUpdate-96499196148383748-127.0.0.1:59354_-n_0000000000) [n:127.0.0.1:59354_    ] o.a.s.c.Overseer processMessage: queueSize: 1, message = {
   [junit4]   2>   "core":"collection1",
   [junit4]   2>   "roles":null,
   [junit4]   2>   "base_url":"http://127.0.0.1:59354",
   [junit4]   2>   "node_name":"127.0.0.1:59354_",
   [junit4]   2>   "numShards":"1",
   [junit4]   2>   "state":"down",
   [junit4]   2>   "shard":null,
   [junit4]   2>   "collection":"control_collection",
   [junit4]   2>   "operation":"state"} current state version: 0
   [junit4]   2> 964936 INFO  (OverseerStateUpdate-96499196148383748-127.0.0.1:59354_-n_0000000000) [n:127.0.0.1:59354_    ] o.a.s.c.o.ReplicaMutator Update state numShards=1 message={
   [junit4]   2>   "core":"collection1",
   [junit4]   2>   "roles":null,
   [junit4]   2>   "base_url":"http://127.0.0.1:59354",
   [junit4]   2>   "node_name":"127.0.0.1:59354_",
   [junit4]   2>   "numShards":"1",
   [junit4]   2>   "state":"down",
   [junit4]   2>   "shard":null,
   [junit4]   2>   "collection":"control_collection",
   [junit4]   2>   "operation":"state"}
   [junit4]   2> 964936 INFO  (coreLoadExecutor-3957-thread-1-processing-n:127.0.0.1:59354_) [n:127.0.0.1:59354_ c:control_collection   x:collection1] o.a.s.c.c.ZkStateReader Deleting data for [control_collection]
   [junit4]   2> 964936 INFO  (OverseerStateUpdate-96499196148383748-127.0.0.1:59354_-n_0000000000) [n:127.0.0.1:59354_    ] o.a.s.c.o.ClusterStateMutator building a new cName: control_collection
   [junit4]   2> 964937 INFO  (OverseerStateUpdate-96499196148383748-127.0.0.1:59354_-n_0000000000) [n:127.0.0.1:59354_    ] o.a.s.c.o.ReplicaMutator Assigning new node to shard shard=shard1
   [junit4]   2> 964938 INFO  (coreLoadExecutor-3957-thread-1-processing-n:127.0.0.1:59354_) [n:127.0.0.1:59354_ c:control_collection   x:collection1] o.a.s.c.ZkController look for our core node name
   [junit4]   2> 964939 INFO  (zkCallback-1619-thread-1-processing-n:127.0.0.1:59354_) [n:127.0.0.1:59354_    ] o.a.s.c.c.ZkStateReader A cluster state change: [WatchedEvent state:SyncConnected type:NodeDataChanged path:/clusterstate.json], has occurred - updating... (live nodes size: [1])
   [junit4]   2> 965938 INFO  (coreLoadExecutor-3957-thread-1-processing-n:127.0.0.1:59354_) [n:127.0.0.1:59354_ c:control_collection   x:collection1] o.a.s.c.ZkController waiting to find shard id in clusterstate for collection1
   [junit4]   2> 965938 INFO  (coreLoadExecutor-3957-thread-1-processing-n:127.0.0.1:59354_) [n:127.0.0.1:59354_ c:control_collection   x:collection1] o.a.s.c.ZkController Check for collection zkNode:control_collection
   [junit4]   2> 965939 INFO  (coreLoadExecutor-3957-thread-1-processing-n:127.0.0.1:59354_) [n:127.0.0.1:59354_ c:control_collection   x:collection1] o.a.s.c.ZkController Collection zkNode exists
   [junit4]   2> 965939 INFO  (coreLoadExecutor-3957-thread-1-processing-n:127.0.0.1:59354_) [n:127.0.0.1:59354_ c:control_collection   x:collection1] o.a.s.c.c.ZkStateReader Load collection config from: [/collections/control_collection]
   [junit4]   2> 965940 INFO  (coreLoadExecutor-3957-thread-1-processing-n:127.0.0.1:59354_) [n:127.0.0.1:59354_ c:control_collection   x:collection1] o.a.s.c.c.ZkStateReader path=[/collections/control_collection] [configName]=[conf1] specified config exists in ZooKeeper
   [junit4]   2> 965940 INFO  (coreLoadExecutor-3957-thread-1-processing-n:127.0.0.1:59354_) [n:127.0.0.1:59354_ c:control_collection   x:collection1] o.a.s.c.SolrResourceLoader new SolrResourceLoader for directory: 'C:\Users\jenkins\workspace\Lucene-Solr-master-Windows\solr\build\solr-core\test\J1\temp\solr.cloud.ForceLeaderTest_534B6471BC1CA2F1-001\control-001\cores\collection1'
   [junit4]   2> 965940 INFO  (coreLoadExecutor-3957-thread-1-processing-n:127.0.0.1:59354_) [n:127.0.0.1:59354_ c:control_collection   x:collection1] o.a.s.c.SolrResourceLoader JNDI not configured for solr (NoInitialContextEx)
   [junit4]   2> 965940 INFO  (coreLoadExecutor-3957-thread-1-processing-n:127.0.0.1:59354_) [n:127.0.0.1:59354_ c:control_collection   x:collection1] o.a.s.c.SolrResourceLoader solr home defaulted to 'solr/' (could not find system property or JNDI)
   [junit4]   2> 965943 INFO  (coreLoadExecutor-3957-thread-1-processing-n:127.0.0.1:59354_) [n:127.0.0.1:59354_ c:control_collection   x:collection1] o.a.s.c.Config loaded config solrconfig.xml with version 0 
   [junit4]   2> 965977 INFO  (coreLoadExecutor-3957-thread-1-processing-n:127.0.0.1:59354_) [n:127.0.0.1:59354_ c:control_collection   x:collection1] o.a.s.c.SolrConfig current version of requestparams : -1
   [junit4]   2> 965981 INFO  (coreLoadExecutor-3957-thread-1-processing-n:127.0.0.1:59354_) [n:127.0.0.1:59354_ c:control_collection   x:collection1] o.a.s.c.SolrConfig Using Lucene MatchVersion: 7.0.0
   [junit4]   2> 965991 INFO  (coreLoadExecutor-3957-thread-1-processing-n:127.0.0.1:59354_) [n:127.0.0.1:59354_ c:control_collection   x:collection1] o.a.s.c.SolrConfig Loaded SolrConfig: solrconfig.xml
   [junit4]   2> 966000 INFO  (coreLoadExecutor-3957-thread-1-processing-n:127.0.0.1:59354_) [n:127.0.0.1:59354_ c:control_collection   x:collection1] o.a.s.s.IndexSchema [collection1] Schema name=test
   [junit4]   2> 966102 INFO  (coreLoadExecutor-3957-thread-1-processing-n:127.0.0.1:59354_) [n:127.0.0.1:59354_ c:control_collection   x:collection1] o.a.s.s.OpenExchangeRatesOrgProvider Initialized with rates=open-exchange-rates.json, refreshInterval=1440.
   [junit4]   2> 966117 INFO  (coreLoadExecutor-3957-thread-1-processing-n:127.0.0.1:59354_) [n:127.0.0.1:59354_ c:control_collection   x:collection1] o.a.s.s.IndexSchema default search field in schema is text
   [junit4]   2> 966118 INFO  (coreLoadExecutor-3957-thread-1-processing-n:127.0.0.1:59354_) [n:127.0.0.1:59354_ c:control_collection   x:collection1] o.a.s.s.IndexSchema unique key field: id
   [junit4]   2> 966128 INFO  (coreLoadExecutor-3957-thread-1-processing-n:127.0.0.1:59354_) [n:127.0.0.1:59354_ c:control_collection   x:collection1] o.a.s.s.FileExchangeRateProvider Reloading exchange rates from file currency.xml
   [junit4]   2> 966131 INFO  (coreLoadExecutor-3957-thread-1-processing-n:127.0.0.1:59354_) [n:127.0.0.1:59354_ c:control_collection   x:collection1] o.a.s.s.FileExchangeRateProvider Reloading exchange rates from file currency.xml
   [junit4]   2> 966136 INFO  (coreLoadExecutor-3957-thread-1-processing-n:127.0.0.1:59354_) [n:127.0.0.1:59354_ c:control_collection   x:collection1] o.a.s.s.OpenExchangeRatesOrgProvider Reloading exchange rates from open-exchange-rates.json
   [junit4]   2> 966137 INFO  (coreLoadExecutor-3957-thread-1-processing-n:127.0.0.1:59354_) [n:127.0.0.1:59354_ c:control_collection   x:collection1] o.a.s.s.OpenExchangeRatesOrgProvider Reloading exchange rates from open-exchange-rates.json
   [junit4]   2> 966141 INFO  (coreLoadExecutor-3957-thread-1-processing-n:127.0.0.1:59354_) [n:127.0.0.1:59354_ c:control_collection   x:collection1] o.a.s.c.ConfigSetProperties Did not find ConfigSet properties, assuming default properties: Can't find resource 'configsetprops.json' in classpath or '/configs/conf1', cwd=C:\Users\jenkins\workspace\Lucene-Solr-master-Windows\solr\build\solr-core\test\J1
   [junit4]   2> 966141 INFO  (coreLoadExecutor-3957-thread-1-processing-n:127.0.0.1:59354_) [n:127.0.0.1:59354_ c:control_collection   x:collection1] o.a.s.c.CoreContainer Creating SolrCore 'collection1' using configuration from collection control_collection
   [junit4]   2> 966141 INFO  (coreLoadExecutor-3957-thread-1-processing-n:127.0.0.1:59354_) [n:127.0.0.1:59354_ c:control_collection s:shard1 r:core_node1 x:collection1] o.a.s.c.SolrCore org.apache.solr.core.MockDirectoryFactory
   [junit4]   2> 966141 INFO  (coreLoadExecutor-3957-thread-1-processing-n:127.0.0.1:59354_) [n:127.0.0.1:59354_ c:control_collection s:shard1 r:core_node1 x:collection1] o.a.s.c.SolrCore [[collection1] ] Opening new SolrCore at [C:\Users\jenkins\workspace\Lucene-Solr-master-Windows\solr\build\solr-core\test\J1\temp\solr.cloud.ForceLeaderTest_534B6471BC1CA2F1-001\control-001\cores\collection1], dataDir=[C:\Users\jenkins\workspace\Lucene-Solr-master-Windows\solr\build\solr-core\test\J1\temp\solr.cloud.ForceLeaderTest_534B6471BC1CA2F1-001\control-001\cores\collection1\data\]
   [junit4]   2> 966141 INFO  (coreLoadExecutor-3957-thread-1-processing-n:127.0.0.1:59354_) [n:127.0.0.1:59354_ c:control_collection s:shard1 r:core_node1 x:collection1] o.a.s.c.JmxMonitoredMap JMX monitoring is enabled. Adding Solr mbeans to JMX Server: com.sun.jmx.mbeanserver.JmxMBeanServer@30ec09c
   [junit4]   2> 966141 INFO  (coreLoadExecutor-3957-thread-1-processing-n:127.0.0.1:59354_) [n:127.0.0.1:59354_ c:control_collection s:shard1 r:core_node1 x:collection1] o.a.s.c.CachingDirectoryFactory return new directory for C:\Users\jenkins\workspace\Lucene-Solr-master-Windows\solr\build\solr-core\test\J1\temp\solr.cloud.ForceLeaderTest_534B6471BC1CA2F1-001\control-001\cores\collection1\data\snapshot_metadata
   [junit4]   2> 966141 INFO  (coreLoadExecutor-3957-thread-1-processing-n:127.0.0.1:59354_) [n:127.0.0.1:59354_ c:control_collection s:shard1 r:core_node1 x:collection1] o.a.s.c.s.SolrSnapshotMetaDataManager Loading from snapshot metadata file...
   [junit4]   2> 966161 INFO  (coreLoadExecutor-3957-thread-1-processing-n:127.0.0.1:59354_) [n:127.0.0.1:59354_ c:control_collection s:shard1 r:core_node1 x:collection1] o.a.s.c.CachingDirectoryFactory return new directory for C:\Users\jenkins\workspace\Lucene-Solr-master-Windows\solr\build\solr-core\test\J1\temp\solr.cloud.ForceLeaderTest_534B6471BC1CA2F1-001\control-001\cores\collection1\data\
   [junit4]   2> 966162 INFO  (coreLoadExecutor-3957-thread-1-processing-n:127.0.0.1:59354_) [n:127.0.0.1:59354_ c:control_collection s:shard1 r:core_node1 x:collection1] o.a.s.c.SolrCore New index directory detected: old=null new=C:\Users\jenkins\workspace\Lucene-Solr-master-Windows\solr\build\solr-core\test\J1\temp\solr.cloud.ForceLeaderTest_534B6471BC1CA2F1-001\control-001\cores\collection1\data\index/
   [junit4]   2> 966162 WARN  (coreLoadExecutor-3957-thread-1-processing-n:127.0.0.1:59354_) [n:127.0.0.1:59354_ c:control_collection s:shard1 r:core_node1 x:collection1] o.a.s.c.SolrCore [collection1] Solr index directory 'C:\Users\jenkins\workspace\Lucene-Solr-master-Windows\solr\build\solr-core\test\J1\temp\solr.cloud.ForceLeaderTest_534B6471BC1CA2F1-001\control-001\cores\collection1\data\index' doesn't exist. Creating new index...
   [junit4]   2> 966162 INFO  (coreLoadExecutor-3957-thread-1-processing-n:127.0.0.1:59354_) [n:127.0.0.1:59354_ c:control_collection s:shard1 r:core_node1 x:collection1] o.a.s.c.CachingDirectoryFactory return new directory for C:\Users\jenkins\workspace\Lucene-Solr-master-Windows\solr\build\solr-core\test\J1\temp\solr.cloud.ForceLeaderTest_534B6471BC1CA2F1-001\control-001\cores\collection1\data\index
   [junit4]   2> 966162 INFO  (coreLoadExecutor-3957-thread-1-processing-n:127.0.0.1:59354_) [n:127.0.0.1:59354_ c:control_collection s:shard1 r:core_node1 x:collection1] o.a.s.u.RandomMergePolicy RandomMergePolicy wrapping class org.apache.lucene.index.TieredMergePolicy: [TieredMergePolicy: maxMergeAtOnce=15, maxMergeAtOnceExplicit=41, maxMergedSegmentMB=90.7744140625, floorSegmentMB=1.26171875, forceMergeDeletesPctAllowed=23.110092132074268, segmentsPerTier=40.0, maxCFSSegmentSizeMB=8.796093022207999E12, noCFSRatio=0.1476515040570611
   [junit4]   2> 966181 INFO  (coreLoadExecutor-3957-thread-1-processing-n:127.0.0.1:59354_) [n:127.0.0.1:59354_ c:control_collection s:shard1 r:core_node1 x:collection1] o.a.s.c.SolrDeletionPolicy SolrDeletionPolicy.onCommit: commits: num=1
   [junit4]   2> 	commit{dir=MockDirectoryWrapper(RAMDirectory@4397afa2 lockFactory=org.apache.lucene.store.SingleInstanceLockFactory@25178598),segFN=segments_1,generation=1}
   [junit4]   2> 966181 INFO  (coreLoadExecutor-3957-thread-1-processing-n:127.0.0.1:59354_) [n:127.0.0.1:59354_ c:control_collection s:shard1 r:core_node1 x:collection1] o.a.s.c.SolrDeletionPolicy newest commit generation = 1
   [junit4]   2> 966181 INFO  (OldIndexDirectoryCleanupThreadForCore-collection1) [n:127.0.0.1:59354_ c:control_collection s:shard1 r:core_node1 x:collection1] o.a.s.c.SolrCore Looking for old index directories to cleanup for core collection1 in C:\Users\jenkins\workspace\Lucene-Solr-master-Windows\solr\build\solr-core\test\J1\temp\solr.cloud.ForceLeaderTest_534B6471BC1CA2F1-001\control-001\cores\collection1\data\
   [junit4]   2> 966193 WARN  (OldIndexDirectoryCleanupThreadForCore-collection1) [n:127.0.0.1:59354_ c:control_collection s:shard1 r:core_node1 x:collection1] o.a.s.c.DirectoryFactory C:\Users\jenkins\workspace\Lucene-Solr-master-Windows\solr\build\solr-core\test\J1\temp\solr.cloud.ForceLeaderTest_534B6471BC1CA2F1-001\control-001\cores\collection1\data\ does not point to a valid data directory; skipping clean-up of old index directories.
   [junit4]   2> 966194 INFO  (coreLoadExecutor-3957-thread-1-processing-n:127.0.0.1:59354_) [n:127.0.0.1:59354_ c:control_collection s:shard1 r:core_node1 x:collection1] o.a.s.u.p.UpdateRequestProcessorChain creating updateRequestProcessorChain "nodistrib"
   [junit4]   2> 966194 INFO  (coreLoadExecutor-3957-thread-1-processing-n:127.0.0.1:59354_) [n:127.0.0.1:59354_ c:control_collection s:shard1 r:core_node1 x:collection1] o.a.s.u.p.UpdateRequestProcessorChain creating updateRequestProcessorChain "dedupe"
   [junit4]   2> 966194 INFO  (coreLoadExecutor-3957-thread-1-processing-n:127.0.0.1:59354_) [n:127.0.0.1:59354_ c:control_collection s:shard1 r:core_node1 x:collection1] o.a.s.u.p.UpdateRequestProcessorChain inserting DistributedUpdateProcessorFactory into updateRequestProcessorChain "dedupe"
   [junit4]   2> 966194 INFO  (coreLoadExecutor-3957-thread-1-processing-n:127.0.0.1:59354_) [n:127.0.0.1:59354_ c:control_collection s:shard1 r:core_node1 x:collection1] o.a.s.u.p.UpdateRequestProcessorChain creating updateRequestProcessorChain "stored_sig"
   [junit4]   2> 966194 INFO  (coreLoadExecutor-3957-thread-1-processing-n:127.0.0.1:59354_) [n:127.0.0.1:59354_ c:control_collection s:shard1 r:core_node1 x:collection1] o.a.s.u.p.UpdateRequestProcessorChain inserting DistributedUpdateProcessorFactory into updateRequestProcessorChain "stored_sig"
   [junit4]   2> 966194 INFO  (coreLoadExecutor-3957-thread-1-processing-n:127.0.0.1:59354_) [n:127.0.0.1:59354_ c:control_collection s:shard1 r:core_node1 x:collection1] o.a.s.u.p.UpdateRequestProcessorChain creating updateRequestProcessorChain "distrib-dup-test-chain-explicit"
   [junit4]   2> 966197 INFO  (coreLoadExecutor-3957-thread-1-processing-n:127.0.0.1:59354_) [n:127.0.0.1:59354_ c:control_collection s:shard1 r:core_node1 x:collection1] o.a.s.u.p.UpdateRequestProcessorChain creating updateRequestProcessorChain "distrib-dup-test-chain-implicit"
   [junit4]   2> 966198 INFO  (coreLoadExecutor-3957-thread-1-processing-n:127.0.0.1:59354_) [n:127.0.0.1:59354_ c:control_collection s:shard1 r:core_node1 x:collection1] o.a.s.u.p.UpdateRequestProcessorChain inserting DistributedUpdateProcessorFactory into updateRequestProcessorChain "distrib-dup-test-chain-implicit"
   [junit4]   2> 966198 INFO  (coreLoadExecutor-3957-thread-1-processing-n:127.0.0.1:59354_) [n:127.0.0.1:59354_ c:control_collection s:shard1 r:core_node1 x:collection1] o.a.s.c.SolrCore no updateRequestProcessorChain defined as default, creating implicit default
   [junit4]   2> 966198 WARN  (coreLoadExecutor-3957-thread-1-processing-n:127.0.0.1:59354_) [n:127.0.0.1:59354_ c:control_collection s:shard1 r:core_node1 x:collection1] o.a.s.c.RequestHandlers INVALID paramSet a in requestHandler {type = requestHandler,name = /dump,class = DumpRequestHandler,args = {defaults={a=A,b=B}}}
   [junit4]   2> 966205 INFO  (coreLoadExecutor-3957-thread-1-processing-n:127.0.0.1:59354_) [n:127.0.0.1:59354_ c:control_collection s:shard1 r:core_node1 x:collection1] o.a.s.h.l.XMLLoader xsltCacheLifetimeSeconds=60
   [junit4]   2> 966206 INFO  (coreLoadExecutor-3957-thread-1-processing-n:127.0.0.1:59354_) [n:127.0.0.1:59354_ c:control_collection s:shard1 r:core_node1 x:collection1] o.a.s.h.l.XMLLoader xsltCacheLifetimeSeconds=60
   [junit4]   2> 966207 INFO  (coreLoadExecutor-3957-thread-1-processing-n:127.0.0.1:59354_) [n:127.0.0.1:59354_ c:control_collection s:shard1 r:core_node1 x:collection1] o.a.s.h.l.XMLLoader xsltCacheLifetimeSeconds=60
   [junit4]   2> 966207 INFO  (coreLoadExecutor-3957-thread-1-processing-n:127.0.0.1:59354_) [n:127.0.0.1:59354_ c:control_collection s:shard1 r:core_node1 x:collection1] o.a.s.h.l.XMLLoader xsltCacheLifetimeSeconds=60
   [junit4]   2> 966211 INFO  (coreLoadExecutor-3957-thread-1-processing-n:127.0.0.1:59354_) [n:127.0.0.1:59354_ c:control_collection s:shard1 r:core_node1 x:collection1] o.a.s.c.RequestHandlers Registered paths: /admin/mbeans,standard,/update/json/docs,/admin/luke,/export,/get,/admin/properties,/update/json,/admin/threads,/dump,/update/csv,/sql,/graph,/admin/segments,/admin/system,/replication,/config,/stream,/schema,/admin/plugins,/admin/logging,/admin/ping,/update,/admin/file,/terms
   [junit4]   2> 966211 INFO  (coreLoadExecutor-3957-thread-1-processing-n:127.0.0.1:59354_) [n:127.0.0.1:59354_ c:control_collection s:shard1 r:core_node1 x:collection1] o.a.s.c.SolrCore Using default statsCache cache: org.apache.solr.search.stats.LocalStatsCache
   [junit4]   2> 966212 INFO  (coreLoadExecutor-3957-thread-1-processing-n:127.0.0.1:59354_) [n:127.0.0.1:59354_ c:control_collection s:shard1 r:core_node1 x:collection1] o.a.s.u.UpdateHandler Using UpdateLog implementation: org.apache.solr.update.UpdateLog
   [junit4]   2> 966212 INFO  (coreLoadExecutor-3957-thread-1-processing-n:127.0.0.1:59354_) [n:127.0.0.1:59354_ c:control_collection s:shard1 r:core_node1 x:collection1] o.a.s.u.UpdateLog Initializing UpdateLog: dataDir= defaultSyncLevel=FLUSH numRecordsToKeep=100 maxNumLogsToKeep=10 numVersionBuckets=65536
   [junit4]   2> 966213 INFO  (coreLoadExecutor-3957-thread-1-processing-n:127.0.0.1:59354_) [n:127.0.0.1:59354_ c:control_collection s:shard1 r:core_node1 x:collection1] o.a.s.u.CommitTracker Hard AutoCommit: disabled
   [junit4]   2> 966213 INFO  (coreLoadExecutor-3957-thread-1-processing-n:127.0.0.1:59354_) [n:127.0.0.1:59354_ c:control_collection s:shard1 r:core_node1 x:collection1] o.a.s.u.CommitTracker Soft AutoCommit: disabled
   [junit4]   2> 966214 INFO  (coreLoadExecutor-3957-thread-1-processing-n:127.0.0.1:59354_) [n:127.0.0.1:59354_ c:control_collection s:shard1 r:core_node1 x:collection1] o.a.s.u.RandomMergePolicy RandomMergePolicy wrapping class org.apache.lucene.index.TieredMergePolicy: [TieredMergePolicy: maxMergeAtOnce=23, maxMergeAtOnceExplicit=35, maxMergedSegmentMB=28.283203125, floorSegmentMB=1.85546875, forceMergeDeletesPctAllowed=13.771003765016008, segmentsPerTier=31.0, maxCFSSegmentSizeMB=8.796093022207999E12, noCFSRatio=0.24800230235418735
   [junit4]   2> 966214 INFO  (coreLoadExecutor-3957-thread-1-processing-n:127.0.0.1:59354_) [n:127.0.0.1:59354_ c:control_collection s:shard1 r:core_node1 x:collection1] o.a.s.c.SolrDeletionPolicy SolrDeletionPolicy.onInit: commits: num=1
   [junit4]   2> 	commit{dir=MockDirectoryWrapper(RAMDirectory@4397afa2 lockFactory=org.apache.lucene.store.SingleInstanceLockFactory@25178598),segFN=segments_1,generation=1}
   [junit4]   2> 966214 INFO  (coreLoadExecutor-3957-thread-1-processing-n:127.0.0.1:59354_) [n:127.0.0.1:59354_ c:control_collection s:shard1 r:core_node1 x:collection1] o.a.s.c.SolrDeletionPolicy newest commit generation = 1
   [junit4]   2> 966215 INFO  (coreLoadExecutor-3957-thread-1-processing-n:127.0.0.1:59354_) [n:127.0.0.1:59354_ c:control_collection s:shard1 r:core_node1 x:collection1] o.a.s.s.SolrIndexSearcher Opening [Searcher@16c24ca0[collection1] main]
   [junit4]   2> 966215 INFO  (coreLoadExecutor-3957-thread-1-processing-n:127.0.0.1:59354_) [n:127.0.0.1:59354_ c:control_collection s:shard1 r:core_node1 x:collection1] o.a.s.c.c.ZkStateReader Load collection config from: [/collections/control_collection]
   [junit4]   2> 966216 INFO  (coreLoadExecutor-3957-thread-1-processing-n:127.0.0.1:59354_) [n:127.0.0.1:59354_ c:control_collection s:shard1 r:core_node1 x:collection1] o.a.s.c.c.ZkStateReader path=[/collections/control_collection] [configName]=[conf1] specified config exists in ZooKeeper
   [junit4]   2> 966216 INFO  (coreLoadExecutor-3957-thread-1-processing-n:127.0.0.1:59354_) [n:127.0.0.1:59354_ c:control_collection s:shard1 r:core_node1 x:collection1] o.a.s.r.ManagedResourceStorage Setting up ZooKeeper-based storage for the RestManager with znodeBase: /configs/conf1
   [junit4]   2> 966216 INFO  (coreLoadExecutor-3957-thread-1-processing-n:127.0.0.1:59354_) [n:127.0.0.1:59354_ c:control_collection s:shard1 r:core_node1 x:collection1] o.a.s.r.ManagedResourceStorage Configured ZooKeeperStorageIO with znodeBase: /configs/conf1
   [junit4]   2> 966216 INFO  (coreLoadExecutor-3957-thread-1-processing-n:127.0.0.1:59354_) [n:127.0.0.1:59354_ c:control_collection s:shard1 r:core_node1 x:collection1] o.a.s.r.RestManager Initializing RestManager with initArgs: {}
   [junit4]   2> 966216 INFO  (coreLoadExecutor-3957-thread-1-processing-n:127.0.0.1:59354_) [n:127.0.0.1:59354_ c:control_collection s:shard1 r:core_node1 x:collection1] o.a.s.r.ManagedResourceStorage Reading _rest_managed.json using ZooKeeperStorageIO:path=/configs/conf1
   [junit4]   2> 966217 INFO  (coreLoadExecutor-3957-thread-1-processing-n:127.0.0.1:59354_) [n:127.0.0.1:59354_ c:control_collection s:shard1 r:core_node1 x:collection1] o.a.s.r.ManagedResourceStorage No data found for znode /configs/conf1/_rest_managed.json
   [junit4]   2> 966217 INFO  (coreLoadExecutor-3957-thread-1-processing-n:127.0.0.1:59354_) [n:127.0.0.1:59354_ c:control_collection s:shard1 r:core_node1 x:collection1] o.a.s.r.ManagedResourceStorage Loaded null at path _rest_managed.json using ZooKeeperStorageIO:path=/configs/conf1
   [junit4]   2> 966217 INFO  (coreLoadExecutor-3957-thread-1-processing-n:127.0.0.1:59354_) [n:127.0.0.1:59354_ c:control_collection s:shard1 r:core_node1 x:collection1] o.a.s.r.RestManager Initializing 0 registered ManagedResources
   [junit4]   2> 966217 INFO  (coreLoadExecutor-3957-thread-1-processing-n:127.0.0.1:59354_) [n:127.0.0.1:59354_ c:control_collection s:shard1 r:core_node1 x:collection1] o.a.s.h.ReplicationHandler Commits will be reserved for  10000
   [junit4]   2> 966218 INFO  (searcherExecutor-3958-thread-1-processing-n:127.0.0.1:59354_ x:collection1 s:shard1 c:control_collection r:core_node1) [n:127.0.0.1:59354_ c:control_collection s:shard1 r:core_node1 x:collection1] o.a.s.c.SolrCore [collection1] Registered new searcher Searcher@16c24ca0[collection1] main{ExitableDirectoryReader(UninvertingDirectoryReader())}
   [junit4]   2> 966218 INFO  (coreLoadExecutor-3957-thread-1-processing-n:127.0.0.1:59354_) [n:127.0.0.1:59354_ c:control_collection s:shard1 r:core_node1 x:collection1] o.a.s.u.UpdateLog Looking up max value of version field to seed version buckets
   [junit4]   2> 966218 INFO  (coreLoadExecutor-3957-thread-1-processing-n:127.0.0.1:59354_) [n:127.0.0.1:59354_ c:control_collection s:shard1 r:core_node1 x:collection1] o.a.s.u.VersionInfo Refreshing highest value of _version_ for 65536 version buckets from index
   [junit4]   2> 966218 INFO  (coreLoadExecutor-3957-thread-1-processing-n:127.0.0.1:59354_) [n:127.0.0.1:59354_ c:control_collection s:shard1 r:core_node1 x:collection1] o.a.s.u.VersionInfo No terms found for _version_, cannot seed version bucket highest value from index
   [junit4]   2> 966218 INFO  (coreLoadExecutor-3957-thread-1-processing-n:127.0.0.1:59354_) [n:127.0.0.1:59354_ c:control_collection s:shard1 r:core_node1 x:collection1] o.a.s.u.UpdateLog Could not find max version in index or recent updates, using new clock 1543987140480729088
   [junit4]   2> 966220 INFO  (coreLoadExecutor-3957-thread-1-processing-n:127.0.0.1:59354_) [n:127.0.0.1:59354_ c:control_collection s:shard1 r:core_node1 x:collection1] o.a.s.u.UpdateLog Took 2.0ms to seed version buckets with highest version 1543987140480729088
   [junit4]   2> 966220 INFO  (coreLoadExecutor-3957-thread-1-processing-n:127.0.0.1:59354_) [n:127.0.0.1:59354_ c:control_collection s:shard1 r:core_node1 x:collection1] o.a.s.c.ZkController watch zkdir /configs/conf1
   [junit4]   2> 966221 INFO  (coreLoadExecutor-3957-thread-1-processing-n:127.0.0.1:59354_) [n:127.0.0.1:59354_ c:control_collection s:shard1 r:core_node1 x:collection1] o.a.s.c.CoreContainer registering core: collection1
   [junit4]   2> 966222 INFO  (coreZkRegister-3950-thread-1-processing-n:127.0.0.1:59354_ x:collection1 s:shard1 c:control_collection r:core_node1) [n:127.0.0.1:59354_ c:control_collection s:shard1 r:core_node1 x:collection1] o.a.s.c.ZkController Register replica - core:collection1 address:http://127.0.0.1:59354 collection:control_collection shard:shard1
   [junit4]   2> 966223 INFO  (coreZkRegister-3950-thread-1-processing-n:127.0.0.1:59354_ x:collection1 s:shard1 c:control_collection r:core_node1) [n:127.0.0.1:59354_ c:control_collection s:shard1 r:core_node1 x:collection1] o.a.s.c.c.SolrZkClient makePath: /collections/control_collection/leader_elect/shard1/election
   [junit4]   2> 966227 INFO  (coreZkRegister-3950-thread-1-processing-n:127.0.0.1:59354_ x:collection1 s:shard1 c:control_collection r:core_node1) [n:127.0.0.1:59354_ c:control_collection s:shard1 r:core_node1 x:collection1] o.a.s.c.LeaderElector Joined leadership election with path: /collections/control_collection/leader_elect/shard1/election/96499196148383748-core_node1-n_0000000000
   [junit4]   2> 966227 INFO  (coreZkRegister-3950-thread-1-processing-n:127.0.0.1:59354_ x:collection1 s:shard1 c:control_collection r:core_node1) [n:127.0.0.1:59354_ c:control_collection s:shard1 r:core_node1 x:collection1] o.a.s.c.ShardLeaderElectionContext Running the leader process for shard=shard1 and weAreReplacement=false and leaderVoteWait=10000
   [junit4]   2> 966229 INFO  (coreZkRegister-3950-thread-1-processing-n:127.0.0.1:59354_ x:collection1 s:shard1 c:control_collection r:core_node1) [n:127.0.0.1:59354_ c:control_collection s:shard1 r:core_node1 x:collection1] o.a.s.c.ShardLeaderElectionContext Enough replicas found to continue.
   [junit4]   2> 966229 INFO  (coreZkRegister-3950-thread-1-processing-n:127.0.0.1:59354_ x:collection1 s:shard1 c:control_collection r:core_node1) [n:127.0.0.1:59354_ c:control_collection s:shard1 r:core_node1 x:collection1] o.a.s.c.ShardLeaderElectionContext I may be the new leader - try and sync
   [junit4]   2> 966229 INFO  (coreZkRegister-3950-thread-1-processing-n:127.0.0.1:59354_ x:collection1 s:shard1 c:control_collection r:core_node1) [n:127.0.0.1:59354_ c:control_collection s:shard1 r:core_node1 x:collection1] o.a.s.c.SyncStrategy Sync replicas to http://127.0.0.1:59354/collection1/
   [junit4]   2> 966229 INFO  (coreZkRegister-3950-thread-1-processing-n:127.0.0.1:59354_ x:collection1 s:shard1 c:control_collection r:core_node1) [n:127.0.0.1:59354_ c:control_collection s:shard1 r:core_node1 x:collection1] o.a.s.c.SyncStrategy Sync Success - now sync replicas to me
   [junit4]   2> 966229 INFO  (coreZkRegister-3950-thread-1-processing-n:127.0.0.1:59354_ x:collection1 s:shard1 c:control_collection r:core_node1) [n:127.0.0.1:59354_ c:control_collection s:shard1 r:core_node1 x:collection1] o.a.s.c.SyncStrategy http://127.0.0.1:59354/collection1/ has no replicas
   [junit4]   2> 966230 INFO  (OverseerStateUpdate-96499196148383748-127.0.0.1:59354_-n_0000000000) [n:127.0.0.1:59354_    ] o.a.s.c.Overseer processMessage: queueSize: 1, message = {
   [junit4]   2>   "operation":"leader",
   [junit4]   2>   "shard":"shard1",
   [junit4]   2>   "collection":"control_collection"} current state version: 1
   [junit4]   2> 966231 INFO  (coreZkRegister-3950-thread-1-processing-n:127.0.0.1:59354_ x:collection1 s:shard1 c:control_collection r:core_node1) [n:127.0.0.1:59354_ c:control_collection s:shard1 r:core_node1 x:collection1] o.a.s.c.c.SolrZkClient makePath: /collections/control_collection/leaders/shard1
   [junit4]   2> 966235 INFO  (coreZkRegister-3950-thread-1-processing-n:127.0.0.1:59354_ x:collection1 s:shard1 c:control_collection r:core_node1) [n:127.0.0.1:59354_ c:control_collection s:shard1 r:core_node1 x:collection1] o.a.s.c.ShardLeaderElectionContextBase Creating leader registration node /collections/control_collection/leaders/shard1/leader after winning as /collections/control_collection/leader_elect/shard1/election/96499196148383748-core_node1-n_0000000000
   [junit4]   2> 966236 INFO  (coreZkRegister-3950-thread-1-processing-n:127.0.0.1:59354_ x:collection1 s:shard1 c:control_collection r:core_node1) [n:127.0.0.1:59354_ c:control_collection s:shard1 r:core_node1 x:collection1] o.a.s.c.ShardLeaderElectionContext I am the new leader: http://127.0.0.1:59354/collection1/ shard1
   [junit4]   2> 966237 INFO  (OverseerStateUpdate-96499196148383748-127.0.0.1:59354_-n_0000000000) [n:127.0.0.1:59354_    ] o.a.s.c.Overseer processMessage: queueSize: 1, message = {
   [junit4]   2>   "operation":"leader",
   [junit4]   2>   "shard":"shard1",
   [junit4]   2>   "collection":"control_collection",
   [junit4]   2>   "base_url":"http://127.0.0.1:59354",
   [junit4]   2>   "core":"collection1",
   [junit4]   2>   "state":"active"} current state version: 1
   [junit4]   2> 966341 INFO  (zkCallback-1619-thread-1-processing-n:127.0.0.1:59354_) [n:127.0.0.1:59354_    ] o.a.s.c.c.ZkStateReader A cluster state change: [WatchedEvent state:SyncConnected type:NodeDataChanged path:/clusterstate.json], has occurred - updating... (live nodes size: [1])
   [junit4]   2> 966388 INFO  (coreZkRegister-3950-thread-1-processing-n:127.0.0.1:59354_ x:collection1 s:shard1 c:control_collection r:core_node1) [n:127.0.0.1:59354_ c:control_collection s:shard1 r:core_node1 x:collection1] o.a.s.c.ZkController We are http://127.0.0.1:59354/collection1/ and leader is http://127.0.0.1:59354/collection1/
   [junit4]   2> 966388 INFO  (coreZkRegister-3950-thread-1-processing-n:127.0.0.1:59354_ x:collection1 s:shard1 c:control_collection r:core_node1) [n:127.0.0.1:59354_ c:control_collection s:shard1 r:core_node1 x:collection1] o.a.s.c.ZkController No LogReplay needed for core=collection1 baseURL=http://127.0.0.1:59354
   [junit4]   2> 966388 INFO  (coreZkRegister-3950-thread-1-processing-n:127.0.0.1:59354_ x:collection1 s:shard1 c:control_collection r:core_node1) [n:127.0.0.1:59354_ c:control_collection s:shard1 r:core_node1 x:collection1] o.a.s.c.ZkController I am the leader, no recovery necessary
   [junit4]   2> 966388 INFO  (coreZkRegister-3950-thread-1-processing-n:127.0.0.1:59354_ x:collection1 s:shard1 c:control_collection r:core_node1) [n:127.0.0.1:59354_ c:control_collection s:shard1 r:core_node1 x:collection1] o.a.s.c.ZkController publishing state=active
   [junit4]   2> 966388 INFO  (coreZkRegister-3950-thread-1-processing-n:127.0.0.1:59354_ x:collection1 s:shard1 c:control_collection r:core_node1) [n:127.0.0.1:59354_ c:control_collection s:shard1 r:core_node1 x:collection1] o.a.s.c.ZkController numShards not found on descriptor - reading it from system property
   [junit4]   2> 966389 INFO  (coreZkRegister-3950-thread-1-processing-n:127.0.0.1:59354_ x:collection1 s:shard1 c:control_collection r:core_node1) [n:127.0.0.1:59354_ c:control_collection s:shard1 r:core_node1 x:collection1] o.a.s.c.c.ZkStateReader Checking legacy cluster state for collection control_collection
   [junit4]   2> 966391 INFO  (OverseerStateUpdate-96499196148383748-127.0.0.1:59354_-n_0000000000) [n:127.0.0.1:59354_    ] o.a.s.c.Overseer processMessage: queueSize: 1, message = {
   [junit4]   2>   "core":"collection1",
   [junit4]   2>   "core_node_name":"core_node1",
   [junit4]   2>   "roles":null,
   [junit4]   2>   "base_url":"http://127.0.0.1:59354",
   [junit4]   2>   "node_name":"127.0.0.1:59354_",
   [junit4]   2>   "numShards":"1",
   [junit4]   2>   "state":"active",
   [junit4]   2>   "shard":"shard1",
   [junit4]   2>   "collection":"control_collection",
   [junit4]   2>   "operation":"state"} current state version: 2
   [junit4]   2> 966391 INFO  (OverseerStateUpdate-96499196148383748-127.0.0.1:59354_-n_0000000000) [n:127.0.0.1:59354_    ] o.a.s.c.o.ReplicaMutator Update state numShards=1 message={
   [junit4]   2>   "core":"collection1",
   [junit4]   2>   "core_node_name":"core_node1",
   [junit4]   2>   "roles":null,
   [junit4]   2>   "base_url":"http://127.0.0.1:59354",
   [junit4]   2>   "node_name":"127.0.0.1:59354_",
   [junit4]   2>   "numShards":"1",
   [junit4]   2>   "state":"active",
   [junit4]   2>   "shard":"shard1",
   [junit4]   2>   "collection":"control_collection",
   [junit4]   2>   "operation":"state"}
   [junit4]   2> 966440 INFO  (TEST-ForceLeaderTest.testLastPublishedStateIsActive-seed#[534B6471BC1CA2F1]) [    ] o.a.s.c.c.SolrZkClient Using default ZkCredentialsProvider
   [junit4]   2> 966441 INFO  (TEST-ForceLeaderTest.testLastPublishedStateIsActive-seed#[534B6471BC1CA2F1]) [    ] o.a.s.c.c.ConnectionManager Waiting for client to connect to ZooKeeper
   [junit4]   2> 966443 INFO  (zkCallback-1623-thread-1) [    ] o.a.s.c.c.ConnectionManager Watcher org.apache.solr.common.cloud.ConnectionManager@9c10f09 name:ZooKeeperConnection Watcher:127.0.0.1:59342/solr got event WatchedEvent state:SyncConnected type:None path:null path:null type:None
   [junit4]   2> 966444 INFO  (TEST-ForceLeaderTest.testLastPublishedStateIsActive-seed#[534B6471BC1CA2F1]) [    ] o.a.s.c.c.ConnectionManager Client is connected to ZooKeeper
   [junit4]   2> 966444 INFO  (TEST-ForceLeaderTest.testLastPublishedStateIsActive-seed#[534B6471BC1CA2F1]) [    ] o.a.s.c.c.SolrZkClient Using default ZkACLProvider
   [junit4]   2> 966444 INFO  (TEST-ForceLeaderTest.testLastPublishedStateIsActive-seed#[534B6471BC1CA2F1]) [    ] o.a.s.c.c.ZkStateReader Updating cluster state from ZooKeeper... 
   [junit4]   2> 966444 INFO  (TEST-ForceLeaderTest.testLastPublishedStateIsActive-seed#[534B6471BC1CA2F1]) [    ] o.a.s.c.c.ZkStateReader Loaded empty cluster properties
   [junit4]   2> 966445 INFO  (TEST-ForceLeaderTest.testLastPublishedStateIsActive-seed#[534B6471BC1CA2F1]) [    ] o.a.s.c.c.ZkStateReader Updated live nodes from ZooKeeper... (0) -> (1)
   [junit4]   2> 966447 INFO  (TEST-ForceLeaderTest.testLastPublishedStateIsActive-seed#[534B6471BC1CA2F1]) [    ] o.a.s.c.ChaosMonkey monkey: init - expire sessions:false cause connection loss:false
   [junit4]   2> 966447 INFO  (TEST-ForceLeaderTest.testLastPublishedStateIsActive-seed#[534B6471BC1CA2F1]) [    ] o.a.s.c.AbstractFullDistribZkTestBase Creating collection1 with stateFormat=2
   [junit4]   2> 966447 INFO  (TEST-ForceLeaderTest.testLastPublishedStateIsActive-seed#[534B6471BC1CA2F1]) [    ] o.a.s.c.c.SolrZkClient Using default ZkCredentialsProvider
   [junit4]   2> 966449 INFO  (TEST-ForceLeaderTest.testLastPublishedStateIsActive-seed#[534B6471BC1CA2F1]) [    ] o.a.s.c.c.ConnectionManager Waiting for client to connect to ZooKeeper
   [junit4]   2> 966450 INFO  (zkCallback-1624-thread-1) [    ] o.a.s.c.c.ConnectionManager Watcher org.apache.solr.common.cloud.ConnectionManager@365c2d0d name:ZooKeeperConnection Watcher:127.0.0.1:59342/solr got event WatchedEvent state:SyncConnected type:None path:null path:null type:None
   [junit4]   2> 966450 INFO  (TEST-ForceLeaderTest.testLastPublishedStateIsActive-seed#[534B6471BC1CA2F1]) [    ] o.a.s.c.c.ConnectionManager Client is connected to ZooKeeper
   [junit4]   2> 966451 INFO  (TEST-ForceLeaderTest.testLastPublishedStateIsActive-seed#[534B6471BC1CA2F1]) [    ] o.a.s.c.c.SolrZkClient Using default ZkACLProvider
   [junit4]   2> 966452 WARN  (NIOServerCxn.Factory:0.0.0.0/0.0.0.0:0) [    ] o.a.z.s.NIOServerCnxn caught end of stream exception
   [junit4]   2> EndOfStreamException: Unable to read additional data from client sessionid 0x156d581f3890006, likely client has closed socket
   [junit4]   2> 	at org.apache.zookeeper.server.NIOServerCnxn.doIO(NIOServerCnxn.java:228)
   [junit4]   2> 	at org.apache.zookeeper.server.NIOServerCnxnFactory.run(NIOServerCnxnFactory.java:208)
   [junit4]   2> 	at java.lang.Thread.run(Thread.java:745)
   [junit4]   2> 966452 INFO  (OverseerStateUpdate-96499196148383748-127.0.0.1:59354_-n_0000000000) [n:127.0.0.1:59354_    ] o.a.s.c.Overseer processMessage: queueSize: 1, message = {
   [junit4]   2>   "operation":"create",
   [junit4]   2>   "name":"collection1",
   [junit4]   2>   "numShards":"2",
   [junit4]   2>   "stateFormat":"2"} current state version: 2
   [junit4]   2> 966452 INFO  (OverseerStateUpdate-96499196148383748-127.0.0.1:59354_-n_0000000000) [n:127.0.0.1:59354_    ] o.a.s.c.o.ClusterStateMutator building a new cName: collection1
   [junit4]   2> 966455 INFO  (zkCallback-1619-thread-2-processing-n:127.0.0.1:59354_) [n:127.0.0.1:59354_    ] o.a.s.c.c.ZkStateReader A cluster state change: [WatchedEvent state:SyncConnected type:NodeDataChanged path:/clusterstate.json], has occurred - updating... (live nodes size: [1])
   [junit4]   2> 966455 INFO  (zkCallback-1623-thread-1) [    ] o.a.s.c.c.ZkStateReader A cluster state change: [WatchedEvent state:SyncConnected type:NodeDataChanged path:/clusterstate.json], has occurred - updating... (live nodes size: [1])
   [junit4]   2> 966566 INFO  (OverseerStateUpdate-96499196148383748-127.0.0.1:59354_-n_0000000000) [n:127.0.0.1:59354_    ] o.a.s.c.o.ZkStateWriter going to create_collection /collections/collection1/state.json
   [junit4]   2> 966889 INFO  (TEST-ForceLeaderTest.testLastPublishedStateIsActive-seed#[534B6471BC1CA2F1]) [    ] o.a.s.SolrTestCaseJ4 Writing core.properties file to C:\Users\jenkins\workspace\Lucene-Solr-master-Windows\solr\build\solr-core\test\J1\temp\solr.cloud.ForceLeaderTest_534B6471BC1CA2F1-001\shard-1-001\cores\collection1
   [junit4]   2> 966892 INFO  (TEST-ForceLeaderTest.testLastPublishedStateIsActive-seed#[534B6471BC1CA2F1]) [    ] o.a.s.c.AbstractFullDistribZkTestBase create jetty 1 in directory C:\Users\jenkins\workspace\Lucene-Solr-master-Windows\solr\build\solr-core\test\J1\temp\solr.cloud.ForceLeaderTest_534B6471BC1CA2F1-001\shard-1-001
   [junit4]   2> 966893 INFO  (TEST-ForceLeaderTest.testLastPublishedStateIsActive-seed#[534B6471BC1CA2F1]) [    ] o.e.j.s.Server jetty-9.3.8.v20160314
   [junit4]   2> 966893 INFO  (TEST-ForceLeaderTest.testLastPublishedStateIsActive-seed#[534B6471BC1CA2F1]) [    ] o.e.j.s.h.ContextHandler Started o.e.j.s.ServletContextHandler@46d6168c{/,null,AVAILABLE}
   [junit4]   2> 966896 INFO  (TEST-ForceLeaderTest.testLastPublishedStateIsActive-seed#[534B6471BC1CA2F1]) [    ] o.e.j.s.ServerConnector Started ServerConnector@7a79545{HTTP/1.1,[http/1.1]}{127.0.0.1:59376}
   [junit4]   2> 966896 INFO  (TEST-ForceLeaderTest.testLastPublishedStateIsActive-seed#[534B6471BC1CA2F1]) [    ] o.e.j.s.Server Started @971652ms
   [junit4]   2> 966896 INFO  (TEST-ForceLeaderTest.testLastPublishedStateIsActive-seed#[534B6471BC1CA2F1]) [    ] o.a.s.c.s.e.JettySolrRunner Jetty properties: {solr.data.dir=C:\Users\jenkins\workspace\Lucene-Solr-master-Windows\solr\build\solr-core\test\J1\temp\solr.cloud.ForceLeaderTest_534B6471BC1CA2F1-001\tempDir-001/jetty1, solrconfig=solrconfig.xml, hostContext=/, hostPort=59375, coreRootDirectory=C:\Users\jenkins\workspace\Lucene-Solr-master-Windows\solr\build\solr-core\test\J1\temp\solr.cloud.ForceLeaderTest_534B6471BC1CA2F1-001\shard-1-001\cores}
   [junit4]   2> 966896 INFO  (TEST-ForceLeaderTest.testLastPublishedStateIsActive-seed#[534B6471BC1CA2F1]) [    ] o.a.s.s.SolrDispatchFilter SolrDispatchFilter.init(): sun.misc.Launcher$AppClassLoader@73d16e93
   [junit4]   2> 966896 INFO  (TEST-ForceLeaderTest.testLastPublishedStateIsActive-seed#[534B6471BC1CA2F1]) [    ] o.a.s.c.SolrResourceLoader new SolrResourceLoader for directory: 'C:\Users\jenkins\workspace\Lucene-Solr-master-Windows\solr\build\solr-core\test\J1\temp\solr.cloud.ForceLeaderTest_534B6471BC1CA2F1-001\shard-1-001'
   [junit4]   2> 966896 INFO  (TEST-ForceLeaderTest.testLastPublishedStateIsActive-seed#[534B6471BC1CA2F1]) [    ] o.a.s.c.SolrResourceLoader JNDI not configured for solr (NoInitialContextEx)
   [junit4]   2> 966896 INFO  (TEST-ForceLeaderTest.testLastPublishedStateIsActive-seed#[534B6471BC1CA2F1]) [    ] o.a.s.c.SolrResourceLoader solr home defaulted to 'solr/' (could not find system property or JNDI)
   [junit4]   2> 966897 INFO  (TEST-ForceLeaderTest.testLastPublishedStateIsActive-seed#[534B6471BC1CA2F1]) [    ] o.a.s.c.c.SolrZkClient Using default ZkCredentialsProvider
   [junit4]   2> 966897 INFO  (TEST-ForceLeaderTest.testLastPublishedStateIsActive-seed#[534B6471BC1CA2F1]) [    ] o.a.s.c.c.ConnectionManager Waiting for client to connect to ZooKeeper
   [junit4]   2> 966898 INFO  (zkCallback-1625-thread-1) [    ] o.a.s.c.c.ConnectionManager Watcher org.apache.solr.common.cloud.ConnectionManager@48048430 name:ZooKeeperConnection Watcher:127.0.0.1:59342/solr got event WatchedEvent state:SyncConnected type:None path:null path:null type:None
   [junit4]   2> 966898 INFO  (TEST-ForceLeaderTest.testLastPublishedStateIsActive-seed#[534B6471BC1CA2F1]) [    ] o.a.s.c.c.ConnectionManager Client is connected to ZooKeeper
   [junit4]   2> 966898 INFO  (TEST-ForceLeaderTest.testLastPublishedStateIsActive-seed#[534B6471BC1CA2F1]) [    ] o.a.s.c.c.SolrZkClient Using default ZkACLProvider
   [junit4]   2> 966899 WARN  (NIOServerCxn.Factory:0.0.0.0/0.0.0.0:0) [    ] o.a.z.s.NIOServerCnxn caught end of stream exception
   [junit4]   2> EndOfStreamException: Unable to read additional data from client sessionid 0x156d581f3890007, likely client has closed socket
   [junit4]   2> 	at org.apache.zookeeper.server.NIOServerCnxn.doIO(NIOServerCnxn.java:228)
   [junit4]   2> 	at org.apache.zookeeper.server.NIOServerCnxnFactory.run(NIOServerCnxnFactory.java:208)
   [junit4]   2> 	at java.lang.Thread.run(Thread.java:745)
   [junit4]   2> 966899 INFO  (TEST-ForceLeaderTest.testLastPublishedStateIsActive-seed#[534B6471BC1CA2F1]) [    ] o.a.s.s.SolrDispatchFilter Loading solr.xml from SolrHome (not found in ZooKeeper)
   [junit4]   2> 966899 INFO  (TEST-ForceLeaderTest.testLastPublishedStateIsActive-seed#[534B6471BC1CA2F1]) [    ] o.a.s.c.SolrXmlConfig Loading container configuration from C:\Users\jenkins\workspace\Lucene-Solr-master-Windows\solr\build\solr-core\test\J1\temp\solr.cloud.ForceLeaderTest_534B6471BC1CA2F1-001\shard-1-001\solr.xml
   [junit4]   2> 966909 INFO  (TEST-ForceLeaderTest.testLastPublishedStateIsActive-seed#[534B6471BC1CA2F1]) [    ] o.a.s.c.CorePropertiesLocator Config-defined core root directory: C:\Users\jenkins\workspace\Lucene-Solr-master-Windows\solr\build\solr-core\test\J1\temp\solr.cloud.ForceLeaderTest_534B6471BC1CA2F1-001\shard-1-001\cores
   [junit4]   2> 966909 INFO  (TEST-ForceLeaderTest.testLastPublishedStateIsActive-seed#[534B6471BC1CA2F1]) [    ] o.a.s.c.CoreContainer New CoreContainer 1684921020
   [junit4]   2> 966909 INFO  (TEST-ForceLeaderTest.testLastPublishedStateIsActive-seed#[534B6471BC1CA2F1]) [    ] o.a.s.c.CoreContainer Loading cores into CoreContainer [instanceDir=C:\Users\jenkins\workspace\Lucene-Solr-master-Windows\solr\build\solr-core\test\J1\temp\solr.cloud.ForceLeaderTest_534B6471BC1CA2F1-001\shard-1-001]
   [junit4]   2> 966909 WARN  (TEST-ForceLeaderTest.testLastPublishedStateIsActive-seed#[534B6471BC1CA2F1]) [    ] o.a.s.c.CoreContainer Couldn't add files from C:\Users\jenkins\workspace\Lucene-Solr-master-Windows\solr\build\solr-core\test\J1\temp\solr.cloud.ForceLeaderTest_534B6471BC1CA2F1-001\shard-1-001\lib to classpath: C:\Users\jenkins\workspace\Lucene-Solr-master-Windows\solr\build\solr-core\test\J1\temp\solr.cloud.ForceLeaderTest_534B6471BC1CA2F1-001\shard-1-001\lib
   [junit4]   2> 966909 INFO  (TEST-ForceLeaderTest.testLastPublishedStateIsActive-seed#[534B6471BC1CA2F1]) [    ] o.a.s.h.c.HttpShardHandlerFactory created with socketTimeout : 90000,urlScheme : ,connTimeout : 15000,maxConnectionsPerHost : 20,maxConnections : 10000,corePoolSize : 0,maximumPoolSize : 2147483647,maxThreadIdleTime : 5,sizeOfQueue : -1,fairnessPolicy : false,
   [junit4]   2> 966913 INFO  (TEST-ForceLeaderTest.testLastPublishedStateIsActive-seed#[534B6471BC1CA2F1]) [    ] o.a.s.u.UpdateShardHandler Created UpdateShardHandler HTTP client with params: socketTimeout=340000&connTimeout=45000&maxConnections=100000&maxConnectionsPerHost=100000
   [junit4]   2> 966913 INFO  (TEST-ForceLeaderTest.testLastPublishedStateIsActive-seed#[534B6471BC1CA2F1]) [    ] o.a.s.l.LogWatcher SLF4J impl is org.slf4j.impl.Log4jLoggerFactory
   [junit4]   2> 966913 INFO  (TEST-ForceLeaderTest.testLastPublishedStateIsActive-seed#[534B6471BC1CA2F1]) [    ] o.a.s.l.LogWatcher Registering Log Listener [Log4j (org.slf4j.impl.Log4jLoggerFactory)]
   [junit4]   2> 966913 INFO  (TEST-ForceLeaderTest.testLastPublishedStateIsActive-seed#[534B6471BC1CA2F1]) [    ] o.a.s.c.ZkContainer Zookeeper client=127.0.0.1:59342/solr
   [junit4]   2> 966913 INFO  (TEST-ForceLeaderTest.testLastPublishedStateIsActive-seed#[534B6471BC1CA2F1]) [    ] o.a.s.c.ZkController zkHost includes chroot
   [junit4]   2> 966913 INFO  (TEST-ForceLeaderTest.testLastPublishedStateIsActive-seed#[534B6471BC1CA2F1]) [    ] o.a.s.c.c.SolrZkClient Using default ZkCredentialsProvider
   [junit4]   2> 966914 INFO  (TEST-ForceLeaderTest.testLastPublishedStateIsActive-seed#[534B6471BC1CA2F1]) [    ] o.a.s.c.c.ConnectionManager Waiting for client to connect to ZooKeeper
   [junit4]   2> 966915 INFO  (zkCallback-1628-thread-1) [    ] o.a.s.c.c.ConnectionManager Watcher org.apache.solr.common.cloud.ConnectionManager@4fe1d641 name:ZooKeeperConnection Watcher:127.0.0.1:59342 got event WatchedEvent state:SyncConnected type:None path:null path:null type:None
   [junit4]

[...truncated too long message...]

l.TestRuleAssertionsRequired$1.evaluate(TestRuleAssertionsRequired.java:53)
   [junit4]   2> 	at org.apache.lucene.util.TestRuleMarkFailure$1.evaluate(TestRuleMarkFailure.java:47)
   [junit4]   2> 	at org.apache.lucene.util.TestRuleIgnoreAfterMaxFailures$1.evaluate(TestRuleIgnoreAfterMaxFailures.java:64)
   [junit4]   2> 	at org.apache.lucene.util.TestRuleIgnoreTestSuites$1.evaluate(TestRuleIgnoreTestSuites.java:54)
   [junit4]   2> 	at com.carrotsearch.randomizedtesting.rules.StatementAdapter.evaluate(StatementAdapter.java:36)
   [junit4]   2> 	at com.carrotsearch.randomizedtesting.ThreadLeakControl$StatementRunner.run(ThreadLeakControl.java:367)
   [junit4]   2> 	at java.lang.Thread.run(Thread.java:745)
   [junit4]   2> 2798706 INFO  (SUITE-TestSolrCloudWithSecureImpersonation-seed#[534B6471BC1CA2F1]-worker) [    ] o.a.s.SolrTestCaseJ4 ###deleteCore
   [junit4]   2> NOTE: test params are: codec=Asserting(Lucene62): {}, docValues:{}, maxPointsInLeafNode=78, maxMBSortInHeap=7.590916452285612, sim=ClassicSimilarity, locale=sk, timezone=Asia/Qyzylorda
   [junit4]   2> NOTE: Windows 10 10.0 amd64/Oracle Corporation 1.8.0_102 (64-bit)/cpus=3,threads=1,free=182695256,total=518979584
   [junit4]   2> NOTE: All tests run in this JVM: [TestDynamicFieldResource, DistributedSpellCheckComponentTest, CleanupOldIndexTest, MBeansHandlerTest, TestBulkSchemaConcurrent, DirectUpdateHandlerTest, ReplaceNodeTest, OutOfBoxZkACLAndCredentialsProvidersTest, TestLazyCores, DOMUtilTest, RegexBoostProcessorTest, DeleteInactiveReplicaTest, AssignTest, TestSweetSpotSimilarityFactory, TestGroupingSearch, TestCoreContainer, TestChildDocTransformer, TestRemoteStreaming, TestMiniSolrCloudClusterBase, AtomicUpdatesTest, TestStandardQParsers, TestLeaderInitiatedRecoveryThread, TestCursorMarkWithoutUniqueKey, TestUninvertingReader, TlogReplayBufferedWhileIndexingTest, CoreMergeIndexesAdminHandlerTest, TestPseudoReturnFields, SyncSliceTest, CollectionReloadTest, TestHashQParserPlugin, ScriptEngineTest, TestDFISimilarityFactory, TestClusterStateMutator, HdfsSyncSliceTest, TestLRUStatsCache, SolrCLIZkUtilsTest, TestFastLRUCache, BasicDistributedZkTest, TestFieldTypeResource, TestExtendedDismaxParser, TestExceedMaxTermLength, TestReplicationHandlerBackup, XmlUpdateRequestHandlerTest, TestHashPartitioner, DisMaxRequestHandlerTest, TolerantUpdateProcessorTest, TestMissingGroups, TestOverriddenPrefixQueryForCustomFieldType, IndexBasedSpellCheckerTest, TestSolrConfigHandler, TestCryptoKeys, TestRawResponseWriter, TestStressReorder, VersionInfoTest, TestReplicationHandler, PolyFieldTest, SolrCoreTest, TestRandomFlRTGCloud, ZkControllerTest, HdfsNNFailoverTest, TestIBSimilarityFactory, SimplePostToolTest, DocValuesMultiTest, TestRequestForwarding, TestConfigReload, TestSolrDeletionPolicy1, TestIntervalFaceting, DistribCursorPagingTest, PKIAuthenticationIntegrationTest, CoreAdminCreateDiscoverTest, TestGeoJSONResponseWriter, SOLR749Test, TestSSLRandomization, TestSlowCompositeReaderWrapper, AnalyticsMergeStrategyTest, TestFaceting, StatelessScriptUpdateProcessorFactoryTest, TestSubQueryTransformerCrossCore, CollectionTooManyReplicasTest, TestPostingsSolrHighlighter, TimeZoneUtilsTest, TestTrieFacet, ClusterStateUpdateTest, TestMergePolicyConfig, RecoveryZkTest, JavabinLoaderTest, UpdateParamsTest, CollectionsAPISolrJTest, DeleteNodeTest, PreAnalyzedFieldTest, TestSimpleQParserPlugin, ExternalFileFieldSortTest, BlockJoinFacetSimpleTest, TestExactSharedStatsCache, TestBackupRepositoryFactory, TestRandomDVFaceting, TestJsonRequest, HdfsDirectoryFactoryTest, TestManagedResource, TestLuceneMatchVersion, DistributedQueryComponentOptimizationTest, RequestLoggingTest, ExplicitHLLTest, DistanceUnitsTest, AnalysisErrorHandlingTest, LeaderInitiatedRecoveryOnCommitTest, TestElisionMultitermQuery, CloneFieldUpdateProcessorFactoryTest, CircularListTest, CachingDirectoryFactoryTest, SpatialFilterTest, TestDocumentBuilder, IgnoreCommitOptimizeUpdateProcessorFactoryTest, DistributedVersionInfoTest, AlternateDirectoryTest, TestRestManager, TestTolerantSearch, TestNumericTerms32, TestSolr4Spatial2, SystemInfoHandlerTest, TestManagedSynonymFilterFactory, TestArbitraryIndexDir, HdfsLockFactoryTest, TestImplicitCoreProperties, HdfsBasicDistributedZkTest, HardAutoCommitTest, SSLMigrationTest, OverseerRolesTest, TestRebalanceLeaders, OverseerTest, TestReloadAndDeleteDocs, ConfigSetsAPITest, SolrTestCaseJ4Test, TestSolrQueryParserDefaultOperatorResource, BadComponentTest, DocumentBuilderTest, TestAddFieldRealTimeGet, MoreLikeThisHandlerTest, TestUpdate, DocValuesTest, TestCloudPivotFacet, TestTestInjection, PrimitiveFieldTypeTest, HdfsChaosMonkeySafeLeaderTest, TestCustomSort, CursorPagingTest, TestQuerySenderNoQuery, CdcrVersionReplicationTest, BlockJoinFacetDistribTest, SuggestComponentContextFilterQueryTest, SolrXmlInZkTest, DistributedFacetPivotWhiteBoxTest, TestFieldCacheSanityChecker, SharedFSAutoReplicaFailoverUtilsTest, HighlighterTest, DistributedQueryElevationComponentTest, AnalysisAfterCoreReloadTest, SuggesterFSTTest, SuggesterTest, SuggesterWFSTTest, WordBreakSolrSpellCheckerTest, TestAtomicUpdateErrorCases, QueryEqualityTest, DistanceFunctionTest, XsltUpdateRequestHandlerTest, TestSurroundQueryParser, StandardRequestHandlerTest, TestReversedWildcardFilterFactory, TestOmitPositions, TermsComponentTest, RequiredFieldsTest, FastVectorHighlighterTest, IndexSchemaTest, ReturnFieldsTest, TestCSVResponseWriter, TestAnalyzedSuggestions, TestPartialUpdateDeduplication, PingRequestHandlerTest, TestBinaryResponseWriter, TestLFUCache, DateMathParserTest, PrimUtilsTest, TestSuggestSpellingConverter, DateFieldTest, SpellingQueryConverterTest, ClusterStateTest, TestSolrJ, TestLRUCache, ZkNodePropsTest, SliceStateTest, UUIDFieldTest, TestDistributedMissingSort, TestHighlightDedupGrouping, TestSimpleTrackingShardHandler, TestEmbeddedSolrServerConstructors, TestJettySolrRunner, ActionThrottleTest, AsyncCallRequestStatusResponseTest, AsyncMigrateRouteKeyTest, CdcrReplicationHandlerTest, CdcrRequestHandlerTest, CreateCollectionCleanupTest, CustomCollectionTest, DistribJoinFromCollectionTest, DistributedQueueTest, LeaderFailoverAfterPartitionTest, MigrateRouteKeyTest, MultiThreadedOCPTest, OverseerTaskQueueTest, RecoveryAfterSoftCommitTest, RestartWhileUpdatingTest, RollingRestartTest, ShardSplitTest, TestSizeLimitedDistributedMap, TestSolrCloudWithSecureImpersonation]
   [junit4]   2> NOTE: reproduce with: ant test  -Dtestcase=TestSolrCloudWithSecureImpersonation -Dtests.seed=534B6471BC1CA2F1 -Dtests.slow=true -Dtests.locale=sk -Dtests.timezone=Asia/Qyzylorda -Dtests.asserts=true -Dtests.file.encoding=US-ASCII
   [junit4] ERROR   0.00s J0 | TestSolrCloudWithSecureImpersonation (suite) <<<
   [junit4]    > Throwable #1: com.google.common.util.concurrent.UncheckedExecutionException: java.lang.NullPointerException
   [junit4]    > 	at __randomizedtesting.SeedInfo.seed([534B6471BC1CA2F1]:0)
   [junit4]    > 	at com.google.common.cache.LocalCache$Segment.get(LocalCache.java:2263)
   [junit4]    > 	at com.google.common.cache.LocalCache.get(LocalCache.java:4000)
   [junit4]    > 	at com.google.common.cache.LocalCache.getOrLoad(LocalCache.java:4004)
   [junit4]    > 	at com.google.common.cache.LocalCache$LocalLoadingCache.get(LocalCache.java:4874)
   [junit4]    > 	at org.apache.hadoop.security.Groups.getGroups(Groups.java:182)
   [junit4]    > 	at org.apache.solr.cloud.TestSolrCloudWithSecureImpersonation.getUsersFirstGroup(TestSolrCloudWithSecureImpersonation.java:64)
   [junit4]    > 	at org.apache.solr.cloud.TestSolrCloudWithSecureImpersonation.getImpersonatorSettings(TestSolrCloudWithSecureImpersonation.java:86)
   [junit4]    > 	at org.apache.solr.cloud.TestSolrCloudWithSecureImpersonation.startup(TestSolrCloudWithSecureImpersonation.java:99)
   [junit4]    > 	at java.lang.Thread.run(Thread.java:745)
   [junit4]    > Caused by: java.lang.NullPointerException
   [junit4]    > 	at java.lang.ProcessBuilder.start(ProcessBuilder.java:1012)
   [junit4]    > 	at org.apache.hadoop.util.Shell.runCommand(Shell.java:483)
   [junit4]    > 	at org.apache.hadoop.util.Shell.run(Shell.java:456)
   [junit4]    > 	at org.apache.hadoop.util.Shell$ShellCommandExecutor.execute(Shell.java:722)
   [junit4]    > 	at org.apache.hadoop.util.Shell.execCommand(Shell.java:815)
   [junit4]    > 	at org.apache.hadoop.util.Shell.execCommand(Shell.java:798)
   [junit4]    > 	at org.apache.hadoop.security.ShellBasedUnixGroupsMapping.getUnixGroups(ShellBasedUnixGroupsMapping.java:84)
   [junit4]    > 	at org.apache.hadoop.security.ShellBasedUnixGroupsMapping.getGroups(ShellBasedUnixGroupsMapping.java:52)
   [junit4]    > 	at org.apache.hadoop.security.JniBasedUnixGroupsMappingWithFallback.getGroups(JniBasedUnixGroupsMappingWithFallback.java:51)
   [junit4]    > 	at org.apache.hadoop.security.Groups$GroupCacheLoader.fetchGroupList(Groups.java:239)
   [junit4]    > 	at org.apache.hadoop.security.Groups$GroupCacheLoader.load(Groups.java:220)
   [junit4]    > 	at org.apache.hadoop.security.Groups$GroupCacheLoader.load(Groups.java:208)
   [junit4]    > 	at com.google.common.cache.LocalCache$LoadingValueReference.loadFuture(LocalCache.java:3599)
   [junit4]    > 	at com.google.common.cache.LocalCache$Segment.loadSync(LocalCache.java:2379)
   [junit4]    > 	at com.google.common.cache.LocalCache$Segment.lockedGetOrLoad(LocalCache.java:2342)
   [junit4]    > 	at com.google.common.cache.LocalCache$Segment.get(LocalCache.java:2257)
   [junit4]    > 	... 31 moreThrowable #2: java.lang.NullPointerException
   [junit4]    > 	at __randomizedtesting.SeedInfo.seed([534B6471BC1CA2F1]:0)
   [junit4]    > 	at org.apache.solr.cloud.TestSolrCloudWithSecureImpersonation.shutdown(TestSolrCloudWithSecureImpersonation.java:154)
   [junit4]    > 	at java.lang.Thread.run(Thread.java:745)
   [junit4] Completed [492/632 (2!)] on J0 in 0.79s, 0 tests, 2 errors <<< FAILURES!

[...truncated 60577 lines...]


Mime
View raw message