lucene-dev mailing list archives

Site index · List index
Message view « Date » · « Thread »
Top « Date » · « Thread »
From Apache Jenkins Server <jenk...@builds.apache.org>
Subject [JENKINS] Lucene-Solr-NightlyTests-6.x - Build # 140 - Still Failing
Date Mon, 08 Aug 2016 12:53:35 GMT
Build: https://builds.apache.org/job/Lucene-Solr-NightlyTests-6.x/140/

2 tests failed.
FAILED:  org.apache.solr.cloud.CdcrReplicationDistributedZkTest.testReplicationAfterRestart

Error Message:
Timeout waiting for CDCR replication to complete @source_collection:shard1

Stack Trace:
java.lang.RuntimeException: Timeout waiting for CDCR replication to complete @source_collection:shard1
	at __randomizedtesting.SeedInfo.seed([C519C4A7A908694E:990423266728DD78]:0)
	at org.apache.solr.cloud.BaseCdcrDistributedZkTest.waitForReplicationToComplete(BaseCdcrDistributedZkTest.java:794)
	at org.apache.solr.cloud.CdcrReplicationDistributedZkTest.testReplicationAfterRestart(CdcrReplicationDistributedZkTest.java:264)
	at sun.reflect.NativeMethodAccessorImpl.invoke0(Native Method)
	at sun.reflect.NativeMethodAccessorImpl.invoke(NativeMethodAccessorImpl.java:62)
	at sun.reflect.DelegatingMethodAccessorImpl.invoke(DelegatingMethodAccessorImpl.java:43)
	at java.lang.reflect.Method.invoke(Method.java:498)
	at com.carrotsearch.randomizedtesting.RandomizedRunner.invoke(RandomizedRunner.java:1764)
	at com.carrotsearch.randomizedtesting.RandomizedRunner$8.evaluate(RandomizedRunner.java:871)
	at com.carrotsearch.randomizedtesting.RandomizedRunner$9.evaluate(RandomizedRunner.java:907)
	at com.carrotsearch.randomizedtesting.RandomizedRunner$10.evaluate(RandomizedRunner.java:921)
	at org.apache.solr.BaseDistributedSearchTestCase$ShardsRepeatRule$ShardsFixedStatement.callStatement(BaseDistributedSearchTestCase.java:992)
	at org.apache.solr.BaseDistributedSearchTestCase$ShardsRepeatRule$ShardsStatement.evaluate(BaseDistributedSearchTestCase.java:967)
	at com.carrotsearch.randomizedtesting.rules.SystemPropertiesRestoreRule$1.evaluate(SystemPropertiesRestoreRule.java:57)
	at org.apache.lucene.util.TestRuleSetupTeardownChained$1.evaluate(TestRuleSetupTeardownChained.java:49)
	at org.apache.lucene.util.AbstractBeforeAfterRule$1.evaluate(AbstractBeforeAfterRule.java:45)
	at org.apache.lucene.util.TestRuleThreadAndTestName$1.evaluate(TestRuleThreadAndTestName.java:48)
	at org.apache.lucene.util.TestRuleIgnoreAfterMaxFailures$1.evaluate(TestRuleIgnoreAfterMaxFailures.java:64)
	at org.apache.lucene.util.TestRuleMarkFailure$1.evaluate(TestRuleMarkFailure.java:47)
	at com.carrotsearch.randomizedtesting.rules.StatementAdapter.evaluate(StatementAdapter.java:36)
	at com.carrotsearch.randomizedtesting.ThreadLeakControl$StatementRunner.run(ThreadLeakControl.java:367)
	at com.carrotsearch.randomizedtesting.ThreadLeakControl.forkTimeoutingTask(ThreadLeakControl.java:809)
	at com.carrotsearch.randomizedtesting.ThreadLeakControl$3.evaluate(ThreadLeakControl.java:460)
	at com.carrotsearch.randomizedtesting.RandomizedRunner.runSingleTest(RandomizedRunner.java:880)
	at com.carrotsearch.randomizedtesting.RandomizedRunner$5.evaluate(RandomizedRunner.java:781)
	at com.carrotsearch.randomizedtesting.RandomizedRunner$6.evaluate(RandomizedRunner.java:816)
	at com.carrotsearch.randomizedtesting.RandomizedRunner$7.evaluate(RandomizedRunner.java:827)
	at com.carrotsearch.randomizedtesting.rules.StatementAdapter.evaluate(StatementAdapter.java:36)
	at com.carrotsearch.randomizedtesting.rules.SystemPropertiesRestoreRule$1.evaluate(SystemPropertiesRestoreRule.java:57)
	at org.apache.lucene.util.AbstractBeforeAfterRule$1.evaluate(AbstractBeforeAfterRule.java:45)
	at com.carrotsearch.randomizedtesting.rules.StatementAdapter.evaluate(StatementAdapter.java:36)
	at org.apache.lucene.util.TestRuleStoreClassName$1.evaluate(TestRuleStoreClassName.java:41)
	at com.carrotsearch.randomizedtesting.rules.NoShadowingOrOverridesOnMethodsRule$1.evaluate(NoShadowingOrOverridesOnMethodsRule.java:40)
	at com.carrotsearch.randomizedtesting.rules.NoShadowingOrOverridesOnMethodsRule$1.evaluate(NoShadowingOrOverridesOnMethodsRule.java:40)
	at com.carrotsearch.randomizedtesting.rules.StatementAdapter.evaluate(StatementAdapter.java:36)
	at com.carrotsearch.randomizedtesting.rules.StatementAdapter.evaluate(StatementAdapter.java:36)
	at com.carrotsearch.randomizedtesting.rules.StatementAdapter.evaluate(StatementAdapter.java:36)
	at org.apache.lucene.util.TestRuleAssertionsRequired$1.evaluate(TestRuleAssertionsRequired.java:53)
	at org.apache.lucene.util.TestRuleMarkFailure$1.evaluate(TestRuleMarkFailure.java:47)
	at org.apache.lucene.util.TestRuleIgnoreAfterMaxFailures$1.evaluate(TestRuleIgnoreAfterMaxFailures.java:64)
	at org.apache.lucene.util.TestRuleIgnoreTestSuites$1.evaluate(TestRuleIgnoreTestSuites.java:54)
	at com.carrotsearch.randomizedtesting.rules.StatementAdapter.evaluate(StatementAdapter.java:36)
	at com.carrotsearch.randomizedtesting.ThreadLeakControl$StatementRunner.run(ThreadLeakControl.java:367)
	at java.lang.Thread.run(Thread.java:745)


FAILED:  org.apache.solr.cloud.CollectionsAPIDistributedZkTest.test

Error Message:
Timeout occured while waiting response from server at: http://127.0.0.1:58224

Stack Trace:
org.apache.solr.client.solrj.SolrServerException: Timeout occured while waiting response from server at: http://127.0.0.1:58224
	at org.apache.solr.client.solrj.impl.HttpSolrClient.executeMethod(HttpSolrClient.java:603)
	at org.apache.solr.client.solrj.impl.HttpSolrClient.request(HttpSolrClient.java:261)
	at org.apache.solr.client.solrj.impl.HttpSolrClient.request(HttpSolrClient.java:250)
	at org.apache.solr.client.solrj.SolrClient.request(SolrClient.java:1219)
	at org.apache.solr.cloud.CollectionsAPIDistributedZkTest.makeRequest(CollectionsAPIDistributedZkTest.java:399)
	at org.apache.solr.cloud.CollectionsAPIDistributedZkTest.testErrorHandling(CollectionsAPIDistributedZkTest.java:457)
	at org.apache.solr.cloud.CollectionsAPIDistributedZkTest.test(CollectionsAPIDistributedZkTest.java:179)
	at sun.reflect.NativeMethodAccessorImpl.invoke0(Native Method)
	at sun.reflect.NativeMethodAccessorImpl.invoke(NativeMethodAccessorImpl.java:62)
	at sun.reflect.DelegatingMethodAccessorImpl.invoke(DelegatingMethodAccessorImpl.java:43)
	at java.lang.reflect.Method.invoke(Method.java:498)
	at com.carrotsearch.randomizedtesting.RandomizedRunner.invoke(RandomizedRunner.java:1764)
	at com.carrotsearch.randomizedtesting.RandomizedRunner$8.evaluate(RandomizedRunner.java:871)
	at com.carrotsearch.randomizedtesting.RandomizedRunner$9.evaluate(RandomizedRunner.java:907)
	at com.carrotsearch.randomizedtesting.RandomizedRunner$10.evaluate(RandomizedRunner.java:921)
	at org.apache.solr.BaseDistributedSearchTestCase$ShardsRepeatRule$ShardsFixedStatement.callStatement(BaseDistributedSearchTestCase.java:992)
	at org.apache.solr.BaseDistributedSearchTestCase$ShardsRepeatRule$ShardsStatement.evaluate(BaseDistributedSearchTestCase.java:967)
	at com.carrotsearch.randomizedtesting.rules.SystemPropertiesRestoreRule$1.evaluate(SystemPropertiesRestoreRule.java:57)
	at org.apache.lucene.util.TestRuleSetupTeardownChained$1.evaluate(TestRuleSetupTeardownChained.java:49)
	at org.apache.lucene.util.AbstractBeforeAfterRule$1.evaluate(AbstractBeforeAfterRule.java:45)
	at org.apache.lucene.util.TestRuleThreadAndTestName$1.evaluate(TestRuleThreadAndTestName.java:48)
	at org.apache.lucene.util.TestRuleIgnoreAfterMaxFailures$1.evaluate(TestRuleIgnoreAfterMaxFailures.java:64)
	at org.apache.lucene.util.TestRuleMarkFailure$1.evaluate(TestRuleMarkFailure.java:47)
	at com.carrotsearch.randomizedtesting.rules.StatementAdapter.evaluate(StatementAdapter.java:36)
	at com.carrotsearch.randomizedtesting.ThreadLeakControl$StatementRunner.run(ThreadLeakControl.java:367)
	at com.carrotsearch.randomizedtesting.ThreadLeakControl.forkTimeoutingTask(ThreadLeakControl.java:809)
	at com.carrotsearch.randomizedtesting.ThreadLeakControl$3.evaluate(ThreadLeakControl.java:460)
	at com.carrotsearch.randomizedtesting.RandomizedRunner.runSingleTest(RandomizedRunner.java:880)
	at com.carrotsearch.randomizedtesting.RandomizedRunner$5.evaluate(RandomizedRunner.java:781)
	at com.carrotsearch.randomizedtesting.RandomizedRunner$6.evaluate(RandomizedRunner.java:816)
	at com.carrotsearch.randomizedtesting.RandomizedRunner$7.evaluate(RandomizedRunner.java:827)
	at com.carrotsearch.randomizedtesting.rules.StatementAdapter.evaluate(StatementAdapter.java:36)
	at com.carrotsearch.randomizedtesting.rules.SystemPropertiesRestoreRule$1.evaluate(SystemPropertiesRestoreRule.java:57)
	at org.apache.lucene.util.AbstractBeforeAfterRule$1.evaluate(AbstractBeforeAfterRule.java:45)
	at com.carrotsearch.randomizedtesting.rules.StatementAdapter.evaluate(StatementAdapter.java:36)
	at org.apache.lucene.util.TestRuleStoreClassName$1.evaluate(TestRuleStoreClassName.java:41)
	at com.carrotsearch.randomizedtesting.rules.NoShadowingOrOverridesOnMethodsRule$1.evaluate(NoShadowingOrOverridesOnMethodsRule.java:40)
	at com.carrotsearch.randomizedtesting.rules.NoShadowingOrOverridesOnMethodsRule$1.evaluate(NoShadowingOrOverridesOnMethodsRule.java:40)
	at com.carrotsearch.randomizedtesting.rules.StatementAdapter.evaluate(StatementAdapter.java:36)
	at com.carrotsearch.randomizedtesting.rules.StatementAdapter.evaluate(StatementAdapter.java:36)
	at com.carrotsearch.randomizedtesting.rules.StatementAdapter.evaluate(StatementAdapter.java:36)
	at org.apache.lucene.util.TestRuleAssertionsRequired$1.evaluate(TestRuleAssertionsRequired.java:53)
	at org.apache.lucene.util.TestRuleMarkFailure$1.evaluate(TestRuleMarkFailure.java:47)
	at org.apache.lucene.util.TestRuleIgnoreAfterMaxFailures$1.evaluate(TestRuleIgnoreAfterMaxFailures.java:64)
	at org.apache.lucene.util.TestRuleIgnoreTestSuites$1.evaluate(TestRuleIgnoreTestSuites.java:54)
	at com.carrotsearch.randomizedtesting.rules.StatementAdapter.evaluate(StatementAdapter.java:36)
	at com.carrotsearch.randomizedtesting.ThreadLeakControl$StatementRunner.run(ThreadLeakControl.java:367)
	at java.lang.Thread.run(Thread.java:745)
Caused by: java.net.SocketTimeoutException: Read timed out
	at java.net.SocketInputStream.socketRead0(Native Method)
	at java.net.SocketInputStream.socketRead(SocketInputStream.java:116)
	at java.net.SocketInputStream.read(SocketInputStream.java:170)
	at java.net.SocketInputStream.read(SocketInputStream.java:141)
	at org.apache.http.impl.io.AbstractSessionInputBuffer.fillBuffer(AbstractSessionInputBuffer.java:160)
	at org.apache.http.impl.io.SocketInputBuffer.fillBuffer(SocketInputBuffer.java:84)
	at org.apache.http.impl.io.AbstractSessionInputBuffer.readLine(AbstractSessionInputBuffer.java:273)
	at org.apache.http.impl.conn.DefaultHttpResponseParser.parseHead(DefaultHttpResponseParser.java:140)
	at org.apache.http.impl.conn.DefaultHttpResponseParser.parseHead(DefaultHttpResponseParser.java:57)
	at org.apache.http.impl.io.AbstractMessageParser.parse(AbstractMessageParser.java:261)
	at org.apache.http.impl.AbstractHttpClientConnection.receiveResponseHeader(AbstractHttpClientConnection.java:283)
	at org.apache.http.impl.conn.DefaultClientConnection.receiveResponseHeader(DefaultClientConnection.java:251)
	at org.apache.http.impl.conn.ManagedClientConnectionImpl.receiveResponseHeader(ManagedClientConnectionImpl.java:197)
	at org.apache.http.protocol.HttpRequestExecutor.doReceiveResponse(HttpRequestExecutor.java:272)
	at org.apache.http.protocol.HttpRequestExecutor.execute(HttpRequestExecutor.java:124)
	at org.apache.http.impl.client.DefaultRequestDirector.tryExecute(DefaultRequestDirector.java:685)
	at org.apache.http.impl.client.DefaultRequestDirector.execute(DefaultRequestDirector.java:487)
	at org.apache.http.impl.client.AbstractHttpClient.doExecute(AbstractHttpClient.java:882)
	at org.apache.http.impl.client.CloseableHttpClient.execute(CloseableHttpClient.java:82)
	at org.apache.http.impl.client.CloseableHttpClient.execute(CloseableHttpClient.java:107)
	at org.apache.http.impl.client.CloseableHttpClient.execute(CloseableHttpClient.java:55)
	at org.apache.solr.client.solrj.impl.HttpSolrClient.executeMethod(HttpSolrClient.java:497)
	... 47 more




Build Log:
[...truncated 11767 lines...]
   [junit4] JVM J2: stdout was not empty, see: /x1/jenkins/jenkins-slave/workspace/Lucene-Solr-NightlyTests-6.x/solr/build/solr-core/test/temp/junit4-J2-20160808_110251_850.sysout
   [junit4] >>> JVM J2 emitted unexpected output (verbatim) ----
   [junit4] java.lang.OutOfMemoryError: GC overhead limit exceeded
   [junit4] Dumping heap to /x1/jenkins/jenkins-slave/workspace/Lucene-Solr-NightlyTests-6.x/heapdumps/java_pid9110.hprof ...
   [junit4] Heap dump file created [735374596 bytes in 9.294 secs]
   [junit4] <<< JVM J2: EOF ----

   [junit4] JVM J2: stderr was not empty, see: /x1/jenkins/jenkins-slave/workspace/Lucene-Solr-NightlyTests-6.x/solr/build/solr-core/test/temp/junit4-J2-20160808_110251_850.syserr
   [junit4] >>> JVM J2 emitted unexpected output (verbatim) ----
   [junit4] WARN: Unhandled exception in event serialization. -> java.lang.OutOfMemoryError: GC overhead limit exceeded
   [junit4] <<< JVM J2: EOF ----

[...truncated 80 lines...]
   [junit4] Suite: org.apache.solr.cloud.CdcrReplicationDistributedZkTest
   [junit4]   2> Creating dataDir: /x1/jenkins/jenkins-slave/workspace/Lucene-Solr-NightlyTests-6.x/solr/build/solr-core/test/J1/temp/solr.cloud.CdcrReplicationDistributedZkTest_C519C4A7A908694E-001/init-core-data-001
   [junit4]   2> 302829 INFO  (SUITE-CdcrReplicationDistributedZkTest-seed#[C519C4A7A908694E]-worker) [    ] o.a.s.SolrTestCaseJ4 Randomized ssl (true) and clientAuth (true) via: @org.apache.solr.util.RandomizeSSL(reason=, ssl=NaN, value=NaN, clientAuth=NaN)
   [junit4]   2> 302830 INFO  (SUITE-CdcrReplicationDistributedZkTest-seed#[C519C4A7A908694E]-worker) [    ] o.a.s.BaseDistributedSearchTestCase Setting hostContext system property: /
   [junit4]   2> 302833 INFO  (TEST-CdcrReplicationDistributedZkTest.testBufferOnNonLeader-seed#[C519C4A7A908694E]) [    ] o.a.s.c.ZkTestServer STARTING ZK TEST SERVER
   [junit4]   2> 302833 INFO  (Thread-789) [    ] o.a.s.c.ZkTestServer client port:0.0.0.0/0.0.0.0:0
   [junit4]   2> 302833 INFO  (Thread-789) [    ] o.a.s.c.ZkTestServer Starting server
   [junit4]   2> 302933 INFO  (TEST-CdcrReplicationDistributedZkTest.testBufferOnNonLeader-seed#[C519C4A7A908694E]) [    ] o.a.s.c.ZkTestServer start zk server on port:41903
   [junit4]   2> 302933 INFO  (TEST-CdcrReplicationDistributedZkTest.testBufferOnNonLeader-seed#[C519C4A7A908694E]) [    ] o.a.s.c.c.SolrZkClient Using default ZkCredentialsProvider
   [junit4]   2> 302934 INFO  (TEST-CdcrReplicationDistributedZkTest.testBufferOnNonLeader-seed#[C519C4A7A908694E]) [    ] o.a.s.c.c.ConnectionManager Waiting for client to connect to ZooKeeper
   [junit4]   2> 302937 INFO  (zkCallback-492-thread-1) [    ] o.a.s.c.c.ConnectionManager Watcher org.apache.solr.common.cloud.ConnectionManager@27e010 name:ZooKeeperConnection Watcher:127.0.0.1:41903 got event WatchedEvent state:SyncConnected type:None path:null path:null type:None
   [junit4]   2> 302937 INFO  (TEST-CdcrReplicationDistributedZkTest.testBufferOnNonLeader-seed#[C519C4A7A908694E]) [    ] o.a.s.c.c.ConnectionManager Client is connected to ZooKeeper
   [junit4]   2> 302937 INFO  (TEST-CdcrReplicationDistributedZkTest.testBufferOnNonLeader-seed#[C519C4A7A908694E]) [    ] o.a.s.c.c.SolrZkClient Using default ZkACLProvider
   [junit4]   2> 302937 INFO  (TEST-CdcrReplicationDistributedZkTest.testBufferOnNonLeader-seed#[C519C4A7A908694E]) [    ] o.a.s.c.c.SolrZkClient makePath: /solr
   [junit4]   2> 302941 INFO  (TEST-CdcrReplicationDistributedZkTest.testBufferOnNonLeader-seed#[C519C4A7A908694E]) [    ] o.a.s.c.c.SolrZkClient Using default ZkCredentialsProvider
   [junit4]   2> 302941 INFO  (TEST-CdcrReplicationDistributedZkTest.testBufferOnNonLeader-seed#[C519C4A7A908694E]) [    ] o.a.s.c.c.ConnectionManager Waiting for client to connect to ZooKeeper
   [junit4]   2> 302944 INFO  (zkCallback-493-thread-1) [    ] o.a.s.c.c.ConnectionManager Watcher org.apache.solr.common.cloud.ConnectionManager@5de3642b name:ZooKeeperConnection Watcher:127.0.0.1:41903/solr got event WatchedEvent state:SyncConnected type:None path:null path:null type:None
   [junit4]   2> 302944 INFO  (TEST-CdcrReplicationDistributedZkTest.testBufferOnNonLeader-seed#[C519C4A7A908694E]) [    ] o.a.s.c.c.ConnectionManager Client is connected to ZooKeeper
   [junit4]   2> 302945 INFO  (TEST-CdcrReplicationDistributedZkTest.testBufferOnNonLeader-seed#[C519C4A7A908694E]) [    ] o.a.s.c.c.SolrZkClient Using default ZkACLProvider
   [junit4]   2> 302945 INFO  (TEST-CdcrReplicationDistributedZkTest.testBufferOnNonLeader-seed#[C519C4A7A908694E]) [    ] o.a.s.c.c.SolrZkClient makePath: /collections/collection1
   [junit4]   2> 302947 INFO  (TEST-CdcrReplicationDistributedZkTest.testBufferOnNonLeader-seed#[C519C4A7A908694E]) [    ] o.a.s.c.c.SolrZkClient makePath: /collections/collection1/shards
   [junit4]   2> 302949 INFO  (TEST-CdcrReplicationDistributedZkTest.testBufferOnNonLeader-seed#[C519C4A7A908694E]) [    ] o.a.s.c.c.SolrZkClient makePath: /collections/control_collection
   [junit4]   2> 302950 INFO  (TEST-CdcrReplicationDistributedZkTest.testBufferOnNonLeader-seed#[C519C4A7A908694E]) [    ] o.a.s.c.c.SolrZkClient makePath: /collections/control_collection/shards
   [junit4]   2> 302952 INFO  (TEST-CdcrReplicationDistributedZkTest.testBufferOnNonLeader-seed#[C519C4A7A908694E]) [    ] o.a.s.c.AbstractZkTestCase put /x1/jenkins/jenkins-slave/workspace/Lucene-Solr-NightlyTests-6.x/solr/core/src/test-files/solr/collection1/conf/solrconfig-cdcr.xml to /configs/conf1/solrconfig.xml
   [junit4]   2> 302952 INFO  (TEST-CdcrReplicationDistributedZkTest.testBufferOnNonLeader-seed#[C519C4A7A908694E]) [    ] o.a.s.c.c.SolrZkClient makePath: /configs/conf1/solrconfig.xml
   [junit4]   2> 302954 INFO  (TEST-CdcrReplicationDistributedZkTest.testBufferOnNonLeader-seed#[C519C4A7A908694E]) [    ] o.a.s.c.AbstractZkTestCase put /x1/jenkins/jenkins-slave/workspace/Lucene-Solr-NightlyTests-6.x/solr/core/src/test-files/solr/collection1/conf/schema15.xml to /configs/conf1/schema.xml
   [junit4]   2> 302954 INFO  (TEST-CdcrReplicationDistributedZkTest.testBufferOnNonLeader-seed#[C519C4A7A908694E]) [    ] o.a.s.c.c.SolrZkClient makePath: /configs/conf1/schema.xml
   [junit4]   2> 302957 INFO  (TEST-CdcrReplicationDistributedZkTest.testBufferOnNonLeader-seed#[C519C4A7A908694E]) [    ] o.a.s.c.AbstractZkTestCase put /x1/jenkins/jenkins-slave/workspace/Lucene-Solr-NightlyTests-6.x/solr/core/src/test-files/solr/collection1/conf/solrconfig.snippet.randomindexconfig.xml to /configs/conf1/solrconfig.snippet.randomindexconfig.xml
   [junit4]   2> 302957 INFO  (TEST-CdcrReplicationDistributedZkTest.testBufferOnNonLeader-seed#[C519C4A7A908694E]) [    ] o.a.s.c.c.SolrZkClient makePath: /configs/conf1/solrconfig.snippet.randomindexconfig.xml
   [junit4]   2> 302958 INFO  (TEST-CdcrReplicationDistributedZkTest.testBufferOnNonLeader-seed#[C519C4A7A908694E]) [    ] o.a.s.c.AbstractZkTestCase put /x1/jenkins/jenkins-slave/workspace/Lucene-Solr-NightlyTests-6.x/solr/core/src/test-files/solr/collection1/conf/stopwords.txt to /configs/conf1/stopwords.txt
   [junit4]   2> 302958 INFO  (TEST-CdcrReplicationDistributedZkTest.testBufferOnNonLeader-seed#[C519C4A7A908694E]) [    ] o.a.s.c.c.SolrZkClient makePath: /configs/conf1/stopwords.txt
   [junit4]   2> 302960 INFO  (TEST-CdcrReplicationDistributedZkTest.testBufferOnNonLeader-seed#[C519C4A7A908694E]) [    ] o.a.s.c.AbstractZkTestCase put /x1/jenkins/jenkins-slave/workspace/Lucene-Solr-NightlyTests-6.x/solr/core/src/test-files/solr/collection1/conf/protwords.txt to /configs/conf1/protwords.txt
   [junit4]   2> 302960 INFO  (TEST-CdcrReplicationDistributedZkTest.testBufferOnNonLeader-seed#[C519C4A7A908694E]) [    ] o.a.s.c.c.SolrZkClient makePath: /configs/conf1/protwords.txt
   [junit4]   2> 302962 INFO  (TEST-CdcrReplicationDistributedZkTest.testBufferOnNonLeader-seed#[C519C4A7A908694E]) [    ] o.a.s.c.AbstractZkTestCase put /x1/jenkins/jenkins-slave/workspace/Lucene-Solr-NightlyTests-6.x/solr/core/src/test-files/solr/collection1/conf/currency.xml to /configs/conf1/currency.xml
   [junit4]   2> 302962 INFO  (TEST-CdcrReplicationDistributedZkTest.testBufferOnNonLeader-seed#[C519C4A7A908694E]) [    ] o.a.s.c.c.SolrZkClient makePath: /configs/conf1/currency.xml
   [junit4]   2> 302963 INFO  (TEST-CdcrReplicationDistributedZkTest.testBufferOnNonLeader-seed#[C519C4A7A908694E]) [    ] o.a.s.c.AbstractZkTestCase put /x1/jenkins/jenkins-slave/workspace/Lucene-Solr-NightlyTests-6.x/solr/core/src/test-files/solr/collection1/conf/enumsConfig.xml to /configs/conf1/enumsConfig.xml
   [junit4]   2> 302963 INFO  (TEST-CdcrReplicationDistributedZkTest.testBufferOnNonLeader-seed#[C519C4A7A908694E]) [    ] o.a.s.c.c.SolrZkClient makePath: /configs/conf1/enumsConfig.xml
   [junit4]   2> 302966 INFO  (TEST-CdcrReplicationDistributedZkTest.testBufferOnNonLeader-seed#[C519C4A7A908694E]) [    ] o.a.s.c.AbstractZkTestCase put /x1/jenkins/jenkins-slave/workspace/Lucene-Solr-NightlyTests-6.x/solr/core/src/test-files/solr/collection1/conf/open-exchange-rates.json to /configs/conf1/open-exchange-rates.json
   [junit4]   2> 302966 INFO  (TEST-CdcrReplicationDistributedZkTest.testBufferOnNonLeader-seed#[C519C4A7A908694E]) [    ] o.a.s.c.c.SolrZkClient makePath: /configs/conf1/open-exchange-rates.json
   [junit4]   2> 302974 INFO  (TEST-CdcrReplicationDistributedZkTest.testBufferOnNonLeader-seed#[C519C4A7A908694E]) [    ] o.a.s.c.AbstractZkTestCase put /x1/jenkins/jenkins-slave/workspace/Lucene-Solr-NightlyTests-6.x/solr/core/src/test-files/solr/collection1/conf/mapping-ISOLatin1Accent.txt to /configs/conf1/mapping-ISOLatin1Accent.txt
   [junit4]   2> 302974 INFO  (TEST-CdcrReplicationDistributedZkTest.testBufferOnNonLeader-seed#[C519C4A7A908694E]) [    ] o.a.s.c.c.SolrZkClient makePath: /configs/conf1/mapping-ISOLatin1Accent.txt
   [junit4]   2> 302977 INFO  (TEST-CdcrReplicationDistributedZkTest.testBufferOnNonLeader-seed#[C519C4A7A908694E]) [    ] o.a.s.c.AbstractZkTestCase put /x1/jenkins/jenkins-slave/workspace/Lucene-Solr-NightlyTests-6.x/solr/core/src/test-files/solr/collection1/conf/old_synonyms.txt to /configs/conf1/old_synonyms.txt
   [junit4]   2> 302977 INFO  (TEST-CdcrReplicationDistributedZkTest.testBufferOnNonLeader-seed#[C519C4A7A908694E]) [    ] o.a.s.c.c.SolrZkClient makePath: /configs/conf1/old_synonyms.txt
   [junit4]   2> 302979 INFO  (TEST-CdcrReplicationDistributedZkTest.testBufferOnNonLeader-seed#[C519C4A7A908694E]) [    ] o.a.s.c.AbstractZkTestCase put /x1/jenkins/jenkins-slave/workspace/Lucene-Solr-NightlyTests-6.x/solr/core/src/test-files/solr/collection1/conf/synonyms.txt to /configs/conf1/synonyms.txt
   [junit4]   2> 302979 INFO  (TEST-CdcrReplicationDistributedZkTest.testBufferOnNonLeader-seed#[C519C4A7A908694E]) [    ] o.a.s.c.c.SolrZkClient makePath: /configs/conf1/synonyms.txt
   [junit4]   2> 302980 INFO  (TEST-CdcrReplicationDistributedZkTest.testBufferOnNonLeader-seed#[C519C4A7A908694E]) [    ] o.a.s.c.c.SolrZkClient Using default ZkCredentialsProvider
   [junit4]   2> 302981 INFO  (TEST-CdcrReplicationDistributedZkTest.testBufferOnNonLeader-seed#[C519C4A7A908694E]) [    ] o.a.s.c.c.ConnectionManager Waiting for client to connect to ZooKeeper
   [junit4]   2> 302982 INFO  (zkCallback-495-thread-1) [    ] o.a.s.c.c.ConnectionManager Watcher org.apache.solr.common.cloud.ConnectionManager@2b0f04f3 name:ZooKeeperConnection Watcher:127.0.0.1:41903/solr got event WatchedEvent state:SyncConnected type:None path:null path:null type:None
   [junit4]   2> 302982 INFO  (TEST-CdcrReplicationDistributedZkTest.testBufferOnNonLeader-seed#[C519C4A7A908694E]) [    ] o.a.s.c.c.ConnectionManager Client is connected to ZooKeeper
   [junit4]   2> 302982 INFO  (TEST-CdcrReplicationDistributedZkTest.testBufferOnNonLeader-seed#[C519C4A7A908694E]) [    ] o.a.s.c.c.SolrZkClient Using default ZkACLProvider
   [junit4]   2> 302984 INFO  (TEST-CdcrReplicationDistributedZkTest.testBufferOnNonLeader-seed#[C519C4A7A908694E]) [    ] o.a.s.SolrTestCaseJ4 ###Starting testBufferOnNonLeader
   [junit4]   2> 303053 INFO  (TEST-CdcrReplicationDistributedZkTest.testBufferOnNonLeader-seed#[C519C4A7A908694E]) [    ] o.a.s.SolrTestCaseJ4 Writing core.properties file to /x1/jenkins/jenkins-slave/workspace/Lucene-Solr-NightlyTests-6.x/solr/build/solr-core/test/J1/temp/solr.cloud.CdcrReplicationDistributedZkTest_C519C4A7A908694E-001/jetty-001/cores/collection1
   [junit4]   2> 303055 INFO  (TEST-CdcrReplicationDistributedZkTest.testBufferOnNonLeader-seed#[C519C4A7A908694E]) [    ] o.e.j.s.Server jetty-9.3.8.v20160314
   [junit4]   2> 303056 INFO  (TEST-CdcrReplicationDistributedZkTest.testBufferOnNonLeader-seed#[C519C4A7A908694E]) [    ] o.e.j.s.h.ContextHandler Started o.e.j.s.ServletContextHandler@62f70b32{/,null,AVAILABLE}
   [junit4]   2> 303064 INFO  (TEST-CdcrReplicationDistributedZkTest.testBufferOnNonLeader-seed#[C519C4A7A908694E]) [    ] o.e.j.s.ServerConnector Started ServerConnector@2a76fbe7{SSL,[ssl, http/1.1]}{127.0.0.1:50701}
   [junit4]   2> 303064 INFO  (TEST-CdcrReplicationDistributedZkTest.testBufferOnNonLeader-seed#[C519C4A7A908694E]) [    ] o.e.j.s.Server Started @305217ms
   [junit4]   2> 303064 INFO  (TEST-CdcrReplicationDistributedZkTest.testBufferOnNonLeader-seed#[C519C4A7A908694E]) [    ] o.a.s.c.s.e.JettySolrRunner Jetty properties: {shards=shard1, hostContext=/, hostPort=50701, coreRootDirectory=/x1/jenkins/jenkins-slave/workspace/Lucene-Solr-NightlyTests-6.x/solr/build/solr-core/test/J1/temp/solr.cloud.CdcrReplicationDistributedZkTest_C519C4A7A908694E-001/jetty-001/cores}
   [junit4]   2> 303064 INFO  (TEST-CdcrReplicationDistributedZkTest.testBufferOnNonLeader-seed#[C519C4A7A908694E]) [    ] o.a.s.s.SolrDispatchFilter SolrDispatchFilter.init(): sun.misc.Launcher$AppClassLoader@73d16e93
   [junit4]   2> 303065 INFO  (TEST-CdcrReplicationDistributedZkTest.testBufferOnNonLeader-seed#[C519C4A7A908694E]) [    ] o.a.s.c.SolrResourceLoader new SolrResourceLoader for directory: '/x1/jenkins/jenkins-slave/workspace/Lucene-Solr-NightlyTests-6.x/solr/build/solr-core/test/J1/temp/solr.cloud.CdcrReplicationDistributedZkTest_C519C4A7A908694E-001/jetty-001'
   [junit4]   2> 303065 INFO  (TEST-CdcrReplicationDistributedZkTest.testBufferOnNonLeader-seed#[C519C4A7A908694E]) [    ] o.a.s.c.SolrResourceLoader JNDI not configured for solr (NoInitialContextEx)
   [junit4]   2> 303065 INFO  (TEST-CdcrReplicationDistributedZkTest.testBufferOnNonLeader-seed#[C519C4A7A908694E]) [    ] o.a.s.c.SolrResourceLoader solr home defaulted to 'solr/' (could not find system property or JNDI)
   [junit4]   2> 303065 INFO  (TEST-CdcrReplicationDistributedZkTest.testBufferOnNonLeader-seed#[C519C4A7A908694E]) [    ] o.a.s.c.c.SolrZkClient Using default ZkCredentialsProvider
   [junit4]   2> 303065 INFO  (TEST-CdcrReplicationDistributedZkTest.testBufferOnNonLeader-seed#[C519C4A7A908694E]) [    ] o.a.s.c.c.ConnectionManager Waiting for client to connect to ZooKeeper
   [junit4]   2> 303066 INFO  (zkCallback-496-thread-1) [    ] o.a.s.c.c.ConnectionManager Watcher org.apache.solr.common.cloud.ConnectionManager@57538a16 name:ZooKeeperConnection Watcher:127.0.0.1:41903/solr got event WatchedEvent state:SyncConnected type:None path:null path:null type:None
   [junit4]   2> 303067 INFO  (TEST-CdcrReplicationDistributedZkTest.testBufferOnNonLeader-seed#[C519C4A7A908694E]) [    ] o.a.s.c.c.ConnectionManager Client is connected to ZooKeeper
   [junit4]   2> 303067 INFO  (TEST-CdcrReplicationDistributedZkTest.testBufferOnNonLeader-seed#[C519C4A7A908694E]) [    ] o.a.s.c.c.SolrZkClient Using default ZkACLProvider
   [junit4]   2> 303067 INFO  (TEST-CdcrReplicationDistributedZkTest.testBufferOnNonLeader-seed#[C519C4A7A908694E]) [    ] o.a.s.s.SolrDispatchFilter Loading solr.xml from SolrHome (not found in ZooKeeper)
   [junit4]   2> 303068 INFO  (TEST-CdcrReplicationDistributedZkTest.testBufferOnNonLeader-seed#[C519C4A7A908694E]) [    ] o.a.s.c.SolrXmlConfig Loading container configuration from /x1/jenkins/jenkins-slave/workspace/Lucene-Solr-NightlyTests-6.x/solr/build/solr-core/test/J1/temp/solr.cloud.CdcrReplicationDistributedZkTest_C519C4A7A908694E-001/jetty-001/solr.xml
   [junit4]   2> 303071 INFO  (TEST-CdcrReplicationDistributedZkTest.testBufferOnNonLeader-seed#[C519C4A7A908694E]) [    ] o.a.s.c.CorePropertiesLocator Config-defined core root directory: /x1/jenkins/jenkins-slave/workspace/Lucene-Solr-NightlyTests-6.x/solr/build/solr-core/test/J1/temp/solr.cloud.CdcrReplicationDistributedZkTest_C519C4A7A908694E-001/jetty-001/cores
   [junit4]   2> 303071 INFO  (TEST-CdcrReplicationDistributedZkTest.testBufferOnNonLeader-seed#[C519C4A7A908694E]) [    ] o.a.s.c.CoreContainer New CoreContainer 808811889
   [junit4]   2> 303071 INFO  (TEST-CdcrReplicationDistributedZkTest.testBufferOnNonLeader-seed#[C519C4A7A908694E]) [    ] o.a.s.c.CoreContainer Loading cores into CoreContainer [instanceDir=/x1/jenkins/jenkins-slave/workspace/Lucene-Solr-NightlyTests-6.x/solr/build/solr-core/test/J1/temp/solr.cloud.CdcrReplicationDistributedZkTest_C519C4A7A908694E-001/jetty-001]
   [junit4]   2> 303071 WARN  (TEST-CdcrReplicationDistributedZkTest.testBufferOnNonLeader-seed#[C519C4A7A908694E]) [    ] o.a.s.c.CoreContainer Couldn't add files from /x1/jenkins/jenkins-slave/workspace/Lucene-Solr-NightlyTests-6.x/solr/build/solr-core/test/J1/temp/solr.cloud.CdcrReplicationDistributedZkTest_C519C4A7A908694E-001/jetty-001/lib to classpath: /x1/jenkins/jenkins-slave/workspace/Lucene-Solr-NightlyTests-6.x/solr/build/solr-core/test/J1/temp/solr.cloud.CdcrReplicationDistributedZkTest_C519C4A7A908694E-001/jetty-001/lib
   [junit4]   2> 303071 INFO  (TEST-CdcrReplicationDistributedZkTest.testBufferOnNonLeader-seed#[C519C4A7A908694E]) [    ] o.a.s.h.c.HttpShardHandlerFactory created with socketTimeout : 90000,urlScheme : ,connTimeout : 15000,maxConnectionsPerHost : 20,maxConnections : 10000,corePoolSize : 0,maximumPoolSize : 2147483647,maxThreadIdleTime : 5,sizeOfQueue : -1,fairnessPolicy : false,useRetries : false,connectionsEvictorSleepDelay : 5000,maxConnectionIdleTime : 40000,
   [junit4]   2> 303072 INFO  (TEST-CdcrReplicationDistributedZkTest.testBufferOnNonLeader-seed#[C519C4A7A908694E]) [    ] o.a.s.u.UpdateShardHandler Creating UpdateShardHandler HTTP client with params: socketTimeout=340000&connTimeout=45000&retry=true
   [junit4]   2> 303073 INFO  (TEST-CdcrReplicationDistributedZkTest.testBufferOnNonLeader-seed#[C519C4A7A908694E]) [    ] o.a.s.l.LogWatcher SLF4J impl is org.slf4j.impl.Log4jLoggerFactory
   [junit4]   2> 303073 INFO  (TEST-CdcrReplicationDistributedZkTest.testBufferOnNonLeader-seed#[C519C4A7A908694E]) [    ] o.a.s.l.LogWatcher Registering Log Listener [Log4j (org.slf4j.impl.Log4jLoggerFactory)]
   [junit4]   2> 303073 INFO  (TEST-CdcrReplicationDistributedZkTest.testBufferOnNonLeader-seed#[C519C4A7A908694E]) [    ] o.a.s.c.ZkContainer Zookeeper client=127.0.0.1:41903/solr
   [junit4]   2> 303073 INFO  (TEST-CdcrReplicationDistributedZkTest.testBufferOnNonLeader-seed#[C519C4A7A908694E]) [    ] o.a.s.c.ZkController zkHost includes chroot
   [junit4]   2> 303073 INFO  (TEST-CdcrReplicationDistributedZkTest.testBufferOnNonLeader-seed#[C519C4A7A908694E]) [    ] o.a.s.c.c.SolrZkClient Using default ZkCredentialsProvider
   [junit4]   2> 303073 INFO  (TEST-CdcrReplicationDistributedZkTest.testBufferOnNonLeader-seed#[C519C4A7A908694E]) [    ] o.a.s.c.c.ConnectionManager Waiting for client to connect to ZooKeeper
   [junit4]   2> 303077 INFO  (zkCallback-499-thread-1) [    ] o.a.s.c.c.ConnectionManager Watcher org.apache.solr.common.cloud.ConnectionManager@587827f6 name:ZooKeeperConnection Watcher:127.0.0.1:41903 got event WatchedEvent state:SyncConnected type:None path:null path:null type:None
   [junit4]   2> 303077 INFO  (TEST-CdcrReplicationDistributedZkTest.testBufferOnNonLeader-seed#[C519C4A7A908694E]) [    ] o.a.s.c.c.ConnectionManager Client is connected to ZooKeeper
   [junit4]   2> 303077 INFO  (TEST-CdcrReplicationDistributedZkTest.testBufferOnNonLeader-seed#[C519C4A7A908694E]) [    ] o.a.s.c.c.SolrZkClient Using default ZkACLProvider
   [junit4]   2> 303078 INFO  (TEST-CdcrReplicationDistributedZkTest.testBufferOnNonLeader-seed#[C519C4A7A908694E]) [n:127.0.0.1:50701_    ] o.a.s.c.ZkController Added new OnReconnect listener org.apache.solr.cloud.ZkController$$Lambda$10/276052250@950bd52
   [junit4]   2> 303078 INFO  (TEST-CdcrReplicationDistributedZkTest.testBufferOnNonLeader-seed#[C519C4A7A908694E]) [n:127.0.0.1:50701_    ] o.a.s.c.c.ConnectionManager Waiting for client to connect to ZooKeeper
   [junit4]   2> 303079 INFO  (zkCallback-500-thread-1-processing-n:127.0.0.1:50701_) [n:127.0.0.1:50701_    ] o.a.s.c.c.ConnectionManager Watcher org.apache.solr.common.cloud.ConnectionManager@57aaf1a8 name:ZooKeeperConnection Watcher:127.0.0.1:41903/solr got event WatchedEvent state:SyncConnected type:None path:null path:null type:None
   [junit4]   2> 303079 INFO  (TEST-CdcrReplicationDistributedZkTest.testBufferOnNonLeader-seed#[C519C4A7A908694E]) [n:127.0.0.1:50701_    ] o.a.s.c.c.ConnectionManager Client is connected to ZooKeeper
   [junit4]   2> 303080 INFO  (TEST-CdcrReplicationDistributedZkTest.testBufferOnNonLeader-seed#[C519C4A7A908694E]) [n:127.0.0.1:50701_    ] o.a.s.c.c.SolrZkClient makePath: /overseer/queue
   [junit4]   2> 303082 INFO  (TEST-CdcrReplicationDistributedZkTest.testBufferOnNonLeader-seed#[C519C4A7A908694E]) [n:127.0.0.1:50701_    ] o.a.s.c.c.SolrZkClient makePath: /overseer/collection-queue-work
   [junit4]   2> 303083 INFO  (TEST-CdcrReplicationDistributedZkTest.testBufferOnNonLeader-seed#[C519C4A7A908694E]) [n:127.0.0.1:50701_    ] o.a.s.c.c.SolrZkClient makePath: /overseer/collection-map-running
   [junit4]   2> 303085 INFO  (TEST-CdcrReplicationDistributedZkTest.testBufferOnNonLeader-seed#[C519C4A7A908694E]) [n:127.0.0.1:50701_    ] o.a.s.c.c.SolrZkClient makePath: /overseer/collection-map-completed
   [junit4]   2> 303086 INFO  (TEST-CdcrReplicationDistributedZkTest.testBufferOnNonLeader-seed#[C519C4A7A908694E]) [n:127.0.0.1:50701_    ] o.a.s.c.c.SolrZkClient makePath: /overseer/collection-map-failure
   [junit4]   2> 303087 INFO  (TEST-CdcrReplicationDistributedZkTest.testBufferOnNonLeader-seed#[C519C4A7A908694E]) [n:127.0.0.1:50701_    ] o.a.s.c.c.SolrZkClient makePath: /live_nodes
   [junit4]   2> 303087 INFO  (TEST-CdcrReplicationDistributedZkTest.testBufferOnNonLeader-seed#[C519C4A7A908694E]) [n:127.0.0.1:50701_    ] o.a.s.c.c.SolrZkClient makePath: /aliases.json
   [junit4]   2> 303088 INFO  (TEST-CdcrReplicationDistributedZkTest.testBufferOnNonLeader-seed#[C519C4A7A908694E]) [n:127.0.0.1:50701_    ] o.a.s.c.c.SolrZkClient makePath: /clusterstate.json
   [junit4]   2> 303089 INFO  (TEST-CdcrReplicationDistributedZkTest.testBufferOnNonLeader-seed#[C519C4A7A908694E]) [n:127.0.0.1:50701_    ] o.a.s.c.c.SolrZkClient makePath: /security.json
   [junit4]   2> 303090 INFO  (TEST-CdcrReplicationDistributedZkTest.testBufferOnNonLeader-seed#[C519C4A7A908694E]) [n:127.0.0.1:50701_    ] o.a.s.c.c.ZkStateReader Updating cluster state from ZooKeeper... 
   [junit4]   2> 303090 INFO  (TEST-CdcrReplicationDistributedZkTest.testBufferOnNonLeader-seed#[C519C4A7A908694E]) [n:127.0.0.1:50701_    ] o.a.s.c.c.ZkStateReader Loaded cluster properties: {urlScheme=https}
   [junit4]   2> 303091 INFO  (TEST-CdcrReplicationDistributedZkTest.testBufferOnNonLeader-seed#[C519C4A7A908694E]) [n:127.0.0.1:50701_    ] o.a.s.c.c.ZkStateReader Updated live nodes from ZooKeeper... (0) -> (0)
   [junit4]   2> 303093 INFO  (TEST-CdcrReplicationDistributedZkTest.testBufferOnNonLeader-seed#[C519C4A7A908694E]) [n:127.0.0.1:50701_    ] o.a.s.c.c.SolrZkClient makePath: /overseer_elect
   [junit4]   2> 303093 INFO  (TEST-CdcrReplicationDistributedZkTest.testBufferOnNonLeader-seed#[C519C4A7A908694E]) [n:127.0.0.1:50701_    ] o.a.s.c.c.SolrZkClient makePath: /overseer_elect/election
   [junit4]   2> 303095 INFO  (TEST-CdcrReplicationDistributedZkTest.testBufferOnNonLeader-seed#[C519C4A7A908694E]) [n:127.0.0.1:50701_    ] o.a.s.c.Overseer Overseer (id=null) closing
   [junit4]   2> 303095 INFO  (TEST-CdcrReplicationDistributedZkTest.testBufferOnNonLeader-seed#[C519C4A7A908694E]) [n:127.0.0.1:50701_    ] o.a.s.c.LeaderElector Joined leadership election with path: /overseer_elect/election/96380811796807685-127.0.0.1:50701_-n_0000000000
   [junit4]   2> 303095 INFO  (TEST-CdcrReplicationDistributedZkTest.testBufferOnNonLeader-seed#[C519C4A7A908694E]) [n:127.0.0.1:50701_    ] o.a.s.c.OverseerElectionContext I am going to be the leader 127.0.0.1:50701_
   [junit4]   2> 303096 INFO  (TEST-CdcrReplicationDistributedZkTest.testBufferOnNonLeader-seed#[C519C4A7A908694E]) [n:127.0.0.1:50701_    ] o.a.s.c.c.SolrZkClient makePath: /overseer_elect/leader
   [junit4]   2> 303097 INFO  (TEST-CdcrReplicationDistributedZkTest.testBufferOnNonLeader-seed#[C519C4A7A908694E]) [n:127.0.0.1:50701_    ] o.a.s.c.Overseer Overseer (id=96380811796807685-127.0.0.1:50701_-n_0000000000) starting
   [junit4]   2> 303098 INFO  (TEST-CdcrReplicationDistributedZkTest.testBufferOnNonLeader-seed#[C519C4A7A908694E]) [n:127.0.0.1:50701_    ] o.a.s.c.c.SolrZkClient makePath: /overseer/queue-work
   [junit4]   2> 303103 INFO  (TEST-CdcrReplicationDistributedZkTest.testBufferOnNonLeader-seed#[C519C4A7A908694E]) [n:127.0.0.1:50701_    ] o.a.s.c.OverseerAutoReplicaFailoverThread Starting OverseerAutoReplicaFailoverThread autoReplicaFailoverWorkLoopDelay=10000 autoReplicaFailoverWaitAfterExpiration=10000 autoReplicaFailoverBadNodeExpiration=60000
   [junit4]   2> 303103 INFO  (OverseerCollectionConfigSetProcessor-96380811796807685-127.0.0.1:50701_-n_0000000000) [n:127.0.0.1:50701_    ] o.a.s.c.OverseerTaskProcessor Process current queue of overseer operations
   [junit4]   2> 303104 INFO  (TEST-CdcrReplicationDistributedZkTest.testBufferOnNonLeader-seed#[C519C4A7A908694E]) [n:127.0.0.1:50701_    ] o.a.s.c.ZkController Register node as live in ZooKeeper:/live_nodes/127.0.0.1:50701_
   [junit4]   2> 303104 INFO  (TEST-CdcrReplicationDistributedZkTest.testBufferOnNonLeader-seed#[C519C4A7A908694E]) [n:127.0.0.1:50701_    ] o.a.s.c.c.SolrZkClient makePath: /live_nodes/127.0.0.1:50701_
   [junit4]   2> 303104 INFO  (OverseerStateUpdate-96380811796807685-127.0.0.1:50701_-n_0000000000) [n:127.0.0.1:50701_    ] o.a.s.c.Overseer Starting to work on the main queue
   [junit4]   2> 303105 INFO  (zkCallback-500-thread-1-processing-n:127.0.0.1:50701_) [n:127.0.0.1:50701_    ] o.a.s.c.c.ZkStateReader A live node change: [WatchedEvent state:SyncConnected type:NodeChildrenChanged path:/live_nodes], has occurred - updating... (live nodes size: [0])
   [junit4]   2> 303105 INFO  (OverseerStateUpdate-96380811796807685-127.0.0.1:50701_-n_0000000000) [n:127.0.0.1:50701_    ] o.a.s.c.c.ZkStateReader Updated live nodes from ZooKeeper... (0) -> (1)
   [junit4]   2> 303112 INFO  (zkCallback-500-thread-1-processing-n:127.0.0.1:50701_) [n:127.0.0.1:50701_    ] o.a.s.c.c.ZkStateReader Updated live nodes from ZooKeeper... (1) -> (1)
   [junit4]   2> 303115 INFO  (TEST-CdcrReplicationDistributedZkTest.testBufferOnNonLeader-seed#[C519C4A7A908694E]) [n:127.0.0.1:50701_    ] o.a.s.c.CoreContainer Security conf doesn't exist. Skipping setup for authorization module.
   [junit4]   2> 303115 INFO  (TEST-CdcrReplicationDistributedZkTest.testBufferOnNonLeader-seed#[C519C4A7A908694E]) [n:127.0.0.1:50701_    ] o.a.s.c.CoreContainer No authentication plugin used.
   [junit4]   2> 303115 INFO  (TEST-CdcrReplicationDistributedZkTest.testBufferOnNonLeader-seed#[C519C4A7A908694E]) [n:127.0.0.1:50701_    ] o.a.s.c.CorePropertiesLocator Looking for core definitions underneath /x1/jenkins/jenkins-slave/workspace/Lucene-Solr-NightlyTests-6.x/solr/build/solr-core/test/J1/temp/solr.cloud.CdcrReplicationDistributedZkTest_C519C4A7A908694E-001/jetty-001/cores
   [junit4]   2> 303116 INFO  (TEST-CdcrReplicationDistributedZkTest.testBufferOnNonLeader-seed#[C519C4A7A908694E]) [n:127.0.0.1:50701_    ] o.a.s.c.CoreDescriptor Created CoreDescriptor: {name=collection1, config=solrconfig.xml, transient=false, schema=schema.xml, loadOnStartup=true, configSetProperties=configsetprops.json, collection=tmp_collection, coreNodeName=, dataDir=data/, shard=}
   [junit4]   2> 303116 INFO  (TEST-CdcrReplicationDistributedZkTest.testBufferOnNonLeader-seed#[C519C4A7A908694E]) [n:127.0.0.1:50701_    ] o.a.s.c.CorePropertiesLocator Found core collection1 in /x1/jenkins/jenkins-slave/workspace/Lucene-Solr-NightlyTests-6.x/solr/build/solr-core/test/J1/temp/solr.cloud.CdcrReplicationDistributedZkTest_C519C4A7A908694E-001/jetty-001/cores/collection1
   [junit4]   2> 303116 INFO  (TEST-CdcrReplicationDistributedZkTest.testBufferOnNonLeader-seed#[C519C4A7A908694E]) [n:127.0.0.1:50701_    ] o.a.s.c.CorePropertiesLocator Found 1 core definitions
   [junit4]   2> 303116 INFO  (coreLoadExecutor-1499-thread-1-processing-n:127.0.0.1:50701_) [n:127.0.0.1:50701_ c:tmp_collection   x:collection1] o.a.s.c.ZkController publishing state=down
   [junit4]   2> 303116 INFO  (coreLoadExecutor-1499-thread-1-processing-n:127.0.0.1:50701_) [n:127.0.0.1:50701_ c:tmp_collection   x:collection1] o.a.s.c.ZkController numShards not found on descriptor - reading it from system property
   [junit4]   2> 303117 INFO  (TEST-CdcrReplicationDistributedZkTest.testBufferOnNonLeader-seed#[C519C4A7A908694E]) [n:127.0.0.1:50701_    ] o.a.s.s.SolrDispatchFilter user.dir=/x1/jenkins/jenkins-slave/workspace/Lucene-Solr-NightlyTests-6.x/solr/build/solr-core/test/J1
   [junit4]   2> 303117 INFO  (TEST-CdcrReplicationDistributedZkTest.testBufferOnNonLeader-seed#[C519C4A7A908694E]) [n:127.0.0.1:50701_    ] o.a.s.s.SolrDispatchFilter SolrDispatchFilter.init() done
   [junit4]   2> 303117 INFO  (coreLoadExecutor-1499-thread-1-processing-n:127.0.0.1:50701_) [n:127.0.0.1:50701_ c:tmp_collection   x:collection1] o.a.s.c.ZkController Collection tmp_collection not visible yet, but flagging it so a watch is registered when it becomes visible
   [junit4]   2> 303117 INFO  (coreLoadExecutor-1499-thread-1-processing-n:127.0.0.1:50701_) [n:127.0.0.1:50701_ c:tmp_collection   x:collection1] o.a.s.c.c.ZkStateReader Deleting data for [tmp_collection]
   [junit4]   2> 303118 INFO  (OverseerStateUpdate-96380811796807685-127.0.0.1:50701_-n_0000000000) [n:127.0.0.1:50701_    ] o.a.s.c.Overseer processMessage: queueSize: 1, message = {
   [junit4]   2>   "core":"collection1",
   [junit4]   2>   "roles":null,
   [junit4]   2>   "base_url":"https://127.0.0.1:50701",
   [junit4]   2>   "node_name":"127.0.0.1:50701_",
   [junit4]   2>   "numShards":"2",
   [junit4]   2>   "state":"down",
   [junit4]   2>   "shard":null,
   [junit4]   2>   "collection":"tmp_collection",
   [junit4]   2>   "operation":"state"} current state version: 0
   [junit4]   2> 303118 INFO  (OverseerStateUpdate-96380811796807685-127.0.0.1:50701_-n_0000000000) [n:127.0.0.1:50701_    ] o.a.s.c.o.ReplicaMutator Update state numShards=2 message={
   [junit4]   2>   "core":"collection1",
   [junit4]   2>   "roles":null,
   [junit4]   2>   "base_url":"https://127.0.0.1:50701",
   [junit4]   2>   "node_name":"127.0.0.1:50701_",
   [junit4]   2>   "numShards":"2",
   [junit4]   2>   "state":"down",
   [junit4]   2>   "shard":null,
   [junit4]   2>   "collection":"tmp_collection",
   [junit4]   2>   "operation":"state"}
   [junit4]   2> 303118 INFO  (OverseerStateUpdate-96380811796807685-127.0.0.1:50701_-n_0000000000) [n:127.0.0.1:50701_    ] o.a.s.c.o.ClusterStateMutator building a new cName: tmp_collection
   [junit4]   2> 303118 INFO  (coreLoadExecutor-1499-thread-1-processing-n:127.0.0.1:50701_) [n:127.0.0.1:50701_ c:tmp_collection   x:collection1] o.a.s.c.ZkController look for our core node name
   [junit4]   2> 303118 INFO  (OverseerStateUpdate-96380811796807685-127.0.0.1:50701_-n_0000000000) [n:127.0.0.1:50701_    ] o.a.s.c.o.ReplicaMutator Assigning new node to shard shard=shard2
   [junit4]   2> 303119 INFO  (zkCallback-500-thread-1-processing-n:127.0.0.1:50701_) [n:127.0.0.1:50701_    ] o.a.s.c.c.ZkStateReader A cluster state change: [WatchedEvent state:SyncConnected type:NodeDataChanged path:/clusterstate.json], has occurred - updating... (live nodes size: [1])
   [junit4]   2> 304118 INFO  (coreLoadExecutor-1499-thread-1-processing-n:127.0.0.1:50701_) [n:127.0.0.1:50701_ c:tmp_collection   x:collection1] o.a.s.c.ZkController waiting to find shard id in clusterstate for collection1
   [junit4]   2> 304118 INFO  (coreLoadExecutor-1499-thread-1-processing-n:127.0.0.1:50701_) [n:127.0.0.1:50701_ c:tmp_collection   x:collection1] o.a.s.c.ZkController Check for collection zkNode:tmp_collection
   [junit4]   2> 304119 INFO  (coreLoadExecutor-1499-thread-1-processing-n:127.0.0.1:50701_) [n:127.0.0.1:50701_ c:tmp_collection   x:collection1] o.a.s.c.ZkController Creating collection in ZooKeeper:tmp_collection
   [junit4]   2> 304119 INFO  (coreLoadExecutor-1499-thread-1-processing-n:127.0.0.1:50701_) [n:127.0.0.1:50701_ c:tmp_collection   x:collection1] o.a.s.c.ZkController Looking for collection configName
   [junit4]   2> 304119 INFO  (coreLoadExecutor-1499-thread-1-processing-n:127.0.0.1:50701_) [n:127.0.0.1:50701_ c:tmp_collection   x:collection1] o.a.s.c.ZkController Only one config set found in zk - using it:conf1
   [junit4]   2> 304120 INFO  (coreLoadExecutor-1499-thread-1-processing-n:127.0.0.1:50701_) [n:127.0.0.1:50701_ c:tmp_collection   x:collection1] o.a.s.c.c.SolrZkClient makePath: /collections/tmp_collection
   [junit4]   2> 304121 INFO  (zkCallback-500-thread-1-processing-n:127.0.0.1:50701_) [n:127.0.0.1:50701_    ] o.a.s.c.c.ZkStateReader A collections change: [WatchedEvent state:SyncConnected type:NodeChildrenChanged path:/collections], has occurred - updating...
   [junit4]   2> 304121 INFO  (coreLoadExecutor-1499-thread-1-processing-n:127.0.0.1:50701_) [n:127.0.0.1:50701_ c:tmp_collection   x:collection1] o.a.s.c.c.ZkStateReader Load collection config from: [/collections/tmp_collection]
   [junit4]   2> 304122 INFO  (coreLoadExecutor-1499-thread-1-processing-n:127.0.0.1:50701_) [n:127.0.0.1:50701_ c:tmp_collection   x:collection1] o.a.s.c.c.ZkStateReader path=[/collections/tmp_collection] [configName]=[conf1] specified config exists in ZooKeeper
   [junit4]   2> 304122 INFO  (coreLoadExecutor-1499-thread-1-processing-n:127.0.0.1:50701_) [n:127.0.0.1:50701_ c:tmp_collection   x:collection1] o.a.s.c.SolrResourceLoader new SolrResourceLoader for directory: '/x1/jenkins/jenkins-slave/workspace/Lucene-Solr-NightlyTests-6.x/solr/build/solr-core/test/J1/temp/solr.cloud.CdcrReplicationDistributedZkTest_C519C4A7A908694E-001/jetty-001/cores/collection1'
   [junit4]   2> 304122 INFO  (coreLoadExecutor-1499-thread-1-processing-n:127.0.0.1:50701_) [n:127.0.0.1:50701_ c:tmp_collection   x:collection1] o.a.s.c.SolrResourceLoader JNDI not configured for solr (NoInitialContextEx)
   [junit4]   2> 304122 INFO  (coreLoadExecutor-1499-thread-1-processing-n:127.0.0.1:50701_) [n:127.0.0.1:50701_ c:tmp_collection   x:collection1] o.a.s.c.SolrResourceLoader solr home defaulted to 'solr/' (could not find system property or JNDI)
   [junit4]   2> 304124 INFO  (coreLoadExecutor-1499-thread-1-processing-n:127.0.0.1:50701_) [n:127.0.0.1:50701_ c:tmp_collection   x:collection1] o.a.s.c.Config loaded config solrconfig.xml with version 0 
   [junit4]   2> 304132 INFO  (coreLoadExecutor-1499-thread-1-processing-n:127.0.0.1:50701_) [n:127.0.0.1:50701_ c:tmp_collection   x:collection1] o.a.s.c.SolrConfig current version of requestparams : -1
   [junit4]   2> 304134 INFO  (coreLoadExecutor-1499-thread-1-processing-n:127.0.0.1:50701_) [n:127.0.0.1:50701_ c:tmp_collection   x:collection1] o.a.s.c.SolrConfig Using Lucene MatchVersion: 6.2.0
   [junit4]   2> 304139 INFO  (coreLoadExecutor-1499-thread-1-processing-n:127.0.0.1:50701_) [n:127.0.0.1:50701_ c:tmp_collection   x:collection1] o.a.s.c.SolrConfig Loaded SolrConfig: solrconfig.xml
   [junit4]   2> 304145 INFO  (coreLoadExecutor-1499-thread-1-processing-n:127.0.0.1:50701_) [n:127.0.0.1:50701_ c:tmp_collection   x:collection1] o.a.s.s.IndexSchema [collection1] Schema name=test
   [junit4]   2> 304212 INFO  (coreLoadExecutor-1499-thread-1-processing-n:127.0.0.1:50701_) [n:127.0.0.1:50701_ c:tmp_collection   x:collection1] o.a.s.s.IndexSchema default search field in schema is text
   [junit4]   2> 304213 INFO  (coreLoadExecutor-1499-thread-1-processing-n:127.0.0.1:50701_) [n:127.0.0.1:50701_ c:tmp_collection   x:collection1] o.a.s.s.IndexSchema unique key field: id
   [junit4]   2> 304213 INFO  (coreLoadExecutor-1499-thread-1-processing-n:127.0.0.1:50701_) [n:127.0.0.1:50701_ c:tmp_collection   x:collection1] o.a.s.s.FileExchangeRateProvider Reloading exchange rates from file currency.xml
   [junit4]   2> 304216 INFO  (coreLoadExecutor-1499-thread-1-processing-n:127.0.0.1:50701_) [n:127.0.0.1:50701_ c:tmp_collection   x:collection1] o.a.s.s.FileExchangeRateProvider Reloading exchange rates from file currency.xml
   [junit4]   2> 304243 INFO  (coreLoadExecutor-1499-thread-1-processing-n:127.0.0.1:50701_) [n:127.0.0.1:50701_ c:tmp_collection   x:collection1] o.a.s.c.ConfigSetProperties Did not find ConfigSet properties, assuming default properties: Can't find resource 'configsetprops.json' in classpath or '/configs/conf1', cwd=/x1/jenkins/jenkins-slave/workspace/Lucene-Solr-NightlyTests-6.x/solr/build/solr-core/test/J1
   [junit4]   2> 304243 INFO  (coreLoadExecutor-1499-thread-1-processing-n:127.0.0.1:50701_) [n:127.0.0.1:50701_ c:tmp_collection   x:collection1] o.a.s.c.CoreContainer Creating SolrCore 'collection1' using configuration from collection tmp_collection
   [junit4]   2> 304244 INFO  (coreLoadExecutor-1499-thread-1-processing-n:127.0.0.1:50701_) [n:127.0.0.1:50701_ c:tmp_collection s:shard2 r:core_node1 x:collection1] o.a.s.c.SolrCore org.apache.solr.core.MockDirectoryFactory
   [junit4]   2> 304244 INFO  (coreLoadExecutor-1499-thread-1-processing-n:127.0.0.1:50701_) [n:127.0.0.1:50701_ c:tmp_collection s:shard2 r:core_node1 x:collection1] o.a.s.c.SolrCore [[collection1] ] Opening new SolrCore at [/x1/jenkins/jenkins-slave/workspace/Lucene-Solr-NightlyTests-6.x/solr/build/solr-core/test/J1/temp/solr.cloud.CdcrReplicationDistributedZkTest_C519C4A7A908694E-001/jetty-001/cores/collection1], dataDir=[/x1/jenkins/jenkins-slave/workspace/Lucene-Solr-NightlyTests-6.x/solr/build/solr-core/test/J1/temp/solr.cloud.CdcrReplicationDistributedZkTest_C519C4A7A908694E-001/jetty-001/cores/collection1/data/]
   [junit4]   2> 304244 INFO  (coreLoadExecutor-1499-thread-1-processing-n:127.0.0.1:50701_) [n:127.0.0.1:50701_ c:tmp_collection s:shard2 r:core_node1 x:collection1] o.a.s.c.JmxMonitoredMap JMX monitoring is enabled. Adding Solr mbeans to JMX Server: com.sun.jmx.mbeanserver.JmxMBeanServer@1b94d521
   [junit4]   2> 304244 INFO  (coreLoadExecutor-1499-thread-1-processing-n:127.0.0.1:50701_) [n:127.0.0.1:50701_ c:tmp_collection s:shard2 r:core_node1 x:collection1] o.a.s.c.CachingDirectoryFactory return new directory for /x1/jenkins/jenkins-slave/workspace/Lucene-Solr-NightlyTests-6.x/solr/build/solr-core/test/J1/temp/solr.cloud.CdcrReplicationDistributedZkTest_C519C4A7A908694E-001/jetty-001/cores/collection1/data/snapshot_metadata
   [junit4]   2> 304244 INFO  (coreLoadExecutor-1499-thread-1-processing-n:127.0.0.1:50701_) [n:127.0.0.1:50701_ c:tmp_collection s:shard2 r:core_node1 x:collection1] o.a.s.c.s.SolrSnapshotMetaDataManager Loading from snapshot metadata file...
   [junit4]   2> 304245 INFO  (coreLoadExecutor-1499-thread-1-processing-n:127.0.0.1:50701_) [n:127.0.0.1:50701_ c:tmp_collection s:shard2 r:core_node1 x:collection1] o.a.s.c.CachingDirectoryFactory return new directory for /x1/jenkins/jenkins-slave/workspace/Lucene-Solr-NightlyTests-6.x/solr/build/solr-core/test/J1/temp/solr.cloud.CdcrReplicationDistributedZkTest_C519C4A7A908694E-001/jetty-001/cores/collection1/data
   [junit4]   2> 304245 INFO  (coreLoadExecutor-1499-thread-1-processing-n:127.0.0.1:50701_) [n:127.0.0.1:50701_ c:tmp_collection s:shard2 r:core_node1 x:collection1] o.a.s.c.SolrCore New index directory detected: old=null new=/x1/jenkins/jenkins-slave/workspace/Lucene-Solr-NightlyTests-6.x/solr/build/solr-core/test/J1/temp/solr.cloud.CdcrReplicationDistributedZkTest_C519C4A7A908694E-001/jetty-001/cores/collection1/data/index/
   [junit4]   2> 304245 WARN  (coreLoadExecutor-1499-thread-1-processing-n:127.0.0.1:50701_) [n:127.0.0.1:50701_ c:tmp_collection s:shard2 r:core_node1 x:collection1] o.a.s.c.SolrCore [collection1] Solr index directory '/x1/jenkins/jenkins-slave/workspace/Lucene-Solr-NightlyTests-6.x/solr/build/solr-core/test/J1/temp/solr.cloud.CdcrReplicationDistributedZkTest_C519C4A7A908694E-001/jetty-001/cores/collection1/data/index' doesn't exist. Creating new index...
   [junit4]   2> 304245 INFO  (coreLoadExecutor-1499-thread-1-processing-n:127.0.0.1:50701_) [n:127.0.0.1:50701_ c:tmp_collection s:shard2 r:core_node1 x:collection1] o.a.s.c.CachingDirectoryFactory return new directory for /x1/jenkins/jenkins-slave/workspace/Lucene-Solr-NightlyTests-6.x/solr/build/solr-core/test/J1/temp/solr.cloud.CdcrReplicationDistributedZkTest_C519C4A7A908694E-001/jetty-001/cores/collection1/data/index
   [junit4]   2> 304246 INFO  (coreLoadExecutor-1499-thread-1-processing-n:127.0.0.1:50701_) [n:127.0.0.1:50701_ c:tmp_collection s:shard2 r:core_node1 x:collection1] o.a.s.u.RandomMergePolicy RandomMergePolicy wrapping class org.apache.lucene.index.AlcoholicMergePolicy: [AlcoholicMergePolicy: minMergeSize=0, mergeFactor=10, maxMergeSize=575335063, maxMergeSizeForForcedMerge=9223372036854775807, calibrateSizeByDeletes=true, maxMergeDocs=2147483647, maxCFSSegmentSizeMB=8.796093022207999E12, noCFSRatio=0.1]
   [junit4]   2> 304246 INFO  (coreLoadExecutor-1499-thread-1-processing-n:127.0.0.1:50701_) [n:127.0.0.1:50701_ c:tmp_collection s:shard2 r:core_node1 x:collection1] o.a.s.c.SolrDeletionPolicy SolrDeletionPolicy.onCommit: commits: num=1
   [junit4]   2> 	commit{dir=RawDirectoryWrapper(RAMDirectory@27214a89 lockFactory=org.apache.lucene.store.SingleInstanceLockFactory@63d07e4),segFN=segments_1,generation=1}
   [junit4]   2> 304246 INFO  (coreLoadExecutor-1499-thread-1-processing-n:127.0.0.1:50701_) [n:127.0.0.1:50701_ c:tmp_collection s:shard2 r:core_node1 x:collection1] o.a.s.c.SolrDeletionPolicy newest commit generation = 1
   [junit4]   2> 304247 INFO  (OldIndexDirectoryCleanupThreadForCore-collection1) [n:127.0.0.1:50701_ c:tmp_collection s:shard2 r:core_node1 x:collection1] o.a.s.c.SolrCore Looking for old index directories to cleanup for core collection1 in /x1/jenkins/jenkins-slave/workspace/Lucene-Solr-NightlyTests-6.x/solr/build/solr-core/test/J1/temp/solr.cloud.CdcrReplicationDistributedZkTest_C519C4A7A908694E-001/jetty-001/cores/collection1/data/
   [junit4]   2> 304247 WARN  (OldIndexDirectoryCleanupThreadForCore-collection1) [n:127.0.0.1:50701_ c:tmp_collection s:shard2 r:core_node1 x:collection1] o.a.s.c.DirectoryFactory /x1/jenkins/jenkins-slave/workspace/Lucene-Solr-NightlyTests-6.x/solr/build/solr-core/test/J1/temp/solr.cloud.CdcrReplicationDistributedZkTest_C519C4A7A908694E-001/jetty-001/cores/collection1/data/ does not point to a valid data directory; skipping clean-up of old index directories.
   [junit4]   2> 304249 INFO  (coreLoadExecutor-1499-thread-1-processing-n:127.0.0.1:50701_) [n:127.0.0.1:50701_ c:tmp_collection s:shard2 r:core_node1 x:collection1] o.a.s.u.p.UpdateRequestProcessorChain creating updateRequestProcessorChain "cdcr-processor-chain"
   [junit4]   2> 304249 INFO  (coreLoadExecutor-1499-thread-1-processing-n:127.0.0.1:50701_) [n:127.0.0.1:50701_ c:tmp_collection s:shard2 r:core_node1 x:collection1] o.a.s.c.SolrCore no updateRequestProcessorChain defined as default, creating implicit default
   [junit4]   2> 304250 INFO  (coreLoadExecutor-1499-thread-1-processing-n:127.0.0.1:50701_) [n:127.0.0.1:50701_ c:tmp_collection s:shard2 r:core_node1 x:collection1] o.a.s.h.l.XMLLoader xsltCacheLifetimeSeconds=60
   [junit4]   2> 304251 INFO  (coreLoadExecutor-1499-thread-1-processing-n:127.0.0.1:50701_) [n:127.0.0.1:50701_ c:tmp_collection s:shard2 r:core_node1 x:collection1] o.a.s.h.l.XMLLoader xsltCacheLifetimeSeconds=60
   [junit4]   2> 304251 INFO  (coreLoadExecutor-1499-thread-1-processing-n:127.0.0.1:50701_) [n:127.0.0.1:50701_ c:tmp_collection s:shard2 r:core_node1 x:collection1] o.a.s.h.l.XMLLoader xsltCacheLifetimeSeconds=60
   [junit4]   2> 304252 INFO  (coreLoadExecutor-1499-thread-1-processing-n:127.0.0.1:50701_) [n:127.0.0.1:50701_ c:tmp_collection s:shard2 r:core_node1 x:collection1] o.a.s.h.l.XMLLoader xsltCacheLifetimeSeconds=60
   [junit4]   2> 304256 INFO  (coreLoadExecutor-1499-thread-1-processing-n:127.0.0.1:50701_) [n:127.0.0.1:50701_ c:tmp_collection s:shard2 r:core_node1 x:collection1] o.a.s.c.RequestHandlers Registered paths: /admin/mbeans,standard,/update/json/docs,/admin/luke,/export,/get,/admin/properties,/update/json,/admin/threads,/update/csv,/sql,/graph,/admin/segments,/admin/system,/replication,/config,/stream,/schema,/admin/plugins,/admin/logging,/admin/ping,/cdcr,/update,/admin/file,/terms
   [junit4]   2> 304256 INFO  (coreLoadExecutor-1499-thread-1-processing-n:127.0.0.1:50701_) [n:127.0.0.1:50701_ c:tmp_collection s:shard2 r:core_node1 x:collection1] o.a.s.c.SolrCore Using default statsCache cache: org.apache.solr.search.stats.LocalStatsCache
   [junit4]   2> 304256 INFO  (coreLoadExecutor-1499-thread-1-processing-n:127.0.0.1:50701_) [n:127.0.0.1:50701_ c:tmp_collection s:shard2 r:core_node1 x:collection1] o.a.s.u.UpdateHandler Using UpdateLog implementation: org.apache.solr.update.CdcrUpdateLog
   [junit4]   2> 304256 INFO  (coreLoadExecutor-1499-thread-1-processing-n:127.0.0.1:50701_) [n:127.0.0.1:50701_ c:tmp_collection s:shard2 r:core_node1 x:collection1] o.a.s.u.UpdateLog Initializing UpdateLog: dataDir= defaultSyncLevel=FLUSH numRecordsToKeep=100 maxNumLogsToKeep=10 numVersionBuckets=65536
   [junit4]   2> 304257 INFO  (coreLoadExecutor-1499-thread-1-processing-n:127.0.0.1:50701_) [n:127.0.0.1:50701_ c:tmp_collection s:shard2 r:core_node1 x:collection1] o.a.s.u.CommitTracker Hard AutoCommit: disabled
   [junit4]   2> 304257 INFO  (coreLoadExecutor-1499-thread-1-processing-n:127.0.0.1:50701_) [n:127.0.0.1:50701_ c:tmp_collection s:shard2 r:core_node1 x:collection1] o.a.s.u.CommitTracker Soft AutoCommit: disabled
   [junit4]   2> 304257 INFO  (coreLoadExecutor-1499-thread-1-processing-n:127.0.0.1:50701_) [n:127.0.0.1:50701_ c:tmp_collection s:shard2 r:core_node1 x:collection1] o.a.s.u.RandomMergePolicy RandomMergePolicy wrapping class org.apache.lucene.index.LogByteSizeMergePolicy: [LogByteSizeMergePolicy: minMergeSize=1677721, mergeFactor=14, maxMergeSize=2147483648, maxMergeSizeForForcedMerge=9223372036854775807, calibrateSizeByDeletes=false, maxMergeDocs=2147483647, maxCFSSegmentSizeMB=8.796093022207999E12, noCFSRatio=0.4610309097504345]
   [junit4]   2> 304257 INFO  (coreLoadExecutor-1499-thread-1-processing-n:127.0.0.1:50701_) [n:127.0.0.1:50701_ c:tmp_collection s:shard2 r:core_node1 x:collection1] o.a.s.c.SolrDeletionPolicy SolrDeletionPolicy.onInit: commits: num=1
   [junit4]   2> 	commit{dir=RawDirectoryWrapper(RAMDirectory@27214a89 lockFactory=org.apache.lucene.store.SingleInstanceLockFactory@63d07e4),segFN=segments_1,generation=1}
   [junit4]   2> 304257 INFO  (coreLoadExecutor-1499-thread-1-processing-n:127.0.0.1:50701_) [n:127.0.0.1:50701_ c:tmp_collection s:shard2 r:core_node1 x:collection1] o.a.s.c.SolrDeletionPolicy newest commit generation = 1
   [junit4]   2> 304257 INFO  (coreLoadExecutor-1499-thread-1-processing-n:127.0.0.1:50701_) [n:127.0.0.1:50701_ c:tmp_collection s:shard2 r:core_node1 x:collection1] o.a.s.s.SolrIndexSearcher Opening [Searcher@5b0b6264[collection1] main]
   [junit4]   2> 304258 INFO  (coreLoadExecutor-1499-thread-1-processing-n:127.0.0.1:50701_) [n:127.0.0.1:50701_ c:tmp_collection s:shard2 r:core_node1 x:collection1] o.a.s.c.c.ZkStateReader Load collection config from: [/collections/tmp_collection]
   [junit4]   2> 304258 INFO  (coreLoadExecutor-1499-thread-1-processing-n:127.0.0.1:50701_) [n:127.0.0.1:50701_ c:tmp_collection s:shard2 r:core_node1 x:collection1] o.a.s.c.c.ZkStateReader path=[/collections/tmp_collection] [configName]=[conf1] specified config exists in ZooKeeper
   [junit4]   2> 304258 INFO  (coreLoadExecutor-1499-thread-1-processing-n:127.0.0.1:50701_) [n:127.0.0.1:50701_ c:tmp_collection s:shard2 r:core_node1 x:collection1] o.a.s.r.ManagedResourceStorage Setting up ZooKeeper-based storage for the RestManager with znodeBase: /configs/conf1
   [junit4]   2> 304258 INFO  (coreLoadExecutor-1499-thread-1-processing-n:127.0.0.1:50701_) [n:127.0.0.1:50701_ c:tmp_collection s:shard2 r:core_node1 x:collection1] o.a.s.r.ManagedResourceStorage Configured ZooKeeperStorageIO with znodeBase: /configs/conf1
   [junit4]   2> 304258 INFO  (coreLoadExecutor-1499-thread-1-processing-n:127.0.0.1:50701_) [n:127.0.0.1:50701_ c:tmp_collection s:shard2 r:core_node1 x:collection1] o.a.s.r.RestManager Initializing RestManager with initArgs: {}
   [junit4]   2> 304258 INFO  (coreLoadExecutor-1499-thread-1-processing-n:127.0.0.1:50701_) [n:127.0.0.1:50701_ c:tmp_collection s:shard2 r:core_node1 x:collection1] o.a.s.r.ManagedResourceStorage Reading _rest_managed.json using ZooKeeperStorageIO:path=/configs/conf1
   [junit4]   2> 304259 INFO  (coreLoadExecutor-1499-thread-1-processing-n:127.0.0.1:50701_) [n:127.0.0.1:50701_ c:tmp_collection s:shard2 r:core_node1 x:collection1] o.a.s.r.ManagedResourceStorage No data found for znode /configs/conf1/_rest_managed.json
   [junit4]   2> 304260 INFO  (coreLoadExecutor-1499-thread-1-processing-n:127.0.0.1:50701_) [n:127.0.0.1:50701_ c:tmp_collection s:shard2 r:core_node1 x:collection1] o.a.s.r.ManagedResourceStorage Loaded null at path _rest_managed.json using ZooKeeperStorageIO:path=/configs/conf1
   [junit4]   2> 304260 INFO  (coreLoadExecutor-1499-thread-1-processing-n:127.0.0.1:50701_) [n:127.0.0.1:50701_ c:tmp_collection s:shard2 r:core_node1 x:collection1] o.a.s.r.RestManager Initializing 0 registered ManagedResources
   [junit4]   2> 304260 INFO  (coreLoadExecutor-1499-thread-1-processing-n:127.0.0.1:50701_) [n:127.0.0.1:50701_ c:tmp_collection s:shard2 r:core_node1 x:collection1] o.a.s.h.ReplicationHandler Commits will be reserved for  10000
   [junit4]   2> 304260 INFO  (coreLoadExecutor-1499-thread-1-processing-n:127.0.0.1:50701_) [n:127.0.0.1:50701_ c:tmp_collection s:shard2 r:core_node1 x:collection1] o.a.s.c.c.SolrZkClient makePath: /collections/tmp_collection/cdcr/state
   [junit4]   2> 304263 INFO  (coreLoadExecutor-1499-thread-1-processing-n:127.0.0.1:50701_) [n:127.0.0.1:50701_ c:tmp_collection s:shard2 r:core_node1 x:collection1] o.a.s.h.CdcrBufferStateManager Created znode /collections/tmp_collection/cdcr/state/buffer
   [junit4]   2> 304264 INFO  (coreLoadExecutor-1499-thread-1-processing-n:127.0.0.1:50701_) [n:127.0.0.1:50701_ c:tmp_collection s:shard2 r:core_node1 x:collection1] o.a.s.h.CdcrProcessStateManager Created znode /collections/tmp_collection/cdcr/state/process
   [junit4]   2> 304265 INFO  (searcherExecutor-1500-thread-1-processing-n:127.0.0.1:50701_ x:collection1 s:shard2 c:tmp_collection r:core_node1) [n:127.0.0.1:50701_ c:tmp_collection s:shard2 r:core_node1 x:collection1] o.a.s.c.SolrCore [collection1] Registered new searcher Searcher@5b0b6264[collection1] main{ExitableDirectoryReader(UninvertingDirectoryReader())}
   [junit4]   2> 304265 INFO  (coreLoadExecutor-1499-thread-1-processing-n:127.0.0.1:50701_) [n:127.0.0.1:50701_ c:tmp_collection s:shard2 r:core_node1 x:collection1] o.a.s.u.UpdateLog Looking up max value of version field to seed version buckets
   [junit4]   2> 304265 INFO  (coreLoadExecutor-1499-thread-1-processing-n:127.0.0.1:50701_) [n:127.0.0.1:50701_ c:tmp_collection s:shard2 r:core_node1 x:collection1] o.a.s.u.VersionInfo Refreshing highest value of _version_ for 65536 version buckets from index
   [junit4]   2> 304265 INFO  (coreLoadExecutor-1499-thread-1-processing-n:127.0.0.1:50701_) [n:127.0.0.1:50701_ c:tmp_collection s:shard2 r:core_node1 x:collection1] o.a.s.u.VersionInfo No terms found for _version_, cannot seed version bucket highest value from index
   [junit4]   2> 304265 INFO  (coreLoadExecutor-1499-thread-1-processing-n:127.0.0.1:50701_) [n:127.0.0.1:50701_ c:tmp_collection s:shard2 r:core_node1 x:collection1] o.a.s.u.UpdateLog Could not find max version in index or recent updates, using new clock 1542092990249435136
   [junit4]   2> 304267 INFO  (coreLoadExecutor-1499-thread-1-processing-n:127.0.0.1:50701_) [n:127.0.0.1:50701_ c:tmp_collection s:shard2 r:core_node1 x:collection1] o.a.s.u.UpdateLog Took 2.0ms to seed version buckets with highest version 1542092990249435136
   [junit4]   2> 304267 INFO  (coreLoadExecutor-1499-thread-1-processing-n:127.0.0.1:50701_) [n:127.0.0.1:50701_ c:tmp_collection s:shard2 r:core_node1 x:collection1] o.a.s.c.ZkController watch zkdir /configs/conf1
   [junit4]   2> 304267 INFO  (coreLoadExecutor-1499-thread-1-processing-n:127.0.0.1:50701_) [n:127.0.0.1:50701_ c:tmp_collection s:shard2 r:core_node1 x:collection1] o.a.s.c.CoreContainer registering core: collection1
   [junit4]   2> 304268 INFO  (coreZkRegister-1493-thread-1-processing-n:127.0.0.1:50701_ x:collection1 s:shard2 c:tmp_collection r:core_node1) [n:127.0.0.1:50701_ c:tmp_collection s:shard2 r:core_node1 x:collection1] o.a.s.c.ZkController Register replica - core:collection1 address:https://127.0.0.1:50701 collection:tmp_collection shard:shard2
   [junit4]   2> 304269 INFO  (coreZkRegister-1493-thread-1-processing-n:127.0.0.1:50701_ x:collection1 s:shard2 c:tmp_collection r:core_node1) [n:127.0.0.1:50701_ c:tmp_collection s:shard2 r:core_node1 x:collection1] o.a.s.c.c.SolrZkClient makePath: /collections/tmp_collection/leader_elect/shard2/election
   [junit4]   2> 304278 INFO  (coreZkRegister-1493-thread-1-processing-n:127.0.0.1:50701_ x:collection1 s:shard2 c:tmp_collection r:core_node1) [n:127.0.0.1:50701_ c:tmp_collection s:shard2 r:core_node1 x:collection1] o.a.s.c.LeaderElector Joined leadership election with path: /collections/tmp_collection/leader_elect/shard2/election/96380811796807685-core_node1-n_0000000000
   [junit4]   2> 304278 INFO  (coreZkRegister-1493-thread-1-processing-n:127.0.0.1:50701_ x:collection1 s:shard2 c:tmp_collection r:core_node1) [n:127.0.0.1:50701_ c:tmp_collection s:shard2 r:core_node1 x:collection1] o.a.s.c.ShardLeaderElectionContext Running the leader process for shard=shard2 and weAreReplacement=false and leaderVoteWait=10000
   [junit4]   2> 304280 INFO  (coreZkRegister-1493-thread-1-processing-n:127.0.0.1:50701_ x:collection1 s:shard2 c:tmp_collection r:core_node1) [n:127.0.0.1:50701_ c:tmp_collection s:shard2 r:core_node1 x:collection1] o.a.s.c.ShardLeaderElectionContext Enough replicas found to continue.
   [junit4]   2> 304280 INFO  (coreZkRegister-1493-thread-1-processing-n:127.0.0.1:50701_ x:collection1 s:shard2 c:tmp_collection r:core_node1) [n:127.0.0.1:50701_ c:tmp_collection s:shard2 r:core_node1 x:collection1] o.a.s.c.ShardLeaderElectionContext I may be the new leader - try and sync
   [junit4]   2> 304280 INFO  (coreZkRegister-1493-thread-1-processing-n:127.0.0.1:50701_ x:collection1 s:shard2 c:tmp_collection r:core_node1) [n:127.0.0.1:50701_ c:tmp_collection s:shard2 r:core_node1 x:collection1] o.a.s.c.SyncStrategy Sync replicas to https://127.0.0.1:50701/collection1/
   [junit4]   2> 304280 INFO  (coreZkRegister-1493-thread-1-processing-n:127.0.0.1:50701_ x:collection1 s:shard2 c:tmp_collection r:core_node1) [n:127.0.0.1:50701_ c:tmp_collection s:shard2 r:core_node1 x:collection1] o.a.s.c.SyncStrategy Sync Success - now sync replicas to me
   [junit4]   2> 304280 INFO  (coreZkRegister-1493-thread-1-processing-n:127.0.0.1:50701_ x:collection1 s:shard2 c:tmp_collection r:core_node1) [n:127.0.0.1:50701_ c:tmp_collection s:shard2 r:core_node1 x:collection1] o.a.s.c.SyncStrategy https://127.0.0.1:50701/collection1/ has no replicas
   [junit4]   2> 304281 INFO  (OverseerStateUpdate-96380811796807685-127.0.0.1:50701_-n_0000000000) [n:127.0.0.1:50701_    ] o.a.s.c.Overseer processMessage: queueSize: 1, message = {
   [junit4]   2>   "operation":"leader",
   [junit4]   2>   "shard":"shard2",
   [junit4]   2>   "collection":"tmp_collection"} current state version: 1
   [junit4]   2> 304281 INFO  (coreZkRegister-1493-thread-1-processing-n:127.0.0.1:50701_ x:collection1 s:shard2 c:tmp_collection r:core_node1) [n:127.0.0.1:50701_ c:tmp_collection s:shard2 r:core_node1 x:collection1] o.a.s.c.c.SolrZkClient makePath: /collections/tmp_collection/leaders/shard2
   [junit4]   2> 304283 INFO  (coreZkRegister-1493-thread-1-processing-n:127.0.0.1:50701_ x:collection1 s:shard2 c:tmp_collection r:core_node1) [n:127.0.0.1:50701_ c:tmp_collection s:shard2 r:core_node1 x:collection1] o.a.s.c.ShardLeaderElectionContextBase Creating leader registration node /collections/tmp_collection/leaders/shard2/leader after winning as /collections/tmp_collection/leader_elect/shard2/election/96380811796807685-core_node1-n_0000000000
   [junit4]   2> 304283 INFO  (zkCallback-500-thread-2-processing-n:127.0.0.1:50701_) [n:127.0.0.1:50701_    ] o.a.s.h.CdcrLeaderStateManager Received new leader state @ tmp_collection:shard2
   [junit4]   2> 304284 INFO  (coreZkRegister-1493-thread-1-processing-n:127.0.0.1:50701_ x:collection1 s:shard2 c:tmp_collection r:core_node1) [n:127.0.0.1:50701_ c:tmp_collection s:shard2 r:core_node1 x:collection1] o.a.s.c.ShardLeaderElectionContext I am the new leader: https://127.0.0.1:50701/collection1/ shard2
   [junit4]   2> 304285 INFO  (OverseerStateUpdate-96380811796807685-127.0.0.1:50701_-n_0000000000) [n:127.0.0.1:50701_    ] o.a.s.c.Overseer processMessage: queueSize: 1, message = {
   [junit4]   2>   "operation":"leader",
   [junit4]   2>   "shard":"shard2",
   [junit4]   2>   "collection":"tmp_collection",
   [junit4]   2>   "base_url":"https://127.0.0.1:50701",
   [junit4]   2>   "core":"collection1",
   [junit4]   2>   "state":"active"} current state version: 1
   [junit4]   2> 304386 INFO  (zkCallback-500-thread-2-processing-n:127.0.0.1:50701_) [n:127.0.0.1:50701_    ] o.a.s.c.c.ZkStateReader A cluster state change: [WatchedEvent state:SyncConnected type:NodeDataChanged path:/clusterstate.json], has occurred - updating... (live nodes size: [1])
   [junit4]   2> 304435 INFO  (coreZkRegister-1493-thread-1-processing-n:127.0.0.1:50701_ x:collection1 s:shard2 c:tmp_collection r:core_node1) [n:127.0.0.1:50701_ c:tmp_collection s:shard2 r:core_node1 x:collection1] o.a.s.c.ZkController We are https://127.0.0.1:50701/collection1/ and leader is https://127.0.0.1:50701/collection1/
   [junit4]   2> 304435 INFO  (coreZkRegister-1493-thread-1-processing-n:127.0.0.1:50701_ x:collection1 s:shard2 c:tmp_collection r:core_node1) [n:127.0.0.1:50701_ c:tmp_collection s:shard2 r:core_node1 x:collection1] o.a.s.c.ZkController No LogReplay needed for core=collection1 baseURL=https://127.0.0.1:50701
   [junit4]   2> 304436 INFO  (coreZkRegister-1493-thread-1-processing-n:127.0.0.1:50701_ x:collection1 s:shard2 c:tmp_collection r:core_node1) [n:127.0.0.1:50701_ c:tmp_collection s:shard2 r:core_node1 x:collection1] o.a.s.c.ZkController I am the leader, no recovery necessary
   [junit4]   2> 304436 INFO  (coreZkRegister-1493-thread-1-processing-n:127.0.0.1:50701_ x:collection1 s:shard2 c:tmp_collection r:core_node1) [n:127.0.0.1:50701_ c:tmp_collection s:shard2 r:core_node1 x:collection1] o.a.s.c.ZkController publishing state=active
   [junit4]   2> 304436 INFO  (coreZkRegister-1493-thread-1-processing-n:127.0.0.1:50701_ x:collection1 s:shard2 c:tmp_collection r:core_node1) [n:127.0.0.1:50701_ c:tmp_collection s:shard2 r:core_node1 x:collection1] o.a.s.c.ZkController numShards not found on descriptor - reading it from system property
   [junit4]   2> 304436 INFO  (coreZkRegister-1493-thread-1-processing-n:127.0.0.1:50701_ x:collection1 s:shard2 c:tmp_collection r:core_node1) [n:127.0.0.1:50701_ c:tmp_collection s:shard2 r:core_node1 x:collection1] o.a.s.c.c.ZkStateReader Checking legacy cluster state for collection tmp_collection
   [junit4]   2> 304437 INFO  (OverseerStateUpdate-96380811796807685-127.0.0.1:50701_-n_0000000000) [n:127.0.0.1:50701_    ] o.a.s.c.Overseer processMessage: queueSize: 1, message = {
   [junit4]   2>   "core":"collection1",
   [junit4]   2>   "core_node_name":"core_node1",
   [junit4]   2>   "roles":null,
   [junit4]   2>   "base_url":"https://127.0.0.1:50701",
   [junit4]   2>   "node_name":"127.0.0.1:50701_",
   [junit4]   2>   "numShards":"2",
   [junit4]   2>   "state":"active",
   [junit4]   2>   "shard":"shard2",
   [junit4]   2>   "collection":"tmp_collection",
   [junit4]   2>   "operation":"state"} current state version: 2
   [junit4]   2> 304437 INFO  (OverseerStateUpdate-96380811796807685-127.0.0.1:50701_-n_0000000000) [n:127.0.0.1:50701_    ] o.a.s.c.o.ReplicaMutator Update state numShards=2 message={
   [junit4]   2>   "core":"collection1",
   [junit4]   2>   "core_node_name":"core_node1",
   [junit4]   2>   "roles":null,
   [junit4]   2>   "base_url":"https://127.0.0.1:50701",
   [junit4]   2>   "node_name":"127.0.0.1:50701_",
   [junit4]   2>   "numShards":"2",
   [junit4]   2>   "state":"active",
   [junit4]   2>   "shard":"shard2",
   [junit4]   2>   "collection":"tmp_collection",
   [junit4]   2>   "operation":"state"}
   [junit4]   2> 304541 INFO  (zkCallback-500-thread-1-processing-n:127.0.0.1:50701_) [n:127.0.0.1:50701_    ] o.a.s.c.c.ZkStateReader A cluster state change: [WatchedEvent state:SyncConnected type:NodeDataChanged path:/clusterstate.json], has occurred - updating... (live nodes size: [1])
   [junit4]   2> 304692 INFO  (TEST-CdcrReplicationDistributedZkTest.testBufferOnNonLeader-seed#[C519C4A7A908694E]) [    ] o.a.s.SolrTestCaseJ4 Writing core.properties file to /x1/jenkins/jenkins-slave/workspace/Lucene-Solr-NightlyTests-6.x/solr/build/solr-core/test/J1/temp/solr.cloud.CdcrReplicationDistributedZkTest_C519C4A7A908694E-001/jetty-002/cores/collection1
   [junit4]   2> 304694 INFO  (TEST-CdcrReplicationDistributedZkTest.testBufferOnNonLeader-seed#[C519C4A7A908694E]) [    ] o.e.j.s.Server jetty-9.3.8.v20160314
   [junit4]   2> 304696 INFO  (TEST-CdcrReplicationDistributedZkTest.testBufferOnNonLeader-seed#[C519C4A7A908694E]) [    ] o.e.j.s.h.ContextHandler Started o.e.j.s.ServletContextHandler@2e703e69{/,null,AVAILABLE}
   [junit4]   2> 304699 INFO  (TEST-CdcrReplicationDistributedZkTest.testBufferOnNonLeader-seed#[C519C4A7A908694E]) [    ] o.e.j.s.ServerConnector Started ServerConnector@2eb367ed{SSL,[ssl, http/1.1]}{127.0.0.1:47996}
   [junit4]   2> 304699 INFO  (TEST-CdcrReplicationDistributedZkTest.testBufferOnNonLeader-seed#[C519C4A7A908694E]) [    ] o.e.j.s.Server Started @306852ms
   [junit4]   2> 304699 INFO  (TEST-CdcrReplicationDistributedZkTest.testBufferOnNonLeader-seed#[C519C4A7A908694E]) [    ] o.a.s.c.s.e.JettySolrRunner Jetty properties: {shards=shard2, hostContext=/, hostPort=47996, coreRootDirectory=/x1/jenkins/jenkins-slave/workspace/Lucene-Solr-NightlyTests-6.x/solr/build/solr-core/test/J1/temp/solr.cloud.CdcrReplicationDistributedZkTest_C519C4A7A908694E-001/jetty-002/cores}
   [junit4]   2> 304700 INFO  (TEST-CdcrReplicationDistributedZkTest.testBufferOnNonLeader-seed#[C519C4A7A908694E]) [    ] o.a.s.s.SolrDispatchFilter SolrDispatchFilter.init(): sun.misc.Launcher$AppClassLoader@73d16e93
   [junit4]   2> 304700 INFO  (TEST-CdcrReplicationDistributedZkTest.testBufferOnNonLeader-seed#[C519C4A7A908694E]) [    ] o.a.s.c.SolrResourceLoader new SolrResourceLoader for directory: '/x1/jenkins/jenkins-slave/workspace/Lucene-Solr-NightlyTests-6.x/solr/build/solr-core/test/J1/temp/solr.cloud.CdcrReplicationDistributedZkTest_C519C4A7A908694E-001/jetty-002'
   [junit4]   2> 304700 INFO  (TEST-CdcrReplicationDistributedZkTest.testBufferOnNonLeader-seed#[C519C4A7A908694E]) [    ] o.a.s.c.SolrResourceLoader JNDI not configured for solr (NoInitialContextEx)
   [junit4]   2> 304700 INFO  (TEST-CdcrReplicationDistributedZkTest.testBufferOnNonLeader-seed#[C519C4A7A908694E]) [    ] o.a.s.c.SolrResourceLoader solr home defaulted to 'solr/' (could not find system property or JNDI)
   [junit4]   2> 304702 INFO  (TEST-CdcrReplicationDistributedZkTest.testBufferOnNonLeader-seed#[C519C4A7A908694E]) [    ] o.a.s.c.c.SolrZkClient Using default ZkCredentialsProvider
   [junit4]   2> 304702 INFO  (TEST-CdcrReplicationDistributedZkTest.testBufferOnNonLeader-seed#[C519C4A7A908694E]) [    ] o.a.s.c.c.ConnectionManager Waiting for client to connect to ZooKeeper
   [junit4]   2> 304704 INFO  (zkCallback-502-thread-1) [    ] o.a.s.c.c.ConnectionManager Watcher org.apache.solr.common.cloud.ConnectionManager@59ba42bb name:ZooKeeperConnection Watcher:127.0.0.1:41903/solr got event WatchedEvent state:SyncConnected type:None path:null path:null type:None
   [junit4]   2> 304704 INFO  (TEST-CdcrReplicationDistributedZkTest.testBufferOnNonLeader-seed#[C519C4A7A908694E]) [    ] o.a.s.c.c.ConnectionManager Client is connected to ZooKeeper
   [junit4]   2> 304704 INFO  (TEST-CdcrReplicationDistributedZkTest.testBufferOnNonLeader-seed#[C519C4A7A908694E]) [    ] o.a.s.c.c.SolrZkClient Using default ZkACLProvider
   [junit4]   2> 304705 INFO  (TEST-CdcrReplicationDistributedZkTest.testBufferOnNonLeader-seed#[C519C4A7A908694E]) [    ] o.a.s.s.SolrDispatchFilter Loading solr.xml from SolrHome (not found in ZooKeeper)
   [junit4]   2> 304705 INFO  (TEST-CdcrReplicationDistributedZkTest.testBufferOnNonLeader-seed#[C519C4A7A908694E]) [    ] o.a.s.c.SolrXmlConfig Loading container configuration from /x1/jenkins/jenkins-slave/workspace/Lucene-Solr-NightlyTests-6.x/solr/build/solr-core/test/J1/temp/solr.cloud.CdcrReplicationDistributedZkTest_C519C4A7A908694E-001/jetty-002/solr.xml
   [junit4]   2> 304709 INFO  (TEST-CdcrReplicationDistributedZkTest.testBufferOnNonLeader-seed#[C519C4A7A908694E]) [    ] o.a.s.c.CorePropertiesLocator Config-defined core root directory: /x1/jenkins/jenkins-slave/workspace/Lucene-Solr-NightlyTests-6.x/solr/build/solr-core/test/J1/temp/solr.cloud.CdcrReplicationDistributedZkTest_C519C4A7A908694E-001/jetty-002/cores
   [junit4]   2> 304709 INFO  (TEST-CdcrReplicationDistributedZkTest.testBufferOnNonLeader-seed#[C519C4A7A908694E]) [    ] o.a.s.c.CoreContainer New CoreContainer 900869275
   [junit4]   2> 304709 INFO  (TEST-CdcrReplicationDistributedZkTest.testBufferOnNonLeader-seed#[C519C4A7A908694E]) [    ] o.a.s.c.CoreContainer Loading cores into CoreContainer [instanceDir=/x1/jenkins/jenkins-slave/workspace/Lucene-Solr-NightlyTests-6.x/solr/build/solr-core/test/J1/temp/solr.cloud.CdcrReplicationDistributedZkTest_C519C4A7A908694E-001/jetty-002]
   [junit4]   2> 304709 WARN  (TEST-CdcrReplicationDistributedZkTest.testBufferOnNonLeader-seed#[C519C4A7A908694E]) [    ] o.a.s.c.CoreContainer Couldn't add files from /x1/jenkins/jenkins-slave/workspace/Lucene-Solr-NightlyTests-6.x/solr/build/solr-core/test/J1/temp/solr.cloud.CdcrReplicationDistributedZkTest_C519C4A7A908694E-001/jetty-002/lib to classpath: /x1/jenkins/jenkins-slave/workspace/Lucene-Solr-NightlyTests-6.x/solr/build/solr-core/test/J1/temp/solr.cloud.CdcrReplicationDistributedZkTest_C519C4A7A908694E-001/jetty-002/lib
   [junit4]   2> 304710 INFO  (TEST-CdcrReplicationDistributedZkTest.testBufferOnNonLeader-seed#[C519C4A7A908694E]) [    ] o.a.s.h.c.HttpShardHandlerFactory created with socketTimeout : 90000,urlScheme : ,connTimeout : 15000,maxConnectionsPerHost : 20,maxConnections : 10000,corePoolSize : 0,maximumPoolSize : 2147483647,maxThreadIdleTime : 5,sizeOfQueue : -1,fairnessPolicy : false,useRetries : false,connectionsEvictorSleepDelay : 5000,maxConnectionIdleTime : 40000,
   [junit4]   2> 304711 INFO  (TEST-CdcrReplicationDistributedZkTest.testBufferOnNonLeader-seed#[C519C4A7A908694E]) [    ] o.a.s.u.UpdateShardHandler Creating UpdateShardHandler HTTP client with params: socketTimeout=340000&connTimeout=45000&retry=true
   [junit4]   2> 304711 INFO  (TEST-CdcrReplicationDistributedZkTest.testBufferOnNonLeader-seed#[C519C4A7A908694E]) [    ] o.a.s.l.LogWatcher SLF4J impl is org.slf4j.impl.Log4jLoggerFactory
   [junit4]   2> 304711 INFO  (TEST-CdcrReplicationDistributedZkTest.testBufferOnNonLeader-seed#[C519C4A7A908694E]) [    ] o.a.s.l.LogWatcher Registering Log Listener [Log4j (org.slf4j.impl.Log4jLoggerFactory)]
   [junit4]   2> 304711 INFO  (TEST-CdcrReplicationDistributedZkTest.testBufferOnNonLeader-seed#[C519C4A7A908694E]) [    ] o.a.s.c.ZkContainer Zookeeper client=127.0.0.1:41903/solr
   [junit4]   2> 304711 INFO  (TEST-CdcrReplicationDistributedZkTest.testBufferOnNonLeader-seed#[C519C4A7A908694E]) [    ] o.a.s.c.ZkController zkHost includes chroot
   [junit4]   2> 304711 INFO  (TEST-CdcrReplicationDistributedZkTest.testBufferOnNonLeader-seed#[C519C4A7A908694E]) [    ] o.a.s.c.c.SolrZkClient Using default ZkCredentialsProvider
   [junit4]   2> 304716 INFO  (TEST-CdcrReplicationDistributedZkTest.testBufferOnNonLeader-seed#[C519C4A7A908694E]) [    ] o.a.s.c.c.ConnectionManager Waiting for client to connect to ZooKeeper
   [junit4]   2> 304718 INFO  (zkCallback-505-thread-1) [    ] o.a.s.c.c.ConnectionManager Watcher org.apache.solr.common.cloud.ConnectionManager@4b8152b9 name:ZooKeeperConnection Watcher:127.0.0.1:41903 got event WatchedEvent state:SyncConnected type:None path:null path:null type:None
   [junit4]   2> 304718 INFO  (TEST-CdcrReplicationDistributedZkTest.testBufferOnNonLeader-seed#[C519C4A7A908694E]) [    ] o.a.s.c.c.ConnectionManager Client is connected to ZooKeeper
   [junit4]   2> 304718 INFO  (TEST-CdcrReplicationDistributedZkTest.testBufferOnNonLeader-seed#[C519C4A7A908694E]) [    ] o.a.s.c.c.SolrZkClient Using default ZkACLProvider
   [junit4]   2> 304719 INFO  (TEST-CdcrReplicationDistributedZkTest.testBufferOnNonLeader-seed#[C519C4A7A908694E]) [n:127.0.0.1:47996_    ] o.a.s.c.ZkController Added new OnReconnect listener org.apache.solr.cloud.ZkController$$Lambda$10/276052250@48471094
   [junit4]   2> 304721 INFO  (TEST-CdcrReplicationDistributedZkTest.testBufferOnNonLeader-seed#[C519C4A7A908694E]) [n:127.0.0.1:47996_    ] o.a.s.c.c.ConnectionManager Waiting for client to connect to ZooKeeper
   [junit4]   2> 304722 INFO  (zkCallback-506-thread-1-processing-n:127.0.0.1:47996_) [n:127.0.0.1:47996_    ] o.a.s.c.c.ConnectionManager Watcher org.apache.solr.common.cloud.ConnectionManager@6b1f9a2c name:ZooKeeperConnection Watcher:127.0.0.1:41903/solr got event WatchedEvent state:SyncConnected type:None path:null path:null type:None
   [junit4]   2> 304722 INFO  (TEST-CdcrReplicationDistributedZkTest.testBufferOnNonLeader-seed#[C519C4A7A908694E]) [n:127.0.0.1:47996_    ] o.a.s.c.c.ConnectionManager Client is connected to ZooKeeper
   [junit4]   2> 304735 INFO  (TEST-CdcrReplicationDistributedZkTest.testBufferOnNonLeader-seed#[C519C4A7A908694E]) [n:127.0.0.1:47996_    ] o.a.s.c.c.ZkStateReader Updating cluster state from ZooKeeper... 
   [junit4]   2> 304736 INFO  (TEST-CdcrReplicationDistributedZkTest.testBufferOnNonLeader-seed#[C519C4A7A908694E]) [n:127.0.0.1:47996_    ] o.a.s.c.c.ZkStateReader Loaded cluster properties: {urlScheme=https}
   [junit4]   2> 304736 INFO  (TEST-CdcrReplicationDistributedZkTest.testBufferOnNonLeader-seed#[C519C4A7A908694E]) [n:127.0.0.1:47996_    ] o.a.s.c.c.ZkStateReader Updated live nodes from ZooKeeper... (0) -> (1)
   [junit4]   2> 304740 INFO  (TEST-CdcrReplicationDistributedZkTest.testBufferOnNonLeader-seed#[C519C4A7A908694E]) [n:127.0.0.1:47996_    ] o.a.s.c.Overseer Overseer (id=null) closing
   [junit4]   2> 304740 INFO  (TEST-CdcrReplicationDistributedZkTest.testBufferOnNonLeader-seed#[C519C4A7A908694E]) [n:127.0.0.1:47996_    ] o.a.s.c.LeaderElector Joined leadership election with path: /overseer_elect/election/96380811796807688-127.0.0.1:47996_-n_0000000001
   [junit4]   2> 304741 INFO  (TEST-CdcrReplicationDistributedZkTest.testBufferOnNonLeader-seed#[C519C4A7A908694E]) [n:127.0.0.1:47996_    ] o.a.s.c.LeaderElector Watching path /overseer_elect/election/96380811796807685-127.0.0.1:50701_-n_0000000000 to know if I could be the leader
   [junit4]   2> 304741 INFO  (TEST-CdcrReplicationDistributedZkTest.testBufferOnNonLeader-seed#[C519C4A7A908694E]) [n:127.0.0.1:47996_    ] o.a.s.c.ZkController Publish node=127.0.0.1:47996_ as DOWN
   [junit4]   2> 304743 INFO  (TEST-CdcrReplicationDistributedZkTest.testBufferOnNonLeader-seed#[C519C4A7A908694E]) [n:127.0.0.1:47996_    ] o.a.s.c.ZkController Register node as live in ZooKeeper:/live_nodes/127.0.0.1:47996_
   [junit4]   2> 304743 INFO  (TEST-CdcrReplicationDistributedZkTest.testBufferOnNonLeader-seed#[C519C4A7A908694E]) [n:127.0.0.1:47996_    ] o.a.s.c.c.SolrZkClient makePath: /live_nodes/127.0.0.1:47996_
   [junit4]   2> 304743 INFO  (OverseerStateUpdate-96380811796807685-127.0.0.1:50701_-n_0000000000) [n:127.0.0.1:50701_    ] o.a.s.c.Overseer processMessage: queueSize: 1, message = {
   [junit4]   2>   "operation":"downnode",
   [junit4]   2>   "node_name":"127.0.0.1:47996_"} current state version: 3
   [junit4]   2> 304743 INFO  (OverseerStateUpdate-96380811796807685-127.0.0.1:50701_-n_0000000000) [n:127.0.0.1:50701_    ] o.a.s.c.o.NodeMutator DownNode state invoked for node: 127.0.0.1:47996_
   [junit4]   2> 304744 INFO  (zkCallback-500-thread-3-processing-n:127.0.0.1:50701_) [n:127.0.0.1:50701_    ] o.a.s.c.c.ZkStateReader A live node change: [WatchedEvent state:SyncConnected type:NodeChildrenChanged path:/live_nodes], has occurred - updating... (live nodes size: [1])
   [junit4]   2> 304744 INFO  (zkCallback-506-thread-1-processing-n:127.0.0.1:47996_) [n:127.0.0.1:47996_    ] o.a.s.c.c.ZkStateReader A live node change: [WatchedEvent state:SyncConnected type:NodeChildrenChanged path:/live_nodes], has occurred - updating... (live nodes size: [1])
   [junit4]   2> 304745 INFO  (zkCallback-500-thread-3-processing-n:127.0.0.1:50701_) [n:127.0.0.1:50701_    ] o.a.s.c.c.ZkStateReader Updated live nodes from ZooKeeper... (1) -> (2)
   [junit4]   2> 304749 INFO  (zkCallback-506-thread-1-processing-n:127.0.0.1:47996_) [n:127.0.0.1:47996_    ] o.a.s.c.c.ZkStateReader Updated live nodes from ZooKeeper... (1) -> (2)
   [junit4]   2> 304755 INFO  (TEST-CdcrReplicationDistributedZkTest.testBufferOnNonLeader-seed#[C519C4A7A908694E]) [n:127.0.0.1:47996_    ] o.a.s.c.CoreContainer Security conf doesn't exist. Skipping setup for authorization module.
   [junit4]   2> 304755 INFO  (TEST-CdcrReplicationDistributedZkTest.testBufferOnNonLeader-seed#[C519C4A7A908694E]) [n:127.0.0.1:47996_    ] o.a.s.c.CoreContainer No authentication plugin used.
   [junit4]   2> 304756 INFO  (TEST-CdcrReplicationDistributedZkTest.testBufferOnNonLeader-seed#[C519C4A7A908694E]) [n:127.0.0.1:47996_    ] o.a.s.c.CorePropertiesLocator Looking for core definitions underneath /x1/jenkins/jenkins-slave/workspace/Lucene-Solr-NightlyTests-6.x/solr/build/solr-core/test/J1/temp/solr.cloud.CdcrReplicationDistributedZkTest_C519C4A7A908694E-001/jetty-002/cores
   [junit4]   2> 304757 INFO  (TEST-CdcrReplicationDistributedZkTest.testBufferOnNonLeader-seed#[C519C4A7A908694E]) [n:127.0.0.1:47996_    ] o.a.s.c.CoreDescriptor Created CoreDescriptor: {name=collection1, config=solrconfig.xml, transient=false, schema=schema.xml, loadOnStartup=true, configSetProperties=configsetprops.json, collection=tmp_collection, coreNodeName=, dataDir=data/, shard=}
   [junit4]   2> 304757 INFO  (TEST-CdcrReplicationDistributedZkTest.testBufferOnNonLeader-seed#[C519C4A7A908694E]) [n:127.0.0.1:47996_    ] o.a.s.c.CorePropertiesLocator Found core collection1 in /x1/jenkins/jenkins-slave/workspace/Lucene-Solr-NightlyTests-6.x/solr/build/solr-core/test/J1/temp/solr.cloud.CdcrReplicationDistributedZkTest_C519C4A7A908694E-001/jetty-002/cores/collection1
   [junit4]   2> 304757 INFO  (TEST-CdcrReplicationDistributedZkTest.testBufferOnNonLeader-seed#[C519C4A7A908694E]) [n:127.0.0.1:47996_    ] o.a.s.c.CorePropertiesLocator Found 1 core definitions
   [junit4]   2> 304758 INFO  (coreLoadExecutor-1511-thread-1-processing-n:127.0.0.1:47996_) [n:127.0.0.1:47996_ c:tmp_collection   x:collection1] o.a.s.c.ZkController publishing state=down
   [junit4]   2> 304758 INFO  (TEST-CdcrReplicationDistributedZkTest.testBufferOnNonLeader-seed#[C519C4A7A908694E]) [n:127.0.0.1:47996_    ] o.a.s.s.SolrDispatchFilter user.dir=/x1/jenkins/jenkins-slave/workspace/Lucene-Solr-NightlyTests-6.x/solr/build/solr-core/test/J1
   [junit4]   2> 304758 INFO  (coreLoadExecutor-1511-thread-1-processing-n:127.0.0.1:47996_) [n:127.0.0.1:47996_ c:tmp_collection   x:collection1] o.a.s.c.ZkController numShards not found on descriptor - reading it from system property
   [junit4]   2> 304758 INFO  (TEST-CdcrReplicationDistributedZkTest.testBufferOnNonLeader-seed#[C519C4A7A908694E]) [n:127.0.0.1:47996_    ] o.a.s.s.SolrDispatchFilter SolrDispatchFilter.init() done
   [junit4]   2> 304759 INFO  (coreLoadExecutor-1511-thread-1-processing-n:127.0.0.1:47996_) [n:127.0.0.1:47996_ c:tmp_collection   x:collection1] o.a.s.c.ZkController Registering watch for collection tmp_collection
   [junit4]   2> 304759 INFO  (coreLoadExecutor-1511-thread-1-processing-n:127.0.0.1:47996_) [n:127.0.0.1:47996_ c:tmp_collection   x:collection1] o.a.s.c.c.ZkStateReader Deleting data for [tmp_collection]
   [junit4]   2> 304759 INFO  (OverseerStateUpdate-96380811796807685-127.0.0.1:50701_-n_0000000000) [n:127.0.0.1:50701_    ] o.a.s.c.Overseer processMessage: queueSize: 1, message = {
   [junit4]   2>   "core":"collection1",
   [junit4]   2>   "roles":null,
   [junit4]   2>   "base_url":"https://127.0.0.1:47996",
   [junit4]   2>   "node_name":"127.0.0.1:47996_",
   [junit4]   2>   "numShards":"2",
   [junit4]   2>   "state":"down",
   [junit4]   2>   "shard":null,
   [junit4]   2>   "collection":"tmp_collection",
   [junit4]   2>   "operation":"state"} current state version: 3
   [junit4]   2> 304760 INFO  (OverseerStateUpdate-96380811796807685-127.0.0.1:50701_-n_000

[...truncated too long message...]

exception-2.0.0-M15.jar:/x1/jenkins/jenkins-slave/workspace/Lucene-Solr-NightlyTests-6.x/solr/core/test-lib/apacheds-interceptors-journal-2.0.0-M15.jar:/x1/jenkins/jenkins-slave/workspace/Lucene-Solr-NightlyTests-6.x/solr/core/test-lib/apacheds-interceptors-normalization-2.0.0-M15.jar:/x1/jenkins/jenkins-slave/workspace/Lucene-Solr-NightlyTests-6.x/solr/core/test-lib/apacheds-interceptors-operational-2.0.0-M15.jar:/x1/jenkins/jenkins-slave/workspace/Lucene-Solr-NightlyTests-6.x/solr/core/test-lib/apacheds-interceptors-referral-2.0.0-M15.jar:/x1/jenkins/jenkins-slave/workspace/Lucene-Solr-NightlyTests-6.x/solr/core/test-lib/apacheds-interceptors-schema-2.0.0-M15.jar:/x1/jenkins/jenkins-slave/workspace/Lucene-Solr-NightlyTests-6.x/solr/core/test-lib/apacheds-interceptors-subtree-2.0.0-M15.jar:/x1/jenkins/jenkins-slave/workspace/Lucene-Solr-NightlyTests-6.x/solr/core/test-lib/apacheds-interceptors-trigger-2.0.0-M15.jar:/x1/jenkins/jenkins-slave/workspace/Lucene-Solr-NightlyTests-6.x/solr/core/test-lib/apacheds-jdbm-partition-2.0.0-M15.jar:/x1/jenkins/jenkins-slave/workspace/Lucene-Solr-NightlyTests-6.x/solr/core/test-lib/apacheds-jdbm1-2.0.0-M2.jar:/x1/jenkins/jenkins-slave/workspace/Lucene-Solr-NightlyTests-6.x/solr/core/test-lib/apacheds-kerberos-codec-2.0.0-M15.jar:/x1/jenkins/jenkins-slave/workspace/Lucene-Solr-NightlyTests-6.x/solr/core/test-lib/apacheds-ldif-partition-2.0.0-M15.jar:/x1/jenkins/jenkins-slave/workspace/Lucene-Solr-NightlyTests-6.x/solr/core/test-lib/apacheds-mavibot-partition-2.0.0-M15.jar:/x1/jenkins/jenkins-slave/workspace/Lucene-Solr-NightlyTests-6.x/solr/core/test-lib/apacheds-protocol-kerberos-2.0.0-M15.jar:/x1/jenkins/jenkins-slave/workspace/Lucene-Solr-NightlyTests-6.x/solr/core/test-lib/apacheds-protocol-ldap-2.0.0-M15.jar:/x1/jenkins/jenkins-slave/workspace/Lucene-Solr-NightlyTests-6.x/solr/core/test-lib/apacheds-protocol-shared-2.0.0-M15.jar:/x1/jenkins/jenkins-slave/workspace/Lucene-Solr-NightlyTests-6.x/solr/core/test-lib/apacheds-xdbm-partition-2.0.0-M15.jar:/x1/jenkins/jenkins-slave/workspace/Lucene-Solr-NightlyTests-6.x/solr/core/test-lib/api-all-1.0.0-M20.jar:/x1/jenkins/jenkins-slave/workspace/Lucene-Solr-NightlyTests-6.x/solr/core/test-lib/bcprov-jdk15-1.45.jar:/x1/jenkins/jenkins-slave/workspace/Lucene-Solr-NightlyTests-6.x/solr/core/test-lib/cglib-nodep-2.2.jar:/x1/jenkins/jenkins-slave/workspace/Lucene-Solr-NightlyTests-6.x/solr/core/test-lib/commons-collections-3.2.2.jar:/x1/jenkins/jenkins-slave/workspace/Lucene-Solr-NightlyTests-6.x/solr/core/test-lib/commons-math3-3.4.1.jar:/x1/jenkins/jenkins-slave/workspace/Lucene-Solr-NightlyTests-6.x/solr/core/test-lib/easymock-3.0.jar:/x1/jenkins/jenkins-slave/workspace/Lucene-Solr-NightlyTests-6.x/solr/core/test-lib/ehcache-core-2.4.4.jar:/x1/jenkins/jenkins-slave/workspace/Lucene-Solr-NightlyTests-6.x/solr/core/test-lib/hadoop-common-2.7.2-tests.jar:/x1/jenkins/jenkins-slave/workspace/Lucene-Solr-NightlyTests-6.x/solr/core/test-lib/hadoop-hdfs-2.7.2-tests.jar:/x1/jenkins/jenkins-slave/workspace/Lucene-Solr-NightlyTests-6.x/solr/core/test-lib/hadoop-minikdc-2.7.2.jar:/x1/jenkins/jenkins-slave/workspace/Lucene-Solr-NightlyTests-6.x/solr/core/test-lib/htrace-core-3.2.0-incubating.jar:/x1/jenkins/jenkins-slave/workspace/Lucene-Solr-NightlyTests-6.x/solr/core/test-lib/jackson-annotations-2.5.4.jar:/x1/jenkins/jenkins-slave/workspace/Lucene-Solr-NightlyTests-6.x/solr/core/test-lib/jackson-core-asl-1.9.13.jar:/x1/jenkins/jenkins-slave/workspace/Lucene-Solr-NightlyTests-6.x/solr/core/test-lib/jackson-databind-2.5.4.jar:/x1/jenkins/jenkins-slave/workspace/Lucene-Solr-NightlyTests-6.x/solr/core/test-lib/jackson-mapper-asl-1.9.13.jar:/x1/jenkins/jenkins-slave/workspace/Lucene-Solr-NightlyTests-6.x/solr/core/test-lib/jersey-core-1.9.jar:/x1/jenkins/jenkins-slave/workspace/Lucene-Solr-NightlyTests-6.x/solr/core/test-lib/jersey-server-1.9.jar:/x1/jenkins/jenkins-slave/workspace/Lucene-Solr-NightlyTests-6.x/solr/core/test-lib/jetty-6.1.26.jar:/x1/jenkins/jenkins-slave/workspace/Lucene-Solr-NightlyTests-6.x/solr/core/test-lib/jetty-util-6.1.26.jar:/x1/jenkins/jenkins-slave/workspace/Lucene-Solr-NightlyTests-6.x/solr/core/test-lib/mina-core-2.0.0-M5.jar:/x1/jenkins/jenkins-slave/workspace/Lucene-Solr-NightlyTests-6.x/solr/core/test-lib/mockito-core-1.9.5.jar:/x1/jenkins/jenkins-slave/workspace/Lucene-Solr-NightlyTests-6.x/solr/core/test-lib/netty-all-4.0.36.Final.jar:/x1/jenkins/jenkins-slave/workspace/Lucene-Solr-NightlyTests-6.x/solr/core/test-lib/objenesis-1.2.jar:/x1/jenkins/jenkins-slave/workspace/Lucene-Solr-NightlyTests-6.x/solr/core/test-lib/presto-parser-0.122.jar:/x1/jenkins/jenkins-slave/workspace/Lucene-Solr-NightlyTests-6.x/solr/core/test-lib/slice-0.10.jar:/x1/jenkins/jenkins-slave/workspace/Lucene-Solr-NightlyTests-6.x/lucene/build/analysis/icu/lucene-analyzers-icu-6.2.0-SNAPSHOT.jar:/x1/jenkins/jenkins-slave/workspace/Lucene-Solr-NightlyTests-6.x/solr/build/contrib/solr-analysis-extras/classes/java:/x1/jenkins/jenkins-slave/workspace/Lucene-Solr-NightlyTests-6.x/lucene/build/queryparser/classes/test:/x1/jenkins/jenkins-slave/workspace/Lucene-Solr-NightlyTests-6.x/solr/contrib/analysis-extras/lib/icu4j-56.1.jar:/home/jenkins/jenkins-slave/tools/hudson.tasks.Ant_AntInstallation/ant-1.8.2/lib/ant-launcher.jar:/x1/jenkins/.ant/lib/ivy-2.3.0.jar:/home/jenkins/jenkins-slave/tools/hudson.tasks.Ant_AntInstallation/ant-1.8.2/lib/ant-antlr.jar:/home/jenkins/jenkins-slave/tools/hudson.tasks.Ant_AntInstallation/ant-1.8.2/lib/ant-apache-regexp.jar:/home/jenkins/jenkins-slave/tools/hudson.tasks.Ant_AntInstallation/ant-1.8.2/lib/ant-apache-resolver.jar:/home/jenkins/jenkins-slave/tools/hudson.tasks.Ant_AntInstallation/ant-1.8.2/lib/ant-commons-net.jar:/home/jenkins/jenkins-slave/tools/hudson.tasks.Ant_AntInstallation/ant-1.8.2/lib/ant-jmf.jar:/home/jenkins/jenkins-slave/tools/hudson.tasks.Ant_AntInstallation/ant-1.8.2/lib/ant-apache-oro.jar:/home/jenkins/jenkins-slave/tools/hudson.tasks.Ant_AntInstallation/ant-1.8.2/lib/ant-apache-xalan2.jar:/home/jenkins/jenkins-slave/tools/hudson.tasks.Ant_AntInstallation/ant-1.8.2/lib/ant-commons-logging.jar:/home/jenkins/jenkins-slave/tools/hudson.tasks.Ant_AntInstallation/ant-1.8.2/lib/ant-jsch.jar:/home/jenkins/jenkins-slave/tools/hudson.tasks.Ant_AntInstallation/ant-1.8.2/lib/ant-junit4.jar:/home/jenkins/jenkins-slave/tools/hudson.tasks.Ant_AntInstallation/ant-1.8.2/lib/ant-javamail.jar:/home/jenkins/jenkins-slave/tools/hudson.tasks.Ant_AntInstallation/ant-1.8.2/lib/ant-jai.jar:/home/jenkins/jenkins-slave/tools/hudson.tasks.Ant_AntInstallation/ant-1.8.2/lib/ant-jdepend.jar:/home/jenkins/jenkins-slave/tools/hudson.tasks.Ant_AntInstallation/ant-1.8.2/lib/ant-junit.jar:/home/jenkins/jenkins-slave/tools/hudson.tasks.Ant_AntInstallation/ant-1.8.2/lib/ant-apache-bsf.jar:/home/jenkins/jenkins-slave/tools/hudson.tasks.Ant_AntInstallation/ant-1.8.2/lib/ant-swing.jar:/home/jenkins/jenkins-slave/tools/hudson.tasks.Ant_AntInstallation/ant-1.8.2/lib/ant.jar:/home/jenkins/jenkins-slave/tools/hudson.tasks.Ant_AntInstallation/ant-1.8.2/lib/ant-netrexx.jar:/home/jenkins/jenkins-slave/tools/hudson.tasks.Ant_AntInstallation/ant-1.8.2/lib/ant-apache-bcel.jar:/home/jenkins/jenkins-slave/tools/hudson.tasks.Ant_AntInstallation/ant-1.8.2/lib/ant-testutil.jar:/home/jenkins/jenkins-slave/tools/hudson.tasks.Ant_AntInstallation/ant-1.8.2/lib/ant-apache-log4j.jar:/x1/jenkins/jenkins-slave/tools/hudson.model.JDK/latest1.8/lib/tools.jar:/x1/jenkins/.ivy2/cache/com.carrotsearch.randomizedtesting/junit4-ant/jars/junit4-ant-2.3.4.jar com.carrotsearch.ant.tasks.junit4.slave.SlaveMainSafe -eventsfile /x1/jenkins/jenkins-slave/workspace/Lucene-Solr-NightlyTests-6.x/solr/build/solr-core/test/temp/junit4-J2-20160808_110251_850.events @/x1/jenkins/jenkins-slave/workspace/Lucene-Solr-NightlyTests-6.x/solr/build/solr-core/test/temp/junit4-J2-20160808_110251_850.suites -stdin
   [junit4] ERROR: JVM J2 ended with an exception: Quit event not received from the forked process? This may indicate JVM crash or runner bugs.
   [junit4] 	at com.carrotsearch.ant.tasks.junit4.JUnit4.executeSlave(JUnit4.java:1501)
   [junit4] 	at com.carrotsearch.ant.tasks.junit4.JUnit4.access$000(JUnit4.java:121)
   [junit4] 	at com.carrotsearch.ant.tasks.junit4.JUnit4$2.call(JUnit4.java:955)
   [junit4] 	at com.carrotsearch.ant.tasks.junit4.JUnit4$2.call(JUnit4.java:952)
   [junit4] 	at java.util.concurrent.FutureTask.run(FutureTask.java:266)
   [junit4] 	at java.util.concurrent.ThreadPoolExecutor.runWorker(ThreadPoolExecutor.java:1142)
   [junit4] 	at java.util.concurrent.ThreadPoolExecutor$Worker.run(ThreadPoolExecutor.java:617)
   [junit4] 	at java.lang.Thread.run(Thread.java:745)

BUILD FAILED
/x1/jenkins/jenkins-slave/workspace/Lucene-Solr-NightlyTests-6.x/build.xml:771: The following error occurred while executing this line:
/x1/jenkins/jenkins-slave/workspace/Lucene-Solr-NightlyTests-6.x/build.xml:707: The following error occurred while executing this line:
/x1/jenkins/jenkins-slave/workspace/Lucene-Solr-NightlyTests-6.x/build.xml:59: The following error occurred while executing this line:
/x1/jenkins/jenkins-slave/workspace/Lucene-Solr-NightlyTests-6.x/solr/build.xml:233: The following error occurred while executing this line:
/x1/jenkins/jenkins-slave/workspace/Lucene-Solr-NightlyTests-6.x/solr/common-build.xml:536: The following error occurred while executing this line:
/x1/jenkins/jenkins-slave/workspace/Lucene-Solr-NightlyTests-6.x/lucene/common-build.xml:1443: The following error occurred while executing this line:
/x1/jenkins/jenkins-slave/workspace/Lucene-Solr-NightlyTests-6.x/lucene/common-build.xml:984: At least one slave process threw an exception, first: Quit event not received from the forked process? This may indicate JVM crash or runner bugs.

Total time: 295 minutes 34 seconds
Build step 'Invoke Ant' marked build as failure
Archiving artifacts
Recording test results
Email was triggered for: Failure - Any
Sending email for trigger: Failure - Any




Mime
View raw message