lucene-dev mailing list archives

Site index · List index
Message view « Date » · « Thread »
Top « Date » · « Thread »
From Policeman Jenkins Server <jenk...@thetaphi.de>
Subject [JENKINS] Lucene-Solr-master-Windows (64bit/jdk1.8.0_102) - Build # 6070 - Still unstable!
Date Tue, 23 Aug 2016 01:47:50 GMT
Build: http://jenkins.thetaphi.de/job/Lucene-Solr-master-Windows/6070/
Java: 64bit/jdk1.8.0_102 -XX:-UseCompressedOops -XX:+UseParallelGC

4 tests failed.
FAILED:  org.apache.solr.cloud.TestSolrCloudWithDelegationTokens.testDelegationTokenCancelFail

Error Message:
expected:<200> but was:<404>

Stack Trace:
java.lang.AssertionError: expected:<200> but was:<404>
	at __randomizedtesting.SeedInfo.seed([6B269833028064D8:399AD19D21A7634]:0)
	at org.junit.Assert.fail(Assert.java:93)
	at org.junit.Assert.failNotEquals(Assert.java:647)
	at org.junit.Assert.assertEquals(Assert.java:128)
	at org.junit.Assert.assertEquals(Assert.java:472)
	at org.junit.Assert.assertEquals(Assert.java:456)
	at org.apache.solr.cloud.TestSolrCloudWithDelegationTokens.cancelDelegationToken(TestSolrCloudWithDelegationTokens.java:137)
	at org.apache.solr.cloud.TestSolrCloudWithDelegationTokens.testDelegationTokenCancelFail(TestSolrCloudWithDelegationTokens.java:282)
	at sun.reflect.NativeMethodAccessorImpl.invoke0(Native Method)
	at sun.reflect.NativeMethodAccessorImpl.invoke(NativeMethodAccessorImpl.java:62)
	at sun.reflect.DelegatingMethodAccessorImpl.invoke(DelegatingMethodAccessorImpl.java:43)
	at java.lang.reflect.Method.invoke(Method.java:498)
	at com.carrotsearch.randomizedtesting.RandomizedRunner.invoke(RandomizedRunner.java:1764)
	at com.carrotsearch.randomizedtesting.RandomizedRunner$8.evaluate(RandomizedRunner.java:871)
	at com.carrotsearch.randomizedtesting.RandomizedRunner$9.evaluate(RandomizedRunner.java:907)
	at com.carrotsearch.randomizedtesting.RandomizedRunner$10.evaluate(RandomizedRunner.java:921)
	at com.carrotsearch.randomizedtesting.rules.SystemPropertiesRestoreRule$1.evaluate(SystemPropertiesRestoreRule.java:57)
	at org.apache.lucene.util.TestRuleSetupTeardownChained$1.evaluate(TestRuleSetupTeardownChained.java:49)
	at org.apache.lucene.util.AbstractBeforeAfterRule$1.evaluate(AbstractBeforeAfterRule.java:45)
	at org.apache.lucene.util.TestRuleThreadAndTestName$1.evaluate(TestRuleThreadAndTestName.java:48)
	at org.apache.lucene.util.TestRuleIgnoreAfterMaxFailures$1.evaluate(TestRuleIgnoreAfterMaxFailures.java:64)
	at org.apache.lucene.util.TestRuleMarkFailure$1.evaluate(TestRuleMarkFailure.java:47)
	at com.carrotsearch.randomizedtesting.rules.StatementAdapter.evaluate(StatementAdapter.java:36)
	at com.carrotsearch.randomizedtesting.ThreadLeakControl$StatementRunner.run(ThreadLeakControl.java:367)
	at com.carrotsearch.randomizedtesting.ThreadLeakControl.forkTimeoutingTask(ThreadLeakControl.java:809)
	at com.carrotsearch.randomizedtesting.ThreadLeakControl$3.evaluate(ThreadLeakControl.java:460)
	at com.carrotsearch.randomizedtesting.RandomizedRunner.runSingleTest(RandomizedRunner.java:880)
	at com.carrotsearch.randomizedtesting.RandomizedRunner$5.evaluate(RandomizedRunner.java:781)
	at com.carrotsearch.randomizedtesting.RandomizedRunner$6.evaluate(RandomizedRunner.java:816)
	at com.carrotsearch.randomizedtesting.RandomizedRunner$7.evaluate(RandomizedRunner.java:827)
	at com.carrotsearch.randomizedtesting.rules.StatementAdapter.evaluate(StatementAdapter.java:36)
	at com.carrotsearch.randomizedtesting.rules.SystemPropertiesRestoreRule$1.evaluate(SystemPropertiesRestoreRule.java:57)
	at org.apache.lucene.util.AbstractBeforeAfterRule$1.evaluate(AbstractBeforeAfterRule.java:45)
	at com.carrotsearch.randomizedtesting.rules.StatementAdapter.evaluate(StatementAdapter.java:36)
	at org.apache.lucene.util.TestRuleStoreClassName$1.evaluate(TestRuleStoreClassName.java:41)
	at com.carrotsearch.randomizedtesting.rules.NoShadowingOrOverridesOnMethodsRule$1.evaluate(NoShadowingOrOverridesOnMethodsRule.java:40)
	at com.carrotsearch.randomizedtesting.rules.NoShadowingOrOverridesOnMethodsRule$1.evaluate(NoShadowingOrOverridesOnMethodsRule.java:40)
	at com.carrotsearch.randomizedtesting.rules.StatementAdapter.evaluate(StatementAdapter.java:36)
	at com.carrotsearch.randomizedtesting.rules.StatementAdapter.evaluate(StatementAdapter.java:36)
	at com.carrotsearch.randomizedtesting.rules.StatementAdapter.evaluate(StatementAdapter.java:36)
	at org.apache.lucene.util.TestRuleAssertionsRequired$1.evaluate(TestRuleAssertionsRequired.java:53)
	at org.apache.lucene.util.TestRuleMarkFailure$1.evaluate(TestRuleMarkFailure.java:47)
	at org.apache.lucene.util.TestRuleIgnoreAfterMaxFailures$1.evaluate(TestRuleIgnoreAfterMaxFailures.java:64)
	at org.apache.lucene.util.TestRuleIgnoreTestSuites$1.evaluate(TestRuleIgnoreTestSuites.java:54)
	at com.carrotsearch.randomizedtesting.rules.StatementAdapter.evaluate(StatementAdapter.java:36)
	at com.carrotsearch.randomizedtesting.ThreadLeakControl$StatementRunner.run(ThreadLeakControl.java:367)
	at java.lang.Thread.run(Thread.java:745)


FAILED:  org.apache.solr.update.PeerSyncTest.test

Error Message:
expected:<true> but was:<false>

Stack Trace:
java.lang.AssertionError: expected:<true> but was:<false>
	at __randomizedtesting.SeedInfo.seed([6B269833028064D8:E372A7E9AC7C0920]:0)
	at org.junit.Assert.fail(Assert.java:93)
	at org.junit.Assert.failNotEquals(Assert.java:647)
	at org.junit.Assert.assertEquals(Assert.java:128)
	at org.junit.Assert.assertEquals(Assert.java:147)
	at org.apache.solr.update.PeerSyncTest.assertSync(PeerSyncTest.java:208)
	at org.apache.solr.update.PeerSyncTest.test(PeerSyncTest.java:124)
	at sun.reflect.NativeMethodAccessorImpl.invoke0(Native Method)
	at sun.reflect.NativeMethodAccessorImpl.invoke(NativeMethodAccessorImpl.java:62)
	at sun.reflect.DelegatingMethodAccessorImpl.invoke(DelegatingMethodAccessorImpl.java:43)
	at java.lang.reflect.Method.invoke(Method.java:498)
	at com.carrotsearch.randomizedtesting.RandomizedRunner.invoke(RandomizedRunner.java:1764)
	at com.carrotsearch.randomizedtesting.RandomizedRunner$8.evaluate(RandomizedRunner.java:871)
	at com.carrotsearch.randomizedtesting.RandomizedRunner$9.evaluate(RandomizedRunner.java:907)
	at com.carrotsearch.randomizedtesting.RandomizedRunner$10.evaluate(RandomizedRunner.java:921)
	at org.apache.solr.BaseDistributedSearchTestCase$ShardsRepeatRule$ShardsFixedStatement.callStatement(BaseDistributedSearchTestCase.java:985)
	at org.apache.solr.BaseDistributedSearchTestCase$ShardsRepeatRule$ShardsStatement.evaluate(BaseDistributedSearchTestCase.java:960)
	at com.carrotsearch.randomizedtesting.rules.SystemPropertiesRestoreRule$1.evaluate(SystemPropertiesRestoreRule.java:57)
	at org.apache.lucene.util.TestRuleSetupTeardownChained$1.evaluate(TestRuleSetupTeardownChained.java:49)
	at org.apache.lucene.util.AbstractBeforeAfterRule$1.evaluate(AbstractBeforeAfterRule.java:45)
	at org.apache.lucene.util.TestRuleThreadAndTestName$1.evaluate(TestRuleThreadAndTestName.java:48)
	at org.apache.lucene.util.TestRuleIgnoreAfterMaxFailures$1.evaluate(TestRuleIgnoreAfterMaxFailures.java:64)
	at org.apache.lucene.util.TestRuleMarkFailure$1.evaluate(TestRuleMarkFailure.java:47)
	at com.carrotsearch.randomizedtesting.rules.StatementAdapter.evaluate(StatementAdapter.java:36)
	at com.carrotsearch.randomizedtesting.ThreadLeakControl$StatementRunner.run(ThreadLeakControl.java:367)
	at com.carrotsearch.randomizedtesting.ThreadLeakControl.forkTimeoutingTask(ThreadLeakControl.java:809)
	at com.carrotsearch.randomizedtesting.ThreadLeakControl$3.evaluate(ThreadLeakControl.java:460)
	at com.carrotsearch.randomizedtesting.RandomizedRunner.runSingleTest(RandomizedRunner.java:880)
	at com.carrotsearch.randomizedtesting.RandomizedRunner$5.evaluate(RandomizedRunner.java:781)
	at com.carrotsearch.randomizedtesting.RandomizedRunner$6.evaluate(RandomizedRunner.java:816)
	at com.carrotsearch.randomizedtesting.RandomizedRunner$7.evaluate(RandomizedRunner.java:827)
	at com.carrotsearch.randomizedtesting.rules.StatementAdapter.evaluate(StatementAdapter.java:36)
	at com.carrotsearch.randomizedtesting.rules.SystemPropertiesRestoreRule$1.evaluate(SystemPropertiesRestoreRule.java:57)
	at org.apache.lucene.util.AbstractBeforeAfterRule$1.evaluate(AbstractBeforeAfterRule.java:45)
	at com.carrotsearch.randomizedtesting.rules.StatementAdapter.evaluate(StatementAdapter.java:36)
	at org.apache.lucene.util.TestRuleStoreClassName$1.evaluate(TestRuleStoreClassName.java:41)
	at com.carrotsearch.randomizedtesting.rules.NoShadowingOrOverridesOnMethodsRule$1.evaluate(NoShadowingOrOverridesOnMethodsRule.java:40)
	at com.carrotsearch.randomizedtesting.rules.NoShadowingOrOverridesOnMethodsRule$1.evaluate(NoShadowingOrOverridesOnMethodsRule.java:40)
	at com.carrotsearch.randomizedtesting.rules.StatementAdapter.evaluate(StatementAdapter.java:36)
	at com.carrotsearch.randomizedtesting.rules.StatementAdapter.evaluate(StatementAdapter.java:36)
	at com.carrotsearch.randomizedtesting.rules.StatementAdapter.evaluate(StatementAdapter.java:36)
	at org.apache.lucene.util.TestRuleAssertionsRequired$1.evaluate(TestRuleAssertionsRequired.java:53)
	at org.apache.lucene.util.TestRuleMarkFailure$1.evaluate(TestRuleMarkFailure.java:47)
	at org.apache.lucene.util.TestRuleIgnoreAfterMaxFailures$1.evaluate(TestRuleIgnoreAfterMaxFailures.java:64)
	at org.apache.lucene.util.TestRuleIgnoreTestSuites$1.evaluate(TestRuleIgnoreTestSuites.java:54)
	at com.carrotsearch.randomizedtesting.rules.StatementAdapter.evaluate(StatementAdapter.java:36)
	at com.carrotsearch.randomizedtesting.ThreadLeakControl$StatementRunner.run(ThreadLeakControl.java:367)
	at java.lang.Thread.run(Thread.java:745)


FAILED:  junit.framework.TestSuite.org.apache.solr.cloud.TestSolrCloudWithSecureImpersonation

Error Message:
java.lang.NullPointerException

Stack Trace:
com.google.common.util.concurrent.UncheckedExecutionException: java.lang.NullPointerException
	at __randomizedtesting.SeedInfo.seed([6B269833028064D8]:0)
	at com.google.common.cache.LocalCache$Segment.get(LocalCache.java:2263)
	at com.google.common.cache.LocalCache.get(LocalCache.java:4000)
	at com.google.common.cache.LocalCache.getOrLoad(LocalCache.java:4004)
	at com.google.common.cache.LocalCache$LocalLoadingCache.get(LocalCache.java:4874)
	at org.apache.hadoop.security.Groups.getGroups(Groups.java:182)
	at org.apache.solr.cloud.TestSolrCloudWithSecureImpersonation.getUsersFirstGroup(TestSolrCloudWithSecureImpersonation.java:64)
	at org.apache.solr.cloud.TestSolrCloudWithSecureImpersonation.getImpersonatorSettings(TestSolrCloudWithSecureImpersonation.java:86)
	at org.apache.solr.cloud.TestSolrCloudWithSecureImpersonation.startup(TestSolrCloudWithSecureImpersonation.java:99)
	at sun.reflect.NativeMethodAccessorImpl.invoke0(Native Method)
	at sun.reflect.NativeMethodAccessorImpl.invoke(NativeMethodAccessorImpl.java:62)
	at sun.reflect.DelegatingMethodAccessorImpl.invoke(DelegatingMethodAccessorImpl.java:43)
	at java.lang.reflect.Method.invoke(Method.java:498)
	at com.carrotsearch.randomizedtesting.RandomizedRunner.invoke(RandomizedRunner.java:1764)
	at com.carrotsearch.randomizedtesting.RandomizedRunner$6.evaluate(RandomizedRunner.java:811)
	at com.carrotsearch.randomizedtesting.RandomizedRunner$7.evaluate(RandomizedRunner.java:827)
	at com.carrotsearch.randomizedtesting.rules.StatementAdapter.evaluate(StatementAdapter.java:36)
	at com.carrotsearch.randomizedtesting.rules.SystemPropertiesRestoreRule$1.evaluate(SystemPropertiesRestoreRule.java:57)
	at org.apache.lucene.util.AbstractBeforeAfterRule$1.evaluate(AbstractBeforeAfterRule.java:45)
	at com.carrotsearch.randomizedtesting.rules.StatementAdapter.evaluate(StatementAdapter.java:36)
	at org.apache.lucene.util.TestRuleStoreClassName$1.evaluate(TestRuleStoreClassName.java:41)
	at com.carrotsearch.randomizedtesting.rules.NoShadowingOrOverridesOnMethodsRule$1.evaluate(NoShadowingOrOverridesOnMethodsRule.java:40)
	at com.carrotsearch.randomizedtesting.rules.NoShadowingOrOverridesOnMethodsRule$1.evaluate(NoShadowingOrOverridesOnMethodsRule.java:40)
	at com.carrotsearch.randomizedtesting.rules.StatementAdapter.evaluate(StatementAdapter.java:36)
	at com.carrotsearch.randomizedtesting.rules.StatementAdapter.evaluate(StatementAdapter.java:36)
	at com.carrotsearch.randomizedtesting.rules.StatementAdapter.evaluate(StatementAdapter.java:36)
	at org.apache.lucene.util.TestRuleAssertionsRequired$1.evaluate(TestRuleAssertionsRequired.java:53)
	at org.apache.lucene.util.TestRuleMarkFailure$1.evaluate(TestRuleMarkFailure.java:47)
	at org.apache.lucene.util.TestRuleIgnoreAfterMaxFailures$1.evaluate(TestRuleIgnoreAfterMaxFailures.java:64)
	at org.apache.lucene.util.TestRuleIgnoreTestSuites$1.evaluate(TestRuleIgnoreTestSuites.java:54)
	at com.carrotsearch.randomizedtesting.rules.StatementAdapter.evaluate(StatementAdapter.java:36)
	at com.carrotsearch.randomizedtesting.ThreadLeakControl$StatementRunner.run(ThreadLeakControl.java:367)
	at java.lang.Thread.run(Thread.java:745)
Caused by: java.lang.NullPointerException
	at java.lang.ProcessBuilder.start(ProcessBuilder.java:1012)
	at org.apache.hadoop.util.Shell.runCommand(Shell.java:483)
	at org.apache.hadoop.util.Shell.run(Shell.java:456)
	at org.apache.hadoop.util.Shell$ShellCommandExecutor.execute(Shell.java:722)
	at org.apache.hadoop.util.Shell.execCommand(Shell.java:815)
	at org.apache.hadoop.util.Shell.execCommand(Shell.java:798)
	at org.apache.hadoop.security.ShellBasedUnixGroupsMapping.getUnixGroups(ShellBasedUnixGroupsMapping.java:84)
	at org.apache.hadoop.security.ShellBasedUnixGroupsMapping.getGroups(ShellBasedUnixGroupsMapping.java:52)
	at org.apache.hadoop.security.JniBasedUnixGroupsMappingWithFallback.getGroups(JniBasedUnixGroupsMappingWithFallback.java:51)
	at org.apache.hadoop.security.Groups$GroupCacheLoader.fetchGroupList(Groups.java:239)
	at org.apache.hadoop.security.Groups$GroupCacheLoader.load(Groups.java:220)
	at org.apache.hadoop.security.Groups$GroupCacheLoader.load(Groups.java:208)
	at com.google.common.cache.LocalCache$LoadingValueReference.loadFuture(LocalCache.java:3599)
	at com.google.common.cache.LocalCache$Segment.loadSync(LocalCache.java:2379)
	at com.google.common.cache.LocalCache$Segment.lockedGetOrLoad(LocalCache.java:2342)
	at com.google.common.cache.LocalCache$Segment.get(LocalCache.java:2257)
	... 31 more


FAILED:  junit.framework.TestSuite.org.apache.solr.cloud.TestSolrCloudWithSecureImpersonation

Error Message:


Stack Trace:
java.lang.NullPointerException
	at __randomizedtesting.SeedInfo.seed([6B269833028064D8]:0)
	at org.apache.solr.cloud.TestSolrCloudWithSecureImpersonation.shutdown(TestSolrCloudWithSecureImpersonation.java:154)
	at sun.reflect.NativeMethodAccessorImpl.invoke0(Native Method)
	at sun.reflect.NativeMethodAccessorImpl.invoke(NativeMethodAccessorImpl.java:62)
	at sun.reflect.DelegatingMethodAccessorImpl.invoke(DelegatingMethodAccessorImpl.java:43)
	at java.lang.reflect.Method.invoke(Method.java:498)
	at com.carrotsearch.randomizedtesting.RandomizedRunner.invoke(RandomizedRunner.java:1764)
	at com.carrotsearch.randomizedtesting.RandomizedRunner$7.evaluate(RandomizedRunner.java:834)
	at com.carrotsearch.randomizedtesting.rules.StatementAdapter.evaluate(StatementAdapter.java:36)
	at com.carrotsearch.randomizedtesting.rules.SystemPropertiesRestoreRule$1.evaluate(SystemPropertiesRestoreRule.java:57)
	at org.apache.lucene.util.AbstractBeforeAfterRule$1.evaluate(AbstractBeforeAfterRule.java:45)
	at com.carrotsearch.randomizedtesting.rules.StatementAdapter.evaluate(StatementAdapter.java:36)
	at org.apache.lucene.util.TestRuleStoreClassName$1.evaluate(TestRuleStoreClassName.java:41)
	at com.carrotsearch.randomizedtesting.rules.NoShadowingOrOverridesOnMethodsRule$1.evaluate(NoShadowingOrOverridesOnMethodsRule.java:40)
	at com.carrotsearch.randomizedtesting.rules.NoShadowingOrOverridesOnMethodsRule$1.evaluate(NoShadowingOrOverridesOnMethodsRule.java:40)
	at com.carrotsearch.randomizedtesting.rules.StatementAdapter.evaluate(StatementAdapter.java:36)
	at com.carrotsearch.randomizedtesting.rules.StatementAdapter.evaluate(StatementAdapter.java:36)
	at com.carrotsearch.randomizedtesting.rules.StatementAdapter.evaluate(StatementAdapter.java:36)
	at org.apache.lucene.util.TestRuleAssertionsRequired$1.evaluate(TestRuleAssertionsRequired.java:53)
	at org.apache.lucene.util.TestRuleMarkFailure$1.evaluate(TestRuleMarkFailure.java:47)
	at org.apache.lucene.util.TestRuleIgnoreAfterMaxFailures$1.evaluate(TestRuleIgnoreAfterMaxFailures.java:64)
	at org.apache.lucene.util.TestRuleIgnoreTestSuites$1.evaluate(TestRuleIgnoreTestSuites.java:54)
	at com.carrotsearch.randomizedtesting.rules.StatementAdapter.evaluate(StatementAdapter.java:36)
	at com.carrotsearch.randomizedtesting.ThreadLeakControl$StatementRunner.run(ThreadLeakControl.java:367)
	at java.lang.Thread.run(Thread.java:745)




Build Log:
[...truncated 11346 lines...]
   [junit4] Suite: org.apache.solr.cloud.TestSolrCloudWithSecureImpersonation
   [junit4]   2> Creating dataDir: C:\Users\jenkins\workspace\Lucene-Solr-master-Windows\solr\build\solr-core\test\J1\temp\solr.cloud.TestSolrCloudWithSecureImpersonation_6B269833028064D8-001\init-core-data-001
   [junit4]   2> 1046840 INFO  (SUITE-TestSolrCloudWithSecureImpersonation-seed#[6B269833028064D8]-worker) [    ] o.a.s.SolrTestCaseJ4 Randomized ssl (false) and clientAuth (false) via: @org.apache.solr.util.RandomizeSSL(reason=, value=NaN, ssl=NaN, clientAuth=NaN)
   [junit4]   2> 1047163 WARN  (SUITE-TestSolrCloudWithSecureImpersonation-seed#[6B269833028064D8]-worker) [    ] o.a.h.u.NativeCodeLoader Unable to load native-hadoop library for your platform... using builtin-java classes where applicable
   [junit4]   2> 1047206 ERROR (SUITE-TestSolrCloudWithSecureImpersonation-seed#[6B269833028064D8]-worker) [    ] o.a.h.u.Shell Failed to locate the winutils binary in the hadoop binary path
   [junit4]   2> java.io.IOException: Could not locate executable null\bin\winutils.exe in the Hadoop binaries.
   [junit4]   2> 	at org.apache.hadoop.util.Shell.getQualifiedBinPath(Shell.java:356)
   [junit4]   2> 	at org.apache.hadoop.util.Shell.getWinUtilsPath(Shell.java:371)
   [junit4]   2> 	at org.apache.hadoop.util.Shell.<clinit>(Shell.java:364)
   [junit4]   2> 	at org.apache.hadoop.util.StringUtils.<clinit>(StringUtils.java:80)
   [junit4]   2> 	at org.apache.hadoop.security.Groups.parseStaticMapping(Groups.java:130)
   [junit4]   2> 	at org.apache.hadoop.security.Groups.<init>(Groups.java:94)
   [junit4]   2> 	at org.apache.hadoop.security.Groups.<init>(Groups.java:74)
   [junit4]   2> 	at org.apache.solr.cloud.TestSolrCloudWithSecureImpersonation.getUsersFirstGroup(TestSolrCloudWithSecureImpersonation.java:60)
   [junit4]   2> 	at org.apache.solr.cloud.TestSolrCloudWithSecureImpersonation.getImpersonatorSettings(TestSolrCloudWithSecureImpersonation.java:86)
   [junit4]   2> 	at org.apache.solr.cloud.TestSolrCloudWithSecureImpersonation.startup(TestSolrCloudWithSecureImpersonation.java:99)
   [junit4]   2> 	at sun.reflect.NativeMethodAccessorImpl.invoke0(Native Method)
   [junit4]   2> 	at sun.reflect.NativeMethodAccessorImpl.invoke(NativeMethodAccessorImpl.java:62)
   [junit4]   2> 	at sun.reflect.DelegatingMethodAccessorImpl.invoke(DelegatingMethodAccessorImpl.java:43)
   [junit4]   2> 	at java.lang.reflect.Method.invoke(Method.java:498)
   [junit4]   2> 	at com.carrotsearch.randomizedtesting.RandomizedRunner.invoke(RandomizedRunner.java:1764)
   [junit4]   2> 	at com.carrotsearch.randomizedtesting.RandomizedRunner$6.evaluate(RandomizedRunner.java:811)
   [junit4]   2> 	at com.carrotsearch.randomizedtesting.RandomizedRunner$7.evaluate(RandomizedRunner.java:827)
   [junit4]   2> 	at com.carrotsearch.randomizedtesting.rules.StatementAdapter.evaluate(StatementAdapter.java:36)
   [junit4]   2> 	at com.carrotsearch.randomizedtesting.rules.SystemPropertiesRestoreRule$1.evaluate(SystemPropertiesRestoreRule.java:57)
   [junit4]   2> 	at org.apache.lucene.util.AbstractBeforeAfterRule$1.evaluate(AbstractBeforeAfterRule.java:45)
   [junit4]   2> 	at com.carrotsearch.randomizedtesting.rules.StatementAdapter.evaluate(StatementAdapter.java:36)
   [junit4]   2> 	at org.apache.lucene.util.TestRuleStoreClassName$1.evaluate(TestRuleStoreClassName.java:41)
   [junit4]   2> 	at com.carrotsearch.randomizedtesting.rules.NoShadowingOrOverridesOnMethodsRule$1.evaluate(NoShadowingOrOverridesOnMethodsRule.java:40)
   [junit4]   2> 	at com.carrotsearch.randomizedtesting.rules.NoShadowingOrOverridesOnMethodsRule$1.evaluate(NoShadowingOrOverridesOnMethodsRule.java:40)
   [junit4]   2> 	at com.carrotsearch.randomizedtesting.rules.StatementAdapter.evaluate(StatementAdapter.java:36)
   [junit4]   2> 	at com.carrotsearch.randomizedtesting.rules.StatementAdapter.evaluate(StatementAdapter.java:36)
   [junit4]   2> 	at com.carrotsearch.randomizedtesting.rules.StatementAdapter.evaluate(StatementAdapter.java:36)
   [junit4]   2> 	at org.apache.lucene.util.TestRuleAssertionsRequired$1.evaluate(TestRuleAssertionsRequired.java:53)
   [junit4]   2> 	at org.apache.lucene.util.TestRuleMarkFailure$1.evaluate(TestRuleMarkFailure.java:47)
   [junit4]   2> 	at org.apache.lucene.util.TestRuleIgnoreAfterMaxFailures$1.evaluate(TestRuleIgnoreAfterMaxFailures.java:64)
   [junit4]   2> 	at org.apache.lucene.util.TestRuleIgnoreTestSuites$1.evaluate(TestRuleIgnoreTestSuites.java:54)
   [junit4]   2> 	at com.carrotsearch.randomizedtesting.rules.StatementAdapter.evaluate(StatementAdapter.java:36)
   [junit4]   2> 	at com.carrotsearch.randomizedtesting.ThreadLeakControl$StatementRunner.run(ThreadLeakControl.java:367)
   [junit4]   2> 	at java.lang.Thread.run(Thread.java:745)
   [junit4]   2> 1047243 INFO  (SUITE-TestSolrCloudWithSecureImpersonation-seed#[6B269833028064D8]-worker) [    ] o.a.s.SolrTestCaseJ4 ###deleteCore
   [junit4]   2> NOTE: test params are: codec=HighCompressionCompressingStoredFields(storedFieldsFormat=CompressingStoredFieldsFormat(compressionMode=HIGH_COMPRESSION, chunkSize=12777, maxDocsPerChunk=512, blockSize=5), termVectorsFormat=CompressingTermVectorsFormat(compressionMode=HIGH_COMPRESSION, chunkSize=12777, blockSize=5)), sim=RandomSimilarity(queryNorm=true): {}, locale=el-CY, timezone=US/Pacific
   [junit4]   2> NOTE: Windows 10 10.0 amd64/Oracle Corporation 1.8.0_102 (64-bit)/cpus=3,threads=1,free=254798528,total=412614656
   [junit4]   2> NOTE: All tests run in this JVM: [BasicDistributedZk2Test, AddBlockUpdateTest, TermVectorComponentDistributedTest, HighlighterMaxOffsetTest, TestBadConfig, CdcrUpdateLogTest, TestShardHandlerFactory, TestSolrIndexConfig, SortByFunctionTest, TestReplicaProperties, NoCacheHeaderTest, SpellingQueryConverterTest, BlockJoinFacetRandomTest, TestLegacyFieldCache, TestOmitPositions, TestSolrJ, MergeStrategyTest, AnalyticsQueryTest, RAMDirectoryFactoryTest, TestStressRecovery, SolrCoreCheckLockOnStartupTest, TestMacroExpander, ShardRoutingCustomTest, TestBinaryResponseWriter, TestStressLiveNodes, FullHLLTest, TestWriterPerf, TriLevelCompositeIdRoutingTest, TestLocalFSCloudBackupRestore, DistanceFunctionTest, BigEndianAscendingWordDeserializerTest, SharedFSAutoReplicaFailoverTest, TestScoreJoinQPScore, TestOrdValues, PluginInfoTest, LeaderFailoverAfterPartitionTest, TestManagedStopFilterFactory, CdcrReplicationDistributedZkTest, TestObjectReleaseTracker, TestFieldCacheReopen, CollectionsAPIAsyncDistributedZkTest, TestDistribDocBasedVersion, TestAuthorizationFramework, DefaultValueUpdateProcessorTest, FileBasedSpellCheckerTest, ConcurrentDeleteAndCreateCollectionTest, SortSpecParsingTest, OpenCloseCoreStressTest, InfoHandlerTest, TestRecovery, TestFiltering, CoreAdminHandlerTest, TestFieldCacheVsDocValues, SuggestComponentTest, CoreSorterTest, TestFuzzyAnalyzedSuggestions, AsyncCallRequestStatusResponseTest, TestCloudPseudoReturnFields, TestSolrQueryParser, TestSolrFieldCacheMBean, HdfsCollectionsAPIDistributedZkTest, TestRangeQuery, TestQueryUtils, OverriddenZkACLAndCredentialsProvidersTest, BasicZkTest, SaslZkACLProviderTest, TestFieldTypeCollectionResource, TestConfigSetProperties, TestConfigSetsAPI, TestInfoStreamLogging, SpellCheckComponentTest, TestBulkSchemaAPI, TestZkChroot, TestSerializedLuceneMatchVersion, TestReqParamsAPI, LeaderElectionIntegrationTest, HdfsThreadLeakTest, TestSchemaSimilarityResource, TestAuthenticationFramework, RemoteQueryErrorTest, TestFieldCacheSort, TestRuleBasedAuthorizationPlugin, UniqFieldsUpdateProcessorFactoryTest, BinaryUpdateRequestHandlerTest, TestRandomFaceting, TestSchemaNameResource, TestBlobHandler, TestCloudManagedSchema, BJQParserTest, DeleteLastCustomShardedReplicaTest, TestConfigSetsAPIZkFailure, OverseerStatusTest, FieldMutatingUpdateProcessorTest, TestCopyFieldCollectionResource, BaseCdcrDistributedZkTest, CustomCollectionTest, SuggesterTSTTest, ShowFileRequestHandlerTest, SolrCloudExampleTest, DistributedExpandComponentTest, HdfsRestartWhileUpdatingTest, TermVectorComponentTest, EchoParamsTest, TestFoldingMultitermQuery, TestDocBasedVersionConstraints, SignatureUpdateProcessorFactoryTest, TestSchemaManager, TestExclusionRuleCollectionAccess, HdfsRecoverLeaseTest, TestHighFrequencyDictionaryFactory, TestCharFilters, CdcrRequestHandlerTest, NumericFieldsTest, ZkNodePropsTest, DistributedTermsComponentTest, DistributedSuggestComponentTest, LoggingHandlerTest, TestConfigOverlay, SuggesterWFSTTest, TestExpandComponent, StressHdfsTest, SynonymTokenizerTest, ExitableDirectoryReaderTest, TestRawTransformer, TestAtomicUpdateErrorCases, TestLeaderElectionZkExpiry, OutputWriterTest, HdfsUnloadDistributedZkTest, HLLUtilTest, TestSolrCloudWithSecureImpersonation]
   [junit4]   2> NOTE: reproduce with: ant test  -Dtestcase=TestSolrCloudWithSecureImpersonation -Dtests.seed=6B269833028064D8 -Dtests.slow=true -Dtests.locale=el-CY -Dtests.timezone=US/Pacific -Dtests.asserts=true -Dtests.file.encoding=UTF-8
   [junit4] ERROR   0.00s J1 | TestSolrCloudWithSecureImpersonation (suite) <<<
   [junit4]    > Throwable #1: com.google.common.util.concurrent.UncheckedExecutionException: java.lang.NullPointerException
   [junit4]    > 	at __randomizedtesting.SeedInfo.seed([6B269833028064D8]:0)
   [junit4]    > 	at com.google.common.cache.LocalCache$Segment.get(LocalCache.java:2263)
   [junit4]    > 	at com.google.common.cache.LocalCache.get(LocalCache.java:4000)
   [junit4]    > 	at com.google.common.cache.LocalCache.getOrLoad(LocalCache.java:4004)
   [junit4]    > 	at com.google.common.cache.LocalCache$LocalLoadingCache.get(LocalCache.java:4874)
   [junit4]    > 	at org.apache.hadoop.security.Groups.getGroups(Groups.java:182)
   [junit4]    > 	at org.apache.solr.cloud.TestSolrCloudWithSecureImpersonation.getUsersFirstGroup(TestSolrCloudWithSecureImpersonation.java:64)
   [junit4]    > 	at org.apache.solr.cloud.TestSolrCloudWithSecureImpersonation.getImpersonatorSettings(TestSolrCloudWithSecureImpersonation.java:86)
   [junit4]    > 	at org.apache.solr.cloud.TestSolrCloudWithSecureImpersonation.startup(TestSolrCloudWithSecureImpersonation.java:99)
   [junit4]    > 	at java.lang.Thread.run(Thread.java:745)
   [junit4]    > Caused by: java.lang.NullPointerException
   [junit4]    > 	at java.lang.ProcessBuilder.start(ProcessBuilder.java:1012)
   [junit4]    > 	at org.apache.hadoop.util.Shell.runCommand(Shell.java:483)
   [junit4]    > 	at org.apache.hadoop.util.Shell.run(Shell.java:456)
   [junit4]    > 	at org.apache.hadoop.util.Shell$ShellCommandExecutor.execute(Shell.java:722)
   [junit4]    > 	at org.apache.hadoop.util.Shell.execCommand(Shell.java:815)
   [junit4]    > 	at org.apache.hadoop.util.Shell.execCommand(Shell.java:798)
   [junit4]    > 	at org.apache.hadoop.security.ShellBasedUnixGroupsMapping.getUnixGroups(ShellBasedUnixGroupsMapping.java:84)
   [junit4]    > 	at org.apache.hadoop.security.ShellBasedUnixGroupsMapping.getGroups(ShellBasedUnixGroupsMapping.java:52)
   [junit4]    > 	at org.apache.hadoop.security.JniBasedUnixGroupsMappingWithFallback.getGroups(JniBasedUnixGroupsMappingWithFallback.java:51)
   [junit4]    > 	at org.apache.hadoop.security.Groups$GroupCacheLoader.fetchGroupList(Groups.java:239)
   [junit4]    > 	at org.apache.hadoop.security.Groups$GroupCacheLoader.load(Groups.java:220)
   [junit4]    > 	at org.apache.hadoop.security.Groups$GroupCacheLoader.load(Groups.java:208)
   [junit4]    > 	at com.google.common.cache.LocalCache$LoadingValueReference.loadFuture(LocalCache.java:3599)
   [junit4]    > 	at com.google.common.cache.LocalCache$Segment.loadSync(LocalCache.java:2379)
   [junit4]    > 	at com.google.common.cache.LocalCache$Segment.lockedGetOrLoad(LocalCache.java:2342)
   [junit4]    > 	at com.google.common.cache.LocalCache$Segment.get(LocalCache.java:2257)
   [junit4]    > 	... 31 moreThrowable #2: java.lang.NullPointerException
   [junit4]    > 	at __randomizedtesting.SeedInfo.seed([6B269833028064D8]:0)
   [junit4]    > 	at org.apache.solr.cloud.TestSolrCloudWithSecureImpersonation.shutdown(TestSolrCloudWithSecureImpersonation.java:154)
   [junit4]    > 	at java.lang.Thread.run(Thread.java:745)
   [junit4] Completed [241/632 (1!)] on J1 in 0.44s, 0 tests, 2 errors <<< FAILURES!

[...truncated 331 lines...]
   [junit4] Suite: org.apache.solr.update.PeerSyncTest
   [junit4]   2> Creating dataDir: C:\Users\jenkins\workspace\Lucene-Solr-master-Windows\solr\build\solr-core\test\J0\temp\solr.update.PeerSyncTest_6B269833028064D8-001\init-core-data-001
   [junit4]   2> 1605043 INFO  (SUITE-PeerSyncTest-seed#[6B269833028064D8]-worker) [    ] o.a.s.SolrTestCaseJ4 Randomized ssl (false) and clientAuth (false) via: @org.apache.solr.SolrTestCaseJ4$SuppressSSL(bugUrl=https://issues.apache.org/jira/browse/SOLR-5776)
   [junit4]   2> 1605043 INFO  (SUITE-PeerSyncTest-seed#[6B269833028064D8]-worker) [    ] o.a.s.BaseDistributedSearchTestCase Setting hostContext system property: /tedv/wb
   [junit4]   2> 1605719 INFO  (TEST-PeerSyncTest.test-seed#[6B269833028064D8]) [    ] o.a.s.SolrTestCaseJ4 Writing core.properties file to C:\Users\jenkins\workspace\Lucene-Solr-master-Windows\solr\build\solr-core\test\J0\temp\solr.update.PeerSyncTest_6B269833028064D8-001\tempDir-001\control\cores\collection1
   [junit4]   2> 1605722 INFO  (TEST-PeerSyncTest.test-seed#[6B269833028064D8]) [    ] o.e.j.s.Server jetty-9.3.8.v20160314
   [junit4]   2> 1605724 INFO  (TEST-PeerSyncTest.test-seed#[6B269833028064D8]) [    ] o.e.j.s.h.ContextHandler Started o.e.j.s.ServletContextHandler@13368f73{/tedv/wb,null,AVAILABLE}
   [junit4]   2> 1605733 INFO  (TEST-PeerSyncTest.test-seed#[6B269833028064D8]) [    ] o.e.j.s.ServerConnector Started ServerConnector@734b7f56{HTTP/1.1,[http/1.1]}{127.0.0.1:65264}
   [junit4]   2> 1605733 INFO  (TEST-PeerSyncTest.test-seed#[6B269833028064D8]) [    ] o.e.j.s.Server Started @1610506ms
   [junit4]   2> 1605733 INFO  (TEST-PeerSyncTest.test-seed#[6B269833028064D8]) [    ] o.a.s.c.s.e.JettySolrRunner Jetty properties: {schema=schema.xml, solrconfig=solrconfig-tlog.xml, hostContext=/tedv/wb, hostPort=65264, coreRootDirectory=C:\Users\jenkins\workspace\Lucene-Solr-master-Windows\solr\build\solr-core\test\J0\temp\solr.update.PeerSyncTest_6B269833028064D8-001\tempDir-001\control\cores}
   [junit4]   2> 1605733 INFO  (TEST-PeerSyncTest.test-seed#[6B269833028064D8]) [    ] o.a.s.s.SolrDispatchFilter SolrDispatchFilter.init(): sun.misc.Launcher$AppClassLoader@73d16e93
   [junit4]   2> 1605733 INFO  (TEST-PeerSyncTest.test-seed#[6B269833028064D8]) [    ] o.a.s.c.SolrResourceLoader new SolrResourceLoader for directory: 'C:\Users\jenkins\workspace\Lucene-Solr-master-Windows\solr\build\solr-core\test\J0\temp\solr.update.PeerSyncTest_6B269833028064D8-001\tempDir-001\control'
   [junit4]   2> 1605733 INFO  (TEST-PeerSyncTest.test-seed#[6B269833028064D8]) [    ] o.a.s.c.SolrResourceLoader JNDI not configured for solr (NoInitialContextEx)
   [junit4]   2> 1605734 INFO  (TEST-PeerSyncTest.test-seed#[6B269833028064D8]) [    ] o.a.s.c.SolrResourceLoader solr home defaulted to 'solr/' (could not find system property or JNDI)
   [junit4]   2> 1605735 INFO  (TEST-PeerSyncTest.test-seed#[6B269833028064D8]) [    ] o.a.s.c.SolrXmlConfig Loading container configuration from C:\Users\jenkins\workspace\Lucene-Solr-master-Windows\solr\build\solr-core\test\J0\temp\solr.update.PeerSyncTest_6B269833028064D8-001\tempDir-001\control\solr.xml
   [junit4]   2> 1605751 INFO  (TEST-PeerSyncTest.test-seed#[6B269833028064D8]) [    ] o.a.s.c.CorePropertiesLocator Config-defined core root directory: C:\Users\jenkins\workspace\Lucene-Solr-master-Windows\solr\build\solr-core\test\J0\temp\solr.update.PeerSyncTest_6B269833028064D8-001\tempDir-001\control\cores
   [junit4]   2> 1605752 INFO  (TEST-PeerSyncTest.test-seed#[6B269833028064D8]) [    ] o.a.s.c.CoreContainer New CoreContainer 947985455
   [junit4]   2> 1605752 INFO  (TEST-PeerSyncTest.test-seed#[6B269833028064D8]) [    ] o.a.s.c.CoreContainer Loading cores into CoreContainer [instanceDir=C:\Users\jenkins\workspace\Lucene-Solr-master-Windows\solr\build\solr-core\test\J0\temp\solr.update.PeerSyncTest_6B269833028064D8-001\tempDir-001\control]
   [junit4]   2> 1605755 WARN  (TEST-PeerSyncTest.test-seed#[6B269833028064D8]) [    ] o.a.s.c.CoreContainer Couldn't add files from C:\Users\jenkins\workspace\Lucene-Solr-master-Windows\solr\build\solr-core\test\J0\temp\solr.update.PeerSyncTest_6B269833028064D8-001\tempDir-001\control\lib to classpath: C:\Users\jenkins\workspace\Lucene-Solr-master-Windows\solr\build\solr-core\test\J0\temp\solr.update.PeerSyncTest_6B269833028064D8-001\tempDir-001\control\lib
   [junit4]   2> 1605755 INFO  (TEST-PeerSyncTest.test-seed#[6B269833028064D8]) [    ] o.a.s.h.c.HttpShardHandlerFactory created with socketTimeout : 90000,urlScheme : ,connTimeout : 15000,maxConnectionsPerHost : 20,maxConnections : 10000,corePoolSize : 0,maximumPoolSize : 2147483647,maxThreadIdleTime : 5,sizeOfQueue : -1,fairnessPolicy : false,
   [junit4]   2> 1605763 INFO  (TEST-PeerSyncTest.test-seed#[6B269833028064D8]) [    ] o.a.s.u.UpdateShardHandler Created UpdateShardHandler HTTP client with params: socketTimeout=340000&connTimeout=45000&maxConnections=100000&maxConnectionsPerHost=100000
   [junit4]   2> 1605763 INFO  (TEST-PeerSyncTest.test-seed#[6B269833028064D8]) [    ] o.a.s.l.LogWatcher SLF4J impl is org.slf4j.impl.Log4jLoggerFactory
   [junit4]   2> 1605763 INFO  (TEST-PeerSyncTest.test-seed#[6B269833028064D8]) [    ] o.a.s.l.LogWatcher Registering Log Listener [Log4j (org.slf4j.impl.Log4jLoggerFactory)]
   [junit4]   2> 1605763 INFO  (TEST-PeerSyncTest.test-seed#[6B269833028064D8]) [    ] o.a.s.c.CoreContainer Security conf doesn't exist. Skipping setup for authorization module.
   [junit4]   2> 1605764 INFO  (TEST-PeerSyncTest.test-seed#[6B269833028064D8]) [    ] o.a.s.c.CoreContainer No authentication plugin used.
   [junit4]   2> 1605766 INFO  (TEST-PeerSyncTest.test-seed#[6B269833028064D8]) [    ] o.a.s.c.CorePropertiesLocator Looking for core definitions underneath C:\Users\jenkins\workspace\Lucene-Solr-master-Windows\solr\build\solr-core\test\J0\temp\solr.update.PeerSyncTest_6B269833028064D8-001\tempDir-001\control\cores
   [junit4]   2> 1605767 INFO  (TEST-PeerSyncTest.test-seed#[6B269833028064D8]) [    ] o.a.s.c.CoreDescriptor Created CoreDescriptor: {name=collection1, config=solrconfig-tlog.xml, loadOnStartup=true, schema=schema.xml, configSetProperties=configsetprops.json, transient=false, dataDir=data\, configSet=collection1}
   [junit4]   2> 1605767 INFO  (TEST-PeerSyncTest.test-seed#[6B269833028064D8]) [    ] o.a.s.c.CorePropertiesLocator Found core collection1 in C:\Users\jenkins\workspace\Lucene-Solr-master-Windows\solr\build\solr-core\test\J0\temp\solr.update.PeerSyncTest_6B269833028064D8-001\tempDir-001\control\cores\collection1
   [junit4]   2> 1605767 INFO  (TEST-PeerSyncTest.test-seed#[6B269833028064D8]) [    ] o.a.s.c.CorePropertiesLocator Found 1 core definitions
   [junit4]   2> 1605768 INFO  (TEST-PeerSyncTest.test-seed#[6B269833028064D8]) [    ] o.a.s.s.SolrDispatchFilter user.dir=C:\Users\jenkins\workspace\Lucene-Solr-master-Windows\solr\build\solr-core\test\J0
   [junit4]   2> 1605768 INFO  (TEST-PeerSyncTest.test-seed#[6B269833028064D8]) [    ] o.a.s.s.SolrDispatchFilter SolrDispatchFilter.init() done
   [junit4]   2> 1605769 INFO  (coreLoadExecutor-4941-thread-1) [    ] o.a.s.c.SolrResourceLoader new SolrResourceLoader for directory: 'C:\Users\jenkins\workspace\Lucene-Solr-master-Windows\solr\core\src\test-files\solr\collection1'
   [junit4]   2> 1605771 INFO  (coreLoadExecutor-4941-thread-1) [    ] o.a.s.c.SolrResourceLoader JNDI not configured for solr (NoInitialContextEx)
   [junit4]   2> 1605771 INFO  (coreLoadExecutor-4941-thread-1) [    ] o.a.s.c.SolrResourceLoader solr home defaulted to 'solr/' (could not find system property or JNDI)
   [junit4]   2> 1605771 INFO  (coreLoadExecutor-4941-thread-1) [    ] o.a.s.c.SolrResourceLoader Adding 'file:/C:/Users/jenkins/workspace/Lucene-Solr-master-Windows/solr/core/src/test-files/solr/collection1/lib/classes/' to classloader
   [junit4]   2> 1605771 INFO  (coreLoadExecutor-4941-thread-1) [    ] o.a.s.c.SolrResourceLoader Adding 'file:/C:/Users/jenkins/workspace/Lucene-Solr-master-Windows/solr/core/src/test-files/solr/collection1/lib/README' to classloader
   [junit4]   2> 1605826 INFO  (coreLoadExecutor-4941-thread-1) [    ] o.a.s.c.SolrConfig current version of requestparams : -1
   [junit4]   2> 1605829 WARN  (coreLoadExecutor-4941-thread-1) [    ] o.a.s.c.Config Beginning with Solr 5.5, <mergePolicy> is deprecated, use <mergePolicyFactory> instead.
   [junit4]   2> 1605830 INFO  (coreLoadExecutor-4941-thread-1) [    ] o.a.s.c.SolrConfig Using Lucene MatchVersion: 7.0.0
   [junit4]   2> 1605838 INFO  (coreLoadExecutor-4941-thread-1) [    ] o.a.s.c.SolrConfig Loaded SolrConfig: solrconfig-tlog.xml
   [junit4]   2> 1605843 INFO  (coreLoadExecutor-4941-thread-1) [    ] o.a.s.s.IndexSchema [collection1] Schema name=test
   [junit4]   2> 1605955 INFO  (coreLoadExecutor-4941-thread-1) [    ] o.a.s.s.OpenExchangeRatesOrgProvider Initialized with rates=open-exchange-rates.json, refreshInterval=1440.
   [junit4]   2> 1605970 INFO  (coreLoadExecutor-4941-thread-1) [    ] o.a.s.s.IndexSchema default search field in schema is text
   [junit4]   2> 1605972 INFO  (coreLoadExecutor-4941-thread-1) [    ] o.a.s.s.IndexSchema unique key field: id
   [junit4]   2> 1605982 INFO  (coreLoadExecutor-4941-thread-1) [    ] o.a.s.s.FileExchangeRateProvider Reloading exchange rates from file currency.xml
   [junit4]   2> 1605984 INFO  (coreLoadExecutor-4941-thread-1) [    ] o.a.s.s.FileExchangeRateProvider Reloading exchange rates from file currency.xml
   [junit4]   2> 1605986 INFO  (coreLoadExecutor-4941-thread-1) [    ] o.a.s.s.OpenExchangeRatesOrgProvider Reloading exchange rates from open-exchange-rates.json
   [junit4]   2> 1605988 INFO  (coreLoadExecutor-4941-thread-1) [    ] o.a.s.s.OpenExchangeRatesOrgProvider Reloading exchange rates from open-exchange-rates.json
   [junit4]   2> 1605997 INFO  (coreLoadExecutor-4941-thread-1) [    ] o.a.s.c.ConfigSetProperties Did not find ConfigSet properties, assuming default properties: Can't find resource 'configsetprops.json' in classpath or 'C:\Users\jenkins\workspace\Lucene-Solr-master-Windows\solr\core\src\test-files\solr\collection1'
   [junit4]   2> 1605997 INFO  (coreLoadExecutor-4941-thread-1) [    ] o.a.s.c.CoreContainer Creating SolrCore 'collection1' using configuration from configset C:\Users\jenkins\workspace\Lucene-Solr-master-Windows\solr\core\src\test-files\solr\collection1
   [junit4]   2> 1605997 INFO  (coreLoadExecutor-4941-thread-1) [    x:collection1] o.a.s.c.SolrCore org.apache.solr.core.MockDirectoryFactory
   [junit4]   2> 1605997 INFO  (coreLoadExecutor-4941-thread-1) [    x:collection1] o.a.s.c.SolrCore [[collection1] ] Opening new SolrCore at [C:\Users\jenkins\workspace\Lucene-Solr-master-Windows\solr\core\src\test-files\solr\collection1], dataDir=[C:\Users\jenkins\workspace\Lucene-Solr-master-Windows\solr\build\solr-core\test\J0\temp\solr.update.PeerSyncTest_6B269833028064D8-001\tempDir-001\control\cores\collection1\data\]
   [junit4]   2> 1605997 INFO  (coreLoadExecutor-4941-thread-1) [    x:collection1] o.a.s.c.JmxMonitoredMap JMX monitoring is enabled. Adding Solr mbeans to JMX Server: com.sun.jmx.mbeanserver.JmxMBeanServer@18d0bfbd
   [junit4]   2> 1605999 INFO  (coreLoadExecutor-4941-thread-1) [    x:collection1] o.a.s.c.CachingDirectoryFactory return new directory for C:\Users\jenkins\workspace\Lucene-Solr-master-Windows\solr\build\solr-core\test\J0\temp\solr.update.PeerSyncTest_6B269833028064D8-001\tempDir-001\control\cores\collection1\data\snapshot_metadata
   [junit4]   2> 1605999 INFO  (coreLoadExecutor-4941-thread-1) [    x:collection1] o.a.s.c.s.SolrSnapshotMetaDataManager Loading from snapshot metadata file...
   [junit4]   2> 1605999 INFO  (coreLoadExecutor-4941-thread-1) [    x:collection1] o.a.s.c.CachingDirectoryFactory return new directory for C:\Users\jenkins\workspace\Lucene-Solr-master-Windows\solr\build\solr-core\test\J0\temp\solr.update.PeerSyncTest_6B269833028064D8-001\tempDir-001\control\cores\collection1\data\
   [junit4]   2> 1605999 INFO  (coreLoadExecutor-4941-thread-1) [    x:collection1] o.a.s.c.SolrCore New index directory detected: old=null new=C:\Users\jenkins\workspace\Lucene-Solr-master-Windows\solr\build\solr-core\test\J0\temp\solr.update.PeerSyncTest_6B269833028064D8-001\tempDir-001\control\cores\collection1\data\index/
   [junit4]   2> 1605999 WARN  (coreLoadExecutor-4941-thread-1) [    x:collection1] o.a.s.c.SolrCore [collection1] Solr index directory 'C:\Users\jenkins\workspace\Lucene-Solr-master-Windows\solr\build\solr-core\test\J0\temp\solr.update.PeerSyncTest_6B269833028064D8-001\tempDir-001\control\cores\collection1\data\index' doesn't exist. Creating new index...
   [junit4]   2> 1605999 INFO  (coreLoadExecutor-4941-thread-1) [    x:collection1] o.a.s.c.CachingDirectoryFactory return new directory for C:\Users\jenkins\workspace\Lucene-Solr-master-Windows\solr\build\solr-core\test\J0\temp\solr.update.PeerSyncTest_6B269833028064D8-001\tempDir-001\control\cores\collection1\data\index
   [junit4]   2> 1605999 INFO  (coreLoadExecutor-4941-thread-1) [    x:collection1] o.a.s.u.RandomMergePolicy RandomMergePolicy wrapping class org.apache.lucene.index.LogDocMergePolicy: [LogDocMergePolicy: minMergeSize=1000, mergeFactor=17, maxMergeSize=9223372036854775807, maxMergeSizeForForcedMerge=9223372036854775807, calibrateSizeByDeletes=true, maxMergeDocs=2147483647, maxCFSSegmentSizeMB=8.796093022207999E12, noCFSRatio=1.0]
   [junit4]   2> 1606000 INFO  (coreLoadExecutor-4941-thread-1) [    x:collection1] o.a.s.c.SolrDeletionPolicy SolrDeletionPolicy.onCommit: commits: num=1
   [junit4]   2> 	commit{dir=MockDirectoryWrapper(RAMDirectory@39b4d23e lockFactory=org.apache.lucene.store.SingleInstanceLockFactory@263c0eea),segFN=segments_1,generation=1}
   [junit4]   2> 1606000 INFO  (coreLoadExecutor-4941-thread-1) [    x:collection1] o.a.s.c.SolrDeletionPolicy newest commit generation = 1
   [junit4]   2> 1606000 INFO  (OldIndexDirectoryCleanupThreadForCore-collection1) [    x:collection1] o.a.s.c.SolrCore Looking for old index directories to cleanup for core collection1 in C:\Users\jenkins\workspace\Lucene-Solr-master-Windows\solr\build\solr-core\test\J0\temp\solr.update.PeerSyncTest_6B269833028064D8-001\tempDir-001\control\cores\collection1\data\
   [junit4]   2> 1606002 WARN  (OldIndexDirectoryCleanupThreadForCore-collection1) [    x:collection1] o.a.s.c.DirectoryFactory C:\Users\jenkins\workspace\Lucene-Solr-master-Windows\solr\build\solr-core\test\J0\temp\solr.update.PeerSyncTest_6B269833028064D8-001\tempDir-001\control\cores\collection1\data\ does not point to a valid data directory; skipping clean-up of old index directories.
   [junit4]   2> 1606003 INFO  (coreLoadExecutor-4941-thread-1) [    x:collection1] o.a.s.u.p.UpdateRequestProcessorChain creating updateRequestProcessorChain "nodistrib"
   [junit4]   2> 1606003 INFO  (coreLoadExecutor-4941-thread-1) [    x:collection1] o.a.s.u.p.UpdateRequestProcessorChain creating updateRequestProcessorChain "dedupe"
   [junit4]   2> 1606003 INFO  (coreLoadExecutor-4941-thread-1) [    x:collection1] o.a.s.u.p.UpdateRequestProcessorChain inserting DistributedUpdateProcessorFactory into updateRequestProcessorChain "dedupe"
   [junit4]   2> 1606003 INFO  (coreLoadExecutor-4941-thread-1) [    x:collection1] o.a.s.u.p.UpdateRequestProcessorChain creating updateRequestProcessorChain "stored_sig"
   [junit4]   2> 1606003 INFO  (coreLoadExecutor-4941-thread-1) [    x:collection1] o.a.s.u.p.UpdateRequestProcessorChain inserting DistributedUpdateProcessorFactory into updateRequestProcessorChain "stored_sig"
   [junit4]   2> 1606003 INFO  (coreLoadExecutor-4941-thread-1) [    x:collection1] o.a.s.u.p.UpdateRequestProcessorChain creating updateRequestProcessorChain "distrib-dup-test-chain-explicit"
   [junit4]   2> 1606003 INFO  (coreLoadExecutor-4941-thread-1) [    x:collection1] o.a.s.u.p.UpdateRequestProcessorChain creating updateRequestProcessorChain "distrib-dup-test-chain-implicit"
   [junit4]   2> 1606003 INFO  (coreLoadExecutor-4941-thread-1) [    x:collection1] o.a.s.u.p.UpdateRequestProcessorChain inserting DistributedUpdateProcessorFactory into updateRequestProcessorChain "distrib-dup-test-chain-implicit"
   [junit4]   2> 1606004 INFO  (coreLoadExecutor-4941-thread-1) [    x:collection1] o.a.s.c.SolrCore no updateRequestProcessorChain defined as default, creating implicit default
   [junit4]   2> 1606004 WARN  (coreLoadExecutor-4941-thread-1) [    x:collection1] o.a.s.c.RequestHandlers INVALID paramSet a in requestHandler {type = requestHandler,name = /dump,class = DumpRequestHandler,args = {defaults={a=A,b=B}}}
   [junit4]   2> 1606012 INFO  (coreLoadExecutor-4941-thread-1) [    x:collection1] o.a.s.h.l.XMLLoader xsltCacheLifetimeSeconds=60
   [junit4]   2> 1606014 INFO  (coreLoadExecutor-4941-thread-1) [    x:collection1] o.a.s.h.l.XMLLoader xsltCacheLifetimeSeconds=60
   [junit4]   2> 1606015 INFO  (coreLoadExecutor-4941-thread-1) [    x:collection1] o.a.s.h.l.XMLLoader xsltCacheLifetimeSeconds=60
   [junit4]   2> 1606016 INFO  (coreLoadExecutor-4941-thread-1) [    x:collection1] o.a.s.h.l.XMLLoader xsltCacheLifetimeSeconds=60
   [junit4]   2> 1606020 INFO  (coreLoadExecutor-4941-thread-1) [    x:collection1] o.a.s.c.RequestHandlers Registered paths: /admin/mbeans,standard,/update/json/docs,/admin/luke,/export,/get,/admin/properties,/update/json,/admin/threads,/dump,/update/csv,/sql,/graph,/admin/segments,/admin/system,/replication,/config,/stream,/schema,/admin/plugins,/admin/logging,/admin/ping,/update,/admin/file,/terms
   [junit4]   2> 1606020 INFO  (coreLoadExecutor-4941-thread-1) [    x:collection1] o.a.s.c.SolrCore Using default statsCache cache: org.apache.solr.search.stats.LocalStatsCache
   [junit4]   2> 1606021 INFO  (coreLoadExecutor-4941-thread-1) [    x:collection1] o.a.s.u.UpdateHandler Using UpdateLog implementation: org.apache.solr.update.UpdateLog
   [junit4]   2> 1606021 INFO  (coreLoadExecutor-4941-thread-1) [    x:collection1] o.a.s.u.UpdateLog Initializing UpdateLog: dataDir= defaultSyncLevel=FLUSH numRecordsToKeep=100 maxNumLogsToKeep=10 numVersionBuckets=65536
   [junit4]   2> 1606022 INFO  (coreLoadExecutor-4941-thread-1) [    x:collection1] o.a.s.u.CommitTracker Hard AutoCommit: disabled
   [junit4]   2> 1606022 INFO  (coreLoadExecutor-4941-thread-1) [    x:collection1] o.a.s.u.CommitTracker Soft AutoCommit: disabled
   [junit4]   2> 1606023 INFO  (coreLoadExecutor-4941-thread-1) [    x:collection1] o.a.s.u.RandomMergePolicy RandomMergePolicy wrapping class org.apache.lucene.index.TieredMergePolicy: [TieredMergePolicy: maxMergeAtOnce=18, maxMergeAtOnceExplicit=38, maxMergedSegmentMB=20.6591796875, floorSegmentMB=0.91796875, forceMergeDeletesPctAllowed=19.221209014276262, segmentsPerTier=47.0, maxCFSSegmentSizeMB=8.796093022207999E12, noCFSRatio=0.0
   [junit4]   2> 1606023 INFO  (coreLoadExecutor-4941-thread-1) [    x:collection1] o.a.s.c.SolrDeletionPolicy SolrDeletionPolicy.onInit: commits: num=1
   [junit4]   2> 	commit{dir=MockDirectoryWrapper(RAMDirectory@39b4d23e lockFactory=org.apache.lucene.store.SingleInstanceLockFactory@263c0eea),segFN=segments_1,generation=1}
   [junit4]   2> 1606023 INFO  (coreLoadExecutor-4941-thread-1) [    x:collection1] o.a.s.c.SolrDeletionPolicy newest commit generation = 1
   [junit4]   2> 1606023 INFO  (coreLoadExecutor-4941-thread-1) [    x:collection1] o.a.s.s.SolrIndexSearcher Opening [Searcher@5834969a[collection1] main]
   [junit4]   2> 1606024 WARN  (coreLoadExecutor-4941-thread-1) [    x:collection1] o.a.s.r.ManagedResourceStorage Cannot write to config directory C:\Users\jenkins\workspace\Lucene-Solr-master-Windows\solr\core\src\test-files\solr\collection1\conf; switching to use InMemory storage instead.
   [junit4]   2> 1606024 INFO  (coreLoadExecutor-4941-thread-1) [    x:collection1] o.a.s.r.RestManager Initializing RestManager with initArgs: {}
   [junit4]   2> 1606024 INFO  (coreLoadExecutor-4941-thread-1) [    x:collection1] o.a.s.r.ManagedResourceStorage Reading _rest_managed.json using InMemoryStorage
   [junit4]   2> 1606024 INFO  (coreLoadExecutor-4941-thread-1) [    x:collection1] o.a.s.r.RestManager Initializing 0 registered ManagedResources
   [junit4]   2> 1606024 INFO  (coreLoadExecutor-4941-thread-1) [    x:collection1] o.a.s.h.ReplicationHandler Commits will be reserved for  10000
   [junit4]   2> 1606025 INFO  (searcherExecutor-4942-thread-1-processing-x:collection1) [    x:collection1] o.a.s.c.SolrCore [collection1] Registered new searcher Searcher@5834969a[collection1] main{ExitableDirectoryReader(UninvertingDirectoryReader())}
   [junit4]   2> 1606025 INFO  (coreLoadExecutor-4941-thread-1) [    x:collection1] o.a.s.u.UpdateLog Looking up max value of version field to seed version buckets
   [junit4]   2> 1606025 INFO  (coreLoadExecutor-4941-thread-1) [    x:collection1] o.a.s.u.VersionInfo Refreshing highest value of _version_ for 65536 version buckets from index
   [junit4]   2> 1606025 INFO  (coreLoadExecutor-4941-thread-1) [    x:collection1] o.a.s.u.VersionInfo No terms found for _version_, cannot seed version bucket highest value from index
   [junit4]   2> 1606025 INFO  (coreLoadExecutor-4941-thread-1) [    x:collection1] o.a.s.u.UpdateLog Could not find max version in index or recent updates, using new clock 1543413784791482368
   [junit4]   2> 1606027 INFO  (coreLoadExecutor-4941-thread-1) [    x:collection1] o.a.s.u.UpdateLog Took 2.0ms to seed version buckets with highest version 1543413784791482368
   [junit4]   2> 1606027 INFO  (coreLoadExecutor-4941-thread-1) [    x:collection1] o.a.s.c.CoreContainer registering core: collection1
   [junit4]   2> 1606915 INFO  (TEST-PeerSyncTest.test-seed#[6B269833028064D8]) [    ] o.a.s.SolrTestCaseJ4 Writing core.properties file to C:\Users\jenkins\workspace\Lucene-Solr-master-Windows\solr\build\solr-core\test\J0\temp\solr.update.PeerSyncTest_6B269833028064D8-001\tempDir-001\shard0\cores\collection1
   [junit4]   2> 1606918 INFO  (TEST-PeerSyncTest.test-seed#[6B269833028064D8]) [    ] o.e.j.s.Server jetty-9.3.8.v20160314
   [junit4]   2> 1606919 INFO  (TEST-PeerSyncTest.test-seed#[6B269833028064D8]) [    ] o.e.j.s.h.ContextHandler Started o.e.j.s.ServletContextHandler@437b266{/tedv/wb,null,AVAILABLE}
   [junit4]   2> 1606919 INFO  (TEST-PeerSyncTest.test-seed#[6B269833028064D8]) [    ] o.e.j.s.ServerConnector Started ServerConnector@4521d108{HTTP/1.1,[http/1.1]}{127.0.0.1:65267}
   [junit4]   2> 1606919 INFO  (TEST-PeerSyncTest.test-seed#[6B269833028064D8]) [    ] o.e.j.s.Server Started @1611694ms
   [junit4]   2> 1606920 INFO  (TEST-PeerSyncTest.test-seed#[6B269833028064D8]) [    ] o.a.s.c.s.e.JettySolrRunner Jetty properties: {schema=schema.xml, solrconfig=solrconfig-tlog.xml, hostContext=/tedv/wb, hostPort=65267, coreRootDirectory=C:\Users\jenkins\workspace\Lucene-Solr-master-Windows\solr\build\solr-core\test\J0\temp\solr.update.PeerSyncTest_6B269833028064D8-001\tempDir-001\shard0\cores}
   [junit4]   2> 1606920 INFO  (TEST-PeerSyncTest.test-seed#[6B269833028064D8]) [    ] o.a.s.s.SolrDispatchFilter SolrDispatchFilter.init(): sun.misc.Launcher$AppClassLoader@73d16e93
   [junit4]   2> 1606920 INFO  (TEST-PeerSyncTest.test-seed#[6B269833028064D8]) [    ] o.a.s.c.SolrResourceLoader new SolrResourceLoader for directory: 'C:\Users\jenkins\workspace\Lucene-Solr-master-Windows\solr\build\solr-core\test\J0\temp\solr.update.PeerSyncTest_6B269833028064D8-001\tempDir-001\shard0'
   [junit4]   2> 1606920 INFO  (TEST-PeerSyncTest.test-seed#[6B269833028064D8]) [    ] o.a.s.c.SolrResourceLoader JNDI not configured for solr (NoInitialContextEx)
   [junit4]   2> 1606920 INFO  (TEST-PeerSyncTest.test-seed#[6B269833028064D8]) [    ] o.a.s.c.SolrResourceLoader solr home defaulted to 'solr/' (could not find system property or JNDI)
   [junit4]   2> 1606922 INFO  (TEST-PeerSyncTest.test-seed#[6B269833028064D8]) [    ] o.a.s.c.SolrXmlConfig Loading container configuration from C:\Users\jenkins\workspace\Lucene-Solr-master-Windows\solr\build\solr-core\test\J0\temp\solr.update.PeerSyncTest_6B269833028064D8-001\tempDir-001\shard0\solr.xml
   [junit4]   2> 1606938 INFO  (TEST-PeerSyncTest.test-seed#[6B269833028064D8]) [    ] o.a.s.c.CorePropertiesLocator Config-defined core root directory: C:\Users\jenkins\workspace\Lucene-Solr-master-Windows\solr\build\solr-core\test\J0\temp\solr.update.PeerSyncTest_6B269833028064D8-001\tempDir-001\shard0\cores
   [junit4]   2> 1606940 INFO  (TEST-PeerSyncTest.test-seed#[6B269833028064D8]) [    ] o.a.s.c.CoreContainer New CoreContainer 2062851763
   [junit4]   2> 1606941 INFO  (TEST-PeerSyncTest.test-seed#[6B269833028064D8]) [    ] o.a.s.c.CoreContainer Loading cores into CoreContainer [instanceDir=C:\Users\jenkins\workspace\Lucene-Solr-master-Windows\solr\build\solr-core\test\J0\temp\solr.update.PeerSyncTest_6B269833028064D8-001\tempDir-001\shard0]
   [junit4]   2> 1606941 WARN  (TEST-PeerSyncTest.test-seed#[6B269833028064D8]) [    ] o.a.s.c.CoreContainer Couldn't add files from C:\Users\jenkins\workspace\Lucene-Solr-master-Windows\solr\build\solr-core\test\J0\temp\solr.update.PeerSyncTest_6B269833028064D8-001\tempDir-001\shard0\lib to classpath: C:\Users\jenkins\workspace\Lucene-Solr-master-Windows\solr\build\solr-core\test\J0\temp\solr.update.PeerSyncTest_6B269833028064D8-001\tempDir-001\shard0\lib
   [junit4]   2> 1606942 INFO  (TEST-PeerSyncTest.test-seed#[6B269833028064D8]) [    ] o.a.s.h.c.HttpShardHandlerFactory created with socketTimeout : 90000,urlScheme : ,connTimeout : 15000,maxConnectionsPerHost : 20,maxConnections : 10000,corePoolSize : 0,maximumPoolSize : 2147483647,maxThreadIdleTime : 5,sizeOfQueue : -1,fairnessPolicy : false,
   [junit4]   2> 1606948 INFO  (TEST-PeerSyncTest.test-seed#[6B269833028064D8]) [    ] o.a.s.u.UpdateShardHandler Created UpdateShardHandler HTTP client with params: socketTimeout=340000&connTimeout=45000&maxConnections=100000&maxConnectionsPerHost=100000
   [junit4]   2> 1606948 INFO  (TEST-PeerSyncTest.test-seed#[6B269833028064D8]) [    ] o.a.s.l.LogWatcher SLF4J impl is org.slf4j.impl.Log4jLoggerFactory
   [junit4]   2> 1606948 INFO  (TEST-PeerSyncTest.test-seed#[6B269833028064D8]) [    ] o.a.s.l.LogWatcher Registering Log Listener [Log4j (org.slf4j.impl.Log4jLoggerFactory)]
   [junit4]   2> 1606948 INFO  (TEST-PeerSyncTest.test-seed#[6B269833028064D8]) [    ] o.a.s.c.CoreContainer Security conf doesn't exist. Skipping setup for authorization module.
   [junit4]   2> 1606949 INFO  (TEST-PeerSyncTest.test-seed#[6B269833028064D8]) [    ] o.a.s.c.CoreContainer No authentication plugin used.
   [junit4]   2> 1606950 INFO  (TEST-PeerSyncTest.test-seed#[6B269833028064D8]) [    ] o.a.s.c.CorePropertiesLocator Looking for core definitions underneath C:\Users\jenkins\workspace\Lucene-Solr-master-Windows\solr\build\solr-core\test\J0\temp\solr.update.PeerSyncTest_6B269833028064D8-001\tempDir-001\shard0\cores
   [junit4]   2> 1606951 INFO  (TEST-PeerSyncTest.test-seed#[6B269833028064D8]) [    ] o.a.s.c.CoreDescriptor Created CoreDescriptor: {name=collection1, config=solrconfig-tlog.xml, loadOnStartup=true, schema=schema.xml, configSetProperties=configsetprops.json, transient=false, dataDir=data\, configSet=collection1}
   [junit4]   2> 1606951 INFO  (TEST-PeerSyncTest.test-seed#[6B269833028064D8]) [    ] o.a.s.c.CorePropertiesLocator Found core collection1 in C:\Users\jenkins\workspace\Lucene-Solr-master-Windows\solr\build\solr-core\test\J0\temp\solr.update.PeerSyncTest_6B269833028064D8-001\tempDir-001\shard0\cores\collection1
   [junit4]   2> 1606951 INFO  (TEST-PeerSyncTest.test-seed#[6B269833028064D8]) [    ] o.a.s.c.CorePropertiesLocator Found 1 core definitions
   [junit4]   2> 1606951 INFO  (TEST-PeerSyncTest.test-seed#[6B269833028064D8]) [    ] o.a.s.s.SolrDispatchFilter user.dir=C:\Users\jenkins\workspace\Lucene-Solr-master-Windows\solr\build\solr-core\test\J0
   [junit4]   2> 1606951 INFO  (TEST-PeerSyncTest.test-seed#[6B269833028064D8]) [    ] o.a.s.s.SolrDispatchFilter SolrDispatchFilter.init() done
   [junit4]   2> 1606952 INFO  (coreLoadExecutor-4952-thread-1) [    ] o.a.s.c.SolrResourceLoader new SolrResourceLoader for directory: 'C:\Users\jenkins\workspace\Lucene-Solr-master-Windows\solr\core\src\test-files\solr\collection1'
   [junit4]   2> 1606954 INFO  (coreLoadExecutor-4952-thread-1) [    ] o.a.s.c.SolrResourceLoader JNDI not configured for solr (NoInitialContextEx)
   [junit4]   2> 1606954 INFO  (coreLoadExecutor-4952-thread-1) [    ] o.a.s.c.SolrResourceLoader solr home defaulted to 'solr/' (could not find system property or JNDI)
   [junit4]   2> 1606955 INFO  (coreLoadExecutor-4952-thread-1) [    ] o.a.s.c.SolrResourceLoader Adding 'file:/C:/Users/jenkins/workspace/Lucene-Solr-master-Windows/solr/core/src/test-files/solr/collection1/lib/classes/' to classloader
   [junit4]   2> 1606955 INFO  (coreLoadExecutor-4952-thread-1) [    ] o.a.s.c.SolrResourceLoader Adding 'file:/C:/Users/jenkins/workspace/Lucene-Solr-master-Windows/solr/core/src/test-files/solr/collection1/lib/README' to classloader
   [junit4]   2> 1607056 INFO  (coreLoadExecutor-4952-thread-1) [    ] o.a.s.c.SolrConfig current version of requestparams : -1
   [junit4]   2> 1607058 WARN  (coreLoadExecutor-4952-thread-1) [    ] o.a.s.c.Config Beginning with Solr 5.5, <mergePolicy> is deprecated, use <mergePolicyFactory> instead.
   [junit4]   2> 1607059 INFO  (coreLoadExecutor-4952-thread-1) [    ] o.a.s.c.SolrConfig Using Lucene MatchVersion: 7.0.0
   [junit4]   2> 1607071 INFO  (coreLoadExecutor-4952-thread-1) [    ] o.a.s.c.SolrConfig Loaded SolrConfig: solrconfig-tlog.xml
   [junit4]   2> 1607080 INFO  (coreLoadExecutor-4952-thread-1) [    ] o.a.s.s.IndexSchema [collection1] Schema name=test
   [junit4]   2> 1607194 INFO  (coreLoadExecutor-4952-thread-1) [    ] o.a.s.s.OpenExchangeRatesOrgProvider Initialized with rates=open-exchange-rates.json, refreshInterval=1440.
   [junit4]   2> 1607202 INFO  (coreLoadExecutor-4952-thread-1) [    ] o.a.s.s.IndexSchema default search field in schema is text
   [junit4]   2> 1607203 INFO  (coreLoadExecutor-4952-thread-1) [    ] o.a.s.s.IndexSchema unique key field: id
   [junit4]   2> 1607209 INFO  (coreLoadExecutor-4952-thread-1) [    ] o.a.s.s.FileExchangeRateProvider Reloading exchange rates from file currency.xml
   [junit4]   2> 1607212 INFO  (coreLoadExecutor-4952-thread-1) [    ] o.a.s.s.FileExchangeRateProvider Reloading exchange rates from file currency.xml
   [junit4]   2> 1607219 INFO  (coreLoadExecutor-4952-thread-1) [    ] o.a.s.s.OpenExchangeRatesOrgProvider Reloading exchange rates from open-exchange-rates.json
   [junit4]   2> 1607219 INFO  (coreLoadExecutor-4952-thread-1) [    ] o.a.s.s.OpenExchangeRatesOrgProvider Reloading exchange rates from open-exchange-rates.json
   [junit4]   2> 1607234 INFO  (coreLoadExecutor-4952-thread-1) [    ] o.a.s.c.ConfigSetProperties Did not find ConfigSet properties, assuming default properties: Can't find resource 'configsetprops.json' in classpath or 'C:\Users\jenkins\workspace\Lucene-Solr-master-Windows\solr\core\src\test-files\solr\collection1'
   [junit4]   2> 1607234 INFO  (coreLoadExecutor-4952-thread-1) [    ] o.a.s.c.CoreContainer Creating SolrCore 'collection1' using configuration from configset C:\Users\jenkins\workspace\Lucene-Solr-master-Windows\solr\core\src\test-files\solr\collection1
   [junit4]   2> 1607235 INFO  (coreLoadExecutor-4952-thread-1) [    x:collection1] o.a.s.c.SolrCore org.apache.solr.core.MockDirectoryFactory
   [junit4]   2> 1607235 INFO  (coreLoadExecutor-4952-thread-1) [    x:collection1] o.a.s.c.SolrCore [[collection1] ] Opening new SolrCore at [C:\Users\jenkins\workspace\Lucene-Solr-master-Windows\solr\core\src\test-files\solr\collection1], dataDir=[C:\Users\jenkins\workspace\Lucene-Solr-master-Windows\solr\build\solr-core\test\J0\temp\solr.update.PeerSyncTest_6B269833028064D8-001\tempDir-001\shard0\cores\collection1\data\]
   [junit4]   2> 1607235 INFO  (coreLoadExecutor-4952-thread-1) [    x:collection1] o.a.s.c.JmxMonitoredMap JMX monitoring is enabled. Adding Solr mbeans to JMX Server: com.sun.jmx.mbeanserver.JmxMBeanServer@18d0bfbd
   [junit4]   2> 1607235 INFO  (coreLoadExecutor-4952-thread-1) [    x:collection1] o.a.s.c.CachingDirectoryFactory return new directory for C:\Users\jenkins\workspace\Lucene-Solr-master-Windows\solr\build\solr-core\test\J0\temp\solr.update.PeerSyncTest_6B269833028064D8-001\tempDir-001\shard0\cores\collection1\data\snapshot_metadata
   [junit4]   2> 1607235 INFO  (coreLoadExecutor-4952-thread-1) [    x:collection1] o.a.s.c.s.SolrSnapshotMetaDataManager Loading from snapshot metadata file...
   [junit4]   2> 1607250 INFO  (coreLoadExecutor-4952-thread-1) [    x:collection1] o.a.s.c.CachingDirectoryFactory return new directory for C:\Users\jenkins\workspace\Lucene-Solr-master-Windows\solr\build\solr-core\test\J0\temp\solr.update.PeerSyncTest_6B269833028064D8-001\tempDir-001\shard0\cores\collection1\data\
   [junit4]   2> 1607250 INFO  (coreLoadExecutor-4952-thread-1) [    x:collection1] o.a.s.c.SolrCore New index directory detected: old=null new=C:\Users\jenkins\workspace\Lucene-Solr-master-Windows\solr\build\solr-core\test\J0\temp\solr.update.PeerSyncTest_6B269833028064D8-001\tempDir-001\shard0\cores\collection1\data\index/
   [junit4]   2> 1607250 WARN  (coreLoadExecutor-4952-thread-1) [    x:collection1] o.a.s.c.SolrCore [collection1] Solr index directory 'C:\Users\jenkins\workspace\Lucene-Solr-master-Windows\solr\build\solr-core\test\J0\temp\solr.update.PeerSyncTest_6B269833028064D8-001\tempDir-001\shard0\cores\collection1\data\index' doesn't exist. Creating new index...
   [junit4]   2> 1607250 INFO  (coreLoadExecutor-4952-thread-1) [    x:collection1] o.a.s.c.CachingDirectoryFactory return new directory for C:\Users\jenkins\workspace\Lucene-Solr-master-Windows\solr\build\solr-core\test\J0\temp\solr.update.PeerSyncTest_6B269833028064D8-001\tempDir-001\shard0\cores\collection1\data\index
   [junit4]   2> 1607250 INFO  (coreLoadExecutor-4952-thread-1) [    x:collection1] o.a.s.u.RandomMergePolicy RandomMergePolicy wrapping class org.apache.lucene.index.LogDocMergePolicy: [LogDocMergePolicy: minMergeSize=1000, mergeFactor=17, maxMergeSize=9223372036854775807, maxMergeSizeForForcedMerge=9223372036854775807, calibrateSizeByDeletes=true, maxMergeDocs=2147483647, maxCFSSegmentSizeMB=8.796093022207999E12, noCFSRatio=1.0]
   [junit4]   2> 1607260 INFO  (coreLoadExecutor-4952-thread-1) [    x:collection1] o.a.s.c.SolrDeletionPolicy SolrDeletionPolicy.onCommit: commits: num=1
   [junit4]   2> 	commit{dir=MockDirectoryWrapper(RAMDirectory@216bfcf8 lockFactory=org.apache.lucene.store.SingleInstanceLockFactory@8ffccdf),segFN=segments_1,generation=1}
   [junit4]   2> 1607260 INFO  (coreLoadExecutor-4952-thread-1) [    x:collection1] o.a.s.c.SolrDeletionPolicy newest commit generation = 1
   [junit4]   2> 1607265 INFO  (coreLoadExecutor-4952-thread-1) [    x:collection1] o.a.s.u.p.UpdateRequestProcessorChain creating updateRequestProcessorChain "nodistrib"
   [junit4]   2> 1607265 INFO  (coreLoadExecutor-4952-thread-1) [    x:collection1] o.a.s.u.p.UpdateRequestProcessorChain creating updateRequestProcessorChain "dedupe"
   [junit4]   2> 1607265 INFO  (coreLoadExecutor-4952-thread-1) [    x:collection1] o.a.s.u.p.UpdateRequestProcessorChain inserting DistributedUpdateProcessorFactory into updateRequestProcessorChain "dedupe"
   [junit4]   2> 1607265 INFO  (coreLoadExecutor-4952-thread-1) [    x:collection1] o.a.s.u.p.UpdateRequestProcessorChain creating updateRequestProcessorChain "stored_sig"
   [junit4]   2> 1607265 INFO  (coreLoadExecutor-4952-thread-1) [    x:collection1] o.a.s.u.p.UpdateRequestProcessorChain inserting DistributedUpdateProcessorFactory into updateRequestProcessorChain "stored_sig"
   [junit4]   2> 1607265 INFO  (coreLoadExecutor-4952-thread-1) [    x:collection1] o.a.s.u.p.UpdateRequestProcessorChain creating updateRequestProcessorChain "distrib-dup-test-chain-explicit"
   [junit4]   2> 1607265 INFO  (coreLoadExecutor-4952-thread-1) [    x:collection1] o.a.s.u.p.UpdateRequestProcessorChain creating updateRequestProcessorChain "distrib-dup-test-chain-implicit"
   [junit4]   2> 1607265 INFO  (coreLoadExecutor-4952-thread-1) [    x:collection1] o.a.s.u.p.UpdateRequestProcessorChain inserting DistributedUpdateProcessorFactory into updateRequestProcessorChain "distrib-dup-test-chain-implicit"
   [junit4]   2> 1607265 INFO  (coreLoadExecutor-4952-thread-1) [    x:collection1] o.a.s.c.SolrCore no updateRequestProcessorChain defined as default, creating implicit default
   [junit4]   2> 1607265 WARN  (coreLoadExecutor-4952-thread-1) [    x:collection1] o.a.s.c.RequestHandlers INVALID paramSet a in requestHandler {type = requestHandler,name = /dump,class = DumpRequestHandler,args = {defaults={a=A,b=B}}}
   [junit4]   2> 1607274 INFO  (coreLoadExecutor-4952-thread-1) [    x:collection1] o.a.s.h.l.XMLLoader xsltCacheLifetimeSeconds=60
   [junit4]   2> 1607277 INFO  (coreLoadExecutor-4952-thread-1) [    x:collection1] o.a.s.h.l.XMLLoader xsltCacheLifetimeSeconds=60
   [junit4]   2> 1607279 INFO  (coreLoadExecutor-4952-thread-1) [    x:collection1] o.a.s.h.l.XMLLoader xsltCacheLifetimeSeconds=60
   [junit4]   2> 1607282 INFO  (coreLoadExecutor-4952-thread-1) [    x:collection1] o.a.s.h.l.XMLLoader xsltCacheLifetimeSeconds=60
   [junit4]   2> 1607283 INFO  (OldIndexDirectoryCleanupThreadForCore-collection1) [    x:collection1] o.a.s.c.SolrCore Looking for old index directories to cleanup for core collection1 in C:\Users\jenkins\workspace\Lucene-Solr-master-Windows\solr\build\solr-core\test\J0\temp\solr.update.PeerSyncTest_6B269833028064D8-001\tempDir-001\shard0\cores\collection1\data\
   [junit4]   2> 1607285 WARN  (OldIndexDirectoryCleanupThreadForCore-collection1) [    x:collection1] o.a.s.c.DirectoryFactory C:\Users\jenkins\workspace\Lucene-Solr-master-Windows\solr\build\solr-core\test\J0\temp\solr.update.PeerSyncTest_6B269833028064D8-001\tempDir-001\shard0\cores\collection1\data\ does not point to a valid data directory; skipping clean-up of old index directories.
   [junit4]   2> 1607290 INFO  (coreLoadExecutor-4952-thread-1) [    x:collection1] o.a.s.c.RequestHandlers Registered paths: /admin/mbeans,standard,/update/json/docs,/admin/luke,/export,/get,/admin/properties,/update/json,/admin/threads,/dump,/update/csv,/sql,/graph,/admin/segments,/admin/system,/replication,/config,/stream,/schema,/admin/plugins,/admin/logging,/admin/ping,/update,/admin/file,/terms
   [junit4]   2> 1607292 INFO  (coreLoadExecutor-4952-thread-1) [    x:collection1] o.a.s.c.SolrCore Using default statsCache cache: org.apache.solr.search.stats.LocalStatsCache
   [junit4]   2> 1607293 INFO  (coreLoadExecutor-4952-thread-1) [    x:collection1] o.a.s.u.UpdateHandler Using UpdateLog implementation: org.apache.solr.update.UpdateLog
   [junit4]   2> 1607293 INFO  (coreLoadExecutor-4952-thread-1) [    x:collection1] o.a.s.u.UpdateLog Initializing UpdateLog: dataDir= defaultSyncLevel=FLUSH numRecordsToKeep=100 maxNumLogsToKeep=10 numVersionBuckets=65536
   [junit4]   2> 1607295 INFO  (coreLoadExecutor-4952-thread-1) [    x:collection1] o.a.s.u.CommitTracker Hard AutoCommit: disabled
   [junit4]   2> 1607295 INFO  (coreLoadExecutor-4952-thread-1) [    x:collection1] o.a.s.u.CommitTracker Soft AutoCommit: disabled
   [junit4]   2> 1607295 INFO  (coreLoadExecutor-4952-thread-1) [    x:collection1] o.a.s.u.RandomMergePolicy RandomMergePolicy wrapping class org.apache.lucene.index.TieredMergePolicy: [TieredMergePolicy: maxMergeAtOnce=18, maxMergeAtOnceExplicit=38, maxMergedSegmentMB=20.6591796875, floorSegmentMB=0.91796875, forceMergeDeletesPctAllowed=19.221209014276262, segmentsPerTier=47.0, maxCFSSegmentSizeMB=8.796093022207999E12, noCFSRatio=0.0
   [junit4]   2> 1607296 INFO  (coreLoadExecutor-4952-thread-1) [    x:collection1] o.a.s.c.SolrDeletionPolicy SolrDeletionPolicy.onInit: commits: num=1
   [junit4]   2> 	commit{dir=MockDirectoryWrapper(RAMDirectory@216bfcf8 lockFactory=org.apache.lucene.store.SingleInstanceLockFactory@8ffccdf),segFN=segments_1,generation=1}
   [junit4]   2> 1607296 INFO  (coreLoadExecutor-4952-thread-1) [    x:collection1] o.a.s.c.SolrDeletionPolicy newest commit generation = 1
   [junit4]   2> 1607296 INFO  (coreLoadExecutor-4952-thread-1) [    x:collection1] o.a.s.s.SolrIndexSearcher Opening [Searcher@25910533[collection1] main]
   [junit4]   2> 1607298 WARN  (coreLoadExecutor-4952-thread-1) [    x:collection1] o.a.s.r.ManagedResourceStorage Cannot write to config directory C:\Users\jenkins\workspace\Lucene-Solr-master-Windows\solr\core\src\test-files\solr\collection1\conf; switching to use InMemory storage instead.
   [junit4]   2> 1607298 INFO  (coreLoadExecutor-4952-thread-1) [    x:collection1] o.a.s.r.RestManager Initializing RestManager with initArgs: {}
   [junit4]   2> 1607298 INFO  (coreLoadExecutor-4952-thread-1) [    x:collection1] o.a.s.r.ManagedResourceStorage Reading _rest_managed.json using InMemoryStorage
   [junit4]   2> 1607298 INFO  (coreLoadExecutor-4952-thread-1) [    x:collection1] o.a.s.r.RestManager Initializing 0 registered ManagedResources
   [junit4]   2> 1607298 INFO  (coreLoadExecutor-4952-thread-1) [    x:collection1] o.a.s.h.ReplicationHandler Commits will be reserved for  10000
   [junit4]   2> 1607299 INFO  (searcherExecutor-4953-thread-1-processing-x:collection1) [    x:collection1] o.a.s.c.SolrCore [collection1] Registered new searcher Searcher@25910533[collection1] main{ExitableDirectoryReader(UninvertingDirectoryReader())}
   [junit4]   2> 1607299 INFO  (coreLoadExecutor-4952-thread-1) [    x:collection1] o.a.s.u.UpdateLog Looking up max value of version field to seed version buckets
   [junit4]   2> 1607301 INFO  (coreLoadExecutor-4952-thread-1) [    x:collection1] o.a.s.u.VersionInfo Refreshing highest value of _version_ for 65536 version buckets from index
   [junit4]   2> 1607301 INFO  (coreLoadExecutor-4952-thread-1) [    x:collection1] o.a.s.u.VersionInfo No terms found for _version_, cannot seed version bucket highest value from index
   [junit4]   2> 1607301 INFO  (coreLoadExecutor-4952-thread-1) [    x:collection1] o.a.s.u.UpdateLog Could not find max version in index or recent updates, using new clock 1543413786129465344
   [junit4]   2> 1607302 INFO  (coreLoadExecutor-4952-thread-1) [    x:collection1] o.a.s.u.UpdateLog Took 1.0ms to seed version buckets with highest version 1543413786129465344
   [junit4]   2> 1607302 INFO  (coreLoadExecutor-4952-thread-1) [    x:collection1] o.a.s.c.CoreContainer registering core: collection1
   [junit4]   2> 1608092 INFO  (TEST-PeerSyncTest.test-seed#[6B269833028064D8]) [    ] o.a.s.SolrTestCaseJ4 Writing core.properties file to C:\Users\jenkins\workspace\Lucene-Solr-master-Windows\solr\build\solr-core\test\J0\temp\solr.update.PeerSyncTest_6B269833028064D8-001\tempDir-001\shard1\cores\collection1
   [junit4]   2> 1608095 INFO  (TEST-PeerSyncTest.test-seed#[6B269833028064D8]) [    ] o.e.j.s.Server jetty-9.3.8.v20160314
   [junit4]   2> 1608095 INFO  (TEST-PeerSyncTest.test-seed#[6B269833028064D8]) [    ] o.e.j.s.h.ContextHandler Started o.e.j.s.ServletContextHandler@42a942b4{/tedv/wb,null,AVAILABLE}
   [junit4]   2> 1608096 INFO  (TEST-PeerSyncTest.test-seed#[6B269833028064D8]) [    ] o.e.j.s.ServerConnector Started ServerConnector@b3446af{HTTP/1.1,[http/1.1]}{127.0.0.1:65270}
   [junit4]   2> 1608096 INFO  (TEST-PeerSyncTest.test-seed#[6B269833028064D8]) [    ] o.e.j.s.Server Started @1612871ms
   [junit4]   2> 1608096 INFO  (TEST-PeerSyncTest.test-seed#[6B269833028064D8]) [    ] o.a.s.c.s.e.JettySolrRunner Jetty properties: {schema=schema.xml, solrconfig=solrconfig-tlog.xml, hostContext=/tedv/wb, hostPort=65270, coreRootDirectory=C:\Users\jenkins\workspace\Lucene-Solr-master-Windows\solr\build\solr-core\test\J0\temp\solr.update.PeerSyncTest_6B269833028064D8-001\tempDir-001\shard1\cores}
   [junit4]   2> 1608097 INFO  (TEST-PeerSyncTest.test-seed#[6B269833028064D8]) [    ] o.a.s.s.SolrDispatchFilter SolrDispatchFilter.init(): sun.misc.Launcher$AppClassLoader@73d16e93
   [junit4]   2> 1608097 INFO  (TEST-PeerSyncTest.test-seed#[6B269833028064D8]) [    ] o.a.s.c.SolrResourceLoader new SolrResourceLoader for directory: 'C:\Users\jenkins\workspace\Lucene-Solr-master-Windows\solr\build\solr-core\test\J0\temp\solr.update.PeerSyncTest_6B269833028064D8-001\tempDir-001\shard1'
   [junit4]   2> 1608097 INFO  (TEST-PeerSyncTest.test-seed#[6B269833028064D8]) [    ] o.a.s.c.SolrResourceLoader JNDI not configured for solr (NoInitialContextEx)
   [junit4]   2> 1608097 INFO  (TEST-PeerSyncTest.test-seed#[6B269833028064D8]) [    ] o.a.s.c.SolrResourceLoader solr home defaulted to 'solr/' (could not find system property or JNDI)
   [junit4]   2> 1608098 INFO  (TEST-PeerSyncTest.test-seed#[6B269833028064D8]) [    ] o.a.s.c.SolrXmlConfig Loading container configuration from C:\Users\jenkins\workspace\Lucene-Solr-master-Windows\solr\build\solr-core\test\J0\temp\solr.update.PeerSyncTest_6B269833028064D8-001\tempDir-001\shard1\solr.xml
   [junit4]   2> 1608117 INFO  (TEST-PeerSyncTest.test-seed#[6B269833028064D8]) [    ] o.a.s.c.CorePropertiesLocator Config-defined core root directory: C:\Users\jenkins\workspace\Lucene-Solr-master-Windows\solr\build\solr-core\test\J0\temp\solr.update.PeerSyncTest_6B269833028064D8-001\tempDir-001\shard1\cores
   [junit4]   2> 1608117 INFO  (TEST-PeerSyncTest.test-seed#[6B269833028064D8]) [    ] o.a.s.c.CoreContainer New CoreContainer 2118657118
   [junit4]   2> 1608117 INFO  (TEST-PeerSyncTest.test-seed#[6B269833028064D8]) [    ] o.a.s.c.CoreContainer Loading cores into CoreContainer [instanceDir=C:\Users\jenkins\workspace\Lucene-Solr-master-Windows\solr\build\solr-core\test\J0\temp\solr.update.PeerSyncTest_6B269833028064D8-001\tempDir-001\shard1]
   [junit4]   2> 1608117 WARN  (TEST-PeerSyncTest.test-seed#[6B269833028064D8]) [    ] o.a.s.c.CoreContainer Couldn't add files from C:\Users\jenkins\workspace\Lucene-Solr-master-Windows\solr\build\solr-core\test\J0\temp\solr.update.PeerSyncTest_6B269833028064D8-001\tempDir-001\shard1\lib to classpath: C:\Users\jenkins\workspace\Lucene-Solr-master-Windows\solr\build\solr-core\test\J0\temp\solr.update.PeerSyncTest_6B269833028064D8-001\tempDir-001\shard1\lib
   [junit4]   2> 1608117 INFO  (TEST-PeerSyncTest.test-seed#[6B269833028064D8]) [    ] o.a.s.h.c.HttpShardHandlerFactory created with socketTimeout : 90000,urlScheme : ,connTimeout : 15000,maxConnectionsPerHost : 20,maxConnections : 10000,corePoolSize : 0,maximumPoolSize : 2147483647,maxThreadIdleTime : 5,sizeOfQueue : -1,fairnessPolicy : false,
   [junit4]   2> 1608122 INFO  (TEST-PeerSyncTest.test-seed#[6B269833028064D8]) [    ] o.a.s.u.UpdateShardHandler Created UpdateShardHandler HTTP client with params: socketTimeout=340000&connTimeout=45000&maxConnections=100000&maxConnectionsPerHost=100000
   [junit4]   2> 1608122 INFO  (TEST-PeerSyncTest.test-seed#[6B269833028064D8]) [    ] o.a.s.l.LogWatcher SLF4J impl is org.slf4j.impl.Log4jLoggerFactory
   [junit4]   2> 1608122 INFO  (TEST-PeerSyncTest.test-seed#[6B269833028064D8]) [    ] o.a.s.l.LogWatcher Registering Log Listener [Log4j (org.slf4j.impl.Log4jLoggerFactory)]
   [junit4]   2> 1608122 INFO  (TEST-PeerSyncTest.test-seed#[6B269833028064D8]) [    ] o.a.s.c.CoreContainer Security conf doesn't exist. Skipping setup for authorization module.
   [junit4]   2> 1608122 INFO  (TEST-PeerSyncTest.test-seed#[6B269833028064D8]) [    ] o.a.s.c.CoreContainer No authentication plugin used.
   [junit4]   2> 1608123 INFO  (TEST-PeerSyncTest.test-seed#[6B269833028064D8]) [    ] o.a.s.c.CorePropertiesLocator Looking for core definitions underneath C:\Users\jenkins\workspace\Lucene-Solr-master-Windows\solr\build\solr-core\test\J0\temp\solr.update.PeerSyncTest_6B269833028064D8-001\tempDir-001\shard1\cores
   [junit4]   2> 1608126 INFO  (TEST-PeerSyncTest.test-seed#[6B269833028064D8]) [    ] o.a.s.c.CoreDescriptor Created CoreDescriptor: {name=collection1, config=solrconfig-tlog.xml, loadOnStartup=true, schema=schema.xml, configSetProperties=configsetprops.json, transient=false, dataDir=data\, configSet=collection1}
   [junit4]   2> 1608126 INFO  (TEST-PeerSyncTest.test-seed#[6B269833028064D8]) [    ] o.a.s.c.CorePropertiesLocator Found core collection1 in C:\Users\jenkins\workspace\Lucene-Solr-master-Windows\solr\build\solr-core\test\J0\temp\solr.update.PeerSyncTest_6B269833028064D8-001\tempDir-001\shard1\cores\collection1
   [junit4]   2> 1608126 INFO  (TEST-PeerSyncTest.test-seed#[6B269833028064D8]) [    ] o.a.s.c.CorePropertiesLocator Found 1 core definitions
   [junit4]   2> 1608126 INFO  (TEST-PeerSyncTest.test-seed#[6B269833028064D8]) [    ] o.a.s.s.SolrDispatchFilter user.dir=C:\Users\jenkins\workspace\Lucene-Solr-master-Windows\solr\build\solr-core\test\J0
   [junit4]   2> 1608126 INFO  (TEST-PeerSyncTest.test-seed#[6B269833028064D8]) [    ] o.a.s.s.SolrDispatchFilter SolrDispatchFilter.init() done
   [junit4]   2> 1608127 INFO  (coreLoadExecutor-4963-thread-1) [    ] o.a.s.c.SolrResourceLoader new SolrResourceLoader for directory: 'C:\Users\jenkins\workspace\Lucene-Solr-master-Windows\solr\core\src\test-files\solr\collection1'
   [junit4]   2> 1608128 INFO  (coreLoadExecutor-4963-thread-1) [    ] o.a.s.c.SolrResourceLoader JNDI not configured for solr (NoInitialContextEx)
   [junit4]   2> 1608128 INFO  (coreLoadExecutor-4963-thread-1) [    ] o.a.s.c.SolrResourceLoader solr home defaulted to 'solr/' (could not find system property or JNDI)
   [junit4]   2> 1608129 INFO  (coreLoadExecutor-4963-thread-1) [    ] o.a.s.c.SolrResourceLoader Adding 'file:/C:/Users/jenkins/workspace/Lucene-Solr-master-Windows/solr/core/src/test-files/solr/collection1/lib/classes/' to classloader
   [junit4]   2> 1608129 INFO  (coreLoadExecutor-4963-thread-1) [    ] o.a.s.c.SolrResourceLoader Adding 'file:/C:/Users/jenkins/workspace/Lucene-Solr-master-Windows/solr/core/src/test-files/solr/collection1/lib/README' to classloader
   [junit4]   2> 1608208 INFO  (coreLoadExecutor-4963-thread-1) [    ] o.a.s.c.SolrConfig current version of requestparams : -1
   [junit4]   2> 1608212 WARN  (coreLoadExecutor-4963-thread-1) [    ] o.a.s.c.Config Beginning with Solr 5.5, <mergePolicy> is deprecated, use <mergePolicyFactory> instead.
   [junit4]   2> 1608213 INFO  (coreLoadExecutor-4963-thread-1) [    ] o.a.s.c.SolrConfig Using Lucene MatchVersion: 7.0.0
   [junit4]   2> 1608250 INFO  (coreLoadExecutor-4963-thread-1) [    ] o.a.s.c.SolrConfig Loaded SolrConfig: solrconfig-tlog.xml
   [junit4]   2> 1608258 INFO  (coreLoadExecutor-4963-thread-1) [    ] o.a.s.s.IndexSchema [collection1] Schema name=test
   [junit4]   2> 1608339 INFO  (coreLoadExecutor-4963-thread-1) [    ] o.a.s.s.OpenExchangeRatesOrgProvider Initialized with rates=open-exchange-rates.json, refreshInterval=1440.
   [junit4]   2> 1608347 INFO  (coreLoadExecutor-4963-thread-1) [    ] o.a.s.s.IndexSchema default search field in schema is text
   [junit4]   2> 1608348 INFO  (coreLoadExecutor-4963-thread-1) [    ] o.a.s.s.IndexSchema unique key field: id
   [junit4]   2> 1608352 INFO  (coreLoadExecutor-4963-thread-1) [    ] o.a.s.s.FileExchangeRateProvider Reloading exchange rates from file currency.xml
   [junit4]   2> 1608355 INFO  (coreLoadExecutor-4963-thread-1) [    ] o.a.s.s.FileExchangeRateProvider Reloading exchange rates from file currency.xml
   [junit4]   2> 1608356 INFO  (coreLoadExecutor-4963-thread-1) [    ] o.a.s.s.OpenExchangeRatesOrgProvider Reloading exchange rates from open-exchange-rates.json
   [junit4]   2> 1608357 INFO  (coreLoadExecutor-4963-thread-1) [    ] o.a.s.s.OpenExchangeRatesOrgProvider Reloading exchange rates from open-exchange-rates.json
   [junit4]   2> 1608366 INFO  (coreLoadExecutor-4963-thread-1) [    ] o.a.s.c.ConfigSetProperties Did not find ConfigSet properties, assuming default properties: Can't find resource 'configsetprops.json' in classpath or 'C:\Users\jenkins\workspace\Lucene-Solr-master-Windows\solr\core\src\test-files\solr\collection1'
   [junit4]   2> 1608366 INFO  (coreLoadExecutor-4963-thread-1) [    ] o.a.s.c.CoreContainer Creating SolrCore 'collection1' using configuration from configset C:\Users\jenkins\workspace\Lucene-Solr-master-Windows\solr\core\src\test-files\solr\collection1
   [junit4]   2> 1608366 INFO  (coreLoadExecutor-4963-thread-1) [    x:collection1] o.a.s.c.SolrCore org.apache.solr.core.MockDirectoryFactory
   [junit4]   2> 1608366 INFO  (coreLoadExecutor-4963-thread-1) [    x:collection1] o.a.s.c.SolrCore [[collection1] ] Opening new SolrCore at [C:\Users\jenkins\workspace\Lucene-Solr-master-Windows\solr\core\src\test-files\solr\collection1], dataDir=[C:\Users\jenkins\workspace\Lucene-Solr-master-Windows\solr\build\solr-core\test\J0\temp\solr.update.PeerSyncTest_6B269833028064D8-001\tempDir-001\shard1\cores\collection1\data\]
   [junit4]   2> 1608366 INFO  (coreLoadExecutor-4963-thread-1) [    x:collection1] o.a.s.c.JmxMonitoredMap JMX monitoring is enabled. Adding Solr mbeans to JMX Server: com.sun.jmx.mbeanserver.JmxMBeanServer@18d0bfbd
   [junit4]   2> 1608367 INFO  (coreLoadExecutor-4963-thread-1) [    x:collection1] o.a.s.c.CachingDirectoryFactory return new directory for C:\Users\jenkins\workspace\Lucene-Solr-master-Windows\solr\build\solr-core\test\J0\temp\solr.update.PeerSyncTest_6B269833028064D8-001\tempDir-001\shard1\cores\collection1\data\snapshot_metadata
   [junit4]   2> 1608367 INFO  (coreLoadExecutor-4963-thread-1) [    x:collection1] o.a.s.c.s.SolrSnapshotMetaDataManager Loading from snapshot metadata file...
   [junit4]   2> 1608367 INFO  (coreLoadExecutor-4963-thread-1) [    x:collection1] o.a.s.c.CachingDirectoryFactory return new directory for C:\Users\jenkins\workspace\Lucene-Solr-master-Windows\solr\build\solr-core\test\J0\temp\solr.update.PeerSyncTest_6B269833028064D8-001\tempDir-001\shard1\cores\collection1\data\
   [junit4]   2> 1608367 INFO  (coreLoadExecutor-4963-thread-1) [    x:collection1] o.a.s.c.SolrCore New index directory detected: old=null new=C:\Users\jenkins\workspace\Lucene-Solr-master-Windows\solr\build\solr-core\test\J0\temp\solr.update.PeerSyncTest_6B269833028064D8-001\tempDir-001\shard1\cores\collection1\data\index/
   [junit4]   2> 1608367 WARN  (coreLoadExecutor-4963-thread-1) [    x:collection1] o.a.s.c.SolrCore [collection1] Solr index directory 'C:\Users\jenkins\workspace\Lucene-Solr-master-Windows\solr\build\solr-core\test\J0\temp\solr.update.PeerSyncTest_6B269833028064D8-001\tempDir-001\shard1\cores\collection1\data\index' doesn't exist. Creating new index...
   [junit4]   2> 1608367 INFO  (coreLoadExecutor-4963-thread-1) [    x:collection1] o.a.s.c.CachingDirectoryFactory return new directory for C:\Users\jenkins\workspace\Lucene-Solr-master-Windows\solr\build\solr-core\test\J0\temp\solr.update.PeerSyncTest_6B269833028064D8-001\tempDir-001\shard1\cores\collection1\data\index
   [junit4]   2> 1608367 INFO  (coreLoadExecutor-4963-thread-1) [    x:collection1] o.a.s.u.RandomMergePolicy RandomMergePolicy wrapping class org.apache.lucene.index.LogDocMergePolicy: [LogDocMergePolicy: minMergeSize=1000, mergeFactor=17, maxMergeSize=9223372036854775807, maxMergeSizeForForcedMerge=9223372036854775807, calibrateSizeByDeletes=true, maxMergeDocs=2147483647, maxCFSSegmentSizeMB=8.796093022207999E12, noCFSRatio=1.0]
   [junit4]   2> 1608368 INFO  (coreLoadExecutor-4963-thread-1) [    x:collection1] o.a.s.c.SolrDeletionPolicy SolrDeletionPolicy.onCommit: commits: num=1
   [junit4]   2> 	commit{dir=MockDirectoryWrapper(RAMDirectory@48948132 lockFactory=org.apache.lucene.store.SingleInstanceLockFactory@57b91b4f),segFN=segments_1,generation=1}
   [junit4]   2> 1608368 INFO  (coreLoadExecutor-4963-thread-1) [    x:collection1] o.a.s.c.SolrDeletionPolicy newest commit generation = 1
   [junit4]   2> 1608369 INFO  (OldIndexDirectoryCleanupThreadForCore-collection1) [    x:collection1] o.a.s.c.SolrCore Looking for old index directories to cleanup for core collection1 in C:\Users\jenkins\workspace\Lucene-Solr-master-Windows\solr\build\solr-core\test\J0\temp\solr.update.PeerSyncTest_6B269833028064D8-001\tempDir-001\shard1\cores\collection1\data\
   [junit4]   2> 1608369 WARN  (OldIndexDirectoryCleanupThreadForCore-collection1) [    x:collection1] o.a.s.c.DirectoryFactory C:\Users\jenkins\workspace\Lucene-Solr-master-Windows\solr\build\solr-core\test\J0\temp\solr.update.PeerSyncTest_6B269833028064D8-001\tempDir-001\shard1\cores\collection1\data\ does not point to a valid data directory; skipping clean-up of old index directories.
   [junit4]   2> 1608372 INFO  (coreLoadExecutor-4963-thread-1) [    x:collection1] o.a.s.u.p.UpdateRequestProcessorChain creating updateRequestProcessorChain "nodistrib"
   [junit4]   2> 1608372 INFO  (coreLoadExecutor-4963-thread-1) [    x:collection1] o.a.s.u.p.UpdateRequestProcessorChain creating updateRequestProcessorChain "dedupe"
   [junit4]   2> 1608372 INFO  (coreLoadExecutor-4963-thread-1) [    x:collection1] o.a.s.u.p.UpdateRequestProcessorChain inserting DistributedUpdateProcessorFactory into updateRequestProcessorChain "dedupe"
   [junit4]   2> 1608372 INFO  (coreLoadExecutor-4963-thread-1) [    x:collection1] o.a.s.u.p.UpdateRequestProcessorChain creating updateRequestProcessorChain "stored_sig"
   [junit4]   2> 1608373 INFO  (coreLoadExecutor-4963-thread-1) [    x:collection1] o.a.s.u.p.UpdateRequestProcessorChain inserting DistributedUpdateProcessorFactory into updateRequestProcessorChain "stored_sig"
   [junit4]   2> 1608373 INFO  (coreLoadExecutor-4963-thread-1) [    x:collection1] o.a.s.u.p.UpdateRequestProcessorChain creating updateRequestProcessorChain "distrib-dup-test-chain-explicit"
   [junit4]   2> 1608373 INFO  (coreLoadExecutor-4963-thread-1) [    x:collection1] o.a.s.u.p.UpdateRequestProcessorChain creating updateRequestProcessorChain "distrib-dup-test-chain-implicit"
   [junit4]   2> 1608373 INFO  (coreLoadExecutor-4963-thread-1) [    x:collection1] o.a.s.u.p.UpdateRequestProcessorChain inserting DistributedUpdateProcessorFactory into updateRequestProcessorChain "distrib-dup-test-chain-implicit"
   [junit4]   2> 1608373 INFO  (coreLoadExecutor-4963-thread-1) [    x:collection1] o.a.s.c.SolrCore no updateRequestProcessorChain defined as default, creating implicit default
   [junit4]   2> 1608373 WARN  (coreLoadExecutor-4963-thread-1) [    x:collection1] o.a.s.c.RequestHandlers INVALID paramSet a in requestHandler {type = requestHandler,name = /dump,class = DumpRequestHandler,args = {defaults={a=A,b=B}}}
   [junit4]   2> 1608379 INFO  (coreLoadExecutor-4963-thread-1) [    x:collection1] o.a.s.h.l.XMLLoader xsltCacheLifetimeSeconds=60
   [junit4]   2> 1608381 INFO  (coreLoadExecutor-4963-thread-1) [    x:collection1] o.a.s.h.l.XMLLoader xsltCacheLifetimeSeconds=60
   [junit4]   2> 1608382 INFO  (coreLoadExecutor-4963-thread-1) [    x:collection1] o.a.s.h.l.XMLLoader xsltCacheLifetimeSeconds=60
   [junit4]   2> 1608383 INFO  (coreLoadExecutor-4963-thread-1) [    x:collection1] o.a.s.h.l.XMLLoader xsltCacheLifetimeSeconds=60
   [junit4]   2> 1608391 INFO  (coreLoadExecutor-4963-thread-1) [    x:collection1] o.a.s.c.RequestHandlers Registered paths: /admin/mbeans,standard,/update/json/docs,/admin/luke,/export,/get,/admin/properties,/update/json,/admin/threads,/dump,/update/csv,/sql,/graph,/admin/segments,/admin/system,/replication,/config,/stream,/schema,/admin/plugins,/admin/logging,/admin/ping,/update,/admin/file,/terms
   [junit4]   2> 1608391 INFO  (coreLoadExecutor-4963-thread-1) [    x:collection1] o.a.s.c.SolrCore Using default statsCache cache: org.apache.solr.search.stats.LocalStatsCache
   [junit4]   2> 1608392 INFO  (coreLoadExecutor-4963-thread-1) [    x:collection1] o.a.s.u.UpdateHandler Using UpdateLog implementation: org.apache.solr.update.UpdateLog
   [junit4]   2> 1608392 INFO  (coreLoadExecutor-4963-thread-1) [    x:collection1] o.a.s.u.UpdateLog Initializing UpdateLog: dataDir= defaultSyncLevel=FLUSH numRecordsToKeep=100 maxNumLogsToKeep=10 numVersionBuckets=65536
   [junit4]   2> 1608393 INFO  (coreLoadExecutor-4963-thread-1) [    x:collection1] o.a.s.u.CommitTracker Hard AutoCommit: disabled
   [junit4]   2> 1608393 INFO  (coreLoadExecutor-4963-thread-1) [    x:collection1] o.a.s.u.CommitTracker Soft AutoCommit: disabled
   [junit4]   2> 1608393 INFO  (coreLoadExecutor-4963-thread-1) [    x:collection1] o.a.s.u.RandomMergePolicy RandomMergePolicy wrapping class org.apache.lucene.index.TieredMergePolicy: [TieredMergePolicy: maxMergeAtOnce=18, maxMergeAtOnceExplicit=38, maxMergedSegmentMB=20.6591796875, floorSegmentMB=0.91796875, forceMergeDeletesPctAllowed=19.221209014276262, segmentsPerTier=47.0, maxCFSSegmentSizeMB=8.796093022207999E12, noCFSRatio=0.0
   [junit4]   2> 1608

[...truncated too long message...]

 end of stream exception
   [junit4]   2> EndOfStreamException: Unable to read additional data from client sessionid 0x156b4f7cd380008, likely client has closed socket
   [junit4]   2> 	at org.apache.zookeeper.server.NIOServerCnxn.doIO(NIOServerCnxn.java:228)
   [junit4]   2> 	at org.apache.zookeeper.server.NIOServerCnxnFactory.run(NIOServerCnxnFactory.java:208)
   [junit4]   2> 	at java.lang.Thread.run(Thread.java:745)
   [junit4]   2> 2478153 INFO  (SUITE-TestSolrCloudWithDelegationTokens-seed#[6B269833028064D8]-worker) [    ] o.a.s.c.ZkTestServer connecting to 127.0.0.1:53782 53782
   [junit4]   2> 2478159 INFO  (Thread-3679) [    ] o.a.s.c.ZkTestServer connecting to 127.0.0.1:53782 53782
   [junit4]   2> 2478161 WARN  (Thread-3679) [    ] o.a.s.c.ZkTestServer Watch limit violations: 
   [junit4]   2> Maximum concurrent create/delete watches above limit:
   [junit4]   2> 
   [junit4]   2> 	2	/solr/aliases.json
   [junit4]   2> 	2	/solr/security.json
   [junit4]   2> 	2	/solr/clusterprops.json
   [junit4]   2> 
   [junit4]   2> Maximum concurrent data watches above limit:
   [junit4]   2> 
   [junit4]   2> 	2	/solr/security/zkdtsm/ZKDTSMRoot/ZKDTSMTokensRoot/DT_7
   [junit4]   2> 	2	/solr/security/zkdtsm/ZKDTSMRoot/ZKDTSMTokensRoot/DT_6
   [junit4]   2> 	2	/solr/security/zkdtsm/ZKDTSMRoot/ZKDTSMTokensRoot/DT_9
   [junit4]   2> 	2	/solr/security/zkdtsm/ZKDTSMRoot/ZKDTSMTokensRoot/DT_8
   [junit4]   2> 	2	/solr/security/zkdtsm/ZKDTSMRoot/ZKDTSMKeyIdRoot
   [junit4]   2> 	2	/solr/security/zkdtsm/ZKDTSMRoot/ZKDTSMMasterKeyRoot/DK_1
   [junit4]   2> 	2	/solr/security/zkdtsm/ZKDTSMRoot/ZKDTSMTokensRoot/DT_1
   [junit4]   2> 	2	/solr/security/zkdtsm/ZKDTSMRoot/ZKDTSMMasterKeyRoot/DK_3
   [junit4]   2> 	2	/solr/security/zkdtsm/ZKDTSMRoot/ZKDTSMTokensRoot/DT_3
   [junit4]   2> 	2	/solr/security/zkdtsm/ZKDTSMRoot/ZKDTSMMasterKeyRoot/DK_2
   [junit4]   2> 	2	/solr/security/zkdtsm/ZKDTSMRoot/ZKDTSMTokensRoot/DT_2
   [junit4]   2> 	2	/solr/clusterstate.json
   [junit4]   2> 	2	/solr/security/zkdtsm/ZKDTSMRoot/ZKDTSMTokensRoot/DT_5
   [junit4]   2> 	2	/solr/security/zkdtsm/ZKDTSMRoot/ZKDTSMMasterKeyRoot/DK_4
   [junit4]   2> 	2	/solr/security/zkdtsm/ZKDTSMRoot/ZKDTSMTokensRoot/DT_4
   [junit4]   2> 	2	/solr/security/zkdtsm/ZKDTSMRoot/ZKDTSMTokensRoot/DT_12
   [junit4]   2> 	2	/solr/security/zkdtsm/ZKDTSMRoot/ZKDTSMSeqNumRoot
   [junit4]   2> 	2	/solr/security/zkdtsm/ZKDTSMRoot/ZKDTSMTokensRoot/DT_11
   [junit4]   2> 	2	/solr/security/zkdtsm/ZKDTSMRoot/ZKDTSMTokensRoot/DT_10
   [junit4]   2> 
   [junit4]   2> Maximum concurrent children watches above limit:
   [junit4]   2> 
   [junit4]   2> 	3	/solr/overseer/queue
   [junit4]   2> 	3	/solr/overseer/collection-queue-work
   [junit4]   2> 	2	/solr/live_nodes
   [junit4]   2> 	2	/solr/collections
   [junit4]   2> 	2	/solr/security/zkdtsm/ZKDTSMRoot/ZKDTSMMasterKeyRoot
   [junit4]   2> 	2	/solr/overseer/queue-work
   [junit4]   2> 	2	/solr/security/zkdtsm/ZKDTSMRoot/ZKDTSMTokensRoot
   [junit4]   2> 
   [junit4]   2> 2478163 INFO  (SUITE-TestSolrCloudWithDelegationTokens-seed#[6B269833028064D8]-worker) [    ] o.a.s.SolrTestCaseJ4 ###deleteCore
   [junit4]   2> NOTE: leaving temporary files on disk at: C:\Users\jenkins\workspace\Lucene-Solr-master-Windows\solr\build\solr-core\test\J0\temp\solr.cloud.TestSolrCloudWithDelegationTokens_6B269833028064D8-001
   [junit4]   2> Aug 23, 2016 1:15:58 AM com.carrotsearch.randomizedtesting.ThreadLeakControl checkThreadLeaks
   [junit4]   2> WARNING: Will linger awaiting termination of 6 leaked thread(s).
   [junit4]   2> NOTE: test params are: codec=Asserting(Lucene62): {}, docValues:{}, maxPointsInLeafNode=534, maxMBSortInHeap=6.262723245447152, sim=RandomSimilarity(queryNorm=false): {}, locale=zh-TW, timezone=Africa/Malabo
   [junit4]   2> NOTE: Windows 10 10.0 amd64/Oracle Corporation 1.8.0_102 (64-bit)/cpus=3,threads=1,free=195215424,total=503316480
   [junit4]   2> NOTE: All tests run in this JVM: [CdcrVersionReplicationTest, AnalysisErrorHandlingTest, DistributedQueryElevationComponentTest, JavabinLoaderTest, TermsComponentTest, TestCodecSupport, DirectUpdateHandlerTest, TestJmxMonitoredMap, TestQuerySenderNoQuery, TestStressLucene, TestRandomFlRTGCloud, TestExactSharedStatsCache, SolrRequestParserTest, TestTrieFacet, TestNumericTerms32, RequiredFieldsTest, TestReRankQParserPlugin, TestCollationFieldDocValues, SOLR749Test, TestSearchPerf, TestBackupRepositoryFactory, SharedFSAutoReplicaFailoverUtilsTest, CheckHdfsIndexTest, TestSolrCloudWithKerberosAlt, HLLSerializationTest, TlogReplayBufferedWhileIndexingTest, TestHdfsCloudBackupRestore, TestStressVersions, BigEndianAscendingWordSerializerTest, SliceStateTest, TestFunctionQuery, TestStressReorder, DirectoryFactoryTest, OverseerCollectionConfigSetProcessorTest, TestDynamicFieldResource, CleanupOldIndexTest, SimplePostToolTest, TestLockTree, TestFieldCacheSanityChecker, ConfigSetsAPITest, TestCryptoKeys, TestLMDirichletSimilarityFactory, AtomicUpdatesTest, PKIAuthenticationIntegrationTest, DeleteInactiveReplicaTest, TestUseDocValuesAsStored, CachingDirectoryFactoryTest, TestCSVLoader, TestLFUCache, QueryEqualityTest, RequestLoggingTest, TestFieldCacheWithThreads, DistributedQueryComponentOptimizationTest, AlternateDirectoryTest, TestPhraseSuggestions, CdcrBootstrapTest, TestCloudPivotFacet, TestReloadDeadlock, TestRandomCollapseQParserPlugin, HdfsBasicDistributedZkTest, TestFastLRUCache, TestDocSet, OverseerTest, ChaosMonkeyNothingIsSafeTest, ShardSplitTest, UUIDFieldTest, TestSubQueryTransformerCrossCore, TestConfigSetImmutable, TestCollectionAPI, TestImplicitCoreProperties, DistributedFacetPivotSmallAdvancedTest, TestGeoJSONResponseWriter, TestTolerantUpdateProcessorCloud, JsonLoaderTest, OutOfBoxZkACLAndCredentialsProvidersTest, HdfsRecoveryZkTest, TestRestManager, SyncSliceTest, RestartWhileUpdatingTest, TestFieldCacheSortRandom, TestPerFieldSimilarityWithDefaultOverride, TestPartialUpdateDeduplication, TestSolrConfigHandler, TestTolerantSearch, TestManagedResource, TestXIncludeConfig, IndexSchemaTest, TestSurroundQueryParser, DistribCursorPagingTest, TestConfigSetsAPIExclusivity, RecoveryZkTest, IgnoreCommitOptimizeUpdateProcessorFactoryTest, TestRawResponseWriter, CdcrReplicationHandlerTest, CollectionReloadTest, DeleteShardTest, IndexBasedSpellCheckerTest, TestRestoreCore, SimpleMLTQParserTest, SolrXmlInZkTest, XmlUpdateRequestHandlerTest, HdfsNNFailoverTest, DistributedSpellCheckComponentTest, SampleTest, RankQueryTest, SolrIndexConfigTest, RegexBoostProcessorTest, SchemaVersionSpecificBehaviorTest, TestDownShardTolerantSearch, HdfsChaosMonkeySafeLeaderTest, BlockCacheTest, TestEmbeddedSolrServerConstructors, ClusterStateTest, DateRangeFieldTest, UnloadDistributedZkTest, SystemInfoHandlerTest, SecurityConfHandlerTest, TestConfigReload, TestConfig, TestAnalyzedSuggestions, FacetPivotSmallTest, HdfsTlogReplayBufferedWhileIndexingTest, EnumFieldTest, BlobRepositoryCloudTest, SmileWriterTest, SoftAutoCommitTest, TestHashPartitioner, TestCursorMarkWithoutUniqueKey, HdfsSyncSliceTest, SparseHLLTest, TestSizeLimitedDistributedMap, TestCollapseQParserPlugin, ZkCLITest, TestArbitraryIndexDir, TestLeaderInitiatedRecoveryThread, TestInitParams, TestXmlQParserPlugin, VMParamsZkACLAndCredentialsProvidersTest, RuleEngineTest, TestScoreJoinQPNoScore, TestMissingGroups, TestFieldTypeResource, TestDefaultSearchFieldResource, ReturnFieldsTest, AssignTest, TestSortByMinMaxFunction, PreAnalyzedUpdateProcessorTest, TestRTimerTree, TestExceedMaxTermLength, CursorMarkTest, TestChildDocTransformer, JSONWriterTest, TestManagedSchemaAPI, TestHashQParserPlugin, CollectionsAPIDistributedZkTest, LeaderElectionTest, TestDistributedSearch, HardAutoCommitTest, TestSolr4Spatial, StatsComponentTest, PeerSyncTest, BasicFunctionalityTest, TestIndexSearcher, CurrencyFieldOpenExchangeTest, CurrencyFieldXmlFileTest, TestCoreDiscovery, TestExtendedDismaxParser, SuggesterFSTTest, SuggesterTest, TestTrie, SpatialFilterTest, PolyFieldTest, WordBreakSolrSpellCheckerTest, TestPseudoReturnFields, TestUpdate, TestWordDelimiterFilterFactory, DirectUpdateHandlerOptimizeTest, StatelessScriptUpdateProcessorFactoryTest, TestRemoteStreaming, DocValuesMultiTest, TestSolrDeletionPolicy1, SolrInfoMBeanTest, XsltUpdateRequestHandlerTest, CacheHeaderTest, DisMaxRequestHandlerTest, StandardRequestHandlerTest, DirectSolrSpellCheckerTest, TestReversedWildcardFilterFactory, TestQueryTypes, RequestHandlersTest, TestValueSourceCache, TestIndexingPerformance, FieldAnalysisRequestHandlerTest, IndexSchemaRuntimeFieldTest, TestJmxIntegration, TestCSVResponseWriter, TestPHPSerializedResponseWriter, CSVRequestHandlerTest, TestComponentsName, SearchHandlerTest, UpdateParamsTest, ResponseLogComponentTest, TestMergePolicyConfig, MinimalSchemaTest, ExternalFileFieldSortTest, TestPostingsSolrHighlighter, NotRequiredUniqueKeyTest, SpellPossibilityIteratorTest, TestDFRSimilarityFactory, TestLMJelinekMercerSimilarityFactory, TestFastWriter, TimeZoneUtilsTest, ScriptEngineTest, DateMathParserTest, TestSystemIdResolver, PrimUtilsTest, TestSuggestSpellingConverter, DateFieldTest, TestUtils, CircularListTest, DistributedMLTComponentTest, DistributedIntervalFacetingTest, TestSimpleTrackingShardHandler, AsyncMigrateRouteKeyTest, CollectionTooManyReplicasTest, ConnectionManagerTest, CreateCollectionCleanupTest, DeleteNodeTest, DeleteStatusTest, DistribDocExpirationUpdateProcessorTest, DistributedQueueTest, DistributedVersionInfoTest, HttpPartitionTest, LeaderInitiatedRecoveryOnShardRestartTest, MigrateRouteKeyTest, OverseerModifyCollectionTest, OverseerTaskQueueTest, PeerSyncReplicationTest, SolrCLIZkUtilsTest, TestCloudInspectUtil, TestMiniSolrCloudClusterBase, TestOnReconnectListenerSupport, TestRandomRequestDistribution, TestRequestStatusCollectionAPI, TestSolrCloudWithDelegationTokens]
   [junit4] Completed [507/632 (3!)] on J0 in 5.04s, 8 tests, 1 failure <<< FAILURES!

[...truncated 60532 lines...]


Mime
View raw message