lucene-dev mailing list archives

Site index · List index
Message view « Date » · « Thread »
Top « Date » · « Thread »
From Policeman Jenkins Server <jenk...@thetaphi.de>
Subject [JENKINS] Lucene-Solr-6.x-Windows (32bit/jdk1.8.0_102) - Build # 368 - Still Unstable!
Date Sun, 07 Aug 2016 17:31:27 GMT
Build: http://jenkins.thetaphi.de/job/Lucene-Solr-6.x-Windows/368/
Java: 32bit/jdk1.8.0_102 -server -XX:+UseSerialGC

2 tests failed.
FAILED:  junit.framework.TestSuite.org.apache.solr.schema.TestManagedSchemaAPI

Error Message:
ObjectTracker found 10 object(s) that were not released!!! [MockDirectoryWrapper, MockDirectoryWrapper, TransactionLog, MockDirectoryWrapper, MockDirectoryWrapper, MDCAwareThreadPoolExecutor, MDCAwareThreadPoolExecutor, MockDirectoryWrapper, MockDirectoryWrapper, TransactionLog]

Stack Trace:
java.lang.AssertionError: ObjectTracker found 10 object(s) that were not released!!! [MockDirectoryWrapper, MockDirectoryWrapper, TransactionLog, MockDirectoryWrapper, MockDirectoryWrapper, MDCAwareThreadPoolExecutor, MDCAwareThreadPoolExecutor, MockDirectoryWrapper, MockDirectoryWrapper, TransactionLog]
	at __randomizedtesting.SeedInfo.seed([6CB391DA4003F1AA]:0)
	at org.junit.Assert.fail(Assert.java:93)
	at org.junit.Assert.assertTrue(Assert.java:43)
	at org.junit.Assert.assertNull(Assert.java:551)
	at org.apache.solr.SolrTestCaseJ4.teardownTestCases(SolrTestCaseJ4.java:258)
	at sun.reflect.GeneratedMethodAccessor28.invoke(Unknown Source)
	at sun.reflect.DelegatingMethodAccessorImpl.invoke(DelegatingMethodAccessorImpl.java:43)
	at java.lang.reflect.Method.invoke(Method.java:498)
	at com.carrotsearch.randomizedtesting.RandomizedRunner.invoke(RandomizedRunner.java:1764)
	at com.carrotsearch.randomizedtesting.RandomizedRunner$7.evaluate(RandomizedRunner.java:834)
	at com.carrotsearch.randomizedtesting.rules.StatementAdapter.evaluate(StatementAdapter.java:36)
	at com.carrotsearch.randomizedtesting.rules.SystemPropertiesRestoreRule$1.evaluate(SystemPropertiesRestoreRule.java:57)
	at org.apache.lucene.util.AbstractBeforeAfterRule$1.evaluate(AbstractBeforeAfterRule.java:45)
	at com.carrotsearch.randomizedtesting.rules.StatementAdapter.evaluate(StatementAdapter.java:36)
	at org.apache.lucene.util.TestRuleStoreClassName$1.evaluate(TestRuleStoreClassName.java:41)
	at com.carrotsearch.randomizedtesting.rules.NoShadowingOrOverridesOnMethodsRule$1.evaluate(NoShadowingOrOverridesOnMethodsRule.java:40)
	at com.carrotsearch.randomizedtesting.rules.NoShadowingOrOverridesOnMethodsRule$1.evaluate(NoShadowingOrOverridesOnMethodsRule.java:40)
	at com.carrotsearch.randomizedtesting.rules.StatementAdapter.evaluate(StatementAdapter.java:36)
	at com.carrotsearch.randomizedtesting.rules.StatementAdapter.evaluate(StatementAdapter.java:36)
	at com.carrotsearch.randomizedtesting.rules.StatementAdapter.evaluate(StatementAdapter.java:36)
	at org.apache.lucene.util.TestRuleAssertionsRequired$1.evaluate(TestRuleAssertionsRequired.java:53)
	at org.apache.lucene.util.TestRuleMarkFailure$1.evaluate(TestRuleMarkFailure.java:47)
	at org.apache.lucene.util.TestRuleIgnoreAfterMaxFailures$1.evaluate(TestRuleIgnoreAfterMaxFailures.java:64)
	at org.apache.lucene.util.TestRuleIgnoreTestSuites$1.evaluate(TestRuleIgnoreTestSuites.java:54)
	at com.carrotsearch.randomizedtesting.rules.StatementAdapter.evaluate(StatementAdapter.java:36)
	at com.carrotsearch.randomizedtesting.ThreadLeakControl$StatementRunner.run(ThreadLeakControl.java:367)
	at java.lang.Thread.run(Thread.java:745)


FAILED:  junit.framework.TestSuite.org.apache.solr.schema.TestManagedSchemaAPI

Error Message:
Could not remove the following files (in the order of attempts):    C:\Users\jenkins\workspace\Lucene-Solr-6.x-Windows\solr\build\solr-core\test\J0\temp\solr.schema.TestManagedSchemaAPI_6CB391DA4003F1AA-001\tempDir-001\node2\testschemaapi_shard1_replica1\data\tlog\tlog.0000000000000000000: java.nio.file.FileSystemException: C:\Users\jenkins\workspace\Lucene-Solr-6.x-Windows\solr\build\solr-core\test\J0\temp\solr.schema.TestManagedSchemaAPI_6CB391DA4003F1AA-001\tempDir-001\node2\testschemaapi_shard1_replica1\data\tlog\tlog.0000000000000000000: The process cannot access the file because it is being used by another process.     C:\Users\jenkins\workspace\Lucene-Solr-6.x-Windows\solr\build\solr-core\test\J0\temp\solr.schema.TestManagedSchemaAPI_6CB391DA4003F1AA-001\tempDir-001\node2\testschemaapi_shard1_replica1\data\tlog: java.nio.file.DirectoryNotEmptyException: C:\Users\jenkins\workspace\Lucene-Solr-6.x-Windows\solr\build\solr-core\test\J0\temp\solr.schema.TestManagedSchemaAPI_6CB391DA4003F1AA-001\tempDir-001\node2\testschemaapi_shard1_replica1\data\tlog    C:\Users\jenkins\workspace\Lucene-Solr-6.x-Windows\solr\build\solr-core\test\J0\temp\solr.schema.TestManagedSchemaAPI_6CB391DA4003F1AA-001\tempDir-001\node2\testschemaapi_shard1_replica1\data: java.nio.file.DirectoryNotEmptyException: C:\Users\jenkins\workspace\Lucene-Solr-6.x-Windows\solr\build\solr-core\test\J0\temp\solr.schema.TestManagedSchemaAPI_6CB391DA4003F1AA-001\tempDir-001\node2\testschemaapi_shard1_replica1\data    C:\Users\jenkins\workspace\Lucene-Solr-6.x-Windows\solr\build\solr-core\test\J0\temp\solr.schema.TestManagedSchemaAPI_6CB391DA4003F1AA-001\tempDir-001\node2\testschemaapi_shard1_replica1: java.nio.file.DirectoryNotEmptyException: C:\Users\jenkins\workspace\Lucene-Solr-6.x-Windows\solr\build\solr-core\test\J0\temp\solr.schema.TestManagedSchemaAPI_6CB391DA4003F1AA-001\tempDir-001\node2\testschemaapi_shard1_replica1    C:\Users\jenkins\workspace\Lucene-Solr-6.x-Windows\solr\build\solr-core\test\J0\temp\solr.schema.TestManagedSchemaAPI_6CB391DA4003F1AA-001\tempDir-001\node2: java.nio.file.DirectoryNotEmptyException: C:\Users\jenkins\workspace\Lucene-Solr-6.x-Windows\solr\build\solr-core\test\J0\temp\solr.schema.TestManagedSchemaAPI_6CB391DA4003F1AA-001\tempDir-001\node2    C:\Users\jenkins\workspace\Lucene-Solr-6.x-Windows\solr\build\solr-core\test\J0\temp\solr.schema.TestManagedSchemaAPI_6CB391DA4003F1AA-001\tempDir-001: java.nio.file.DirectoryNotEmptyException: C:\Users\jenkins\workspace\Lucene-Solr-6.x-Windows\solr\build\solr-core\test\J0\temp\solr.schema.TestManagedSchemaAPI_6CB391DA4003F1AA-001\tempDir-001 

Stack Trace:
java.io.IOException: Could not remove the following files (in the order of attempts):
   C:\Users\jenkins\workspace\Lucene-Solr-6.x-Windows\solr\build\solr-core\test\J0\temp\solr.schema.TestManagedSchemaAPI_6CB391DA4003F1AA-001\tempDir-001\node2\testschemaapi_shard1_replica1\data\tlog\tlog.0000000000000000000: java.nio.file.FileSystemException: C:\Users\jenkins\workspace\Lucene-Solr-6.x-Windows\solr\build\solr-core\test\J0\temp\solr.schema.TestManagedSchemaAPI_6CB391DA4003F1AA-001\tempDir-001\node2\testschemaapi_shard1_replica1\data\tlog\tlog.0000000000000000000: The process cannot access the file because it is being used by another process.

   C:\Users\jenkins\workspace\Lucene-Solr-6.x-Windows\solr\build\solr-core\test\J0\temp\solr.schema.TestManagedSchemaAPI_6CB391DA4003F1AA-001\tempDir-001\node2\testschemaapi_shard1_replica1\data\tlog: java.nio.file.DirectoryNotEmptyException: C:\Users\jenkins\workspace\Lucene-Solr-6.x-Windows\solr\build\solr-core\test\J0\temp\solr.schema.TestManagedSchemaAPI_6CB391DA4003F1AA-001\tempDir-001\node2\testschemaapi_shard1_replica1\data\tlog
   C:\Users\jenkins\workspace\Lucene-Solr-6.x-Windows\solr\build\solr-core\test\J0\temp\solr.schema.TestManagedSchemaAPI_6CB391DA4003F1AA-001\tempDir-001\node2\testschemaapi_shard1_replica1\data: java.nio.file.DirectoryNotEmptyException: C:\Users\jenkins\workspace\Lucene-Solr-6.x-Windows\solr\build\solr-core\test\J0\temp\solr.schema.TestManagedSchemaAPI_6CB391DA4003F1AA-001\tempDir-001\node2\testschemaapi_shard1_replica1\data
   C:\Users\jenkins\workspace\Lucene-Solr-6.x-Windows\solr\build\solr-core\test\J0\temp\solr.schema.TestManagedSchemaAPI_6CB391DA4003F1AA-001\tempDir-001\node2\testschemaapi_shard1_replica1: java.nio.file.DirectoryNotEmptyException: C:\Users\jenkins\workspace\Lucene-Solr-6.x-Windows\solr\build\solr-core\test\J0\temp\solr.schema.TestManagedSchemaAPI_6CB391DA4003F1AA-001\tempDir-001\node2\testschemaapi_shard1_replica1
   C:\Users\jenkins\workspace\Lucene-Solr-6.x-Windows\solr\build\solr-core\test\J0\temp\solr.schema.TestManagedSchemaAPI_6CB391DA4003F1AA-001\tempDir-001\node2: java.nio.file.DirectoryNotEmptyException: C:\Users\jenkins\workspace\Lucene-Solr-6.x-Windows\solr\build\solr-core\test\J0\temp\solr.schema.TestManagedSchemaAPI_6CB391DA4003F1AA-001\tempDir-001\node2
   C:\Users\jenkins\workspace\Lucene-Solr-6.x-Windows\solr\build\solr-core\test\J0\temp\solr.schema.TestManagedSchemaAPI_6CB391DA4003F1AA-001\tempDir-001: java.nio.file.DirectoryNotEmptyException: C:\Users\jenkins\workspace\Lucene-Solr-6.x-Windows\solr\build\solr-core\test\J0\temp\solr.schema.TestManagedSchemaAPI_6CB391DA4003F1AA-001\tempDir-001

	at org.apache.lucene.util.IOUtils.rm(IOUtils.java:323)
	at org.apache.lucene.util.TestRuleTemporaryFilesCleanup.afterAlways(TestRuleTemporaryFilesCleanup.java:216)
	at com.carrotsearch.randomizedtesting.rules.TestRuleAdapter$1.afterAlways(TestRuleAdapter.java:31)
	at com.carrotsearch.randomizedtesting.rules.StatementAdapter.evaluate(StatementAdapter.java:43)
	at com.carrotsearch.randomizedtesting.rules.StatementAdapter.evaluate(StatementAdapter.java:36)
	at org.apache.lucene.util.TestRuleAssertionsRequired$1.evaluate(TestRuleAssertionsRequired.java:53)
	at org.apache.lucene.util.TestRuleMarkFailure$1.evaluate(TestRuleMarkFailure.java:47)
	at org.apache.lucene.util.TestRuleIgnoreAfterMaxFailures$1.evaluate(TestRuleIgnoreAfterMaxFailures.java:64)
	at org.apache.lucene.util.TestRuleIgnoreTestSuites$1.evaluate(TestRuleIgnoreTestSuites.java:54)
	at com.carrotsearch.randomizedtesting.rules.StatementAdapter.evaluate(StatementAdapter.java:36)
	at com.carrotsearch.randomizedtesting.ThreadLeakControl$StatementRunner.run(ThreadLeakControl.java:367)
	at java.lang.Thread.run(Thread.java:745)




Build Log:
[...truncated 12469 lines...]
   [junit4] Suite: org.apache.solr.schema.TestManagedSchemaAPI
   [junit4]   2> Creating dataDir: C:\Users\jenkins\workspace\Lucene-Solr-6.x-Windows\solr\build\solr-core\test\J0\temp\solr.schema.TestManagedSchemaAPI_6CB391DA4003F1AA-001\init-core-data-001
   [junit4]   2> 2692599 INFO  (SUITE-TestManagedSchemaAPI-seed#[6CB391DA4003F1AA]-worker) [    ] o.a.s.SolrTestCaseJ4 Randomized ssl (false) and clientAuth (false) via: @org.apache.solr.util.RandomizeSSL(reason=, value=NaN, ssl=NaN, clientAuth=NaN)
   [junit4]   2> 2692601 INFO  (SUITE-TestManagedSchemaAPI-seed#[6CB391DA4003F1AA]-worker) [    ] o.a.s.c.ZkTestServer STARTING ZK TEST SERVER
   [junit4]   2> 2692601 INFO  (Thread-4452) [    ] o.a.s.c.ZkTestServer client port:0.0.0.0/0.0.0.0:0
   [junit4]   2> 2692601 INFO  (Thread-4452) [    ] o.a.s.c.ZkTestServer Starting server
   [junit4]   2> 2692702 INFO  (SUITE-TestManagedSchemaAPI-seed#[6CB391DA4003F1AA]-worker) [    ] o.a.s.c.ZkTestServer start zk server on port:51546
   [junit4]   2> 2692702 INFO  (SUITE-TestManagedSchemaAPI-seed#[6CB391DA4003F1AA]-worker) [    ] o.a.s.c.c.SolrZkClient Using default ZkCredentialsProvider
   [junit4]   2> 2692703 INFO  (SUITE-TestManagedSchemaAPI-seed#[6CB391DA4003F1AA]-worker) [    ] o.a.s.c.c.ConnectionManager Waiting for client to connect to ZooKeeper
   [junit4]   2> 2692707 INFO  (zkCallback-11142-thread-1) [    ] o.a.s.c.c.ConnectionManager Watcher org.apache.solr.common.cloud.ConnectionManager@1f63bd1 name:ZooKeeperConnection Watcher:127.0.0.1:51546 got event WatchedEvent state:SyncConnected type:None path:null path:null type:None
   [junit4]   2> 2692708 INFO  (SUITE-TestManagedSchemaAPI-seed#[6CB391DA4003F1AA]-worker) [    ] o.a.s.c.c.ConnectionManager Client is connected to ZooKeeper
   [junit4]   2> 2692708 INFO  (SUITE-TestManagedSchemaAPI-seed#[6CB391DA4003F1AA]-worker) [    ] o.a.s.c.c.SolrZkClient Using default ZkACLProvider
   [junit4]   2> 2692708 INFO  (SUITE-TestManagedSchemaAPI-seed#[6CB391DA4003F1AA]-worker) [    ] o.a.s.c.c.SolrZkClient makePath: /solr/solr.xml
   [junit4]   2> 2692714 INFO  (jetty-launcher-11141-thread-2) [    ] o.e.j.s.Server jetty-9.3.8.v20160314
   [junit4]   2> 2692714 INFO  (jetty-launcher-11141-thread-1) [    ] o.e.j.s.Server jetty-9.3.8.v20160314
   [junit4]   2> 2692718 INFO  (jetty-launcher-11141-thread-1) [    ] o.e.j.s.h.ContextHandler Started o.e.j.s.ServletContextHandler@1a7d514{/solr,null,AVAILABLE}
   [junit4]   2> 2692718 INFO  (jetty-launcher-11141-thread-2) [    ] o.e.j.s.h.ContextHandler Started o.e.j.s.ServletContextHandler@10f556d{/solr,null,AVAILABLE}
   [junit4]   2> 2692720 INFO  (jetty-launcher-11141-thread-1) [    ] o.e.j.s.ServerConnector Started ServerConnector@17c9c60{HTTP/1.1,[http/1.1]}{127.0.0.1:51550}
   [junit4]   2> 2692720 INFO  (jetty-launcher-11141-thread-2) [    ] o.e.j.s.ServerConnector Started ServerConnector@16c04a5{HTTP/1.1,[http/1.1]}{127.0.0.1:51551}
   [junit4]   2> 2692720 INFO  (jetty-launcher-11141-thread-2) [    ] o.e.j.s.Server Started @2698899ms
   [junit4]   2> 2692720 INFO  (jetty-launcher-11141-thread-2) [    ] o.a.s.c.s.e.JettySolrRunner Jetty properties: {hostContext=/solr, hostPort=51551}
   [junit4]   2> 2692720 INFO  (jetty-launcher-11141-thread-1) [    ] o.e.j.s.Server Started @2698900ms
   [junit4]   2> 2692720 INFO  (jetty-launcher-11141-thread-1) [    ] o.a.s.c.s.e.JettySolrRunner Jetty properties: {hostContext=/solr, hostPort=51550}
   [junit4]   2> 2692720 INFO  (jetty-launcher-11141-thread-2) [    ] o.a.s.s.SolrDispatchFilter SolrDispatchFilter.init(): sun.misc.Launcher$AppClassLoader@1d16e93
   [junit4]   2> 2692720 INFO  (jetty-launcher-11141-thread-1) [    ] o.a.s.s.SolrDispatchFilter SolrDispatchFilter.init(): sun.misc.Launcher$AppClassLoader@1d16e93
   [junit4]   2> 2692721 INFO  (jetty-launcher-11141-thread-2) [    ] o.a.s.c.SolrResourceLoader new SolrResourceLoader for directory: 'C:\Users\jenkins\workspace\Lucene-Solr-6.x-Windows\solr\build\solr-core\test\J0\temp\solr.schema.TestManagedSchemaAPI_6CB391DA4003F1AA-001\tempDir-001\node2'
   [junit4]   2> 2692721 INFO  (jetty-launcher-11141-thread-1) [    ] o.a.s.c.SolrResourceLoader new SolrResourceLoader for directory: 'C:\Users\jenkins\workspace\Lucene-Solr-6.x-Windows\solr\build\solr-core\test\J0\temp\solr.schema.TestManagedSchemaAPI_6CB391DA4003F1AA-001\tempDir-001\node1'
   [junit4]   2> 2692721 INFO  (jetty-launcher-11141-thread-2) [    ] o.a.s.c.SolrResourceLoader JNDI not configured for solr (NoInitialContextEx)
   [junit4]   2> 2692721 INFO  (jetty-launcher-11141-thread-1) [    ] o.a.s.c.SolrResourceLoader JNDI not configured for solr (NoInitialContextEx)
   [junit4]   2> 2692721 INFO  (jetty-launcher-11141-thread-2) [    ] o.a.s.c.SolrResourceLoader solr home defaulted to 'solr/' (could not find system property or JNDI)
   [junit4]   2> 2692721 INFO  (jetty-launcher-11141-thread-1) [    ] o.a.s.c.SolrResourceLoader solr home defaulted to 'solr/' (could not find system property or JNDI)
   [junit4]   2> 2692723 INFO  (jetty-launcher-11141-thread-1) [    ] o.a.s.c.c.SolrZkClient Using default ZkCredentialsProvider
   [junit4]   2> 2692723 INFO  (jetty-launcher-11141-thread-2) [    ] o.a.s.c.c.SolrZkClient Using default ZkCredentialsProvider
   [junit4]   2> 2692724 INFO  (jetty-launcher-11141-thread-2) [    ] o.a.s.c.c.ConnectionManager Waiting for client to connect to ZooKeeper
   [junit4]   2> 2692724 INFO  (jetty-launcher-11141-thread-1) [    ] o.a.s.c.c.ConnectionManager Waiting for client to connect to ZooKeeper
   [junit4]   2> 2692725 INFO  (zkCallback-11144-thread-1) [    ] o.a.s.c.c.ConnectionManager Watcher org.apache.solr.common.cloud.ConnectionManager@fad76 name:ZooKeeperConnection Watcher:127.0.0.1:51546/solr got event WatchedEvent state:SyncConnected type:None path:null path:null type:None
   [junit4]   2> 2692725 INFO  (jetty-launcher-11141-thread-1) [    ] o.a.s.c.c.ConnectionManager Client is connected to ZooKeeper
   [junit4]   2> 2692725 INFO  (zkCallback-11143-thread-1) [    ] o.a.s.c.c.ConnectionManager Watcher org.apache.solr.common.cloud.ConnectionManager@1971d8d name:ZooKeeperConnection Watcher:127.0.0.1:51546/solr got event WatchedEvent state:SyncConnected type:None path:null path:null type:None
   [junit4]   2> 2692726 INFO  (jetty-launcher-11141-thread-2) [    ] o.a.s.c.c.ConnectionManager Client is connected to ZooKeeper
   [junit4]   2> 2692726 INFO  (jetty-launcher-11141-thread-1) [    ] o.a.s.c.c.SolrZkClient Using default ZkACLProvider
   [junit4]   2> 2692726 INFO  (jetty-launcher-11141-thread-2) [    ] o.a.s.c.c.SolrZkClient Using default ZkACLProvider
   [junit4]   2> 2692726 INFO  (jetty-launcher-11141-thread-2) [    ] o.a.s.s.SolrDispatchFilter solr.xml found in ZooKeeper. Loading...
   [junit4]   2> 2692726 INFO  (jetty-launcher-11141-thread-1) [    ] o.a.s.s.SolrDispatchFilter solr.xml found in ZooKeeper. Loading...
   [junit4]   2> 2692741 INFO  (jetty-launcher-11141-thread-1) [    ] o.a.s.c.CorePropertiesLocator Config-defined core root directory: C:\Users\jenkins\workspace\Lucene-Solr-6.x-Windows\solr\build\solr-core\test\J0\temp\solr.schema.TestManagedSchemaAPI_6CB391DA4003F1AA-001\tempDir-001\node1\.
   [junit4]   2> 2692741 WARN  (NIOServerCxn.Factory:0.0.0.0/0.0.0.0:0) [    ] o.a.z.s.NIOServerCnxn caught end of stream exception
   [junit4]   2> EndOfStreamException: Unable to read additional data from client sessionid 0x15665f019530002, likely client has closed socket
   [junit4]   2> 	at org.apache.zookeeper.server.NIOServerCnxn.doIO(NIOServerCnxn.java:228)
   [junit4]   2> 	at org.apache.zookeeper.server.NIOServerCnxnFactory.run(NIOServerCnxnFactory.java:208)
   [junit4]   2> 	at java.lang.Thread.run(Thread.java:745)
   [junit4]   2> 2692741 INFO  (jetty-launcher-11141-thread-1) [    ] o.a.s.c.CoreContainer New CoreContainer 1096507
   [junit4]   2> 2692742 INFO  (jetty-launcher-11141-thread-1) [    ] o.a.s.c.CoreContainer Loading cores into CoreContainer [instanceDir=C:\Users\jenkins\workspace\Lucene-Solr-6.x-Windows\solr\build\solr-core\test\J0\temp\solr.schema.TestManagedSchemaAPI_6CB391DA4003F1AA-001\tempDir-001\node1]
   [junit4]   2> 2692742 WARN  (jetty-launcher-11141-thread-1) [    ] o.a.s.c.CoreContainer Couldn't add files from C:\Users\jenkins\workspace\Lucene-Solr-6.x-Windows\solr\build\solr-core\test\J0\temp\solr.schema.TestManagedSchemaAPI_6CB391DA4003F1AA-001\tempDir-001\node1\lib to classpath: C:\Users\jenkins\workspace\Lucene-Solr-6.x-Windows\solr\build\solr-core\test\J0\temp\solr.schema.TestManagedSchemaAPI_6CB391DA4003F1AA-001\tempDir-001\node1\lib
   [junit4]   2> 2692742 INFO  (jetty-launcher-11141-thread-1) [    ] o.a.s.h.c.HttpShardHandlerFactory created with socketTimeout : 90000,urlScheme : ,connTimeout : 15000,maxConnectionsPerHost : 20,maxConnections : 10000,corePoolSize : 0,maximumPoolSize : 2147483647,maxThreadIdleTime : 5,sizeOfQueue : -1,fairnessPolicy : false,useRetries : false,connectionsEvictorSleepDelay : 5000,maxConnectionIdleTime : 40000,
   [junit4]   2> 2692747 INFO  (jetty-launcher-11141-thread-1) [    ] o.a.s.u.UpdateShardHandler Creating UpdateShardHandler HTTP client with params: socketTimeout=340000&connTimeout=45000&retry=true
   [junit4]   2> 2692747 INFO  (jetty-launcher-11141-thread-2) [    ] o.a.s.c.CorePropertiesLocator Config-defined core root directory: C:\Users\jenkins\workspace\Lucene-Solr-6.x-Windows\solr\build\solr-core\test\J0\temp\solr.schema.TestManagedSchemaAPI_6CB391DA4003F1AA-001\tempDir-001\node2\.
   [junit4]   2> 2692747 INFO  (jetty-launcher-11141-thread-2) [    ] o.a.s.c.CoreContainer New CoreContainer 32954518
   [junit4]   2> 2692747 INFO  (jetty-launcher-11141-thread-2) [    ] o.a.s.c.CoreContainer Loading cores into CoreContainer [instanceDir=C:\Users\jenkins\workspace\Lucene-Solr-6.x-Windows\solr\build\solr-core\test\J0\temp\solr.schema.TestManagedSchemaAPI_6CB391DA4003F1AA-001\tempDir-001\node2]
   [junit4]   2> 2692747 WARN  (jetty-launcher-11141-thread-2) [    ] o.a.s.c.CoreContainer Couldn't add files from C:\Users\jenkins\workspace\Lucene-Solr-6.x-Windows\solr\build\solr-core\test\J0\temp\solr.schema.TestManagedSchemaAPI_6CB391DA4003F1AA-001\tempDir-001\node2\lib to classpath: C:\Users\jenkins\workspace\Lucene-Solr-6.x-Windows\solr\build\solr-core\test\J0\temp\solr.schema.TestManagedSchemaAPI_6CB391DA4003F1AA-001\tempDir-001\node2\lib
   [junit4]   2> 2692747 INFO  (jetty-launcher-11141-thread-2) [    ] o.a.s.h.c.HttpShardHandlerFactory created with socketTimeout : 90000,urlScheme : ,connTimeout : 15000,maxConnectionsPerHost : 20,maxConnections : 10000,corePoolSize : 0,maximumPoolSize : 2147483647,maxThreadIdleTime : 5,sizeOfQueue : -1,fairnessPolicy : false,useRetries : false,connectionsEvictorSleepDelay : 5000,maxConnectionIdleTime : 40000,
   [junit4]   2> 2692749 INFO  (jetty-launcher-11141-thread-1) [    ] o.a.s.l.LogWatcher SLF4J impl is org.slf4j.impl.Log4jLoggerFactory
   [junit4]   2> 2692749 INFO  (jetty-launcher-11141-thread-1) [    ] o.a.s.l.LogWatcher Registering Log Listener [Log4j (org.slf4j.impl.Log4jLoggerFactory)]
   [junit4]   2> 2692749 INFO  (jetty-launcher-11141-thread-1) [    ] o.a.s.c.ZkContainer Zookeeper client=127.0.0.1:51546/solr
   [junit4]   2> 2692749 INFO  (jetty-launcher-11141-thread-1) [    ] o.a.s.c.ZkController zkHost includes chroot
   [junit4]   2> 2692749 INFO  (jetty-launcher-11141-thread-1) [    ] o.a.s.c.c.SolrZkClient Using default ZkCredentialsProvider
   [junit4]   2> 2692749 INFO  (jetty-launcher-11141-thread-2) [    ] o.a.s.u.UpdateShardHandler Creating UpdateShardHandler HTTP client with params: socketTimeout=340000&connTimeout=45000&retry=true
   [junit4]   2> 2692750 INFO  (jetty-launcher-11141-thread-2) [    ] o.a.s.l.LogWatcher SLF4J impl is org.slf4j.impl.Log4jLoggerFactory
   [junit4]   2> 2692750 INFO  (jetty-launcher-11141-thread-2) [    ] o.a.s.l.LogWatcher Registering Log Listener [Log4j (org.slf4j.impl.Log4jLoggerFactory)]
   [junit4]   2> 2692750 INFO  (jetty-launcher-11141-thread-1) [    ] o.a.s.c.c.ConnectionManager Waiting for client to connect to ZooKeeper
   [junit4]   2> 2692750 INFO  (jetty-launcher-11141-thread-2) [    ] o.a.s.c.ZkContainer Zookeeper client=127.0.0.1:51546/solr
   [junit4]   2> 2692750 INFO  (jetty-launcher-11141-thread-2) [    ] o.a.s.c.ZkController zkHost includes chroot
   [junit4]   2> 2692750 INFO  (jetty-launcher-11141-thread-2) [    ] o.a.s.c.c.SolrZkClient Using default ZkCredentialsProvider
   [junit4]   2> 2692751 INFO  (jetty-launcher-11141-thread-2) [    ] o.a.s.c.c.ConnectionManager Waiting for client to connect to ZooKeeper
   [junit4]   2> 2692751 INFO  (zkCallback-11147-thread-1) [    ] o.a.s.c.c.ConnectionManager Watcher org.apache.solr.common.cloud.ConnectionManager@b3f7d5 name:ZooKeeperConnection Watcher:127.0.0.1:51546 got event WatchedEvent state:SyncConnected type:None path:null path:null type:None
   [junit4]   2> 2692751 INFO  (jetty-launcher-11141-thread-1) [    ] o.a.s.c.c.ConnectionManager Client is connected to ZooKeeper
   [junit4]   2> 2692752 INFO  (jetty-launcher-11141-thread-1) [    ] o.a.s.c.c.SolrZkClient Using default ZkACLProvider
   [junit4]   2> 2692752 INFO  (zkCallback-11150-thread-1) [    ] o.a.s.c.c.ConnectionManager Watcher org.apache.solr.common.cloud.ConnectionManager@b21b8b name:ZooKeeperConnection Watcher:127.0.0.1:51546 got event WatchedEvent state:SyncConnected type:None path:null path:null type:None
   [junit4]   2> 2692752 INFO  (jetty-launcher-11141-thread-2) [    ] o.a.s.c.c.ConnectionManager Client is connected to ZooKeeper
   [junit4]   2> 2692752 WARN  (NIOServerCxn.Factory:0.0.0.0/0.0.0.0:0) [    ] o.a.z.s.NIOServerCnxn caught end of stream exception
   [junit4]   2> EndOfStreamException: Unable to read additional data from client sessionid 0x15665f019530003, likely client has closed socket
   [junit4]   2> 	at org.apache.zookeeper.server.NIOServerCnxn.doIO(NIOServerCnxn.java:228)
   [junit4]   2> 	at org.apache.zookeeper.server.NIOServerCnxnFactory.run(NIOServerCnxnFactory.java:208)
   [junit4]   2> 	at java.lang.Thread.run(Thread.java:745)
   [junit4]   2> 2692753 INFO  (jetty-launcher-11141-thread-1) [n:127.0.0.1:51550_solr    ] o.a.s.c.ZkController Added new OnReconnect listener org.apache.solr.cloud.ZkController$$Lambda$68/15752936@42f39c
   [junit4]   2> 2692753 INFO  (jetty-launcher-11141-thread-2) [    ] o.a.s.c.c.SolrZkClient Using default ZkACLProvider
   [junit4]   2> 2692754 INFO  (jetty-launcher-11141-thread-1) [n:127.0.0.1:51550_solr    ] o.a.s.c.c.ConnectionManager Waiting for client to connect to ZooKeeper
   [junit4]   2> 2692754 INFO  (jetty-launcher-11141-thread-2) [n:127.0.0.1:51551_solr    ] o.a.s.c.ZkController Added new OnReconnect listener org.apache.solr.cloud.ZkController$$Lambda$68/15752936@18a04e7
   [junit4]   2> 2692754 WARN  (NIOServerCxn.Factory:0.0.0.0/0.0.0.0:0) [    ] o.a.z.s.NIOServerCnxn caught end of stream exception
   [junit4]   2> EndOfStreamException: Unable to read additional data from client sessionid 0x15665f019530004, likely client has closed socket
   [junit4]   2> 	at org.apache.zookeeper.server.NIOServerCnxn.doIO(NIOServerCnxn.java:228)
   [junit4]   2> 	at org.apache.zookeeper.server.NIOServerCnxnFactory.run(NIOServerCnxnFactory.java:208)
   [junit4]   2> 	at java.lang.Thread.run(Thread.java:745)
   [junit4]   2> 2692757 INFO  (jetty-launcher-11141-thread-2) [n:127.0.0.1:51551_solr    ] o.a.s.c.c.ConnectionManager Waiting for client to connect to ZooKeeper
   [junit4]   2> 2692758 INFO  (zkCallback-11151-thread-1-processing-n:127.0.0.1:51550_solr) [n:127.0.0.1:51550_solr    ] o.a.s.c.c.ConnectionManager Watcher org.apache.solr.common.cloud.ConnectionManager@b72d6a name:ZooKeeperConnection Watcher:127.0.0.1:51546/solr got event WatchedEvent state:SyncConnected type:None path:null path:null type:None
   [junit4]   2> 2692758 INFO  (jetty-launcher-11141-thread-1) [n:127.0.0.1:51550_solr    ] o.a.s.c.c.ConnectionManager Client is connected to ZooKeeper
   [junit4]   2> 2692758 INFO  (zkCallback-11152-thread-1-processing-n:127.0.0.1:51551_solr) [n:127.0.0.1:51551_solr    ] o.a.s.c.c.ConnectionManager Watcher org.apache.solr.common.cloud.ConnectionManager@1a8afcd name:ZooKeeperConnection Watcher:127.0.0.1:51546/solr got event WatchedEvent state:SyncConnected type:None path:null path:null type:None
   [junit4]   2> 2692758 INFO  (jetty-launcher-11141-thread-2) [n:127.0.0.1:51551_solr    ] o.a.s.c.c.ConnectionManager Client is connected to ZooKeeper
   [junit4]   2> 2692759 INFO  (jetty-launcher-11141-thread-1) [n:127.0.0.1:51550_solr    ] o.a.s.c.c.SolrZkClient makePath: /overseer/queue
   [junit4]   2> 2692760 INFO  (jetty-launcher-11141-thread-2) [n:127.0.0.1:51551_solr    ] o.a.s.c.c.SolrZkClient makePath: /overseer/queue
   [junit4]   2> 2692762 INFO  (jetty-launcher-11141-thread-1) [n:127.0.0.1:51550_solr    ] o.a.s.c.c.SolrZkClient makePath: /overseer/collection-queue-work
   [junit4]   2> 2692762 INFO  (jetty-launcher-11141-thread-2) [n:127.0.0.1:51551_solr    ] o.a.s.c.c.SolrZkClient makePath: /overseer/collection-queue-work
   [junit4]   2> 2692766 INFO  (jetty-launcher-11141-thread-1) [n:127.0.0.1:51550_solr    ] o.a.s.c.c.SolrZkClient makePath: /overseer/collection-map-running
   [junit4]   2> 2692766 INFO  (jetty-launcher-11141-thread-2) [n:127.0.0.1:51551_solr    ] o.a.s.c.c.SolrZkClient makePath: /overseer/collection-map-running
   [junit4]   2> 2692768 INFO  (jetty-launcher-11141-thread-2) [n:127.0.0.1:51551_solr    ] o.a.s.c.c.SolrZkClient makePath: /overseer/collection-map-completed
   [junit4]   2> 2692769 INFO  (jetty-launcher-11141-thread-1) [n:127.0.0.1:51550_solr    ] o.a.s.c.c.SolrZkClient makePath: /overseer/collection-map-completed
   [junit4]   2> 2692771 INFO  (jetty-launcher-11141-thread-1) [n:127.0.0.1:51550_solr    ] o.a.s.c.c.SolrZkClient makePath: /overseer/collection-map-failure
   [junit4]   2> 2692771 INFO  (jetty-launcher-11141-thread-2) [n:127.0.0.1:51551_solr    ] o.a.s.c.c.SolrZkClient makePath: /overseer/collection-map-failure
   [junit4]   2> 2692773 INFO  (jetty-launcher-11141-thread-1) [n:127.0.0.1:51550_solr    ] o.a.s.c.c.SolrZkClient makePath: /live_nodes
   [junit4]   2> 2692774 INFO  (jetty-launcher-11141-thread-2) [n:127.0.0.1:51551_solr    ] o.a.s.c.c.SolrZkClient makePath: /live_nodes
   [junit4]   2> 2692775 INFO  (jetty-launcher-11141-thread-1) [n:127.0.0.1:51550_solr    ] o.a.s.c.c.SolrZkClient makePath: /collections
   [junit4]   2> 2692775 INFO  (jetty-launcher-11141-thread-2) [n:127.0.0.1:51551_solr    ] o.a.s.c.c.SolrZkClient makePath: /collections
   [junit4]   2> 2692776 INFO  (jetty-launcher-11141-thread-2) [n:127.0.0.1:51551_solr    ] o.a.s.c.c.SolrZkClient makePath: /aliases.json
   [junit4]   2> 2692777 INFO  (jetty-launcher-11141-thread-1) [n:127.0.0.1:51550_solr    ] o.a.s.c.c.SolrZkClient makePath: /aliases.json
   [junit4]   2> 2692778 INFO  (jetty-launcher-11141-thread-2) [n:127.0.0.1:51551_solr    ] o.a.s.c.c.SolrZkClient makePath: /clusterstate.json
   [junit4]   2> 2692778 INFO  (jetty-launcher-11141-thread-1) [n:127.0.0.1:51550_solr    ] o.a.s.c.c.SolrZkClient makePath: /clusterstate.json
   [junit4]   2> 2692779 INFO  (jetty-launcher-11141-thread-1) [n:127.0.0.1:51550_solr    ] o.a.s.c.c.SolrZkClient makePath: /security.json
   [junit4]   2> 2692779 INFO  (jetty-launcher-11141-thread-2) [n:127.0.0.1:51551_solr    ] o.a.s.c.c.SolrZkClient makePath: /security.json
   [junit4]   2> 2692780 INFO  (jetty-launcher-11141-thread-1) [n:127.0.0.1:51550_solr    ] o.a.s.c.c.ZkStateReader Updating cluster state from ZooKeeper... 
   [junit4]   2> 2692781 INFO  (jetty-launcher-11141-thread-2) [n:127.0.0.1:51551_solr    ] o.a.s.c.c.ZkStateReader Updating cluster state from ZooKeeper... 
   [junit4]   2> 2692782 INFO  (jetty-launcher-11141-thread-1) [n:127.0.0.1:51550_solr    ] o.a.s.c.c.ZkStateReader Loaded empty cluster properties
   [junit4]   2> 2692782 INFO  (jetty-launcher-11141-thread-2) [n:127.0.0.1:51551_solr    ] o.a.s.c.c.ZkStateReader Loaded empty cluster properties
   [junit4]   2> 2692783 INFO  (jetty-launcher-11141-thread-1) [n:127.0.0.1:51550_solr    ] o.a.s.c.c.ZkStateReader Updated live nodes from ZooKeeper... (0) -> (0)
   [junit4]   2> 2692783 INFO  (jetty-launcher-11141-thread-2) [n:127.0.0.1:51551_solr    ] o.a.s.c.c.ZkStateReader Updated live nodes from ZooKeeper... (0) -> (0)
   [junit4]   2> 2692785 INFO  (jetty-launcher-11141-thread-1) [n:127.0.0.1:51550_solr    ] o.a.s.c.c.SolrZkClient makePath: /overseer_elect
   [junit4]   2> 2692786 INFO  (jetty-launcher-11141-thread-2) [n:127.0.0.1:51551_solr    ] o.a.s.c.c.SolrZkClient makePath: /overseer_elect
   [junit4]   2> 2692787 INFO  (jetty-launcher-11141-thread-1) [n:127.0.0.1:51550_solr    ] o.a.s.c.c.SolrZkClient makePath: /overseer_elect/election
   [junit4]   2> 2692787 INFO  (jetty-launcher-11141-thread-2) [n:127.0.0.1:51551_solr    ] o.a.s.c.c.SolrZkClient makePath: /overseer_elect/election
   [junit4]   2> 2692788 INFO  (jetty-launcher-11141-thread-2) [n:127.0.0.1:51551_solr    ] o.a.s.c.Overseer Overseer (id=null) closing
   [junit4]   2> 2692788 INFO  (jetty-launcher-11141-thread-1) [n:127.0.0.1:51550_solr    ] o.a.s.c.Overseer Overseer (id=null) closing
   [junit4]   2> 2692790 INFO  (jetty-launcher-11141-thread-2) [n:127.0.0.1:51551_solr    ] o.a.s.c.LeaderElector Joined leadership election with path: /overseer_elect/election/96376523926470662-127.0.0.1:51551_solr-n_0000000000
   [junit4]   2> 2692790 INFO  (jetty-launcher-11141-thread-1) [n:127.0.0.1:51550_solr    ] o.a.s.c.LeaderElector Joined leadership election with path: /overseer_elect/election/96376523926470661-127.0.0.1:51550_solr-n_0000000001
   [junit4]   2> 2692790 INFO  (jetty-launcher-11141-thread-2) [n:127.0.0.1:51551_solr    ] o.a.s.c.OverseerElectionContext I am going to be the leader 127.0.0.1:51551_solr
   [junit4]   2> 2692790 INFO  (jetty-launcher-11141-thread-2) [n:127.0.0.1:51551_solr    ] o.a.s.c.c.SolrZkClient makePath: /overseer_elect/leader
   [junit4]   2> 2692791 INFO  (jetty-launcher-11141-thread-1) [n:127.0.0.1:51550_solr    ] o.a.s.c.LeaderElector Watching path /overseer_elect/election/96376523926470662-127.0.0.1:51551_solr-n_0000000000 to know if I could be the leader
   [junit4]   2> 2692791 INFO  (jetty-launcher-11141-thread-1) [n:127.0.0.1:51550_solr    ] o.a.s.c.ZkController Register node as live in ZooKeeper:/live_nodes/127.0.0.1:51550_solr
   [junit4]   2> 2692791 INFO  (jetty-launcher-11141-thread-1) [n:127.0.0.1:51550_solr    ] o.a.s.c.c.SolrZkClient makePath: /live_nodes/127.0.0.1:51550_solr
   [junit4]   2> 2692792 INFO  (jetty-launcher-11141-thread-2) [n:127.0.0.1:51551_solr    ] o.a.s.c.Overseer Overseer (id=96376523926470662-127.0.0.1:51551_solr-n_0000000000) starting
   [junit4]   2> 2692792 INFO  (zkCallback-11152-thread-1-processing-n:127.0.0.1:51551_solr) [n:127.0.0.1:51551_solr    ] o.a.s.c.c.ZkStateReader A live node change: [WatchedEvent state:SyncConnected type:NodeChildrenChanged path:/live_nodes], has occurred - updating... (live nodes size: [0])
   [junit4]   2> 2692792 INFO  (zkCallback-11151-thread-1-processing-n:127.0.0.1:51550_solr) [n:127.0.0.1:51550_solr    ] o.a.s.c.c.ZkStateReader A live node change: [WatchedEvent state:SyncConnected type:NodeChildrenChanged path:/live_nodes], has occurred - updating... (live nodes size: [0])
   [junit4]   2> 2692794 INFO  (zkCallback-11152-thread-1-processing-n:127.0.0.1:51551_solr) [n:127.0.0.1:51551_solr    ] o.a.s.c.c.ZkStateReader Updated live nodes from ZooKeeper... (0) -> (1)
   [junit4]   2> 2692795 INFO  (zkCallback-11151-thread-1-processing-n:127.0.0.1:51550_solr) [n:127.0.0.1:51550_solr    ] o.a.s.c.c.ZkStateReader Updated live nodes from ZooKeeper... (0) -> (1)
   [junit4]   2> 2692796 INFO  (jetty-launcher-11141-thread-2) [n:127.0.0.1:51551_solr    ] o.a.s.c.c.SolrZkClient makePath: /overseer/queue-work
   [junit4]   2> 2692803 INFO  (jetty-launcher-11141-thread-2) [n:127.0.0.1:51551_solr    ] o.a.s.c.OverseerAutoReplicaFailoverThread Starting OverseerAutoReplicaFailoverThread autoReplicaFailoverWorkLoopDelay=10000 autoReplicaFailoverWaitAfterExpiration=30000 autoReplicaFailoverBadNodeExpiration=60000
   [junit4]   2> 2692804 INFO  (OverseerCollectionConfigSetProcessor-96376523926470662-127.0.0.1:51551_solr-n_0000000000) [n:127.0.0.1:51551_solr    ] o.a.s.c.OverseerTaskProcessor Process current queue of overseer operations
   [junit4]   2> 2692804 INFO  (jetty-launcher-11141-thread-2) [n:127.0.0.1:51551_solr    ] o.a.s.c.ZkController Publish node=127.0.0.1:51551_solr as DOWN
   [junit4]   2> 2692804 INFO  (OverseerStateUpdate-96376523926470662-127.0.0.1:51551_solr-n_0000000000) [n:127.0.0.1:51551_solr    ] o.a.s.c.Overseer Starting to work on the main queue
   [junit4]   2> 2692806 INFO  (jetty-launcher-11141-thread-2) [n:127.0.0.1:51551_solr    ] o.a.s.c.ZkController Register node as live in ZooKeeper:/live_nodes/127.0.0.1:51551_solr
   [junit4]   2> 2692806 INFO  (jetty-launcher-11141-thread-2) [n:127.0.0.1:51551_solr    ] o.a.s.c.c.SolrZkClient makePath: /live_nodes/127.0.0.1:51551_solr
   [junit4]   2> 2692806 INFO  (OverseerStateUpdate-96376523926470662-127.0.0.1:51551_solr-n_0000000000) [n:127.0.0.1:51551_solr    ] o.a.s.c.c.ZkStateReader Updated live nodes from ZooKeeper... (1) -> (1)
   [junit4]   2> 2692807 INFO  (zkCallback-11151-thread-1-processing-n:127.0.0.1:51550_solr) [n:127.0.0.1:51550_solr    ] o.a.s.c.c.ZkStateReader A live node change: [WatchedEvent state:SyncConnected type:NodeChildrenChanged path:/live_nodes], has occurred - updating... (live nodes size: [1])
   [junit4]   2> 2692807 INFO  (zkCallback-11152-thread-1-processing-n:127.0.0.1:51551_solr) [n:127.0.0.1:51551_solr    ] o.a.s.c.c.ZkStateReader A live node change: [WatchedEvent state:SyncConnected type:NodeChildrenChanged path:/live_nodes], has occurred - updating... (live nodes size: [1])
   [junit4]   2> 2692808 INFO  (zkCallback-11151-thread-1-processing-n:127.0.0.1:51550_solr) [n:127.0.0.1:51550_solr    ] o.a.s.c.c.ZkStateReader Updated live nodes from ZooKeeper... (1) -> (2)
   [junit4]   2> 2692809 INFO  (zkCallback-11152-thread-1-processing-n:127.0.0.1:51551_solr) [n:127.0.0.1:51551_solr    ] o.a.s.c.c.ZkStateReader Updated live nodes from ZooKeeper... (1) -> (2)
   [junit4]   2> 2692809 INFO  (OverseerStateUpdate-96376523926470662-127.0.0.1:51551_solr-n_0000000000) [n:127.0.0.1:51551_solr    ] o.a.s.c.Overseer processMessage: queueSize: 1, message = {
   [junit4]   2>   "operation":"downnode",
   [junit4]   2>   "node_name":"127.0.0.1:51551_solr"} current state version: 0
   [junit4]   2> 2692809 INFO  (OverseerStateUpdate-96376523926470662-127.0.0.1:51551_solr-n_0000000000) [n:127.0.0.1:51551_solr    ] o.a.s.c.o.NodeMutator DownNode state invoked for node: 127.0.0.1:51551_solr
   [junit4]   2> 2692817 INFO  (jetty-launcher-11141-thread-1) [n:127.0.0.1:51550_solr    ] o.a.s.c.CoreContainer Security conf doesn't exist. Skipping setup for authorization module.
   [junit4]   2> 2692817 INFO  (jetty-launcher-11141-thread-1) [n:127.0.0.1:51550_solr    ] o.a.s.c.CoreContainer No authentication plugin used.
   [junit4]   2> 2692817 INFO  (jetty-launcher-11141-thread-1) [n:127.0.0.1:51550_solr    ] o.a.s.c.CorePropertiesLocator Looking for core definitions underneath C:\Users\jenkins\workspace\Lucene-Solr-6.x-Windows\solr\build\solr-core\test\J0\temp\solr.schema.TestManagedSchemaAPI_6CB391DA4003F1AA-001\tempDir-001\node1\.
   [junit4]   2> 2692818 INFO  (jetty-launcher-11141-thread-1) [n:127.0.0.1:51550_solr    ] o.a.s.c.CorePropertiesLocator Found 0 core definitions
   [junit4]   2> 2692819 INFO  (jetty-launcher-11141-thread-1) [n:127.0.0.1:51550_solr    ] o.a.s.s.SolrDispatchFilter user.dir=C:\Users\jenkins\workspace\Lucene-Solr-6.x-Windows\solr\build\solr-core\test\J0
   [junit4]   2> 2692819 INFO  (jetty-launcher-11141-thread-1) [n:127.0.0.1:51550_solr    ] o.a.s.s.SolrDispatchFilter SolrDispatchFilter.init() done
   [junit4]   2> 2692822 INFO  (jetty-launcher-11141-thread-2) [n:127.0.0.1:51551_solr    ] o.a.s.c.CoreContainer Security conf doesn't exist. Skipping setup for authorization module.
   [junit4]   2> 2692822 INFO  (jetty-launcher-11141-thread-2) [n:127.0.0.1:51551_solr    ] o.a.s.c.CoreContainer No authentication plugin used.
   [junit4]   2> 2692823 INFO  (jetty-launcher-11141-thread-2) [n:127.0.0.1:51551_solr    ] o.a.s.c.CorePropertiesLocator Looking for core definitions underneath C:\Users\jenkins\workspace\Lucene-Solr-6.x-Windows\solr\build\solr-core\test\J0\temp\solr.schema.TestManagedSchemaAPI_6CB391DA4003F1AA-001\tempDir-001\node2\.
   [junit4]   2> 2692824 INFO  (jetty-launcher-11141-thread-2) [n:127.0.0.1:51551_solr    ] o.a.s.c.CorePropertiesLocator Found 0 core definitions
   [junit4]   2> 2692826 INFO  (jetty-launcher-11141-thread-2) [n:127.0.0.1:51551_solr    ] o.a.s.s.SolrDispatchFilter user.dir=C:\Users\jenkins\workspace\Lucene-Solr-6.x-Windows\solr\build\solr-core\test\J0
   [junit4]   2> 2692826 INFO  (jetty-launcher-11141-thread-2) [n:127.0.0.1:51551_solr    ] o.a.s.s.SolrDispatchFilter SolrDispatchFilter.init() done
   [junit4]   2> 2692826 INFO  (SUITE-TestManagedSchemaAPI-seed#[6CB391DA4003F1AA]-worker) [    ] o.a.s.c.c.SolrZkClient Using default ZkCredentialsProvider
   [junit4]   2> 2692827 INFO  (SUITE-TestManagedSchemaAPI-seed#[6CB391DA4003F1AA]-worker) [    ] o.a.s.c.c.ConnectionManager Waiting for client to connect to ZooKeeper
   [junit4]   2> 2692828 INFO  (zkCallback-11155-thread-1) [    ] o.a.s.c.c.ConnectionManager Watcher org.apache.solr.common.cloud.ConnectionManager@1181a3c name:ZooKeeperConnection Watcher:127.0.0.1:51546 got event WatchedEvent state:SyncConnected type:None path:null path:null type:None
   [junit4]   2> 2692828 INFO  (SUITE-TestManagedSchemaAPI-seed#[6CB391DA4003F1AA]-worker) [    ] o.a.s.c.c.ConnectionManager Client is connected to ZooKeeper
   [junit4]   2> 2692828 INFO  (SUITE-TestManagedSchemaAPI-seed#[6CB391DA4003F1AA]-worker) [    ] o.a.s.c.c.SolrZkClient Using default ZkACLProvider
   [junit4]   2> 2692830 INFO  (SUITE-TestManagedSchemaAPI-seed#[6CB391DA4003F1AA]-worker) [    ] o.a.s.c.c.SolrZkClient Using default ZkCredentialsProvider
   [junit4]   2> 2692833 INFO  (SUITE-TestManagedSchemaAPI-seed#[6CB391DA4003F1AA]-worker) [    ] o.a.s.c.c.ConnectionManager Waiting for client to connect to ZooKeeper
   [junit4]   2> 2692834 INFO  (zkCallback-11158-thread-1) [    ] o.a.s.c.c.ConnectionManager Watcher org.apache.solr.common.cloud.ConnectionManager@20ec4e name:ZooKeeperConnection Watcher:127.0.0.1:51546/solr got event WatchedEvent state:SyncConnected type:None path:null path:null type:None
   [junit4]   2> 2692834 INFO  (SUITE-TestManagedSchemaAPI-seed#[6CB391DA4003F1AA]-worker) [    ] o.a.s.c.c.ConnectionManager Client is connected to ZooKeeper
   [junit4]   2> 2692835 INFO  (SUITE-TestManagedSchemaAPI-seed#[6CB391DA4003F1AA]-worker) [    ] o.a.s.c.c.SolrZkClient Using default ZkACLProvider
   [junit4]   2> 2692835 INFO  (SUITE-TestManagedSchemaAPI-seed#[6CB391DA4003F1AA]-worker) [    ] o.a.s.c.c.ZkStateReader Updating cluster state from ZooKeeper... 
   [junit4]   2> 2692835 INFO  (SUITE-TestManagedSchemaAPI-seed#[6CB391DA4003F1AA]-worker) [    ] o.a.s.c.c.ZkStateReader Loaded empty cluster properties
   [junit4]   2> 2692836 INFO  (SUITE-TestManagedSchemaAPI-seed#[6CB391DA4003F1AA]-worker) [    ] o.a.s.c.c.ZkStateReader Updated live nodes from ZooKeeper... (0) -> (2)
   [junit4]   2> 2692840 INFO  (SUITE-TestManagedSchemaAPI-seed#[6CB391DA4003F1AA]-worker) [    ] o.a.s.c.c.SolrZkClient makePath: /configs/conf1/managed-schema
   [junit4]   2> 2692843 INFO  (SUITE-TestManagedSchemaAPI-seed#[6CB391DA4003F1AA]-worker) [    ] o.a.s.c.c.SolrZkClient makePath: /configs/conf1/solrconfig.xml
   [junit4]   2> 2692866 INFO  (TEST-TestManagedSchemaAPI.test-seed#[6CB391DA4003F1AA]) [    ] o.a.s.SolrTestCaseJ4 ###Starting test
   [junit4]   2> 2692868 INFO  (qtp9925390-47049) [n:127.0.0.1:51550_solr    ] o.a.s.h.a.CollectionsHandler Invoked Collection Action :create with params replicationFactor=2&collection.configName=conf1&name=testschemaapi&action=CREATE&numShards=1&wt=javabin&version=2 and sendToOCPQueue=true
   [junit4]   2> 2692871 INFO  (OverseerCollectionConfigSetProcessor-96376523926470662-127.0.0.1:51551_solr-n_0000000000) [n:127.0.0.1:51551_solr    ] o.a.s.c.OverseerTaskProcessor Overseer Collection Message Handler: Get the message id:/overseer/collection-queue-work/qn-0000000000 message:{
   [junit4]   2>   "name":"testschemaapi",
   [junit4]   2>   "fromApi":"true",
   [junit4]   2>   "replicationFactor":"2",
   [junit4]   2>   "collection.configName":"conf1",
   [junit4]   2>   "numShards":"1",
   [junit4]   2>   "stateFormat":"2",
   [junit4]   2>   "operation":"create"}
   [junit4]   2> 2692871 INFO  (OverseerThreadFactory-10139-thread-1-processing-n:127.0.0.1:51551_solr) [n:127.0.0.1:51551_solr    ] o.a.s.c.OverseerCollectionMessageHandler OverseerCollectionMessageHandler.processMessage : create , {
   [junit4]   2>   "name":"testschemaapi",
   [junit4]   2>   "fromApi":"true",
   [junit4]   2>   "replicationFactor":"2",
   [junit4]   2>   "collection.configName":"conf1",
   [junit4]   2>   "numShards":"1",
   [junit4]   2>   "stateFormat":"2",
   [junit4]   2>   "operation":"create"}
   [junit4]   2> 2692871 INFO  (OverseerThreadFactory-10139-thread-1-processing-n:127.0.0.1:51551_solr) [n:127.0.0.1:51551_solr    ] o.a.s.c.OverseerCollectionMessageHandler Create collection testschemaapi
   [junit4]   2> 2692872 INFO  (OverseerThreadFactory-10139-thread-1-processing-n:127.0.0.1:51551_solr) [n:127.0.0.1:51551_solr    ] o.a.s.c.OverseerCollectionMessageHandler creating collections conf node /collections/testschemaapi 
   [junit4]   2> 2692872 INFO  (OverseerThreadFactory-10139-thread-1-processing-n:127.0.0.1:51551_solr) [n:127.0.0.1:51551_solr    ] o.a.s.c.c.SolrZkClient makePath: /collections/testschemaapi
   [junit4]   2> 2692874 INFO  (zkCallback-11152-thread-1-processing-n:127.0.0.1:51551_solr) [n:127.0.0.1:51551_solr    ] o.a.s.c.c.ZkStateReader A collections change: [WatchedEvent state:SyncConnected type:NodeChildrenChanged path:/collections], has occurred - updating...
   [junit4]   2> 2692874 INFO  (zkCallback-11158-thread-1) [    ] o.a.s.c.c.ZkStateReader A collections change: [WatchedEvent state:SyncConnected type:NodeChildrenChanged path:/collections], has occurred - updating...
   [junit4]   2> 2692874 INFO  (zkCallback-11151-thread-1-processing-n:127.0.0.1:51550_solr) [n:127.0.0.1:51550_solr    ] o.a.s.c.c.ZkStateReader A collections change: [WatchedEvent state:SyncConnected type:NodeChildrenChanged path:/collections], has occurred - updating...
   [junit4]   2> 2692878 INFO  (OverseerStateUpdate-96376523926470662-127.0.0.1:51551_solr-n_0000000000) [n:127.0.0.1:51551_solr    ] o.a.s.c.Overseer processMessage: queueSize: 1, message = {
   [junit4]   2>   "name":"testschemaapi",
   [junit4]   2>   "fromApi":"true",
   [junit4]   2>   "replicationFactor":"2",
   [junit4]   2>   "collection.configName":"conf1",
   [junit4]   2>   "numShards":"1",
   [junit4]   2>   "stateFormat":"2",
   [junit4]   2>   "operation":"create"} current state version: 0
   [junit4]   2> 2692878 INFO  (OverseerStateUpdate-96376523926470662-127.0.0.1:51551_solr-n_0000000000) [n:127.0.0.1:51551_solr    ] o.a.s.c.o.ClusterStateMutator building a new cName: testschemaapi
   [junit4]   2> 2692879 INFO  (OverseerStateUpdate-96376523926470662-127.0.0.1:51551_solr-n_0000000000) [n:127.0.0.1:51551_solr    ] o.a.s.c.o.ZkStateWriter going to create_collection /collections/testschemaapi/state.json
   [junit4]   2> 2692977 INFO  (OverseerThreadFactory-10139-thread-1-processing-n:127.0.0.1:51551_solr) [n:127.0.0.1:51551_solr    ] o.a.s.c.OverseerCollectionMessageHandler Creating SolrCores for new collection testschemaapi, shardNames [shard1] , replicationFactor : 2
   [junit4]   2> 2692977 INFO  (OverseerThreadFactory-10139-thread-1-processing-n:127.0.0.1:51551_solr) [n:127.0.0.1:51551_solr    ] o.a.s.c.OverseerCollectionMessageHandler Creating core testschemaapi_shard1_replica1 as part of shard shard1 of collection testschemaapi on 127.0.0.1:51551_solr
   [junit4]   2> 2692977 INFO  (OverseerThreadFactory-10139-thread-1-processing-n:127.0.0.1:51551_solr) [n:127.0.0.1:51551_solr    ] o.a.s.c.OverseerCollectionMessageHandler Creating core testschemaapi_shard1_replica2 as part of shard shard1 of collection testschemaapi on 127.0.0.1:51550_solr
   [junit4]   2> 2692983 INFO  (qtp9925390-47047) [n:127.0.0.1:51550_solr    ] o.a.s.h.a.CoreAdminOperation core create command qt=/admin/cores&collection.configName=conf1&name=testschemaapi_shard1_replica2&action=CREATE&numShards=1&collection=testschemaapi&shard=shard1&wt=javabin&version=2
   [junit4]   2> 2692983 INFO  (qtp3016210-47048) [n:127.0.0.1:51551_solr    ] o.a.s.h.a.CoreAdminOperation core create command qt=/admin/cores&collection.configName=conf1&name=testschemaapi_shard1_replica1&action=CREATE&numShards=1&collection=testschemaapi&shard=shard1&wt=javabin&version=2
   [junit4]   2> 2692985 INFO  (qtp9925390-47047) [n:127.0.0.1:51550_solr    ] o.a.s.c.CoreDescriptor Created CoreDescriptor: {name=testschemaapi_shard1_replica2, collection.configName=conf1, config=solrconfig.xml, transient=false, schema=schema.xml, loadOnStartup=true, configSetProperties=configsetprops.json, collection=testschemaapi, numShards=1, dataDir=data\, shard=shard1}
   [junit4]   2> 2692985 INFO  (qtp3016210-47048) [n:127.0.0.1:51551_solr    ] o.a.s.c.CoreDescriptor Created CoreDescriptor: {name=testschemaapi_shard1_replica1, collection.configName=conf1, config=solrconfig.xml, transient=false, schema=schema.xml, loadOnStartup=true, configSetProperties=configsetprops.json, collection=testschemaapi, numShards=1, dataDir=data\, shard=shard1}
   [junit4]   2> 2692986 INFO  (qtp9925390-47047) [n:127.0.0.1:51550_solr c:testschemaapi s:shard1  x:testschemaapi_shard1_replica2] o.a.s.c.ZkController publishing state=down
   [junit4]   2> 2692986 INFO  (qtp3016210-47048) [n:127.0.0.1:51551_solr c:testschemaapi s:shard1  x:testschemaapi_shard1_replica1] o.a.s.c.ZkController publishing state=down
   [junit4]   2> 2692986 INFO  (qtp9925390-47047) [n:127.0.0.1:51550_solr c:testschemaapi s:shard1  x:testschemaapi_shard1_replica2] o.a.s.c.ZkController Registering watch for collection testschemaapi
   [junit4]   2> 2692988 INFO  (qtp9925390-47047) [n:127.0.0.1:51550_solr c:testschemaapi s:shard1  x:testschemaapi_shard1_replica2] o.a.s.c.c.ZkStateReader Add data for [testschemaapi] ver [0]
   [junit4]   2> 2692988 INFO  (qtp3016210-47048) [n:127.0.0.1:51551_solr c:testschemaapi s:shard1  x:testschemaapi_shard1_replica1] o.a.s.c.ZkController Registering watch for collection testschemaapi
   [junit4]   2> 2692988 INFO  (qtp9925390-47047) [n:127.0.0.1:51550_solr c:testschemaapi s:shard1  x:testschemaapi_shard1_replica2] o.a.s.c.ZkController look for our core node name
   [junit4]   2> 2692988 INFO  (OverseerStateUpdate-96376523926470662-127.0.0.1:51551_solr-n_0000000000) [n:127.0.0.1:51551_solr    ] o.a.s.c.Overseer processMessage: queueSize: 2, message = {
   [junit4]   2>   "core":"testschemaapi_shard1_replica2",
   [junit4]   2>   "roles":null,
   [junit4]   2>   "base_url":"http://127.0.0.1:51550/solr",
   [junit4]   2>   "node_name":"127.0.0.1:51550_solr",
   [junit4]   2>   "numShards":"1",
   [junit4]   2>   "state":"down",
   [junit4]   2>   "shard":"shard1",
   [junit4]   2>   "collection":"testschemaapi",
   [junit4]   2>   "operation":"state"} current state version: 0
   [junit4]   2> 2692988 INFO  (qtp3016210-47048) [n:127.0.0.1:51551_solr c:testschemaapi s:shard1  x:testschemaapi_shard1_replica1] o.a.s.c.c.ZkStateReader Add data for [testschemaapi] ver [0]
   [junit4]   2> 2692988 INFO  (OverseerStateUpdate-96376523926470662-127.0.0.1:51551_solr-n_0000000000) [n:127.0.0.1:51551_solr    ] o.a.s.c.o.ReplicaMutator Update state numShards=1 message={
   [junit4]   2>   "core":"testschemaapi_shard1_replica2",
   [junit4]   2>   "roles":null,
   [junit4]   2>   "base_url":"http://127.0.0.1:51550/solr",
   [junit4]   2>   "node_name":"127.0.0.1:51550_solr",
   [junit4]   2>   "numShards":"1",
   [junit4]   2>   "state":"down",
   [junit4]   2>   "shard":"shard1",
   [junit4]   2>   "collection":"testschemaapi",
   [junit4]   2>   "operation":"state"}
   [junit4]   2> 2692988 INFO  (qtp3016210-47048) [n:127.0.0.1:51551_solr c:testschemaapi s:shard1  x:testschemaapi_shard1_replica1] o.a.s.c.ZkController look for our core node name
   [junit4]   2> 2692990 INFO  (OverseerStateUpdate-96376523926470662-127.0.0.1:51551_solr-n_0000000000) [n:127.0.0.1:51551_solr    ] o.a.s.c.Overseer processMessage: queueSize: 2, message = {
   [junit4]   2>   "core":"testschemaapi_shard1_replica1",
   [junit4]   2>   "roles":null,
   [junit4]   2>   "base_url":"http://127.0.0.1:51551/solr",
   [junit4]   2>   "node_name":"127.0.0.1:51551_solr",
   [junit4]   2>   "numShards":"1",
   [junit4]   2>   "state":"down",
   [junit4]   2>   "shard":"shard1",
   [junit4]   2>   "collection":"testschemaapi",
   [junit4]   2>   "operation":"state"} current state version: 0
   [junit4]   2> 2692990 INFO  (OverseerStateUpdate-96376523926470662-127.0.0.1:51551_solr-n_0000000000) [n:127.0.0.1:51551_solr    ] o.a.s.c.o.ReplicaMutator Update state numShards=1 message={
   [junit4]   2>   "core":"testschemaapi_shard1_replica1",
   [junit4]   2>   "roles":null,
   [junit4]   2>   "base_url":"http://127.0.0.1:51551/solr",
   [junit4]   2>   "node_name":"127.0.0.1:51551_solr",
   [junit4]   2>   "numShards":"1",
   [junit4]   2>   "state":"down",
   [junit4]   2>   "shard":"shard1",
   [junit4]   2>   "collection":"testschemaapi",
   [junit4]   2>   "operation":"state"}
   [junit4]   2> 2693094 INFO  (OverseerStateUpdate-96376523926470662-127.0.0.1:51551_solr-n_0000000000) [n:127.0.0.1:51551_solr    ] o.a.s.c.o.ZkStateWriter going to update_collection /collections/testschemaapi/state.json version: 0
   [junit4]   2> 2693095 INFO  (zkCallback-11152-thread-3-processing-n:127.0.0.1:51551_solr) [n:127.0.0.1:51551_solr    ] o.a.s.c.c.ZkStateReader A cluster state change: [WatchedEvent state:SyncConnected type:NodeDataChanged path:/collections/testschemaapi/state.json] for collection [testschemaapi] has occurred - updating... (live nodes size: [2])
   [junit4]   2> 2693095 INFO  (zkCallback-11151-thread-1-processing-n:127.0.0.1:51550_solr) [n:127.0.0.1:51550_solr    ] o.a.s.c.c.ZkStateReader A cluster state change: [WatchedEvent state:SyncConnected type:NodeDataChanged path:/collections/testschemaapi/state.json] for collection [testschemaapi] has occurred - updating... (live nodes size: [2])
   [junit4]   2> 2693095 INFO  (zkCallback-11152-thread-3-processing-n:127.0.0.1:51551_solr) [n:127.0.0.1:51551_solr    ] o.a.s.c.c.ZkStateReader Updating data for [testschemaapi] from [0] to [1]
   [junit4]   2> 2693095 INFO  (zkCallback-11151-thread-1-processing-n:127.0.0.1:51550_solr) [n:127.0.0.1:51550_solr    ] o.a.s.c.c.ZkStateReader Updating data for [testschemaapi] from [0] to [1]
   [junit4]   2> 2693988 INFO  (qtp3016210-47048) [n:127.0.0.1:51551_solr c:testschemaapi s:shard1  x:testschemaapi_shard1_replica1] o.a.s.c.ZkController waiting to find shard id in clusterstate for testschemaapi_shard1_replica1
   [junit4]   2> 2693988 INFO  (qtp3016210-47048) [n:127.0.0.1:51551_solr c:testschemaapi s:shard1  x:testschemaapi_shard1_replica1] o.a.s.c.ZkController Check for collection zkNode:testschemaapi
   [junit4]   2> 2693988 INFO  (qtp9925390-47047) [n:127.0.0.1:51550_solr c:testschemaapi s:shard1  x:testschemaapi_shard1_replica2] o.a.s.c.ZkController waiting to find shard id in clusterstate for testschemaapi_shard1_replica2
   [junit4]   2> 2693988 INFO  (qtp9925390-47047) [n:127.0.0.1:51550_solr c:testschemaapi s:shard1  x:testschemaapi_shard1_replica2] o.a.s.c.ZkController Check for collection zkNode:testschemaapi
   [junit4]   2> 2693988 INFO  (qtp3016210-47048) [n:127.0.0.1:51551_solr c:testschemaapi s:shard1  x:testschemaapi_shard1_replica1] o.a.s.c.ZkController Collection zkNode exists
   [junit4]   2> 2693988 INFO  (qtp9925390-47047) [n:127.0.0.1:51550_solr c:testschemaapi s:shard1  x:testschemaapi_shard1_replica2] o.a.s.c.ZkController Collection zkNode exists
   [junit4]   2> 2693989 INFO  (qtp9925390-47047) [n:127.0.0.1:51550_solr c:testschemaapi s:shard1  x:testschemaapi_shard1_replica2] o.a.s.c.c.ZkStateReader Load collection config from: [/collections/testschemaapi]
   [junit4]   2> 2693988 INFO  (qtp3016210-47048) [n:127.0.0.1:51551_solr c:testschemaapi s:shard1  x:testschemaapi_shard1_replica1] o.a.s.c.c.ZkStateReader Load collection config from: [/collections/testschemaapi]
   [junit4]   2> 2693990 INFO  (qtp9925390-47047) [n:127.0.0.1:51550_solr c:testschemaapi s:shard1  x:testschemaapi_shard1_replica2] o.a.s.c.c.ZkStateReader path=[/collections/testschemaapi] [configName]=[conf1] specified config exists in ZooKeeper
   [junit4]   2> 2693990 INFO  (qtp9925390-47047) [n:127.0.0.1:51550_solr c:testschemaapi s:shard1  x:testschemaapi_shard1_replica2] o.a.s.c.SolrResourceLoader new SolrResourceLoader for directory: 'C:\Users\jenkins\workspace\Lucene-Solr-6.x-Windows\solr\build\solr-core\test\J0\temp\solr.schema.TestManagedSchemaAPI_6CB391DA4003F1AA-001\tempDir-001\node1\testschemaapi_shard1_replica2'
   [junit4]   2> 2693990 INFO  (qtp9925390-47047) [n:127.0.0.1:51550_solr c:testschemaapi s:shard1  x:testschemaapi_shard1_replica2] o.a.s.c.SolrResourceLoader JNDI not configured for solr (NoInitialContextEx)
   [junit4]   2> 2693990 INFO  (qtp3016210-47048) [n:127.0.0.1:51551_solr c:testschemaapi s:shard1  x:testschemaapi_shard1_replica1] o.a.s.c.c.ZkStateReader path=[/collections/testschemaapi] [configName]=[conf1] specified config exists in ZooKeeper
   [junit4]   2> 2693990 INFO  (qtp3016210-47048) [n:127.0.0.1:51551_solr c:testschemaapi s:shard1  x:testschemaapi_shard1_replica1] o.a.s.c.SolrResourceLoader new SolrResourceLoader for directory: 'C:\Users\jenkins\workspace\Lucene-Solr-6.x-Windows\solr\build\solr-core\test\J0\temp\solr.schema.TestManagedSchemaAPI_6CB391DA4003F1AA-001\tempDir-001\node2\testschemaapi_shard1_replica1'
   [junit4]   2> 2693990 INFO  (qtp9925390-47047) [n:127.0.0.1:51550_solr c:testschemaapi s:shard1  x:testschemaapi_shard1_replica2] o.a.s.c.SolrResourceLoader solr home defaulted to 'solr/' (could not find system property or JNDI)
   [junit4]   2> 2693991 INFO  (qtp3016210-47048) [n:127.0.0.1:51551_solr c:testschemaapi s:shard1  x:testschemaapi_shard1_replica1] o.a.s.c.SolrResourceLoader JNDI not configured for solr (NoInitialContextEx)
   [junit4]   2> 2693991 INFO  (qtp3016210-47048) [n:127.0.0.1:51551_solr c:testschemaapi s:shard1  x:testschemaapi_shard1_replica1] o.a.s.c.SolrResourceLoader solr home defaulted to 'solr/' (could not find system property or JNDI)
   [junit4]   2> 2693993 INFO  (qtp3016210-47048) [n:127.0.0.1:51551_solr c:testschemaapi s:shard1  x:testschemaapi_shard1_replica1] o.a.s.c.Config loaded config solrconfig.xml with version 0 
   [junit4]   2> 2693993 INFO  (qtp9925390-47047) [n:127.0.0.1:51550_solr c:testschemaapi s:shard1  x:testschemaapi_shard1_replica2] o.a.s.c.Config loaded config solrconfig.xml with version 0 
   [junit4]   2> 2694003 INFO  (qtp3016210-47048) [n:127.0.0.1:51551_solr c:testschemaapi s:shard1  x:testschemaapi_shard1_replica1] o.a.s.c.SolrConfig current version of requestparams : -1
   [junit4]   2> 2694003 INFO  (qtp9925390-47047) [n:127.0.0.1:51550_solr c:testschemaapi s:shard1  x:testschemaapi_shard1_replica2] o.a.s.c.SolrConfig current version of requestparams : -1
   [junit4]   2> 2694017 INFO  (qtp3016210-47048) [n:127.0.0.1:51551_solr c:testschemaapi s:shard1  x:testschemaapi_shard1_replica1] o.a.s.c.SolrConfig Using Lucene MatchVersion: 6.2.0
   [junit4]   2> 2694017 INFO  (qtp9925390-47047) [n:127.0.0.1:51550_solr c:testschemaapi s:shard1  x:testschemaapi_shard1_replica2] o.a.s.c.SolrConfig Using Lucene MatchVersion: 6.2.0
   [junit4]   2> 2694022 INFO  (qtp3016210-47048) [n:127.0.0.1:51551_solr c:testschemaapi s:shard1  x:testschemaapi_shard1_replica1] o.a.s.c.SolrConfig Loaded SolrConfig: solrconfig.xml
   [junit4]   2> 2694023 INFO  (qtp9925390-47047) [n:127.0.0.1:51550_solr c:testschemaapi s:shard1  x:testschemaapi_shard1_replica2] o.a.s.c.SolrConfig Loaded SolrConfig: solrconfig.xml
   [junit4]   2> 2694027 INFO  (qtp9925390-47047) [n:127.0.0.1:51550_solr c:testschemaapi s:shard1  x:testschemaapi_shard1_replica2] o.a.s.s.IndexSchema [testschemaapi_shard1_replica2] Schema name=minimal
   [junit4]   2> 2694027 INFO  (qtp3016210-47048) [n:127.0.0.1:51551_solr c:testschemaapi s:shard1  x:testschemaapi_shard1_replica1] o.a.s.s.IndexSchema [testschemaapi_shard1_replica1] Schema name=minimal
   [junit4]   2> 2694039 INFO  (qtp3016210-47048) [n:127.0.0.1:51551_solr c:testschemaapi s:shard1  x:testschemaapi_shard1_replica1] o.a.s.s.IndexSchema unique key field: id
   [junit4]   2> 2694039 INFO  (qtp9925390-47047) [n:127.0.0.1:51550_solr c:testschemaapi s:shard1  x:testschemaapi_shard1_replica2] o.a.s.s.IndexSchema unique key field: id
   [junit4]   2> 2694044 INFO  (qtp3016210-47048) [n:127.0.0.1:51551_solr c:testschemaapi s:shard1  x:testschemaapi_shard1_replica1] o.a.s.c.ConfigSetProperties Did not find ConfigSet properties, assuming default properties: Can't find resource 'configsetprops.json' in classpath or '/configs/conf1', cwd=C:\Users\jenkins\workspace\Lucene-Solr-6.x-Windows\solr\build\solr-core\test\J0
   [junit4]   2> 2694044 INFO  (qtp9925390-47047) [n:127.0.0.1:51550_solr c:testschemaapi s:shard1  x:testschemaapi_shard1_replica2] o.a.s.c.ConfigSetProperties Did not find ConfigSet properties, assuming default properties: Can't find resource 'configsetprops.json' in classpath or '/configs/conf1', cwd=C:\Users\jenkins\workspace\Lucene-Solr-6.x-Windows\solr\build\solr-core\test\J0
   [junit4]   2> 2694044 INFO  (qtp9925390-47047) [n:127.0.0.1:51550_solr c:testschemaapi s:shard1  x:testschemaapi_shard1_replica2] o.a.s.c.CoreContainer Creating SolrCore 'testschemaapi_shard1_replica2' using configuration from collection testschemaapi
   [junit4]   2> 2694044 INFO  (qtp3016210-47048) [n:127.0.0.1:51551_solr c:testschemaapi s:shard1  x:testschemaapi_shard1_replica1] o.a.s.c.CoreContainer Creating SolrCore 'testschemaapi_shard1_replica1' using configuration from collection testschemaapi
   [junit4]   2> 2694045 INFO  (qtp3016210-47048) [n:127.0.0.1:51551_solr c:testschemaapi s:shard1 r:core_node2 x:testschemaapi_shard1_replica1] o.a.s.c.SolrCore org.apache.solr.core.MockDirectoryFactory
   [junit4]   2> 2694045 INFO  (qtp9925390-47047) [n:127.0.0.1:51550_solr c:testschemaapi s:shard1 r:core_node1 x:testschemaapi_shard1_replica2] o.a.s.c.SolrCore org.apache.solr.core.MockDirectoryFactory
   [junit4]   2> 2694045 INFO  (qtp3016210-47048) [n:127.0.0.1:51551_solr c:testschemaapi s:shard1 r:core_node2 x:testschemaapi_shard1_replica1] o.a.s.c.SolrCore [[testschemaapi_shard1_replica1] ] Opening new SolrCore at [C:\Users\jenkins\workspace\Lucene-Solr-6.x-Windows\solr\build\solr-core\test\J0\temp\solr.schema.TestManagedSchemaAPI_6CB391DA4003F1AA-001\tempDir-001\node2\testschemaapi_shard1_replica1], dataDir=[C:\Users\jenkins\workspace\Lucene-Solr-6.x-Windows\solr\build\solr-core\test\J0\temp\solr.schema.TestManagedSchemaAPI_6CB391DA4003F1AA-001\tempDir-001\node2\.\testschemaapi_shard1_replica1\data\]
   [junit4]   2> 2694045 INFO  (qtp9925390-47047) [n:127.0.0.1:51550_solr c:testschemaapi s:shard1 r:core_node1 x:testschemaapi_shard1_replica2] o.a.s.c.SolrCore [[testschemaapi_shard1_replica2] ] Opening new SolrCore at [C:\Users\jenkins\workspace\Lucene-Solr-6.x-Windows\solr\build\solr-core\test\J0\temp\solr.schema.TestManagedSchemaAPI_6CB391DA4003F1AA-001\tempDir-001\node1\testschemaapi_shard1_replica2], dataDir=[C:\Users\jenkins\workspace\Lucene-Solr-6.x-Windows\solr\build\solr-core\test\J0\temp\solr.schema.TestManagedSchemaAPI_6CB391DA4003F1AA-001\tempDir-001\node1\.\testschemaapi_shard1_replica2\data\]
   [junit4]   2> 2694045 INFO  (qtp3016210-47048) [n:127.0.0.1:51551_solr c:testschemaapi s:shard1 r:core_node2 x:testschemaapi_shard1_replica1] o.a.s.c.SolrCore JMX monitoring not detected for core: testschemaapi_shard1_replica1
   [junit4]   2> 2694045 INFO  (qtp9925390-47047) [n:127.0.0.1:51550_solr c:testschemaapi s:shard1 r:core_node1 x:testschemaapi_shard1_replica2] o.a.s.c.SolrCore JMX monitoring not detected for core: testschemaapi_shard1_replica2
   [junit4]   2> 2694046 INFO  (qtp3016210-47048) [n:127.0.0.1:51551_solr c:testschemaapi s:shard1 r:core_node2 x:testschemaapi_shard1_replica1] o.a.s.c.CachingDirectoryFactory return new directory for C:\Users\jenkins\workspace\Lucene-Solr-6.x-Windows\solr\build\solr-core\test\J0\temp\solr.schema.TestManagedSchemaAPI_6CB391DA4003F1AA-001\tempDir-001\node2\.\testschemaapi_shard1_replica1\data\snapshot_metadata
   [junit4]   2> 2694046 INFO  (qtp3016210-47048) [n:127.0.0.1:51551_solr c:testschemaapi s:shard1 r:core_node2 x:testschemaapi_shard1_replica1] o.a.s.c.s.SolrSnapshotMetaDataManager Loading from snapshot metadata file...
   [junit4]   2> 2694046 INFO  (qtp9925390-47047) [n:127.0.0.1:51550_solr c:testschemaapi s:shard1 r:core_node1 x:testschemaapi_shard1_replica2] o.a.s.c.CachingDirectoryFactory return new directory for C:\Users\jenkins\workspace\Lucene-Solr-6.x-Windows\solr\build\solr-core\test\J0\temp\solr.schema.TestManagedSchemaAPI_6CB391DA4003F1AA-001\tempDir-001\node1\.\testschemaapi_shard1_replica2\data\snapshot_metadata
   [junit4]   2> 2694046 INFO  (qtp9925390-47047) [n:127.0.0.1:51550_solr c:testschemaapi s:shard1 r:core_node1 x:testschemaapi_shard1_replica2] o.a.s.c.s.SolrSnapshotMetaDataManager Loading from snapshot metadata file...
   [junit4]   2> 2694047 INFO  (qtp3016210-47048) [n:127.0.0.1:51551_solr c:testschemaapi s:shard1 r:core_node2 x:testschemaapi_shard1_replica1] o.a.s.c.CachingDirectoryFactory return new directory for C:\Users\jenkins\workspace\Lucene-Solr-6.x-Windows\solr\build\solr-core\test\J0\temp\solr.schema.TestManagedSchemaAPI_6CB391DA4003F1AA-001\tempDir-001\node2\.\testschemaapi_shard1_replica1\data\
   [junit4]   2> 2694047 INFO  (qtp3016210-47048) [n:127.0.0.1:51551_solr c:testschemaapi s:shard1 r:core_node2 x:testschemaapi_shard1_replica1] o.a.s.c.SolrCore New index directory detected: old=null new=C:\Users\jenkins\workspace\Lucene-Solr-6.x-Windows\solr\build\solr-core\test\J0\temp\solr.schema.TestManagedSchemaAPI_6CB391DA4003F1AA-001\tempDir-001\node2\.\testschemaapi_shard1_replica1\data\index/
   [junit4]   2> 2694047 WARN  (qtp3016210-47048) [n:127.0.0.1:51551_solr c:testschemaapi s:shard1 r:core_node2 x:testschemaapi_shard1_replica1] o.a.s.c.SolrCore [testschemaapi_shard1_replica1] Solr index directory 'C:\Users\jenkins\workspace\Lucene-Solr-6.x-Windows\solr\build\solr-core\test\J0\temp\solr.schema.TestManagedSchemaAPI_6CB391DA4003F1AA-001\tempDir-001\node2\.\testschemaapi_shard1_replica1\data\index' doesn't exist. Creating new index...
   [junit4]   2> 2694047 INFO  (qtp9925390-47047) [n:127.0.0.1:51550_solr c:testschemaapi s:shard1 r:core_node1 x:testschemaapi_shard1_replica2] o.a.s.c.CachingDirectoryFactory return new directory for C:\Users\jenkins\workspace\Lucene-Solr-6.x-Windows\solr\build\solr-core\test\J0\temp\solr.schema.TestManagedSchemaAPI_6CB391DA4003F1AA-001\tempDir-001\node1\.\testschemaapi_shard1_replica2\data\
   [junit4]   2> 2694047 INFO  (qtp9925390-47047) [n:127.0.0.1:51550_solr c:testschemaapi s:shard1 r:core_node1 x:testschemaapi_shard1_replica2] o.a.s.c.SolrCore New index directory detected: old=null new=C:\Users\jenkins\workspace\Lucene-Solr-6.x-Windows\solr\build\solr-core\test\J0\temp\solr.schema.TestManagedSchemaAPI_6CB391DA4003F1AA-001\tempDir-001\node1\.\testschemaapi_shard1_replica2\data\index/
   [junit4]   2> 2694048 WARN  (qtp9925390-47047) [n:127.0.0.1:51550_solr c:testschemaapi s:shard1 r:core_node1 x:testschemaapi_shard1_replica2] o.a.s.c.SolrCore [testschemaapi_shard1_replica2] Solr index directory 'C:\Users\jenkins\workspace\Lucene-Solr-6.x-Windows\solr\build\solr-core\test\J0\temp\solr.schema.TestManagedSchemaAPI_6CB391DA4003F1AA-001\tempDir-001\node1\.\testschemaapi_shard1_replica2\data\index' doesn't exist. Creating new index...
   [junit4]   2> 2694048 INFO  (qtp3016210-47048) [n:127.0.0.1:51551_solr c:testschemaapi s:shard1 r:core_node2 x:testschemaapi_shard1_replica1] o.a.s.c.CachingDirectoryFactory return new directory for C:\Users\jenkins\workspace\Lucene-Solr-6.x-Windows\solr\build\solr-core\test\J0\temp\solr.schema.TestManagedSchemaAPI_6CB391DA4003F1AA-001\tempDir-001\node2\.\testschemaapi_shard1_replica1\data\index
   [junit4]   2> 2694049 INFO  (qtp9925390-47047) [n:127.0.0.1:51550_solr c:testschemaapi s:shard1 r:core_node1 x:testschemaapi_shard1_replica2] o.a.s.c.CachingDirectoryFactory return new directory for C:\Users\jenkins\workspace\Lucene-Solr-6.x-Windows\solr\build\solr-core\test\J0\temp\solr.schema.TestManagedSchemaAPI_6CB391DA4003F1AA-001\tempDir-001\node1\.\testschemaapi_shard1_replica2\data\index
   [junit4]   2> 2694049 INFO  (qtp3016210-47048) [n:127.0.0.1:51551_solr c:testschemaapi s:shard1 r:core_node2 x:testschemaapi_shard1_replica1] o.a.s.c.SolrDeletionPolicy SolrDeletionPolicy.onCommit: commits: num=1
   [junit4]   2> 	commit{dir=MockDirectoryWrapper(RAMDirectory@3e9ebe lockFactory=org.apache.lucene.store.SingleInstanceLockFactory@10df1ba),segFN=segments_1,generation=1}
   [junit4]   2> 2694049 INFO  (qtp3016210-47048) [n:127.0.0.1:51551_solr c:testschemaapi s:shard1 r:core_node2 x:testschemaapi_shard1_replica1] o.a.s.c.SolrDeletionPolicy newest commit generation = 1
   [junit4]   2> 2694050 INFO  (qtp9925390-47047) [n:127.0.0.1:51550_solr c:testschemaapi s:shard1 r:core_node1 x:testschemaapi_shard1_replica2] o.a.s.c.SolrDeletionPolicy SolrDeletionPolicy.onCommit: commits: num=1
   [junit4]   2> 	commit{dir=MockDirectoryWrapper(RAMDirectory@e25c53 lockFactory=org.apache.lucene.store.SingleInstanceLockFactory@1c2808c),segFN=segments_1,generation=1}
   [junit4]   2> 2694050 INFO  (qtp9925390-47047) [n:127.0.0.1:51550_solr c:testschemaapi s:shard1 r:core_node1 x:testschemaapi_shard1_replica2] o.a.s.c.SolrDeletionPolicy newest commit generation = 1
   [junit4]   2> 2694051 INFO  (OldIndexDirectoryCleanupThreadForCore-testschemaapi_shard1_replica1) [n:127.0.0.1:51551_solr c:testschemaapi s:shard1 r:core_node2 x:testschemaapi_shard1_replica1] o.a.s.c.SolrCore Looking for old index directories to cleanup for core testschemaapi_shard1_replica1 in C:\Users\jenkins\workspace\Lucene-Solr-6.x-Windows\solr\build\solr-core\test\J0\temp\solr.schema.TestManagedSchemaAPI_6CB391DA4003F1AA-001\tempDir-001\node2\.\testschemaapi_shard1_replica1\data\
   [junit4]   2> 2694051 INFO  (OldIndexDirectoryCleanupThreadForCore-testschemaapi_shard1_replica2) [n:127.0.0.1:51550_solr c:testschemaapi s:shard1 r:core_node1 x:testschemaapi_shard1_replica2] o.a.s.c.SolrCore Looking for old index directories to cleanup for core testschemaapi_shard1_replica2 in C:\Users\jenkins\workspace\Lucene-Solr-6.x-Windows\solr\build\solr-core\test\J0\temp\solr.schema.TestManagedSchemaAPI_6CB391DA4003F1AA-001\tempDir-001\node1\.\testschemaapi_shard1_replica2\data\
   [junit4]   2> 2694052 INFO  (qtp9925390-47047) [n:127.0.0.1:51550_solr c:testschemaapi s:shard1 r:core_node1 x:testschemaapi_shard1_replica2] o.a.s.c.SolrCore no updateRequestProcessorChain defined as default, creating implicit default
   [junit4]   2> 2694052 INFO  (qtp3016210-47048) [n:127.0.0.1:51551_solr c:testschemaapi s:shard1 r:core_node2 x:testschemaapi_shard1_replica1] o.a.s.c.SolrCore no updateRequestProcessorChain defined as default, creating implicit default
   [junit4]   2> 2694053 WARN  (OldIndexDirectoryCleanupThreadForCore-testschemaapi_shard1_replica2) [n:127.0.0.1:51550_solr c:testschemaapi s:shard1 r:core_node1 x:testschemaapi_shard1_replica2] o.a.s.c.DirectoryFactory C:\Users\jenkins\workspace\Lucene-Solr-6.x-Windows\solr\build\solr-core\test\J0\temp\solr.schema.TestManagedSchemaAPI_6CB391DA4003F1AA-001\tempDir-001\node1\.\testschemaapi_shard1_replica2\data\ does not point to a valid data directory; skipping clean-up of old index directories.
   [junit4]   2> 2694054 WARN  (OldIndexDirectoryCleanupThreadForCore-testschemaapi_shard1_replica1) [n:127.0.0.1:51551_solr c:testschemaapi s:shard1 r:core_node2 x:testschemaapi_shard1_replica1] o.a.s.c.DirectoryFactory C:\Users\jenkins\workspace\Lucene-Solr-6.x-Windows\solr\build\solr-core\test\J0\temp\solr.schema.TestManagedSchemaAPI_6CB391DA4003F1AA-001\tempDir-001\node2\.\testschemaapi_shard1_replica1\data\ does not point to a valid data directory; skipping clean-up of old index directories.
   [junit4]   2> 2694059 INFO  (qtp9925390-47047) [n:127.0.0.1:51550_solr c:testschemaapi s:shard1 r:core_node1 x:testschemaapi_shard1_replica2] o.a.s.h.l.XMLLoader xsltCacheLifetimeSeconds=60
   [junit4]   2> 2694059 INFO  (qtp3016210-47048) [n:127.0.0.1:51551_solr c:testschemaapi s:shard1 r:core_node2 x:testschemaapi_shard1_replica1] o.a.s.h.l.XMLLoader xsltCacheLifetimeSeconds=60
   [junit4]   2> 2694060 INFO  (qtp9925390-47047) [n:127.0.0.1:51550_solr c:testschemaapi s:shard1 r:core_node1 x:testschemaapi_shard1_replica2] o.a.s.h.l.XMLLoader xsltCacheLifetimeSeconds=60
   [junit4]   2> 2694060 INFO  (qtp3016210-47048) [n:127.0.0.1:51551_solr c:testschemaapi s:shard1 r:core_node2 x:testschemaapi_shard1_replica1] o.a.s.h.l.XMLLoader xsltCacheLifetimeSeconds=60
   [junit4]   2> 2694062 INFO  (qtp9925390-47047) [n:127.0.0.1:51550_solr c:testschemaapi s:shard1 r:core_node1 x:testschemaapi_shard1_replica2] o.a.s.h.l.XMLLoader xsltCacheLifetimeSeconds=60
   [junit4]   2> 2694062 INFO  (qtp3016210-47048) [n:127.0.0.1:51551_solr c:testschemaapi s:shard1 r:core_node2 x:testschemaapi_shard1_replica1] o.a.s.h.l.XMLLoader xsltCacheLifetimeSeconds=60
   [junit4]   2> 2694063 INFO  (qtp9925390-47047) [n:127.0.0.1:51550_solr c:testschemaapi s:shard1 r:core_node1 x:testschemaapi_shard1_replica2] o.a.s.h.l.XMLLoader xsltCacheLifetimeSeconds=60
   [junit4]   2> 2694063 INFO  (qtp3016210-47048) [n:127.0.0.1:51551_solr c:testschemaapi s:shard1 r:core_node2 x:testschemaapi_shard1_replica1] o.a.s.h.l.XMLLoader xsltCacheLifetimeSeconds=60
   [junit4]   2> 2694065 INFO  (qtp9925390-47047) [n:127.0.0.1:51550_solr c:testschemaapi s:shard1 r:core_node1 x:testschemaapi_shard1_replica2] o.a.s.c.RequestHandlers Registered paths: /admin/mbeans,/update/json/docs,/admin/luke,/export,/get,/admin/properties,/update/json,/admin/threads,/update/csv,/sql,/graph,/select,/admin/segments,/admin/system,/replication,/config,/stream,/schema,/admin/plugins,/admin/logging,/admin/ping,/update,/admin/file,/terms
   [junit4]   2> 2694066 INFO  (qtp9925390-47047) [n:127.0.0.1:51550_solr c:testschemaapi s:shard1 r:core_node1 x:testschemaapi_shard1_replica2] o.a.s.c.SolrCore Using default statsCache cache: org.apache.solr.search.stats.LocalStatsCache
   [junit4]   2> 2694066 INFO  (qtp3016210-47048) [n:127.0.0.1:51551_solr c:testschemaapi s:shard1 r:core_node2 x:testschemaapi_shard1_replica1] o.a.s.c.RequestHandlers Registered paths: /admin/mbeans,/update/json/docs,/admin/luke,/export,/get,/admin/properties,/update/json,/admin/threads,/update/csv,/sql,/graph,/select,/admin/segments,/admin/system,/replication,/config,/stream,/schema,/admin/plugins,/admin/logging,/admin/ping,/update,/admin/file,/terms
   [junit4]   2> 2694066 INFO  (qtp3016210-47048) [n:127.0.0.1:51551_solr c:testschemaapi s:shard1 r:core_node2 x:testschemaapi_shard1_replica1] o.a.s.c.SolrCore Using default statsCache cache: org.apache.solr.search.stats.LocalStatsCache
   [junit4]   2> 2694067 INFO  (qtp9925390-47047) [n:127.0.0.1:51550_solr c:testschemaapi s:shard1 r:core_node1 x:testschemaapi_shard1_replica2] o.a.s.u.UpdateHandler Using UpdateLog implementation: org.apache.solr.update.UpdateLog
   [junit4]   2> 2694067 INFO  (qtp9925390-47047) [n:127.0.0.1:51550_solr c:testschemaapi s:shard1 r:core_node1 x:testschemaapi_shard1_replica2] o.a.s.u.UpdateLog Initializing UpdateLog: dataDir=null defaultSyncLevel=FLUSH numRecordsToKeep=100 maxNumLogsToKeep=10 numVersionBuckets=65536
   [junit4]   2> 2694067 INFO  (qtp3016210-47048) [n:127.0.0.1:51551_solr c:testschemaapi s:shard1 r:core_node2 x:testschemaapi_shard1_replica1] o.a.s.u.UpdateHandler Using UpdateLog implementation: org.apache.solr.update.UpdateLog
   [junit4]   2> 2694067 INFO  (qtp3016210-47048) [n:127.0.0.1:51551_solr c:testschemaapi s:shard1 r:core_node2 x:testschemaapi_shard1_replica1] o.a.s.u.UpdateLog Initializing UpdateLog: dataDir=null defaultSyncLevel=FLUSH numRecordsToKeep=100 maxNumLogsToKeep=10 numVersionBuckets=65536
   [junit4]   2> 2694069 INFO  (qtp9925390-47047) [n:127.0.0.1:51550_solr c:testschemaapi s:shard1 r:core_node1 x:testschemaapi_shard1_replica2] o.a.s.u.CommitTracker Hard AutoCommit: disabled
   [junit4]   2> 2694069 INFO  (qtp9925390-47047) [n:127.0.0.1:51550_solr c:testschemaapi s:shard1 r:core_node1 x:testschemaapi_shard1_replica2] o.a.s.u.CommitTracker Soft AutoCommit: disabled
   [junit4]   2> 2694069 INFO  (qtp9925390-47047) [n:127.0.0.1:51550_solr c:testschemaapi s:shard1 r:core_node1 x:testschemaapi_shard1_replica2] o.a.s.c.SolrDeletionPolicy SolrDeletionPolicy.onInit: commits: num=1
   [junit4]   2> 	commit{dir=MockDirectoryWrapper(RAMDirectory@e25c53 lockFactory=org.apache.lucene.store.SingleInstanceLockFactory@1c2808c),segFN=segments_1,generation=1}
   [junit4]   2> 2694069 INFO  (qtp9925390-47047) [n:127.0.0.1:51550_solr c:testschemaapi s:shard1 r:core_node1 x:testschemaapi_shard1_replica2] o.a.s.c.SolrDeletionPolicy newest commit generation = 1
   [junit4]   2> 2694069 INFO  (qtp9925390-47047) [n:127.0.0.1:51550_solr c:testschemaapi s:shard1 r:core_node1 x:testschemaapi_shard1_replica2] o.a.s.s.SolrIndexSearcher Opening [Searcher@713270[testschemaapi_shard1_replica2] main]
   [junit4]   2> 2694069 INFO  (qtp3016210-47048) [n:127.0.0.1:51551_solr c:testschemaapi s:shard1 r:core_node2 x:testschemaapi_shard1_replica1] o.a.s.u.CommitTracker Hard AutoCommit: disabled
   [junit4]   2> 2694069 INFO  (qtp3016210-47048) [n:127.0.0.1:51551_solr c:testschemaapi s:shard1 r:core_node2 x:testschemaapi_shard1_replica1] o.a.s.u.CommitTracker Soft AutoCommit: disabled
   [junit4]   2> 2694069 INFO  (qtp9925390-47047) [n:127.0.0.1:51550_solr c:testschemaapi s:shard1 r:core_node1 x:testschemaapi_shard1_replica2] o.a.s.c.c.ZkStateReader Load collection config from: [/collections/testschemaapi]
   [junit4]   2> 2694070 INFO  (qtp3016210-47048) [n:127.0.0.1:51551_solr c:testschemaapi s:shard1 r:core_node2 x:testschemaapi_shard1_replica1] o.a.s.c.SolrDeletionPolicy SolrDeletionPolicy.onInit: commits: num=1
   [junit4]   2> 	commit{dir=MockDirectoryWrapper(RAMDirectory@3e9ebe lockFactory=org.apache.lucene.store.SingleInstanceLockFactory@10df1ba),segFN=segments_1,generation=1}
   [junit4]   2> 2694070 INFO  (qtp3016210-47048) [n:127.0.0.1:51551_solr c:testschemaapi s:shard1 r:core_node2 x:testschemaapi_shard1_replica1] o.a.s.c.SolrDeletionPolicy newest commit generation = 1
   [junit4]   2> 2694070 INFO  (qtp3016210-47048) [n:127.0.0.1:51551_solr c:testschemaapi s:shard1 r:core_node2 x:testschemaapi_shard1_replica1] o.a.s.s.SolrIndexSearcher Opening [Searcher@1012448[testschemaapi_shard1_replica1] main]
   [junit4]   2> 2694070 INFO  (qtp3016210-47048) [n:127.0.0.1:51551_solr c:testschemaapi s:shard1 r:core_node2 x:testschemaapi_shard1_replica1] o.a.s.c.c.ZkStateReader Load collection config from: [/collections/testschemaapi]
   [junit4]   2> 2694071 INFO  (qtp9925390-47047) [n:127.0.0.1:51550_solr c:testschemaapi s:shard1 r:core_node1 x:testschemaapi_shard1_replica2] o.a.s.c.c.ZkStateReader path=[/collections/testschemaapi] [configName]=[conf1] specified config exists in ZooKeeper
   [junit4]   2> 2694071 INFO  (qtp9925390-47047) [n:127.0.0.1:51550_solr c:testschemaapi s:shard1 r:core_node1 x:testschemaapi_shard1_replica2] o.a.s.r.ManagedResourceStorage Setting up ZooKeeper-based storage for the RestManager with znodeBase: /configs/conf1
   [junit4]   2> 2694071 INFO  (qtp3016210-47048) [n:127.0.0.1:51551_solr c:testschemaapi s:shard1 r:core_node2 x:testschemaapi_shard1_replica1] o.a.s.c.c.ZkStateReader path=[/collections/testschemaapi] [configName]=[conf1] specified config exists in ZooKeeper
   [junit4]   2> 2694071 INFO  (qtp3016210-47048) [n:127.0.0.1:51551_solr c:testschemaapi s:shard1 r:core_node2 x:testschemaapi_shard1_replica1] o.a.s.r.ManagedResourceStorage Setting up ZooKeeper-based storage for the RestManager with znodeBase: /configs/conf1
   [junit4]   2> 2694072 INFO  (qtp9925390-47047) [n:127.0.0.1:51550_solr c:testschemaapi s:shard1 r:core_node1 x:testschemaapi_shard1_replica2] o.a.s.r.ManagedResourceStorage Configured ZooKeeperStorageIO with znodeBase: /configs/conf1
   [junit4]   2> 2694072 INFO  (qtp9925390-47047) [n:127.0.0.1:51550_solr c:testschemaapi s:shard1 r:core_node1 x:testschemaapi_shard1_replica2] o.a.s.r.RestManager Initializing RestManager with initArgs: {}
   [junit4]   2> 2694072 INFO  (qtp9925390-47047) [n:127.0.0.1:51550_solr c:testschemaapi s:shard1 r:core_node1 x:testschemaapi_shard1_replica2] o.a.s.r.ManagedResourceStorage Reading _rest_managed.json using ZooKeeperStorageIO:path=/configs/conf1
   [junit4]   2> 2694072 INFO  (qtp3016210-47048) [n:127.0.0.1:51551_solr c:testschemaapi s:shard1 r:core_node2 x:testschemaapi_shard1_replica1] o.a.s.r.ManagedResourceStorage Configured ZooKeeperStorageIO with znodeBase: /configs/conf1
   [junit4]   2> 2694072 INFO  (qtp3016210-47048) [n:127.0.0.1:51551_solr c:testschemaapi s:shard1 r:core_node2 x:testschemaapi_shard1_replica1] o.a.s.r.RestManager Initializing RestManager with initArgs: {}
   [junit4]   2> 2694072 INFO  (qtp3016210-47048) [n:127.0.0.1:51551_solr c:testschemaapi s:shard1 r:core_node2 x:testschemaapi_shard1_replica1] o.a.s.r.ManagedResourceStorage Reading _rest_managed.json using ZooKeeperStorageIO:path=/configs/conf1
   [junit4]   2> 2694073 INFO  (qtp9925390-47047) [n:127.0.0.1:51550_solr c:testschemaapi s:shard1 r:core_node1 x:testschemaapi_shard1_replica2] o.a.s.r.ManagedResourceStorage No data found for znode /configs/conf1/_rest_managed.json
   [junit4]   2> 2694073 INFO  (qtp9925390-47047) [n:127.0.0.1:51550_solr c:testschemaapi s:shard1 r:core_node1 x:testschemaapi_shard1_replica2] o.a.s.r.ManagedResourceStorage Loaded null at path _rest_managed.json using ZooKeeperStorageIO:path=/configs/conf1
   [junit4]   2> 2694073 INFO  (qtp3016210-47048) [n:127.0.0.1:51551_solr c:testschemaapi s:shard1 r:core_node2 x:testschemaapi_shard1_replica1] o.a.s.r.ManagedResourceStorage No data found for znode /configs/conf1/_rest_managed.json
   [junit4]   2> 2694073 INFO  (qtp9925390-47047) [n:127.0.0.1:51550_solr c:testschemaapi s:shard1 r:core_node1 x:testschemaapi_shard1_replica2] o.a.s.r.RestManager Initializing 0 registered ManagedResources
   [junit4]   2> 2694073 INFO  (qtp3016210-47048) [n:127.0.0.1:51551_solr c:testschemaapi s:shard1 r:core_node2 x:testschemaapi_shard1_replica1] o.a.s.r.ManagedResourceStorage Loaded null at path _rest_managed.json using ZooKeeperStorageIO:path=/configs/conf1
   [junit4]   2> 2694073 INFO  (qtp9925390-47047) [n:127.0.0.1:51550_solr c:testschemaapi s:shard1 r:core_node1 x:testschemaapi_shard1_replica2] o.a.s.s.ZkIndexSchemaReader Creating ZooKeeper watch for the managed schema at /configs/conf1/managed-schema
   [junit4]   2> 2694074 INFO  (qtp3016210-47048) [n:127.0.0.1:51551_solr c:testschemaapi s:shard1 r:core_node2 x:testschemaapi_shard1_replica1] o.a.s.r.RestManager Initializing 0 registered ManagedResources
   [junit4]   2> 2694074 INFO  (qtp3016210-47048) [n:127.0.0.1:51551_solr c:testschemaapi s:shard1 r:core_node2 x:testschemaapi_shard1_replica1] o.a.s.s.ZkIndexSchemaReader Creating ZooKeeper watch for the managed schema at /configs/conf1/managed-schema
   [junit4]   2> 2694075 INFO  (qtp9925390-47047) [n:127.0.0.1:51550_solr c:testschemaapi s:shard1 r:core_node1 x:testschemaapi_shard1_replica2] o.a.s.c.ZkController Added new OnReconnect listener ZkIndexSchemaReader: /configs/conf1/managed-schema, uniqueCoreId: testschemaapi_shard1_replica2:4303392364018
   [junit4]   2> 2694075 INFO  (qtp3016210-47048) [n:127.0.0.1:51551_solr c:testschemaapi s:shard1 r:core_node2 x:testschemaapi_shard1_replica1] o.a.s.c.ZkController Added new OnReconnect listener ZkIndexSchemaReader: /configs/conf1/managed-schema, uniqueCoreId: testschemaapi_shard1_replica1:4303392436635
   [junit4]   2> 2694075 INFO  (qtp9925390-47047) [n:127.0.0.1:51550_solr c:testschemaapi s:shard1 r:core_node1 x:testschemaapi_shard1_replica2] o.a.s.h.ReplicationHandler Commits will be reserved for  10000
   [junit4]   2> 2694075 INFO  (qtp3016210-47048) [n:127.0.0.1:51551_solr c:testschemaapi s:shard1 r:core_node2 x:testschemaapi_shard1_replica1] o.a.s.h.ReplicationHandler Commits will be reserved for  10000
   [junit4]   2> 2694075 INFO  (qtp3016210-47048) [n:127.0.0.1:51551_solr c:testschemaapi s:shard1 r:core_node2 x:testschemaapi_shard1_replica1] o.a.s.u.UpdateLog Looking up max value of version field to seed version buckets
   [junit4]   2> 2694075 INFO  (qtp9925390-47047) [n:127.0.0.1:51550_solr c:testschemaapi s:shard1 r:core_node1 x:testschemaapi_shard1_replica2] o.a.s.u.UpdateLog Looking up max value of version field to seed version buckets
   [junit4]   2> 2694075 INFO  (qtp9925390-47047) [n:127.0.0.1:51550_solr c:testschemaapi s:shard1 r:core_node1 x:testschemaapi_shard1_replica2] o.a.s.u.VersionInfo Refreshing highest value of _version_ for 65536 version buckets from index
   [junit4]   2> 2694075 INFO  (searcherExecutor-10144-thread-1-processing-n:127.0.0.1:51550_solr x:testschemaapi_shard1_replica2 s:shard1 c:testschemaapi r:core_node1) [n:127.0.0.1:51550_solr c:testschemaapi s:shard1 r:core_node1 x:testschemaapi_shard1_replica2] o.a.s.c.SolrCore [testschemaapi_shard1_replica2] Registered new searcher Searcher@713270[testschemaapi_shard1_replica2] main{ExitableDirectoryReader(UninvertingDirectoryReader())}
   [junit4]   2> 2694075 INFO  (qtp3016210-47048) [n:127.0.0.1:51551_solr c:testschemaapi s:shard1 r:core_node2 x:testschemaapi_shard1_replica1] o.a.s.u.VersionInfo Refreshing highest value of _version_ for 65536 version buckets from index
   [junit4]   2> 2694075 INFO  (searcherExecutor-10145-thread-1-processing-n:127.0.0.1:51551_solr x:testschemaapi_shard1_replica1 s:shard1 c:testschemaapi r:core_node2) [n:127.0.0.1:51551_solr c:testschemaapi s:shard1 r:core_node2 x:testschemaapi_shard1_replica1] o.a.s.c.SolrCore [testschemaapi_shard1_replica1] Registered new searcher Searcher@1012448[testschemaapi_shard1_replica1] main{ExitableDirectoryReader(UninvertingDirectoryReader())}
   [junit4]   2> 2694076 INFO  (qtp3016210-47048) [n:127.0.0.1:51551_solr c:testschemaapi s:shard1 r:core_node2 x:testschemaapi_shard1_replica1] o.a.s.u.VersionInfo No terms found for _version_, cannot seed version bucket highest value from index
   [junit4]   2> 2694075 INFO  (qtp9925390-47047) [n:127.0.0.1:51550_solr c:testschemaapi s:shard1 r:core_node1 x:testschemaapi_shard1_replica2] o.a.s.u.VersionInfo No terms found for _version_, cannot seed version bucket highest value from index
   [junit4]   2> 2694076 INFO  (qtp3016210-47048) [n:127.0.0.1:51551_solr c:testschemaapi s:shard1 r:core_node2 x:testschemaapi_shard1_replica1] o.a.s.u.UpdateLog Could not find max version in index or recent updates, using new clock 1542024384364937216
   [junit4]   2> 2694076 INFO  (qtp9925390-47047) [n:127.0.0.1:51550_solr c:testschemaapi s:shard1 r:core_node1 x:testschemaapi_shard1_replica2] o.a.s.u.UpdateLog Could not find max version in index or recent updates, using new clock 1542024384364937216
   [junit4]   2> 2694078 INFO  (qtp3016210-47048) [n:127.0.0.1:51551_solr c:testschemaapi s:shard1 r:core_node2 x:testschemaapi_shard1_replica1] o.a.s.u.UpdateLog Took 2.0ms to seed version buckets with highest version 1542024384364937216
   [junit4]   2> 2694078 INFO  (qtp3016210-47048) [n:127.0.0.1:51551_solr c:testschemaapi s:shard1 r:core_node2 x:testschemaapi_shard1_replica1] o.a.s.c.ZkController watch zkdir /configs/conf1
   [junit4]   2> 2694078 INFO  (qtp9925390-47047) [n:127.0.0.1:51550_solr c:testschemaapi s:shard1 r:core_node1 x:testschemaapi_shard1_replica2] o.a.s.u.UpdateLog Took 2.0ms to seed version buckets with highest version 1542024384364937216
   [junit4]   2> 2694078 INFO  (qtp9925390-47047) [n:127.0.0.1:51550_solr c:testschemaapi s:shard1 r:core_node1 x:testschemaapi_shard1_replica2] o.a.s.c.ZkController watch zkdir /configs/conf1
   [junit4]   2> 2694079 INFO  (qtp3016210-47048) [n:127.0.0.1:51551_solr c:testschemaapi s:shard1 r:core_node2 x:testschemaapi_shard1_replica1] o.a.s.c.CoreContainer registering core: testschemaapi_shard1_replica1
   [junit4]   2> 2694079 INFO  (qtp3016210-47048) [n:127.0.0.1:51551_solr c:testschemaapi s:shard1 r:core_node2 x:testschemaapi_shard1_replica1] o.a.s.c.ZkController Register replica - core:testschemaapi_shard1_replica1 address:http://127.0.0.1:51551/solr collection:testschemaapi shard:shard1
   [junit4]   2> 2694079 INFO  (qtp9925390-47047) [n:127.0.0.1:51550_solr c:testschemaapi s:shard1 r:core_node1 x:testschemaapi_shard1_replica2] o.a.s.c.CoreContainer registering core: testschemaapi_shard1_replica2
   [junit4]   2> 2694079 INFO  (qtp9925390-47047) [n:127.0.0.1:51550_solr c:testschemaapi s:shard1 r:core_node1 x:testschemaapi_shard1_replica2] o.a.s.c.ZkController Register replica - core:testschemaapi_shard1_replica2 address:http://127.0.0.1:51550/solr collection:testschemaapi shard:shard1
   [junit4]   2> 2694080 INFO  (qtp3016210-47048) [n:127.0.0.1:51551_solr c:testschemaapi s:shard1 r:core_node2 x:testschemaapi_shard1_replica1] o.a.s.c.c.SolrZkClient makePath: /collections/testschemaapi/leader_elect/shard1/election
   [junit4]   2> 2694080 INFO  (qtp9925390-47047) [n:127.0.0.1:51550_solr c:testschemaapi s:shard1 r:core_node1 x:testschemaapi_shard1_replica2] o.a.s.c.c.SolrZkClient makePath: /collections/testschemaapi/leader_elect/shard1/election
   [junit4]   2> 2694084 INFO  (qtp9925390-47047) [n:127.0.0.1:51550_solr c:testschemaapi s:shard1 r:core_node1 x:testschemaapi_shard1_replica2] o.a.s.c.LeaderElector Joined leadership election with path: /collections/testschemaapi/leader_elect/shard1/election/96376523926470661-core_node1-n_0000000000
   [junit4]   2> 2694084 INFO  (qtp3016210-47048) [n:127.0.0.1:51551_solr c:testschemaapi s:shard1 r:core_node2 x:testschemaapi_shard1_replica1] o.a.s.c.LeaderElector Joined leadership election with path: /collections/testschemaapi/leader_elect/shard1/election/96376523926470662-core_node2-n_0000000001
   [junit4]   2> 2694085 INFO  (qtp9925390-47047) [n:127.0.0.1:51550_solr c:testschemaapi s:shard1 r:core_node1 x:testschemaapi_shard1_replica2] o.a.s.c.ShardLeaderElectionContext Running the leader process for shard=shard1 and weAreReplacement=false and leaderVoteWait=10000
   [junit4]   2> 2694086 INFO  (qtp3016210-47048) [n:127.0.0.1:51551_solr c:testschemaapi s:shard1 r:core_node2 x:testschemaapi_shard1_replica1] o.a.s.c.LeaderElector Watching path /collections/testschemaapi/leader_elect/shard1/election/96376523926470661-core_node1-n_0000000000 to know if I could be the leader
   [junit4]   2> 2694088 INFO  (qtp9925390-47047) [n:127.0.0.1:51550_solr c:testschemaapi s:shard1 r:core_node1 x:testschemaapi_shard1_replica2] o.a.s.c.ShardLeaderElectionContext Enough replicas found to continue.
   [junit4]   2> 2694088 INFO  (qtp9925390-47047) [n:127.0.0.1:51550_solr c:testschemaapi s:shard1 r:core_node1 x:testschemaapi_shard1_replica2] o.a.s.c.ShardLeaderElectionContext I may be the new leader - try and sync
   [junit4]   2> 2694088 INFO  

[...truncated too long message...]

leFieldSortTest, LeaderElectionTest, TestExceedMaxTermLength, TestNoOpRegenerator, TestRequestForwarding, DisMaxRequestHandlerTest, SolrRequestParserTest, TestSchemaVersionResource, TestFieldCache, BJQParserTest, TestCollectionAPI, RestartWhileUpdatingTest, IndexBasedSpellCheckerTest, TestXIncludeConfig, TestSolrCloudWithKerberosAlt, TestStressLucene, PingRequestHandlerTest, TestReplicationHandler, OverseerTaskQueueTest, CloudMLTQParserTest, TestHashQParserPlugin, TestJsonFacets, TestDistributedSearch, HttpPartitionTest, TestRecoveryHdfs, TestShardHandlerFactory, TestCollapseQParserPlugin, ScriptEngineTest, RequiredFieldsTest, TestExactSharedStatsCache, OutOfBoxZkACLAndCredentialsProvidersTest, DistributedSpellCheckComponentTest, TestCoreContainer, TriLevelCompositeIdRoutingTest, LeaderInitiatedRecoveryOnCommitTest, TestIBSimilarityFactory, TestPerFieldSimilarityWithDefaultOverride, TestPostingsSolrHighlighter, TestMacros, CollectionStateFormat2Test, SegmentsInfoRequestHandlerTest, MBeansHandlerTest, PrimUtilsTest, TestPKIAuthenticationPlugin, TestRestManager, TestCryptoKeys, SampleTest, TestLuceneMatchVersion, TestStressLiveNodes, DOMUtilTest, ZkStateReaderTest, TestLMDirichletSimilarityFactory, TestGroupingSearch, TestSearchPerf, TestCloudDeleteByQuery, AnalyticsMergeStrategyTest, VersionInfoTest, DeleteShardTest, DistribCursorPagingTest, StressHdfsTest, DistanceUnitsTest, TestDocSet, TestStressUserVersions, HdfsLockFactoryTest, TestSweetSpotSimilarityFactory, DistributedQueryElevationComponentTest, TestTestInjection, SuggestComponentTest, TimeZoneUtilsTest, XsltUpdateRequestHandlerTest, PolyFieldTest, HLLSerializationTest, QueryElevationComponentTest, TestConfigOverlay, TestDownShardTolerantSearch, TestDynamicFieldResource, ZkCLITest, TestSmileRequest, TestFreeTextSuggestions, TestDocumentBuilder, TestNonDefinedSimilarityFactory, TestGeoJSONResponseWriter, SparseHLLTest, TestCursorMarkWithoutUniqueKey, ZkControllerTest, PathHierarchyTokenizerFactoryTest, DocumentAnalysisRequestHandlerTest, TestSort, StatelessScriptUpdateProcessorFactoryTest, PreAnalyzedUpdateProcessorTest, MigrateRouteKeyTest, TestJmxMonitoredMap, TestSolrQueryResponse, SliceStateTest, ActionThrottleTest, TestBlendedInfixSuggestions, RemoteQueryErrorTest, DistributedFacetPivotSmallTest, TestSolrCoreSnapshots, TestSolrDeletionPolicy1, AlternateDirectoryTest, TestDefaultSearchFieldResource, TestConfigSetsAPIExclusivity, DirectUpdateHandlerTest, UpdateParamsTest, TestMaxScoreQueryParser, FastVectorHighlighterTest, SimpleFacetsTest, ChaosMonkeyNothingIsSafeTest, HardAutoCommitTest, TestFieldCacheSortRandom, TolerantUpdateProcessorTest, TestDynamicLoading, TestTrackingShardHandlerFactory, BadComponentTest, SimplePostToolTest, PKIAuthenticationIntegrationTest, SharedFSAutoReplicaFailoverUtilsTest, TestCollationFieldDocValues, ConcurrentDeleteAndCreateCollectionTest, RankQueryTest, DeleteLastCustomShardedReplicaTest, SystemInfoHandlerTest, DataDrivenBlockJoinTest, TestDFRSimilarityFactory, CoreAdminRequestStatusTest, TestHashPartitioner, SSLMigrationTest, CloudExitableDirectoryReaderTest, StandardRequestHandlerTest, SolrCLIZkUtilsTest, TestDefaultStatsCache, TestMiniSolrCloudClusterSSL, HdfsRecoverLeaseTest, TestPhraseSuggestions, HdfsUnloadDistributedZkTest, CurrencyFieldXmlFileTest, ClusterStateUpdateTest, OverseerCollectionConfigSetProcessorTest, DistribJoinFromCollectionTest, TestPartialUpdateDeduplication, HighlighterMaxOffsetTest, TestUseDocValuesAsStored, WrapperMergePolicyFactoryTest, DocValuesTest, ClusterStateTest, ReturnFieldsTest, TestStressReorder, UnloadDistributedZkTest, TestFieldCacheWithThreads, OpenCloseCoreStressTest, OverseerTest, RecoveryZkTest, TestSolr4Spatial, SpellCheckComponentTest, BadIndexSchemaTest, ConvertedLegacyTest, TestFiltering, BasicFunctionalityTest, TestBadConfig, TestIndexSearcher, ShowFileRequestHandlerTest, AnalysisAfterCoreReloadTest, TestExtendedDismaxParser, SuggesterFSTTest, SpatialFilterTest, TestCSVLoader, SchemaVersionSpecificBehaviorTest, TestPseudoReturnFields, FieldMutatingUpdateProcessorTest, TestWordDelimiterFilterFactory, DirectUpdateHandlerOptimizeTest, TestRemoteStreaming, DebugComponentTest, TestSurroundQueryParser, TestWriterPerf, DirectSolrSpellCheckerTest, PrimitiveFieldTypeTest, XmlUpdateRequestHandlerTest, DocumentBuilderTest, TestIndexingPerformance, FieldAnalysisRequestHandlerTest, IndexSchemaRuntimeFieldTest, LoggingHandlerTest, IndexSchemaTest, TestCollationField, TestCSVResponseWriter, TestAnalyzedSuggestions, TestPHPSerializedResponseWriter, SearchHandlerTest, SOLR749Test, TestQuerySenderListener, TestSolrIndexConfig, TestQuerySenderNoQuery, SolrIndexConfigTest, TestStressRecovery, TestMergePolicyConfig, NumericFieldsTest, TestElisionMultitermQuery, SpellPossibilityIteratorTest, TestCharFilters, SynonymTokenizerTest, TestPerFieldSimilarity, TestLMJelinekMercerSimilarityFactory, ResourceLoaderTest, OpenExchangeRatesOrgProviderTest, URLClassifyProcessorTest, TestFastLRUCache, PreAnalyzedFieldTest, DateFieldTest, UUIDFieldTest, CircularListTest, TestRTGBase, CursorPagingTest, TestHighlightDedupGrouping, TestTolerantSearch, ConnectionReuseTest, AssignTest, AsyncCallRequestStatusResponseTest, AsyncMigrateRouteKeyTest, CollectionsAPIAsyncDistributedZkTest, ConnectionManagerTest, CustomCollectionTest, ShardSplitTest, TestMiniSolrCloudClusterBase, TestRandomFlRTGCloud, TestRebalanceLeaders, TestSSLRandomization, TestSizeLimitedDistributedMap, TlogReplayBufferedWhileIndexingTest, HdfsBasicDistributedZk2Test, HdfsChaosMonkeyNothingIsSafeTest, HdfsChaosMonkeySafeLeaderTest, HdfsCollectionsAPIDistributedZkTest, HdfsNNFailoverTest, HdfsRecoveryZkTest, HdfsRestartWhileUpdatingTest, HdfsThreadLeakTest, HdfsTlogReplayBufferedWhileIndexingTest, HdfsWriteToMultipleCollectionsTest, RulesTest, TestSolrConfigHandlerConcurrent, DistributedFacetPivotLargeTest, DistributedQueryComponentCustomSortTest, DistributedSuggestComponentTest, SuggestComponentContextFilterQueryTest, TestDistributedStatsComponentCardinality, TestCloudManagedSchema, TestManagedSchema, TestManagedSchemaAPI]
   [junit4]   2> NOTE: reproduce with: ant test  -Dtestcase=TestManagedSchemaAPI -Dtests.seed=6CB391DA4003F1AA -Dtests.slow=true -Dtests.locale=en-US -Dtests.timezone=Pacific/Chatham -Dtests.asserts=true -Dtests.file.encoding=UTF-8
   [junit4] ERROR   0.00s J0 | TestManagedSchemaAPI (suite) <<<
   [junit4]    > Throwable #1: java.lang.AssertionError: ObjectTracker found 10 object(s) that were not released!!! [MockDirectoryWrapper, MockDirectoryWrapper, TransactionLog, MockDirectoryWrapper, MockDirectoryWrapper, MDCAwareThreadPoolExecutor, MDCAwareThreadPoolExecutor, MockDirectoryWrapper, MockDirectoryWrapper, TransactionLog]
   [junit4]    > 	at __randomizedtesting.SeedInfo.seed([6CB391DA4003F1AA]:0)
   [junit4]    > 	at org.apache.solr.SolrTestCaseJ4.teardownTestCases(SolrTestCaseJ4.java:258)
   [junit4]    > 	at java.lang.Thread.run(Thread.java:745)Throwable #2: java.io.IOException: Could not remove the following files (in the order of attempts):
   [junit4]    >    C:\Users\jenkins\workspace\Lucene-Solr-6.x-Windows\solr\build\solr-core\test\J0\temp\solr.schema.TestManagedSchemaAPI_6CB391DA4003F1AA-001\tempDir-001\node2\testschemaapi_shard1_replica1\data\tlog\tlog.0000000000000000000: java.nio.file.FileSystemException: C:\Users\jenkins\workspace\Lucene-Solr-6.x-Windows\solr\build\solr-core\test\J0\temp\solr.schema.TestManagedSchemaAPI_6CB391DA4003F1AA-001\tempDir-001\node2\testschemaapi_shard1_replica1\data\tlog\tlog.0000000000000000000: The process cannot access the file because it is being used by another process.
   [junit4]    >    C:\Users\jenkins\workspace\Lucene-Solr-6.x-Windows\solr\build\solr-core\test\J0\temp\solr.schema.TestManagedSchemaAPI_6CB391DA4003F1AA-001\tempDir-001\node2\testschemaapi_shard1_replica1\data\tlog: java.nio.file.DirectoryNotEmptyException: C:\Users\jenkins\workspace\Lucene-Solr-6.x-Windows\solr\build\solr-core\test\J0\temp\solr.schema.TestManagedSchemaAPI_6CB391DA4003F1AA-001\tempDir-001\node2\testschemaapi_shard1_replica1\data\tlog
   [junit4]    >    C:\Users\jenkins\workspace\Lucene-Solr-6.x-Windows\solr\build\solr-core\test\J0\temp\solr.schema.TestManagedSchemaAPI_6CB391DA4003F1AA-001\tempDir-001\node2\testschemaapi_shard1_replica1\data: java.nio.file.DirectoryNotEmptyException: C:\Users\jenkins\workspace\Lucene-Solr-6.x-Windows\solr\build\solr-core\test\J0\temp\solr.schema.TestManagedSchemaAPI_6CB391DA4003F1AA-001\tempDir-001\node2\testschemaapi_shard1_replica1\data
   [junit4]    >    C:\Users\jenkins\workspace\Lucene-Solr-6.x-Windows\solr\build\solr-core\test\J0\temp\solr.schema.TestManagedSchemaAPI_6CB391DA4003F1AA-001\tempDir-001\node2\testschemaapi_shard1_replica1: java.nio.file.DirectoryNotEmptyException: C:\Users\jenkins\workspace\Lucene-Solr-6.x-Windows\solr\build\solr-core\test\J0\temp\solr.schema.TestManagedSchemaAPI_6CB391DA4003F1AA-001\tempDir-001\node2\testschemaapi_shard1_replica1
   [junit4]    >    C:\Users\jenkins\workspace\Lucene-Solr-6.x-Windows\solr\build\solr-core\test\J0\temp\solr.schema.TestManagedSchemaAPI_6CB391DA4003F1AA-001\tempDir-001\node2: java.nio.file.DirectoryNotEmptyException: C:\Users\jenkins\workspace\Lucene-Solr-6.x-Windows\solr\build\solr-core\test\J0\temp\solr.schema.TestManagedSchemaAPI_6CB391DA4003F1AA-001\tempDir-001\node2
   [junit4]    >    C:\Users\jenkins\workspace\Lucene-Solr-6.x-Windows\solr\build\solr-core\test\J0\temp\solr.schema.TestManagedSchemaAPI_6CB391DA4003F1AA-001\tempDir-001: java.nio.file.DirectoryNotEmptyException: C:\Users\jenkins\workspace\Lucene-Solr-6.x-Windows\solr\build\solr-core\test\J0\temp\solr.schema.TestManagedSchemaAPI_6CB391DA4003F1AA-001\tempDir-001
   [junit4]    > 	at org.apache.lucene.util.IOUtils.rm(IOUtils.java:323)
   [junit4]    > 	at java.lang.Thread.run(Thread.java:745)
   [junit4] Completed [569/626 (1!)] on J0 in 13.00s, 1 test, 1 failure, 1 error <<< FAILURES!

[...truncated 52611 lines...]


Mime
View raw message