lucene-dev mailing list archives

Site index · List index
Message view « Date » · « Thread »
Top « Date » · « Thread »
From Apache Jenkins Server <jenk...@builds.apache.org>
Subject [JENKINS] Lucene-Solr-Tests-6.2 - Build # 6 - Still Unstable
Date Wed, 24 Aug 2016 23:42:35 GMT
Build: https://builds.apache.org/job/Lucene-Solr-Tests-6.2/6/

1 tests failed.
FAILED:  org.apache.solr.core.TestArbitraryIndexDir.testLoadNewIndexDir

Error Message:
Exception during query

Stack Trace:
java.lang.RuntimeException: Exception during query
	at __randomizedtesting.SeedInfo.seed([A357B17FF82D4672:4A0D0A4766B4D6DA]:0)
	at org.apache.solr.SolrTestCaseJ4.assertQ(SolrTestCaseJ4.java:783)
	at org.apache.solr.core.TestArbitraryIndexDir.testLoadNewIndexDir(TestArbitraryIndexDir.java:107)
	at sun.reflect.NativeMethodAccessorImpl.invoke0(Native Method)
	at sun.reflect.NativeMethodAccessorImpl.invoke(NativeMethodAccessorImpl.java:62)
	at sun.reflect.DelegatingMethodAccessorImpl.invoke(DelegatingMethodAccessorImpl.java:43)
	at java.lang.reflect.Method.invoke(Method.java:498)
	at com.carrotsearch.randomizedtesting.RandomizedRunner.invoke(RandomizedRunner.java:1764)
	at com.carrotsearch.randomizedtesting.RandomizedRunner$8.evaluate(RandomizedRunner.java:871)
	at com.carrotsearch.randomizedtesting.RandomizedRunner$9.evaluate(RandomizedRunner.java:907)
	at com.carrotsearch.randomizedtesting.RandomizedRunner$10.evaluate(RandomizedRunner.java:921)
	at com.carrotsearch.randomizedtesting.rules.SystemPropertiesRestoreRule$1.evaluate(SystemPropertiesRestoreRule.java:57)
	at com.carrotsearch.randomizedtesting.rules.SystemPropertiesRestoreRule$1.evaluate(SystemPropertiesRestoreRule.java:57)
	at org.apache.lucene.util.TestRuleSetupTeardownChained$1.evaluate(TestRuleSetupTeardownChained.java:49)
	at org.apache.lucene.util.AbstractBeforeAfterRule$1.evaluate(AbstractBeforeAfterRule.java:45)
	at org.apache.lucene.util.TestRuleThreadAndTestName$1.evaluate(TestRuleThreadAndTestName.java:48)
	at org.apache.lucene.util.TestRuleIgnoreAfterMaxFailures$1.evaluate(TestRuleIgnoreAfterMaxFailures.java:64)
	at org.apache.lucene.util.TestRuleMarkFailure$1.evaluate(TestRuleMarkFailure.java:47)
	at com.carrotsearch.randomizedtesting.rules.StatementAdapter.evaluate(StatementAdapter.java:36)
	at com.carrotsearch.randomizedtesting.ThreadLeakControl$StatementRunner.run(ThreadLeakControl.java:367)
	at com.carrotsearch.randomizedtesting.ThreadLeakControl.forkTimeoutingTask(ThreadLeakControl.java:809)
	at com.carrotsearch.randomizedtesting.ThreadLeakControl$3.evaluate(ThreadLeakControl.java:460)
	at com.carrotsearch.randomizedtesting.RandomizedRunner.runSingleTest(RandomizedRunner.java:880)
	at com.carrotsearch.randomizedtesting.RandomizedRunner$5.evaluate(RandomizedRunner.java:781)
	at com.carrotsearch.randomizedtesting.RandomizedRunner$6.evaluate(RandomizedRunner.java:816)
	at com.carrotsearch.randomizedtesting.RandomizedRunner$7.evaluate(RandomizedRunner.java:827)
	at com.carrotsearch.randomizedtesting.rules.StatementAdapter.evaluate(StatementAdapter.java:36)
	at com.carrotsearch.randomizedtesting.rules.SystemPropertiesRestoreRule$1.evaluate(SystemPropertiesRestoreRule.java:57)
	at org.apache.lucene.util.AbstractBeforeAfterRule$1.evaluate(AbstractBeforeAfterRule.java:45)
	at com.carrotsearch.randomizedtesting.rules.StatementAdapter.evaluate(StatementAdapter.java:36)
	at org.apache.lucene.util.TestRuleStoreClassName$1.evaluate(TestRuleStoreClassName.java:41)
	at com.carrotsearch.randomizedtesting.rules.NoShadowingOrOverridesOnMethodsRule$1.evaluate(NoShadowingOrOverridesOnMethodsRule.java:40)
	at com.carrotsearch.randomizedtesting.rules.NoShadowingOrOverridesOnMethodsRule$1.evaluate(NoShadowingOrOverridesOnMethodsRule.java:40)
	at com.carrotsearch.randomizedtesting.rules.StatementAdapter.evaluate(StatementAdapter.java:36)
	at com.carrotsearch.randomizedtesting.rules.StatementAdapter.evaluate(StatementAdapter.java:36)
	at com.carrotsearch.randomizedtesting.rules.StatementAdapter.evaluate(StatementAdapter.java:36)
	at org.apache.lucene.util.TestRuleAssertionsRequired$1.evaluate(TestRuleAssertionsRequired.java:53)
	at org.apache.lucene.util.TestRuleMarkFailure$1.evaluate(TestRuleMarkFailure.java:47)
	at org.apache.lucene.util.TestRuleIgnoreAfterMaxFailures$1.evaluate(TestRuleIgnoreAfterMaxFailures.java:64)
	at org.apache.lucene.util.TestRuleIgnoreTestSuites$1.evaluate(TestRuleIgnoreTestSuites.java:54)
	at com.carrotsearch.randomizedtesting.rules.StatementAdapter.evaluate(StatementAdapter.java:36)
	at com.carrotsearch.randomizedtesting.ThreadLeakControl$StatementRunner.run(ThreadLeakControl.java:367)
	at java.lang.Thread.run(Thread.java:745)
Caused by: java.lang.RuntimeException: REQUEST FAILED: xpath=*[count(//doc)=1]
	xml response was: <?xml version="1.0" encoding="UTF-8"?>
<response>
<lst name="responseHeader"><int name="status">0</int><int name="QTime">0</int></lst><result name="response" numFound="0" start="0"></result>
</response>

	request was:q=id:2&qt=standard&start=0&rows=20&version=2.2
	at org.apache.solr.SolrTestCaseJ4.assertQ(SolrTestCaseJ4.java:776)
	... 41 more




Build Log:
[...truncated 11849 lines...]
   [junit4] Suite: org.apache.solr.core.TestArbitraryIndexDir
   [junit4]   2> Creating dataDir: /x1/jenkins/jenkins-slave/workspace/Lucene-Solr-Tests-6.2/solr/build/solr-core/test/J0/temp/solr.core.TestArbitraryIndexDir_A357B17FF82D4672-001/init-core-data-001
   [junit4]   2> 1390092 INFO  (SUITE-TestArbitraryIndexDir-seed#[A357B17FF82D4672]-worker) [    ] o.a.s.SolrTestCaseJ4 Randomized ssl (true) and clientAuth (true) via: @org.apache.solr.util.RandomizeSSL(reason=, ssl=NaN, value=NaN, clientAuth=NaN)
   [junit4]   2> 1390094 INFO  (TEST-TestArbitraryIndexDir.testLoadNewIndexDir-seed#[A357B17FF82D4672]) [    ] o.a.s.SolrTestCaseJ4 ###Starting testLoadNewIndexDir
   [junit4]   2> 1390095 INFO  (TEST-TestArbitraryIndexDir.testLoadNewIndexDir-seed#[A357B17FF82D4672]) [    ] o.a.s.SolrTestCaseJ4 ####initCore
   [junit4]   2> 1390095 INFO  (TEST-TestArbitraryIndexDir.testLoadNewIndexDir-seed#[A357B17FF82D4672]) [    ] o.a.s.c.SolrResourceLoader new SolrResourceLoader for directory: '/x1/jenkins/jenkins-slave/workspace/Lucene-Solr-Tests-6.2/solr/core/src/test-files/solr/collection1'
   [junit4]   2> 1390095 INFO  (TEST-TestArbitraryIndexDir.testLoadNewIndexDir-seed#[A357B17FF82D4672]) [    ] o.a.s.c.SolrResourceLoader JNDI not configured for solr (NoInitialContextEx)
   [junit4]   2> 1390095 INFO  (TEST-TestArbitraryIndexDir.testLoadNewIndexDir-seed#[A357B17FF82D4672]) [    ] o.a.s.c.SolrResourceLoader using system property solr.solr.home: /x1/jenkins/jenkins-slave/workspace/Lucene-Solr-Tests-6.2/solr/core/src/test-files/solr
   [junit4]   2> 1390095 INFO  (TEST-TestArbitraryIndexDir.testLoadNewIndexDir-seed#[A357B17FF82D4672]) [    ] o.a.s.c.SolrResourceLoader Adding 'file:/x1/jenkins/jenkins-slave/workspace/Lucene-Solr-Tests-6.2/solr/core/src/test-files/solr/collection1/lib/classes/' to classloader
   [junit4]   2> 1390095 INFO  (TEST-TestArbitraryIndexDir.testLoadNewIndexDir-seed#[A357B17FF82D4672]) [    ] o.a.s.c.SolrResourceLoader Adding 'file:/x1/jenkins/jenkins-slave/workspace/Lucene-Solr-Tests-6.2/solr/core/src/test-files/solr/collection1/lib/README' to classloader
   [junit4]   2> 1390118 INFO  (TEST-TestArbitraryIndexDir.testLoadNewIndexDir-seed#[A357B17FF82D4672]) [    ] o.a.s.c.SolrConfig current version of requestparams : -1
   [junit4]   2> 1390126 INFO  (TEST-TestArbitraryIndexDir.testLoadNewIndexDir-seed#[A357B17FF82D4672]) [    ] o.a.s.c.SolrConfig Using Lucene MatchVersion: 6.2.0
   [junit4]   2> 1390144 INFO  (TEST-TestArbitraryIndexDir.testLoadNewIndexDir-seed#[A357B17FF82D4672]) [    ] o.a.s.c.SolrConfig Loaded SolrConfig: solrconfig.xml
   [junit4]   2> 1390154 INFO  (TEST-TestArbitraryIndexDir.testLoadNewIndexDir-seed#[A357B17FF82D4672]) [    ] o.a.s.s.IndexSchema [null] Schema name=test
   [junit4]   2> 1390228 INFO  (TEST-TestArbitraryIndexDir.testLoadNewIndexDir-seed#[A357B17FF82D4672]) [    ] o.a.s.s.IndexSchema default search field in schema is text
   [junit4]   2> 1390228 INFO  (TEST-TestArbitraryIndexDir.testLoadNewIndexDir-seed#[A357B17FF82D4672]) [    ] o.a.s.s.IndexSchema unique key field: id
   [junit4]   2> 1390229 WARN  (TEST-TestArbitraryIndexDir.testLoadNewIndexDir-seed#[A357B17FF82D4672]) [    ] o.a.s.s.IndexSchema Field text is not multivalued and destination for multiple copyFields (2)
   [junit4]   2> 1390233 INFO  (TEST-TestArbitraryIndexDir.testLoadNewIndexDir-seed#[A357B17FF82D4672]) [    ] o.a.s.s.FileExchangeRateProvider Reloading exchange rates from file currency.xml
   [junit4]   2> 1390235 INFO  (TEST-TestArbitraryIndexDir.testLoadNewIndexDir-seed#[A357B17FF82D4672]) [    ] o.a.s.s.FileExchangeRateProvider Reloading exchange rates from file currency.xml
   [junit4]   2> 1390236 INFO  (TEST-TestArbitraryIndexDir.testLoadNewIndexDir-seed#[A357B17FF82D4672]) [    ] o.a.s.c.SolrResourceLoader JNDI not configured for solr (NoInitialContextEx)
   [junit4]   2> 1390236 INFO  (TEST-TestArbitraryIndexDir.testLoadNewIndexDir-seed#[A357B17FF82D4672]) [    ] o.a.s.c.SolrResourceLoader using system property solr.solr.home: /x1/jenkins/jenkins-slave/workspace/Lucene-Solr-Tests-6.2/solr/core/src/test-files/solr
   [junit4]   2> 1390236 INFO  (TEST-TestArbitraryIndexDir.testLoadNewIndexDir-seed#[A357B17FF82D4672]) [    ] o.a.s.c.SolrResourceLoader new SolrResourceLoader for directory: '/x1/jenkins/jenkins-slave/workspace/Lucene-Solr-Tests-6.2/solr/core/src/test-files/solr'
   [junit4]   2> 1390236 INFO  (TEST-TestArbitraryIndexDir.testLoadNewIndexDir-seed#[A357B17FF82D4672]) [    ] o.a.s.c.SolrResourceLoader JNDI not configured for solr (NoInitialContextEx)
   [junit4]   2> 1390236 INFO  (TEST-TestArbitraryIndexDir.testLoadNewIndexDir-seed#[A357B17FF82D4672]) [    ] o.a.s.c.SolrResourceLoader using system property solr.solr.home: /x1/jenkins/jenkins-slave/workspace/Lucene-Solr-Tests-6.2/solr/core/src/test-files/solr
   [junit4]   2> 1390236 INFO  (TEST-TestArbitraryIndexDir.testLoadNewIndexDir-seed#[A357B17FF82D4672]) [    ] o.a.s.c.CoreContainer New CoreContainer 111523944
   [junit4]   2> 1390236 INFO  (TEST-TestArbitraryIndexDir.testLoadNewIndexDir-seed#[A357B17FF82D4672]) [    ] o.a.s.c.CoreContainer Loading cores into CoreContainer [instanceDir=/x1/jenkins/jenkins-slave/workspace/Lucene-Solr-Tests-6.2/solr/core/src/test-files/solr]
   [junit4]   2> 1390237 WARN  (TEST-TestArbitraryIndexDir.testLoadNewIndexDir-seed#[A357B17FF82D4672]) [    ] o.a.s.c.CoreContainer Couldn't add files from /x1/jenkins/jenkins-slave/workspace/Lucene-Solr-Tests-6.2/solr/core/src/test-files/solr/lib to classpath: /x1/jenkins/jenkins-slave/workspace/Lucene-Solr-Tests-6.2/solr/core/src/test-files/solr/lib
   [junit4]   2> 1390237 INFO  (TEST-TestArbitraryIndexDir.testLoadNewIndexDir-seed#[A357B17FF82D4672]) [    ] o.a.s.h.c.HttpShardHandlerFactory created with socketTimeout : 600000,connTimeout : 60000,maxConnectionsPerHost : 20,maxConnections : 10000,corePoolSize : 0,maximumPoolSize : 2147483647,maxThreadIdleTime : 5,sizeOfQueue : -1,fairnessPolicy : false,useRetries : false,connectionsEvictorSleepDelay : 5000,maxConnectionIdleTime : 40000,
   [junit4]   2> 1390240 INFO  (TEST-TestArbitraryIndexDir.testLoadNewIndexDir-seed#[A357B17FF82D4672]) [    ] o.a.s.u.UpdateShardHandler Creating UpdateShardHandler HTTP client with params: socketTimeout=30000&connTimeout=30000&retry=true
   [junit4]   2> 1390244 INFO  (TEST-TestArbitraryIndexDir.testLoadNewIndexDir-seed#[A357B17FF82D4672]) [    ] o.a.s.l.LogWatcher SLF4J impl is org.slf4j.impl.Log4jLoggerFactory
   [junit4]   2> 1390244 INFO  (TEST-TestArbitraryIndexDir.testLoadNewIndexDir-seed#[A357B17FF82D4672]) [    ] o.a.s.l.LogWatcher Registering Log Listener [Log4j (org.slf4j.impl.Log4jLoggerFactory)]
   [junit4]   2> 1390244 INFO  (TEST-TestArbitraryIndexDir.testLoadNewIndexDir-seed#[A357B17FF82D4672]) [    ] o.a.s.c.CoreContainer Security conf doesn't exist. Skipping setup for authorization module.
   [junit4]   2> 1390244 INFO  (TEST-TestArbitraryIndexDir.testLoadNewIndexDir-seed#[A357B17FF82D4672]) [    ] o.a.s.c.CoreContainer No authentication plugin used.
   [junit4]   2> 1390245 INFO  (TEST-TestArbitraryIndexDir.testLoadNewIndexDir-seed#[A357B17FF82D4672]) [    ] o.a.s.c.CoreDescriptor Created CoreDescriptor: {name=collection1, config=solrconfig.xml, transient=false, schema=schema12.xml, loadOnStartup=true, configSetProperties=configsetprops.json, collection=collection1, dataDir=/x1/jenkins/jenkins-slave/workspace/Lucene-Solr-Tests-6.2/solr/build/solr-core/test/J0/temp/solr.core.TestArbitraryIndexDir_A357B17FF82D4672-001/init-core-data-001, shard=shard1}
   [junit4]   2> 1390245 INFO  (coreLoadExecutor-3941-thread-1) [    ] o.a.s.c.SolrResourceLoader new SolrResourceLoader for directory: '/x1/jenkins/jenkins-slave/workspace/Lucene-Solr-Tests-6.2/solr/core/src/test-files/solr/collection1'
   [junit4]   2> 1390245 INFO  (coreLoadExecutor-3941-thread-1) [    ] o.a.s.c.SolrResourceLoader JNDI not configured for solr (NoInitialContextEx)
   [junit4]   2> 1390245 INFO  (coreLoadExecutor-3941-thread-1) [    ] o.a.s.c.SolrResourceLoader using system property solr.solr.home: /x1/jenkins/jenkins-slave/workspace/Lucene-Solr-Tests-6.2/solr/core/src/test-files/solr
   [junit4]   2> 1390246 INFO  (coreLoadExecutor-3941-thread-1) [    ] o.a.s.c.SolrResourceLoader Adding 'file:/x1/jenkins/jenkins-slave/workspace/Lucene-Solr-Tests-6.2/solr/core/src/test-files/solr/collection1/lib/classes/' to classloader
   [junit4]   2> 1390246 INFO  (coreLoadExecutor-3941-thread-1) [    ] o.a.s.c.SolrResourceLoader Adding 'file:/x1/jenkins/jenkins-slave/workspace/Lucene-Solr-Tests-6.2/solr/core/src/test-files/solr/collection1/lib/README' to classloader
   [junit4]   2> 1390285 INFO  (coreLoadExecutor-3941-thread-1) [    ] o.a.s.c.SolrConfig current version of requestparams : -1
   [junit4]   2> 1390301 INFO  (coreLoadExecutor-3941-thread-1) [    ] o.a.s.c.SolrConfig Using Lucene MatchVersion: 6.2.0
   [junit4]   2> 1390337 INFO  (coreLoadExecutor-3941-thread-1) [    ] o.a.s.c.SolrConfig Loaded SolrConfig: solrconfig.xml
   [junit4]   2> 1390341 INFO  (coreLoadExecutor-3941-thread-1) [    ] o.a.s.s.IndexSchema [collection1] Schema name=test
   [junit4]   2> 1390405 INFO  (coreLoadExecutor-3941-thread-1) [    ] o.a.s.s.IndexSchema default search field in schema is text
   [junit4]   2> 1390406 INFO  (coreLoadExecutor-3941-thread-1) [    ] o.a.s.s.IndexSchema unique key field: id
   [junit4]   2> 1390406 WARN  (coreLoadExecutor-3941-thread-1) [    ] o.a.s.s.IndexSchema Field text is not multivalued and destination for multiple copyFields (2)
   [junit4]   2> 1390410 INFO  (coreLoadExecutor-3941-thread-1) [    ] o.a.s.s.FileExchangeRateProvider Reloading exchange rates from file currency.xml
   [junit4]   2> 1390412 INFO  (coreLoadExecutor-3941-thread-1) [    ] o.a.s.s.FileExchangeRateProvider Reloading exchange rates from file currency.xml
   [junit4]   2> 1390415 INFO  (coreLoadExecutor-3941-thread-1) [    ] o.a.s.c.ConfigSetProperties Did not find ConfigSet properties, assuming default properties: Can't find resource 'configsetprops.json' in classpath or '/x1/jenkins/jenkins-slave/workspace/Lucene-Solr-Tests-6.2/solr/core/src/test-files/solr/collection1'
   [junit4]   2> 1390415 INFO  (coreLoadExecutor-3941-thread-1) [    ] o.a.s.c.CoreContainer Creating SolrCore 'collection1' using configuration from instancedir /x1/jenkins/jenkins-slave/workspace/Lucene-Solr-Tests-6.2/solr/core/src/test-files/solr/collection1
   [junit4]   2> 1390415 INFO  (coreLoadExecutor-3941-thread-1) [    x:collection1] o.a.s.c.SolrCore org.apache.solr.core.MockFSDirectoryFactory
   [junit4]   2> 1390416 INFO  (coreLoadExecutor-3941-thread-1) [    x:collection1] o.a.s.c.SolrCore [[collection1] ] Opening new SolrCore at [/x1/jenkins/jenkins-slave/workspace/Lucene-Solr-Tests-6.2/solr/core/src/test-files/solr/collection1], dataDir=[/x1/jenkins/jenkins-slave/workspace/Lucene-Solr-Tests-6.2/solr/build/solr-core/test/J0/temp/solr.core.TestArbitraryIndexDir_A357B17FF82D4672-001/init-core-data-001/]
   [junit4]   2> 1390416 INFO  (coreLoadExecutor-3941-thread-1) [    x:collection1] o.a.s.c.JmxMonitoredMap JMX monitoring is enabled. Adding Solr mbeans to JMX Server: com.sun.jmx.mbeanserver.JmxMBeanServer@72db16ab
   [junit4]   2> 1390417 INFO  (coreLoadExecutor-3941-thread-1) [    x:collection1] o.a.s.c.CachingDirectoryFactory return new directory for /x1/jenkins/jenkins-slave/workspace/Lucene-Solr-Tests-6.2/solr/build/solr-core/test/J0/temp/solr.core.TestArbitraryIndexDir_A357B17FF82D4672-001/init-core-data-001/snapshot_metadata
   [junit4]   2> 1390417 INFO  (coreLoadExecutor-3941-thread-1) [    x:collection1] o.a.s.c.s.SolrSnapshotMetaDataManager Loading from snapshot metadata file...
   [junit4]   2> 1390417 INFO  (coreLoadExecutor-3941-thread-1) [    x:collection1] o.a.s.c.CachingDirectoryFactory return new directory for /x1/jenkins/jenkins-slave/workspace/Lucene-Solr-Tests-6.2/solr/build/solr-core/test/J0/temp/solr.core.TestArbitraryIndexDir_A357B17FF82D4672-001/init-core-data-001
   [junit4]   2> 1390418 INFO  (coreLoadExecutor-3941-thread-1) [    x:collection1] o.a.s.c.SolrCore New index directory detected: old=null new=/x1/jenkins/jenkins-slave/workspace/Lucene-Solr-Tests-6.2/solr/build/solr-core/test/J0/temp/solr.core.TestArbitraryIndexDir_A357B17FF82D4672-001/init-core-data-001/index/
   [junit4]   2> 1390418 WARN  (coreLoadExecutor-3941-thread-1) [    x:collection1] o.a.s.c.SolrCore [collection1] Solr index directory '/x1/jenkins/jenkins-slave/workspace/Lucene-Solr-Tests-6.2/solr/build/solr-core/test/J0/temp/solr.core.TestArbitraryIndexDir_A357B17FF82D4672-001/init-core-data-001/index' doesn't exist. Creating new index...
   [junit4]   2> 1390418 INFO  (coreLoadExecutor-3941-thread-1) [    x:collection1] o.a.s.c.CachingDirectoryFactory return new directory for /x1/jenkins/jenkins-slave/workspace/Lucene-Solr-Tests-6.2/solr/build/solr-core/test/J0/temp/solr.core.TestArbitraryIndexDir_A357B17FF82D4672-001/init-core-data-001/index
   [junit4]   2> 1390418 INFO  (coreLoadExecutor-3941-thread-1) [    x:collection1] o.a.s.u.RandomMergePolicy RandomMergePolicy wrapping class org.apache.lucene.index.TieredMergePolicy: [TieredMergePolicy: maxMergeAtOnce=26, maxMergeAtOnceExplicit=46, maxMergedSegmentMB=39.7880859375, floorSegmentMB=0.7275390625, forceMergeDeletesPctAllowed=2.8120502107454817, segmentsPerTier=49.0, maxCFSSegmentSizeMB=8.796093022207999E12, noCFSRatio=1.0
   [junit4]   2> 1390423 INFO  (coreLoadExecutor-3941-thread-1) [    x:collection1] o.a.s.c.SolrDeletionPolicy SolrDeletionPolicy.onCommit: commits: num=1
   [junit4]   2> 	commit{dir=MockDirectoryWrapper(MMapDirectory@/x1/jenkins/jenkins-slave/workspace/Lucene-Solr-Tests-6.2/solr/build/solr-core/test/J0/temp/solr.core.TestArbitraryIndexDir_A357B17FF82D4672-001/init-core-data-001/index lockFactory=org.apache.lucene.store.SingleInstanceLockFactory@54c60b9a),segFN=segments_1,generation=1}
   [junit4]   2> 1390423 INFO  (coreLoadExecutor-3941-thread-1) [    x:collection1] o.a.s.c.SolrDeletionPolicy newest commit generation = 1
   [junit4]   2> 1390428 INFO  (OldIndexDirectoryCleanupThreadForCore-collection1) [    x:collection1] o.a.s.c.SolrCore Looking for old index directories to cleanup for core collection1 in /x1/jenkins/jenkins-slave/workspace/Lucene-Solr-Tests-6.2/solr/build/solr-core/test/J0/temp/solr.core.TestArbitraryIndexDir_A357B17FF82D4672-001/init-core-data-001/
   [junit4]   2> 1390431 INFO  (coreLoadExecutor-3941-thread-1) [    x:collection1] o.a.s.u.p.UpdateRequestProcessorChain creating updateRequestProcessorChain "dedupe"
   [junit4]   2> 1390432 INFO  (coreLoadExecutor-3941-thread-1) [    x:collection1] o.a.s.u.p.UpdateRequestProcessorChain inserting DistributedUpdateProcessorFactory into updateRequestProcessorChain "dedupe"
   [junit4]   2> 1390432 INFO  (coreLoadExecutor-3941-thread-1) [    x:collection1] o.a.s.u.p.UpdateRequestProcessorChain creating updateRequestProcessorChain "dedupe-allfields"
   [junit4]   2> 1390432 INFO  (coreLoadExecutor-3941-thread-1) [    x:collection1] o.a.s.u.p.UpdateRequestProcessorChain inserting DistributedUpdateProcessorFactory into updateRequestProcessorChain "dedupe-allfields"
   [junit4]   2> 1390432 INFO  (coreLoadExecutor-3941-thread-1) [    x:collection1] o.a.s.u.p.UpdateRequestProcessorChain creating updateRequestProcessorChain "stored_sig"
   [junit4]   2> 1390432 INFO  (coreLoadExecutor-3941-thread-1) [    x:collection1] o.a.s.u.p.UpdateRequestProcessorChain inserting DistributedUpdateProcessorFactory into updateRequestProcessorChain "stored_sig"
   [junit4]   2> 1390432 INFO  (coreLoadExecutor-3941-thread-1) [    x:collection1] o.a.s.u.p.UpdateRequestProcessorChain creating updateRequestProcessorChain "uniq-fields"
   [junit4]   2> 1390432 INFO  (coreLoadExecutor-3941-thread-1) [    x:collection1] o.a.s.u.p.UpdateRequestProcessorChain inserting DistributedUpdateProcessorFactory into updateRequestProcessorChain "uniq-fields"
   [junit4]   2> 1390432 INFO  (coreLoadExecutor-3941-thread-1) [    x:collection1] o.a.s.u.p.UpdateRequestProcessorChain creating updateRequestProcessorChain "distrib-dup-test-chain-explicit"
   [junit4]   2> 1390432 INFO  (coreLoadExecutor-3941-thread-1) [    x:collection1] o.a.s.u.p.UpdateRequestProcessorChain creating updateRequestProcessorChain "distrib-dup-test-chain-implicit"
   [junit4]   2> 1390432 INFO  (coreLoadExecutor-3941-thread-1) [    x:collection1] o.a.s.u.p.UpdateRequestProcessorChain inserting DistributedUpdateProcessorFactory into updateRequestProcessorChain "distrib-dup-test-chain-implicit"
   [junit4]   2> 1390433 INFO  (coreLoadExecutor-3941-thread-1) [    x:collection1] o.a.s.c.SolrCore no updateRequestProcessorChain defined as default, creating implicit default
   [junit4]   2> 1390434 INFO  (coreLoadExecutor-3941-thread-1) [    x:collection1] o.a.s.h.l.XMLLoader xsltCacheLifetimeSeconds=60
   [junit4]   2> 1390435 INFO  (coreLoadExecutor-3941-thread-1) [    x:collection1] o.a.s.h.l.XMLLoader xsltCacheLifetimeSeconds=60
   [junit4]   2> 1390436 INFO  (coreLoadExecutor-3941-thread-1) [    x:collection1] o.a.s.h.l.XMLLoader xsltCacheLifetimeSeconds=60
   [junit4]   2> 1390437 INFO  (coreLoadExecutor-3941-thread-1) [    x:collection1] o.a.s.h.l.XMLLoader xsltCacheLifetimeSeconds=60
   [junit4]   2> 1390440 INFO  (coreLoadExecutor-3941-thread-1) [    x:collection1] o.a.s.c.PluginBag requestHandler : 'lazy' created with startup=lazy 
   [junit4]   2> 1390442 INFO  (coreLoadExecutor-3941-thread-1) [    x:collection1] o.a.s.c.RequestHandlers Registered paths: /admin/mbeans,standard,spellCheckCompRH,lazy,/update/json/docs,/admin/luke,/export,spellCheckWithWordbreak_Direct,tvrh,/get,/admin/properties,/update/json,mltrh,/admin/threads,/search-facet-def,/update/csv,/sql,/graph,/search-facet-invariants,/admin/segments,spellCheckCompRH1,/mlt,/admin/system,/replication,dismax,defaults,/config,/stream,/schema,/admin/plugins,/admin/logging,spellCheckWithWordbreak,mock,/admin/ping,/update,/admin/file,/terms,spellCheckCompRH_Direct,/debug/dump
   [junit4]   2> 1390442 INFO  (coreLoadExecutor-3941-thread-1) [    x:collection1] o.a.s.c.SolrCore Using default statsCache cache: org.apache.solr.search.stats.LocalStatsCache
   [junit4]   2> 1390442 INFO  (coreLoadExecutor-3941-thread-1) [    x:collection1] o.a.s.u.CommitTracker Hard AutoCommit: disabled
   [junit4]   2> 1390442 INFO  (coreLoadExecutor-3941-thread-1) [    x:collection1] o.a.s.u.CommitTracker Soft AutoCommit: disabled
   [junit4]   2> 1390443 INFO  (coreLoadExecutor-3941-thread-1) [    x:collection1] o.a.s.u.RandomMergePolicy RandomMergePolicy wrapping class org.apache.lucene.index.AlcoholicMergePolicy: [AlcoholicMergePolicy: minMergeSize=0, mergeFactor=10, maxMergeSize=324533177, maxMergeSizeForForcedMerge=9223372036854775807, calibrateSizeByDeletes=true, maxMergeDocs=2147483647, maxCFSSegmentSizeMB=8.796093022207999E12, noCFSRatio=0.1]
   [junit4]   2> 1390444 INFO  (coreLoadExecutor-3941-thread-1) [    x:collection1] o.a.s.c.SolrDeletionPolicy SolrDeletionPolicy.onInit: commits: num=1
   [junit4]   2> 	commit{dir=MockDirectoryWrapper(MMapDirectory@/x1/jenkins/jenkins-slave/workspace/Lucene-Solr-Tests-6.2/solr/build/solr-core/test/J0/temp/solr.core.TestArbitraryIndexDir_A357B17FF82D4672-001/init-core-data-001/index lockFactory=org.apache.lucene.store.SingleInstanceLockFactory@54c60b9a),segFN=segments_1,generation=1}
   [junit4]   2> 1390444 INFO  (coreLoadExecutor-3941-thread-1) [    x:collection1] o.a.s.c.SolrDeletionPolicy newest commit generation = 1
   [junit4]   2> 1390444 INFO  (coreLoadExecutor-3941-thread-1) [    x:collection1] o.a.s.s.SolrIndexSearcher Opening [Searcher@13674ffe[collection1] main]
   [junit4]   2> 1390444 INFO  (coreLoadExecutor-3941-thread-1) [    x:collection1] o.a.s.r.RestManager Initializing RestManager with initArgs: {storageIO=org.apache.solr.rest.ManagedResourceStorage$InMemoryStorageIO}
   [junit4]   2> 1390444 INFO  (coreLoadExecutor-3941-thread-1) [    x:collection1] o.a.s.r.ManagedResourceStorage Reading _rest_managed.json using InMemoryStorage
   [junit4]   2> 1390444 INFO  (coreLoadExecutor-3941-thread-1) [    x:collection1] o.a.s.r.RestManager Initializing 0 registered ManagedResources
   [junit4]   2> 1390444 INFO  (coreLoadExecutor-3941-thread-1) [    x:collection1] o.a.s.h.c.SpellCheckComponent Initializing spell checkers
   [junit4]   2> 1390452 INFO  (coreLoadExecutor-3941-thread-1) [    x:collection1] o.a.s.s.DirectSolrSpellChecker init: {name=direct,classname=DirectSolrSpellChecker,field=lowerfilt,minQueryLength=3}
   [junit4]   2> 1390504 INFO  (coreLoadExecutor-3941-thread-1) [    x:collection1] o.a.s.h.ReplicationHandler Commits will be reserved for  10000
   [junit4]   2> 1390504 INFO  (searcherExecutor-3942-thread-1-processing-x:collection1) [    x:collection1] o.a.s.h.c.SpellCheckComponent Loading spell index for spellchecker: default
   [junit4]   2> 1390504 INFO  (searcherExecutor-3942-thread-1-processing-x:collection1) [    x:collection1] o.a.s.h.c.SpellCheckComponent Loading spell index for spellchecker: direct
   [junit4]   2> 1390504 INFO  (searcherExecutor-3942-thread-1-processing-x:collection1) [    x:collection1] o.a.s.h.c.SpellCheckComponent Loading spell index for spellchecker: wordbreak
   [junit4]   2> 1390504 INFO  (searcherExecutor-3942-thread-1-processing-x:collection1) [    x:collection1] o.a.s.h.c.SpellCheckComponent Loading spell index for spellchecker: multipleFields
   [junit4]   2> 1390504 INFO  (searcherExecutor-3942-thread-1-processing-x:collection1) [    x:collection1] o.a.s.h.c.SpellCheckComponent Loading spell index for spellchecker: jarowinkler
   [junit4]   2> 1390505 INFO  (coreLoadExecutor-3941-thread-1) [    x:collection1] o.a.s.c.CoreContainer registering core: collection1
   [junit4]   2> 1390505 INFO  (searcherExecutor-3942-thread-1-processing-x:collection1) [    x:collection1] o.a.s.h.c.SpellCheckComponent Loading spell index for spellchecker: external
   [junit4]   2> 1390506 INFO  (TEST-TestArbitraryIndexDir.testLoadNewIndexDir-seed#[A357B17FF82D4672]) [    ] o.a.s.SolrTestCaseJ4 ####initCore end
   [junit4]   2> 1390507 INFO  (searcherExecutor-3942-thread-1-processing-x:collection1) [    x:collection1] o.a.s.h.c.SpellCheckComponent Loading spell index for spellchecker: freq
   [junit4]   2> 1390508 INFO  (searcherExecutor-3942-thread-1-processing-x:collection1) [    x:collection1] o.a.s.h.c.SpellCheckComponent Loading spell index for spellchecker: fqcn
   [junit4]   2> 1390508 INFO  (searcherExecutor-3942-thread-1-processing-x:collection1) [    x:collection1] o.a.s.h.c.SpellCheckComponent Loading spell index for spellchecker: perDict
   [junit4]   2> 1390508 INFO  (searcherExecutor-3942-thread-1-processing-x:collection1) [    x:collection1] o.a.s.c.SolrCore [collection1] Registered new searcher Searcher@13674ffe[collection1] main{ExitableDirectoryReader(UninvertingDirectoryReader())}
   [junit4]   2> 1390509 INFO  (TEST-TestArbitraryIndexDir.testLoadNewIndexDir-seed#[A357B17FF82D4672]) [    ] o.a.s.u.p.LogUpdateProcessorFactory [collection1]  webapp=null path=null params={}{add=[1]} 0 2
   [junit4]   2> 1390679 INFO  (TEST-TestArbitraryIndexDir.testLoadNewIndexDir-seed#[A357B17FF82D4672]) [    ] o.a.s.u.DirectUpdateHandler2 start commit{,optimize=false,openSearcher=true,waitSearcher=true,expungeDeletes=false,softCommit=false,prepareCommit=false}
   [junit4]   2> 1390698 INFO  (TEST-TestArbitraryIndexDir.testLoadNewIndexDir-seed#[A357B17FF82D4672]) [    ] o.a.s.c.SolrDeletionPolicy SolrDeletionPolicy.onCommit: commits: num=2
   [junit4]   2> 	commit{dir=MockDirectoryWrapper(MMapDirectory@/x1/jenkins/jenkins-slave/workspace/Lucene-Solr-Tests-6.2/solr/build/solr-core/test/J0/temp/solr.core.TestArbitraryIndexDir_A357B17FF82D4672-001/init-core-data-001/index lockFactory=org.apache.lucene.store.SingleInstanceLockFactory@54c60b9a),segFN=segments_1,generation=1}
   [junit4]   2> 	commit{dir=MockDirectoryWrapper(MMapDirectory@/x1/jenkins/jenkins-slave/workspace/Lucene-Solr-Tests-6.2/solr/build/solr-core/test/J0/temp/solr.core.TestArbitraryIndexDir_A357B17FF82D4672-001/init-core-data-001/index lockFactory=org.apache.lucene.store.SingleInstanceLockFactory@54c60b9a),segFN=segments_2,generation=2}
   [junit4]   2> 1390698 INFO  (TEST-TestArbitraryIndexDir.testLoadNewIndexDir-seed#[A357B17FF82D4672]) [    ] o.a.s.c.SolrDeletionPolicy newest commit generation = 2
   [junit4]   2> 1390700 INFO  (TEST-TestArbitraryIndexDir.testLoadNewIndexDir-seed#[A357B17FF82D4672]) [    ] o.a.s.c.SolrCore New index directory detected: old=/x1/jenkins/jenkins-slave/workspace/Lucene-Solr-Tests-6.2/solr/build/solr-core/test/J0/temp/solr.core.TestArbitraryIndexDir_A357B17FF82D4672-001/init-core-data-001/index/ new=/x1/jenkins/jenkins-slave/workspace/Lucene-Solr-Tests-6.2/solr/build/solr-core/test/J0/temp/solr.core.TestArbitraryIndexDir_A357B17FF82D4672-001/init-core-data-001/index_temp
   [junit4]   2> 1390708 INFO  (TEST-TestArbitraryIndexDir.testLoadNewIndexDir-seed#[A357B17FF82D4672]) [    ] o.a.s.s.SolrIndexSearcher Opening [Searcher@754bbc26[collection1] main]
   [junit4]   2> 1390709 INFO  (TEST-TestArbitraryIndexDir.testLoadNewIndexDir-seed#[A357B17FF82D4672]) [    ] o.a.s.u.DirectUpdateHandler2 end_commit_flush
   [junit4]   2> 1390710 INFO  (searcherExecutor-3942-thread-1) [    ] o.a.s.c.SolrCore [collection1] Registered new searcher Searcher@754bbc26[collection1] main{ExitableDirectoryReader(UninvertingDirectoryReader(Uninverting(_0(6.2.0):C1)))}
   [junit4]   2> 1390710 INFO  (TEST-TestArbitraryIndexDir.testLoadNewIndexDir-seed#[A357B17FF82D4672]) [    ] o.a.s.u.p.LogUpdateProcessorFactory [collection1]  webapp=null path=null params={}{commit=} 0 30
   [junit4]   2> 1390710 INFO  (TEST-TestArbitraryIndexDir.testLoadNewIndexDir-seed#[A357B17FF82D4672]) [    ] o.a.s.c.SolrResourceLoader new SolrResourceLoader for directory: '/x1/jenkins/jenkins-slave/workspace/Lucene-Solr-Tests-6.2/solr/core/src/test-files/solr/collection1'
   [junit4]   2> 1390710 INFO  (TEST-TestArbitraryIndexDir.testLoadNewIndexDir-seed#[A357B17FF82D4672]) [    ] o.a.s.c.SolrResourceLoader JNDI not configured for solr (NoInitialContextEx)
   [junit4]   2> 1390711 INFO  (TEST-TestArbitraryIndexDir.testLoadNewIndexDir-seed#[A357B17FF82D4672]) [    ] o.a.s.c.SolrResourceLoader using system property solr.solr.home: /x1/jenkins/jenkins-slave/workspace/Lucene-Solr-Tests-6.2/solr/core/src/test-files/solr
   [junit4]   2> 1390711 INFO  (TEST-TestArbitraryIndexDir.testLoadNewIndexDir-seed#[A357B17FF82D4672]) [    ] o.a.s.c.SolrResourceLoader Adding 'file:/x1/jenkins/jenkins-slave/workspace/Lucene-Solr-Tests-6.2/solr/core/src/test-files/solr/collection1/lib/classes/' to classloader
   [junit4]   2> 1390711 INFO  (TEST-TestArbitraryIndexDir.testLoadNewIndexDir-seed#[A357B17FF82D4672]) [    ] o.a.s.c.SolrResourceLoader Adding 'file:/x1/jenkins/jenkins-slave/workspace/Lucene-Solr-Tests-6.2/solr/core/src/test-files/solr/collection1/lib/README' to classloader
   [junit4]   2> 1390735 INFO  (TEST-TestArbitraryIndexDir.testLoadNewIndexDir-seed#[A357B17FF82D4672]) [    ] o.a.s.c.SolrConfig current version of requestparams : -1
   [junit4]   2> 1390743 INFO  (TEST-TestArbitraryIndexDir.testLoadNewIndexDir-seed#[A357B17FF82D4672]) [    ] o.a.s.c.SolrConfig Using Lucene MatchVersion: 6.2.0
   [junit4]   2> 1390772 INFO  (TEST-TestArbitraryIndexDir.testLoadNewIndexDir-seed#[A357B17FF82D4672]) [    ] o.a.s.c.SolrConfig Loaded SolrConfig: solrconfig.xml
   [junit4]   2> 1390777 INFO  (TEST-TestArbitraryIndexDir.testLoadNewIndexDir-seed#[A357B17FF82D4672]) [    ] o.a.s.s.IndexSchema [collection1] Schema name=test
   [junit4]   2> 1390846 INFO  (TEST-TestArbitraryIndexDir.testLoadNewIndexDir-seed#[A357B17FF82D4672]) [    ] o.a.s.s.IndexSchema default search field in schema is text
   [junit4]   2> 1390847 INFO  (TEST-TestArbitraryIndexDir.testLoadNewIndexDir-seed#[A357B17FF82D4672]) [    ] o.a.s.s.IndexSchema unique key field: id
   [junit4]   2> 1390847 WARN  (TEST-TestArbitraryIndexDir.testLoadNewIndexDir-seed#[A357B17FF82D4672]) [    ] o.a.s.s.IndexSchema Field text is not multivalued and destination for multiple copyFields (2)
   [junit4]   2> 1390852 INFO  (TEST-TestArbitraryIndexDir.testLoadNewIndexDir-seed#[A357B17FF82D4672]) [    ] o.a.s.s.FileExchangeRateProvider Reloading exchange rates from file currency.xml
   [junit4]   2> 1390853 INFO  (TEST-TestArbitraryIndexDir.testLoadNewIndexDir-seed#[A357B17FF82D4672]) [    ] o.a.s.s.FileExchangeRateProvider Reloading exchange rates from file currency.xml
   [junit4]   2> 1390856 INFO  (TEST-TestArbitraryIndexDir.testLoadNewIndexDir-seed#[A357B17FF82D4672]) [    ] o.a.s.c.ConfigSetProperties Did not find ConfigSet properties, assuming default properties: Can't find resource 'configsetprops.json' in classpath or '/x1/jenkins/jenkins-slave/workspace/Lucene-Solr-Tests-6.2/solr/core/src/test-files/solr/collection1'
   [junit4]   2> 1390856 INFO  (TEST-TestArbitraryIndexDir.testLoadNewIndexDir-seed#[A357B17FF82D4672]) [    ] o.a.s.c.CoreContainer Reloading SolrCore 'collection1' using configuration from instancedir /x1/jenkins/jenkins-slave/workspace/Lucene-Solr-Tests-6.2/solr/core/src/test-files/solr/collection1
   [junit4]   2> 1390857 INFO  (TEST-TestArbitraryIndexDir.testLoadNewIndexDir-seed#[A357B17FF82D4672]) [    x:collection1] o.a.s.c.SolrCore [[collection1] ] Opening new SolrCore at [/x1/jenkins/jenkins-slave/workspace/Lucene-Solr-Tests-6.2/solr/core/src/test-files/solr/collection1], dataDir=[/x1/jenkins/jenkins-slave/workspace/Lucene-Solr-Tests-6.2/solr/build/solr-core/test/J0/temp/solr.core.TestArbitraryIndexDir_A357B17FF82D4672-001/init-core-data-001/]
   [junit4]   2> 1390857 INFO  (TEST-TestArbitraryIndexDir.testLoadNewIndexDir-seed#[A357B17FF82D4672]) [    x:collection1] o.a.s.c.JmxMonitoredMap JMX monitoring is enabled. Adding Solr mbeans to JMX Server: com.sun.jmx.mbeanserver.JmxMBeanServer@72db16ab
   [junit4]   2> 1390857 INFO  (TEST-TestArbitraryIndexDir.testLoadNewIndexDir-seed#[A357B17FF82D4672]) [    x:collection1] o.a.s.c.s.SolrSnapshotMetaDataManager Loading from snapshot metadata file...
   [junit4]   2> 1390858 INFO  (TEST-TestArbitraryIndexDir.testLoadNewIndexDir-seed#[A357B17FF82D4672]) [    x:collection1] o.a.s.c.SolrCore New index directory detected: old=null new=/x1/jenkins/jenkins-slave/workspace/Lucene-Solr-Tests-6.2/solr/build/solr-core/test/J0/temp/solr.core.TestArbitraryIndexDir_A357B17FF82D4672-001/init-core-data-001/index_temp
   [junit4]   2> 1390859 INFO  (OldIndexDirectoryCleanupThreadForCore-collection1) [    x:collection1] o.a.s.c.SolrCore Looking for old index directories to cleanup for core collection1 in /x1/jenkins/jenkins-slave/workspace/Lucene-Solr-Tests-6.2/solr/build/solr-core/test/J0/temp/solr.core.TestArbitraryIndexDir_A357B17FF82D4672-001/init-core-data-001/
   [junit4]   2> 1390859 INFO  (OldIndexDirectoryCleanupThreadForCore-collection1) [    x:collection1] o.a.s.c.DirectoryFactory Found 1 old index directories to clean-up under /x1/jenkins/jenkins-slave/workspace/Lucene-Solr-Tests-6.2/solr/build/solr-core/test/J0/temp/solr.core.TestArbitraryIndexDir_A357B17FF82D4672-001/init-core-data-001/
   [junit4]   2> 1390859 WARN  (OldIndexDirectoryCleanupThreadForCore-collection1) [    x:collection1] o.a.s.c.CachingDirectoryFactory Cannot delete directory /x1/jenkins/jenkins-slave/workspace/Lucene-Solr-Tests-6.2/solr/build/solr-core/test/J0/temp/solr.core.TestArbitraryIndexDir_A357B17FF82D4672-001/init-core-data-001/index as it is still being referenced in the cache!
   [junit4]   2> 1390859 WARN  (OldIndexDirectoryCleanupThreadForCore-collection1) [    x:collection1] o.a.s.c.DirectoryFactory Delete old index directory /x1/jenkins/jenkins-slave/workspace/Lucene-Solr-Tests-6.2/solr/build/solr-core/test/J0/temp/solr.core.TestArbitraryIndexDir_A357B17FF82D4672-001/init-core-data-001/index failed.
   [junit4]   2> 1390863 INFO  (TEST-TestArbitraryIndexDir.testLoadNewIndexDir-seed#[A357B17FF82D4672]) [    x:collection1] o.a.s.u.p.UpdateRequestProcessorChain creating updateRequestProcessorChain "dedupe"
   [junit4]   2> 1390863 INFO  (TEST-TestArbitraryIndexDir.testLoadNewIndexDir-seed#[A357B17FF82D4672]) [    x:collection1] o.a.s.u.p.UpdateRequestProcessorChain inserting DistributedUpdateProcessorFactory into updateRequestProcessorChain "dedupe"
   [junit4]   2> 1390863 INFO  (TEST-TestArbitraryIndexDir.testLoadNewIndexDir-seed#[A357B17FF82D4672]) [    x:collection1] o.a.s.u.p.UpdateRequestProcessorChain creating updateRequestProcessorChain "dedupe-allfields"
   [junit4]   2> 1390864 INFO  (TEST-TestArbitraryIndexDir.testLoadNewIndexDir-seed#[A357B17FF82D4672]) [    x:collection1] o.a.s.u.p.UpdateRequestProcessorChain inserting DistributedUpdateProcessorFactory into updateRequestProcessorChain "dedupe-allfields"
   [junit4]   2> 1390864 INFO  (TEST-TestArbitraryIndexDir.testLoadNewIndexDir-seed#[A357B17FF82D4672]) [    x:collection1] o.a.s.u.p.UpdateRequestProcessorChain creating updateRequestProcessorChain "stored_sig"
   [junit4]   2> 1390864 INFO  (TEST-TestArbitraryIndexDir.testLoadNewIndexDir-seed#[A357B17FF82D4672]) [    x:collection1] o.a.s.u.p.UpdateRequestProcessorChain inserting DistributedUpdateProcessorFactory into updateRequestProcessorChain "stored_sig"
   [junit4]   2> 1390864 INFO  (TEST-TestArbitraryIndexDir.testLoadNewIndexDir-seed#[A357B17FF82D4672]) [    x:collection1] o.a.s.u.p.UpdateRequestProcessorChain creating updateRequestProcessorChain "uniq-fields"
   [junit4]   2> 1390864 INFO  (TEST-TestArbitraryIndexDir.testLoadNewIndexDir-seed#[A357B17FF82D4672]) [    x:collection1] o.a.s.u.p.UpdateRequestProcessorChain inserting DistributedUpdateProcessorFactory into updateRequestProcessorChain "uniq-fields"
   [junit4]   2> 1390864 INFO  (TEST-TestArbitraryIndexDir.testLoadNewIndexDir-seed#[A357B17FF82D4672]) [    x:collection1] o.a.s.u.p.UpdateRequestProcessorChain creating updateRequestProcessorChain "distrib-dup-test-chain-explicit"
   [junit4]   2> 1390864 INFO  (TEST-TestArbitraryIndexDir.testLoadNewIndexDir-seed#[A357B17FF82D4672]) [    x:collection1] o.a.s.u.p.UpdateRequestProcessorChain creating updateRequestProcessorChain "distrib-dup-test-chain-implicit"
   [junit4]   2> 1390864 INFO  (TEST-TestArbitraryIndexDir.testLoadNewIndexDir-seed#[A357B17FF82D4672]) [    x:collection1] o.a.s.u.p.UpdateRequestProcessorChain inserting DistributedUpdateProcessorFactory into updateRequestProcessorChain "distrib-dup-test-chain-implicit"
   [junit4]   2> 1390864 INFO  (TEST-TestArbitraryIndexDir.testLoadNewIndexDir-seed#[A357B17FF82D4672]) [    x:collection1] o.a.s.c.SolrCore no updateRequestProcessorChain defined as default, creating implicit default
   [junit4]   2> 1390866 INFO  (TEST-TestArbitraryIndexDir.testLoadNewIndexDir-seed#[A357B17FF82D4672]) [    x:collection1] o.a.s.h.l.XMLLoader xsltCacheLifetimeSeconds=60
   [junit4]   2> 1390867 INFO  (TEST-TestArbitraryIndexDir.testLoadNewIndexDir-seed#[A357B17FF82D4672]) [    x:collection1] o.a.s.h.l.XMLLoader xsltCacheLifetimeSeconds=60
   [junit4]   2> 1390868 INFO  (TEST-TestArbitraryIndexDir.testLoadNewIndexDir-seed#[A357B17FF82D4672]) [    x:collection1] o.a.s.h.l.XMLLoader xsltCacheLifetimeSeconds=60
   [junit4]   2> 1390869 INFO  (TEST-TestArbitraryIndexDir.testLoadNewIndexDir-seed#[A357B17FF82D4672]) [    x:collection1] o.a.s.h.l.XMLLoader xsltCacheLifetimeSeconds=60
   [junit4]   2> 1390870 INFO  (TEST-TestArbitraryIndexDir.testLoadNewIndexDir-seed#[A357B17FF82D4672]) [    x:collection1] o.a.s.c.CachingDirectoryFactory return new directory for /x1/jenkins/jenkins-slave/workspace/Lucene-Solr-Tests-6.2/solr/build/solr-core/test/J0/temp/solr.core.TestArbitraryIndexDir_A357B17FF82D4672-001/init-core-data-001/index_temp
   [junit4]   2> 1390875 INFO  (TEST-TestArbitraryIndexDir.testLoadNewIndexDir-seed#[A357B17FF82D4672]) [    x:collection1] o.a.s.c.PluginBag requestHandler : 'lazy' created with startup=lazy 
   [junit4]   2> 1390877 INFO  (TEST-TestArbitraryIndexDir.testLoadNewIndexDir-seed#[A357B17FF82D4672]) [    x:collection1] o.a.s.c.RequestHandlers Registered paths: /admin/mbeans,standard,spellCheckCompRH,lazy,/update/json/docs,/admin/luke,/export,spellCheckWithWordbreak_Direct,tvrh,/get,/admin/properties,/update/json,mltrh,/admin/threads,/search-facet-def,/update/csv,/sql,/graph,/search-facet-invariants,/admin/segments,spellCheckCompRH1,/mlt,/admin/system,/replication,dismax,defaults,/config,/stream,/schema,/admin/plugins,/admin/logging,spellCheckWithWordbreak,mock,/admin/ping,/update,/admin/file,/terms,spellCheckCompRH_Direct,/debug/dump
   [junit4]   2> 1390877 INFO  (TEST-TestArbitraryIndexDir.testLoadNewIndexDir-seed#[A357B17FF82D4672]) [    x:collection1] o.a.s.c.SolrCore Using default statsCache cache: org.apache.solr.search.stats.LocalStatsCache
   [junit4]   2> 1390877 INFO  (TEST-TestArbitraryIndexDir.testLoadNewIndexDir-seed#[A357B17FF82D4672]) [    x:collection1] o.a.s.u.CommitTracker Hard AutoCommit: disabled
   [junit4]   2> 1390878 INFO  (TEST-TestArbitraryIndexDir.testLoadNewIndexDir-seed#[A357B17FF82D4672]) [    x:collection1] o.a.s.u.CommitTracker Soft AutoCommit: disabled
   [junit4]   2> 1390878 INFO  (TEST-TestArbitraryIndexDir.testLoadNewIndexDir-seed#[A357B17FF82D4672]) [    x:collection1] o.a.s.s.SolrIndexSearcher Opening [Searcher@7a7920f0[collection1] main]
   [junit4]   2> 1390879 INFO  (TEST-TestArbitraryIndexDir.testLoadNewIndexDir-seed#[A357B17FF82D4672]) [    x:collection1] o.a.s.r.RestManager Initializing RestManager with initArgs: {storageIO=org.apache.solr.rest.ManagedResourceStorage$InMemoryStorageIO}
   [junit4]   2> 1390879 INFO  (TEST-TestArbitraryIndexDir.testLoadNewIndexDir-seed#[A357B17FF82D4672]) [    x:collection1] o.a.s.r.ManagedResourceStorage Reading _rest_managed.json using InMemoryStorage
   [junit4]   2> 1390879 INFO  (TEST-TestArbitraryIndexDir.testLoadNewIndexDir-seed#[A357B17FF82D4672]) [    x:collection1] o.a.s.r.RestManager Initializing 0 registered ManagedResources
   [junit4]   2> 1390879 INFO  (TEST-TestArbitraryIndexDir.testLoadNewIndexDir-seed#[A357B17FF82D4672]) [    x:collection1] o.a.s.h.c.SpellCheckComponent Initializing spell checkers
   [junit4]   2> 1390879 INFO  (TEST-TestArbitraryIndexDir.testLoadNewIndexDir-seed#[A357B17FF82D4672]) [    x:collection1] o.a.s.s.DirectSolrSpellChecker init: {name=direct,classname=DirectSolrSpellChecker,field=lowerfilt,minQueryLength=3}
   [junit4]   2> 1390882 INFO  (TEST-TestArbitraryIndexDir.testLoadNewIndexDir-seed#[A357B17FF82D4672]) [    x:collection1] o.a.s.h.ReplicationHandler Commits will be reserved for  10000
   [junit4]   2> 1390882 INFO  (searcherExecutor-3946-thread-1-processing-x:collection1) [    x:collection1] o.a.s.h.c.SpellCheckComponent Loading spell index for spellchecker: default
   [junit4]   2> 1390882 INFO  (searcherExecutor-3946-thread-1-processing-x:collection1) [    x:collection1] o.a.s.h.c.SpellCheckComponent Loading spell index for spellchecker: direct
   [junit4]   2> 1390883 INFO  (searcherExecutor-3946-thread-1-processing-x:collection1) [    x:collection1] o.a.s.h.c.SpellCheckComponent Loading spell index for spellchecker: wordbreak
   [junit4]   2> 1390883 INFO  (searcherExecutor-3946-thread-1-processing-x:collection1) [    x:collection1] o.a.s.h.c.SpellCheckComponent Loading spell index for spellchecker: multipleFields
   [junit4]   2> 1390883 INFO  (searcherExecutor-3946-thread-1-processing-x:collection1) [    x:collection1] o.a.s.h.c.SpellCheckComponent Loading spell index for spellchecker: jarowinkler
   [junit4]   2> 1390883 INFO  (searcherExecutor-3946-thread-1-processing-x:collection1) [    x:collection1] o.a.s.h.c.SpellCheckComponent Loading spell index for spellchecker: external
   [junit4]   2> 1390883 INFO  (searcherExecutor-3946-thread-1-processing-x:collection1) [    x:collection1] o.a.s.h.c.SpellCheckComponent Loading spell index for spellchecker: freq
   [junit4]   2> 1390883 INFO  (TEST-TestArbitraryIndexDir.testLoadNewIndexDir-seed#[A357B17FF82D4672]) [    x:collection1] o.a.s.u.DefaultSolrCoreState Closing old IndexWriter... core=collection1
   [junit4]   2> 1390883 INFO  (searcherExecutor-3946-thread-1-processing-x:collection1) [    x:collection1] o.a.s.h.c.SpellCheckComponent Loading spell index for spellchecker: fqcn
   [junit4]   2> 1390884 INFO  (searcherExecutor-3946-thread-1-processing-x:collection1) [    x:collection1] o.a.s.h.c.SpellCheckComponent Loading spell index for spellchecker: perDict
   [junit4]   2> 1390884 INFO  (TEST-TestArbitraryIndexDir.testLoadNewIndexDir-seed#[A357B17FF82D4672]) [    x:collection1] o.a.s.u.RandomMergePolicy RandomMergePolicy wrapping class org.apache.lucene.index.LogByteSizeMergePolicy: [LogByteSizeMergePolicy: minMergeSize=1677721, mergeFactor=26, maxMergeSize=2147483648, maxMergeSizeForForcedMerge=9223372036854775807, calibrateSizeByDeletes=false, maxMergeDocs=2147483647, maxCFSSegmentSizeMB=8.796093022207999E12, noCFSRatio=0.7817022828165635]
   [junit4]   2> 1390885 INFO  (searcherExecutor-3946-thread-1-processing-x:collection1) [    x:collection1] o.a.s.c.SolrCore [collection1] Registered new searcher Searcher@7a7920f0[collection1] main{ExitableDirectoryReader(UninvertingDirectoryReader(Uninverting(_0(6.2.0):C1)))}
   [junit4]   2> 1390886 INFO  (TEST-TestArbitraryIndexDir.testLoadNewIndexDir-seed#[A357B17FF82D4672]) [    x:collection1] o.a.s.c.SolrDeletionPolicy SolrDeletionPolicy.onInit: commits: num=1
   [junit4]   2> 	commit{dir=MockDirectoryWrapper(SimpleFSDirectory@/x1/jenkins/jenkins-slave/workspace/Lucene-Solr-Tests-6.2/solr/build/solr-core/test/J0/temp/solr.core.TestArbitraryIndexDir_A357B17FF82D4672-001/init-core-data-001/index_temp lockFactory=org.apache.lucene.store.SingleInstanceLockFactory@74caf99d),segFN=segments_1,generation=1}
   [junit4]   2> 1390886 INFO  (TEST-TestArbitraryIndexDir.testLoadNewIndexDir-seed#[A357B17FF82D4672]) [    x:collection1] o.a.s.c.SolrDeletionPolicy newest commit generation = 1
   [junit4]   2> 1390886 INFO  (TEST-TestArbitraryIndexDir.testLoadNewIndexDir-seed#[A357B17FF82D4672]) [    x:collection1] o.a.s.u.DefaultSolrCoreState New IndexWriter is ready to be used.
   [junit4]   2> 1390888 INFO  (TEST-TestArbitraryIndexDir.testLoadNewIndexDir-seed#[A357B17FF82D4672]) [    x:collection1] o.a.s.s.SolrIndexSearcher Opening [Searcher@1dbc8bbb[collection1] main]
   [junit4]   2> 1390888 INFO  (TEST-TestArbitraryIndexDir.testLoadNewIndexDir-seed#[A357B17FF82D4672]) [    x:collection1] o.a.s.c.CoreContainer replacing core: collection1
   [junit4]   2> 1390888 INFO  (TEST-TestArbitraryIndexDir.testLoadNewIndexDir-seed#[A357B17FF82D4672]) [    x:collection1] o.a.s.c.SolrCore [collection1]  CLOSING SolrCore org.apache.solr.core.SolrCore@389c87e5
   [junit4]   2> 1390889 INFO  (TEST-TestArbitraryIndexDir.testLoadNewIndexDir-seed#[A357B17FF82D4672]) [    x:collection1] o.a.s.u.DirectUpdateHandler2 closing DirectUpdateHandler2{commits=1,autocommits=0,soft autocommits=0,optimizes=0,rollbacks=0,expungeDeletes=0,docsPending=0,adds=0,deletesById=0,deletesByQuery=0,errors=0,cumulative_adds=1,cumulative_deletesById=0,cumulative_deletesByQuery=0,cumulative_errors=0}
   [junit4]   2> 1390889 INFO  (TEST-TestArbitraryIndexDir.testLoadNewIndexDir-seed#[A357B17FF82D4672]) [    x:collection1] o.a.s.c.SolrCore [collection1] Closing main searcher on request.
   [junit4]   2> 1390896 INFO  (TEST-TestArbitraryIndexDir.testLoadNewIndexDir-seed#[A357B17FF82D4672]) [    x:collection1] o.a.s.c.S.Request [collection1]  webapp=null path=null params={q=id:2&qt=standard&start=0&rows=20&version=2.2} hits=0 status=0 QTime=0
   [junit4]   2> 1390897 ERROR (TEST-TestArbitraryIndexDir.testLoadNewIndexDir-seed#[A357B17FF82D4672]) [    x:collection1] o.a.s.SolrTestCaseJ4 REQUEST FAILED: xpath=*[count(//doc)=1]
   [junit4]   2> 	xml response was: <?xml version="1.0" encoding="UTF-8"?>
   [junit4]   2> <response>
   [junit4]   2> <lst name="responseHeader"><int name="status">0</int><int name="QTime">0</int></lst><result name="response" numFound="0" start="0"></result>
   [junit4]   2> </response>
   [junit4]   2> 
   [junit4]   2> 	request was:q=id:2&qt=standard&start=0&rows=20&version=2.2
   [junit4]   2> 1390897 ERROR (TEST-TestArbitraryIndexDir.testLoadNewIndexDir-seed#[A357B17FF82D4672]) [    x:collection1] o.a.s.SolrTestCaseJ4 REQUEST FAILED: q=id:2&qt=standard&start=0&rows=20&version=2.2:java.lang.RuntimeException: REQUEST FAILED: xpath=*[count(//doc)=1]
   [junit4]   2> 	xml response was: <?xml version="1.0" encoding="UTF-8"?>
   [junit4]   2> <response>
   [junit4]   2> <lst name="responseHeader"><int name="status">0</int><int name="QTime">0</int></lst><result name="response" numFound="0" start="0"></result>
   [junit4]   2> </response>
   [junit4]   2> 
   [junit4]   2> 	request was:q=id:2&qt=standard&start=0&rows=20&version=2.2
   [junit4]   2> 	at org.apache.solr.SolrTestCaseJ4.assertQ(SolrTestCaseJ4.java:776)
   [junit4]   2> 	at org.apache.solr.core.TestArbitraryIndexDir.testLoadNewIndexDir(TestArbitraryIndexDir.java:107)
   [junit4]   2> 	at sun.reflect.NativeMethodAccessorImpl.invoke0(Native Method)
   [junit4]   2> 	at sun.reflect.NativeMethodAccessorImpl.invoke(NativeMethodAccessorImpl.java:62)
   [junit4]   2> 	at sun.reflect.DelegatingMethodAccessorImpl.invoke(DelegatingMethodAccessorImpl.java:43)
   [junit4]   2> 	at java.lang.reflect.Method.invoke(Method.java:498)
   [junit4]   2> 	at com.carrotsearch.randomizedtesting.RandomizedRunner.invoke(RandomizedRunner.java:1764)
   [junit4]   2> 	at com.carrotsearch.randomizedtesting.RandomizedRunner$8.evaluate(RandomizedRunner.java:871)
   [junit4]   2> 	at com.carrotsearch.randomizedtesting.RandomizedRunner$9.evaluate(RandomizedRunner.java:907)
   [junit4]   2> 	at com.carrotsearch.randomizedtesting.RandomizedRunner$10.evaluate(RandomizedRunner.java:921)
   [junit4]   2> 	at com.carrotsearch.randomizedtesting.rules.SystemPropertiesRestoreRule$1.evaluate(SystemPropertiesRestoreRule.java:57)
   [junit4]   2> 	at com.carrotsearch.randomizedtesting.rules.SystemPropertiesRestoreRule$1.evaluate(SystemPropertiesRestoreRule.java:57)
   [junit4]   2> 	at org.apache.lucene.util.TestRuleSetupTeardownChained$1.evaluate(TestRuleSetupTeardownChained.java:49)
   [junit4]   2> 	at org.apache.lucene.util.AbstractBeforeAfterRule$1.evaluate(AbstractBeforeAfterRule.java:45)
   [junit4]   2> 	at org.apache.lucene.util.TestRuleThreadAndTestName$1.evaluate(TestRuleThreadAndTestName.java:48)
   [junit4]   2> 	at org.apache.lucene.util.TestRuleIgnoreAfterMaxFailures$1.evaluate(TestRuleIgnoreAfterMaxFailures.java:64)
   [junit4]   2> 	at org.apache.lucene.util.TestRuleMarkFailure$1.evaluate(TestRuleMarkFailure.java:47)
   [junit4]   2> 	at com.carrotsearch.randomizedtesting.rules.StatementAdapter.evaluate(StatementAdapter.java:36)
   [junit4]   2> 	at com.carrotsearch.randomizedtesting.ThreadLeakControl$StatementRunner.run(ThreadLeakControl.java:367)
   [junit4]   2> 	at com.carrotsearch.randomizedtesting.ThreadLeakControl.forkTimeoutingTask(ThreadLeakControl.java:809)
   [junit4]   2> 	at com.carrotsearch.randomizedtesting.ThreadLeakControl$3.evaluate(ThreadLeakControl.java:460)
   [junit4]   2> 	at com.carrotsearch.randomizedtesting.RandomizedRunner.runSingleTest(RandomizedRunner.java:880)
   [junit4]   2> 	at com.carrotsearch.randomizedtesting.RandomizedRunner$5.evaluate(RandomizedRunner.java:781)
   [junit4]   2> 	at com.carrotsearch.randomizedtesting.RandomizedRunner$6.evaluate(RandomizedRunner.java:816)
   [junit4]   2> 	at com.carrotsearch.randomizedtesting.RandomizedRunner$7.evaluate(RandomizedRunner.java:827)
   [junit4]   2> 	at com.carrotsearch.randomizedtesting.rules.StatementAdapter.evaluate(StatementAdapter.java:36)
   [junit4]   2> 	at com.carrotsearch.randomizedtesting.rules.SystemPropertiesRestoreRule$1.evaluate(SystemPropertiesRestoreRule.java:57)
   [junit4]   2> 	at org.apache.lucene.util.AbstractBeforeAfterRule$1.evaluate(AbstractBeforeAfterRule.java:45)
   [junit4]   2> 	at com.carrotsearch.randomizedtesting.rules.StatementAdapter.evaluate(StatementAdapter.java:36)
   [junit4]   2> 	at org.apache.lucene.util.TestRuleStoreClassName$1.evaluate(TestRuleStoreClassName.java:41)
   [junit4]   2> 	at com.carrotsearch.randomizedtesting.rules.NoShadowingOrOverridesOnMethodsRule$1.evaluate(NoShadowingOrOverridesOnMethodsRule.java:40)
   [junit4]   2> 	at com.carrotsearch.randomizedtesting.rules.NoShadowingOrOverridesOnMethodsRule$1.evaluate(NoShadowingOrOverridesOnMethodsRule.java:40)
   [junit4]   2> 	at com.carrotsearch.randomizedtesting.rules.StatementAdapter.evaluate(StatementAdapter.java:36)
   [junit4]   2> 	at com.carrotsearch.randomizedtesting.rules.StatementAdapter.evaluate(StatementAdapter.java:36)
   [junit4]   2> 	at com.carrotsearch.randomizedtesting.rules.StatementAdapter.evaluate(StatementAdapter.java:36)
   [junit4]   2> 	at org.apache.lucene.util.TestRuleAssertionsRequired$1.evaluate(TestRuleAssertionsRequired.java:53)
   [junit4]   2> 	at org.apache.lucene.util.TestRuleMarkFailure$1.evaluate(TestRuleMarkFailure.java:47)
   [junit4]   2> 	at org.apache.lucene.util.TestRuleIgnoreAfterMaxFailures$1.evaluate(TestRuleIgnoreAfterMaxFailures.java:64)
   [junit4]   2> 	at org.apache.lucene.util.TestRuleIgnoreTestSuites$1.evaluate(TestRuleIgnoreTestSuites.java:54)
   [junit4]   2> 	at com.carrotsearch.randomizedtesting.rules.StatementAdapter.evaluate(StatementAdapter.java:36)
   [junit4]   2> 	at com.carrotsearch.randomizedtesting.ThreadLeakControl$StatementRunner.run(ThreadLeakControl.java:367)
   [junit4]   2> 	at java.lang.Thread.run(Thread.java:745)
   [junit4]   2> 
   [junit4]   2> 1390898 INFO  (TEST-TestArbitraryIndexDir.testLoadNewIndexDir-seed#[A357B17FF82D4672]) [    x:collection1] o.a.s.SolrTestCaseJ4 ###Ending testLoadNewIndexDir
   [junit4]   2> 1390898 INFO  (searcherExecutor-3946-thread-1-processing-x:collection1) [    x:collection1] o.a.s.c.SolrCore [collection1] Registered new searcher Searcher@1dbc8bbb[collection1] main{ExitableDirectoryReader(UninvertingDirectoryReader(Uninverting(_0(6.2.0):c1)))}
   [junit4]   2> NOTE: reproduce with: ant test  -Dtestcase=TestArbitraryIndexDir -Dtests.method=testLoadNewIndexDir -Dtests.seed=A357B17FF82D4672 -Dtests.multiplier=2 -Dtests.slow=true -Dtests.locale=sr-Latn -Dtests.timezone=Antarctica/Mawson -Dtests.asserts=true -Dtests.file.encoding=UTF-8
   [junit4] ERROR   0.81s J0 | TestArbitraryIndexDir.testLoadNewIndexDir <<<
   [junit4]    > Throwable #1: java.lang.RuntimeException: Exception during query
   [junit4]    > 	at __randomizedtesting.SeedInfo.seed([A357B17FF82D4672:4A0D0A4766B4D6DA]:0)
   [junit4]    > 	at org.apache.solr.SolrTestCaseJ4.assertQ(SolrTestCaseJ4.java:783)
   [junit4]    > 	at org.apache.solr.core.TestArbitraryIndexDir.testLoadNewIndexDir(TestArbitraryIndexDir.java:107)
   [junit4]    > 	at java.lang.Thread.run(Thread.java:745)
   [junit4]    > Caused by: java.lang.RuntimeException: REQUEST FAILED: xpath=*[count(//doc)=1]
   [junit4]    > 	xml response was: <?xml version="1.0" encoding="UTF-8"?>
   [junit4]    > <response>
   [junit4]    > <lst name="responseHeader"><int name="status">0</int><int name="QTime">0</int></lst><result name="response" numFound="0" start="0"></result>
   [junit4]    > </response>
   [junit4]    > 	request was:q=id:2&qt=standard&start=0&rows=20&version=2.2
   [junit4]    > 	at org.apache.solr.SolrTestCaseJ4.assertQ(SolrTestCaseJ4.java:776)
   [junit4]    > 	... 41 more
   [junit4]   2> 1390901 INFO  (SUITE-TestArbitraryIndexDir-seed#[A357B17FF82D4672]-worker) [    x:collection1] o.a.s.SolrTestCaseJ4 ###deleteCore
   [junit4]   2> 1390901 INFO  (SUITE-TestArbitraryIndexDir-seed#[A357B17FF82D4672]-worker) [    x:collection1] o.a.s.c.CoreContainer Shutting down CoreContainer instance=111523944
   [junit4]   2> 1390902 INFO  (coreCloseExecutor-3950-thread-1-processing-x:collection1) [    x:collection1] o.a.s.c.SolrCore [collection1]  CLOSING SolrCore org.apache.solr.core.SolrCore@18018b8a
   [junit4]   2> 1390902 INFO  (coreCloseExecutor-3950-thread-1-processing-x:collection1) [    x:collection1] o.a.s.u.DirectUpdateHandler2 closing DirectUpdateHandler2{commits=0,autocommits=0,soft autocommits=0,optimizes=0,rollbacks=0,expungeDeletes=0,docsPending=0,adds=0,deletesById=0,deletesByQuery=0,errors=0,cumulative_adds=0,cumulative_deletesById=0,cumulative_deletesByQuery=0,cumulative_errors=0}
   [junit4]   2> 1390902 INFO  (coreCloseExecutor-3950-thread-1-processing-x:collection1) [    x:collection1] o.a.s.u.SolrCoreState Closing SolrCoreState
   [junit4]   2> 1390902 INFO  (coreCloseExecutor-3950-thread-1-processing-x:collection1) [    x:collection1] o.a.s.u.DefaultSolrCoreState SolrCoreState ref count has reached 0 - closing IndexWriter
   [junit4]   2> 1390902 INFO  (coreCloseExecutor-3950-thread-1-processing-x:collection1) [    x:collection1] o.a.s.u.DefaultSolrCoreState closing IndexWriter with IndexWriterCloser
   [junit4]   2> 1390914 INFO  (coreCloseExecutor-3950-thread-1-processing-x:collection1) [    x:collection1] o.a.s.c.SolrCore [collection1] Closing main searcher on request.
   [junit4]   2> 1390971 INFO  (coreCloseExecutor-3950-thread-1-processing-x:collection1) [    x:collection1] o.a.s.c.CachingDirectoryFactory Closing MockFSDirectoryFactory - 4 directories currently being tracked
   [junit4]   2> 1390971 INFO  (coreCloseExecutor-3950-thread-1-processing-x:collection1) [    x:collection1] o.a.s.c.CachingDirectoryFactory looking to close /x1/jenkins/jenkins-slave/workspace/Lucene-Solr-Tests-6.2/solr/build/solr-core/test/J0/temp/solr.core.TestArbitraryIndexDir_A357B17FF82D4672-001/init-core-data-001/index [CachedDir<<refCount=0;path=/x1/jenkins/jenkins-slave/workspace/Lucene-Solr-Tests-6.2/solr/build/solr-core/test/J0/temp/solr.core.TestArbitraryIndexDir_A357B17FF82D4672-001/init-core-data-001/index;done=false>>]
   [junit4]   2> 1390971 INFO  (coreCloseExecutor-3950-thread-1-processing-x:collection1) [    x:collection1] o.a.s.c.CachingDirectoryFactory Closing directory, CoreContainer#isShutdown=true
   [junit4]   2> 1390971 INFO  (coreCloseExecutor-3950-thread-1-processing-x:collection1) [    x:collection1] o.a.s.c.CachingDirectoryFactory Closing directory: /x1/jenkins/jenkins-slave/workspace/Lucene-Solr-Tests-6.2/solr/build/solr-core/test/J0/temp/solr.core.TestArbitraryIndexDir_A357B17FF82D4672-001/init-core-data-001/index
   [junit4]   2> 1391029 INFO  (coreCloseExecutor-3950-thread-1-processing-x:collection1) [    x:collection1] o.a.s.c.CachingDirectoryFactory looking to close /x1/jenkins/jenkins-slave/workspace/Lucene-Solr-Tests-6.2/solr/build/solr-core/test/J0/temp/solr.core.TestArbitraryIndexDir_A357B17FF82D4672-001/init-core-data-001 [CachedDir<<refCount=0;path=/x1/jenkins/jenkins-slave/workspace/Lucene-Solr-Tests-6.2/solr/build/solr-core/test/J0/temp/solr.core.TestArbitraryIndexDir_A357B17FF82D4672-001/init-core-data-001;done=false>>]
   [junit4]   2> 1391029 INFO  (coreCloseExecutor-3950-thread-1-processing-x:collection1) [    x:collection1] o.a.s.c.CachingDirectoryFactory Closing directory, CoreContainer#isShutdown=true
   [junit4]   2> 1391029 INFO  (coreCloseExecutor-3950-thread-1-processing-x:collection1) [    x:collection1] o.a.s.c.CachingDirectoryFactory Closing directory: /x1/jenkins/jenkins-slave/workspace/Lucene-Solr-Tests-6.2/solr/build/solr-core/test/J0/temp/solr.core.TestArbitraryIndexDir_A357B17FF82D4672-001/init-core-data-001
   [junit4]   2> 1391029 INFO  (coreCloseExecutor-3950-thread-1-processing-x:collection1) [    x:collection1] o.a.s.c.CachingDirectoryFactory looking to close /x1/jenkins/jenkins-slave/workspace/Lucene-Solr-Tests-6.2/solr/build/solr-core/test/J0/temp/solr.core.TestArbitraryIndexDir_A357B17FF82D4672-001/init-core-data-001/index_temp [CachedDir<<refCount=0;path=/x1/jenkins/jenkins-slave/workspace/Lucene-Solr-Tests-6.2/solr/build/solr-core/test/J0/temp/solr.core.TestArbitraryIndexDir_A357B17FF82D4672-001/init-core-data-001/index_temp;done=false>>]
   [junit4]   2> 1391029 INFO  (coreCloseExecutor-3950-thread-1-processing-x:collection1) [    x:collection1] o.a.s.c.CachingDirectoryFactory Closing directory, CoreContainer#isShutdown=true
   [junit4]   2> 1391029 INFO  (coreCloseExecutor-3950-thread-1-processing-x:collection1) [    x:collection1] o.a.s.c.CachingDirectoryFactory Closing directory: /x1/jenkins/jenkins-slave/workspace/Lucene-Solr-Tests-6.2/solr/build/solr-core/test/J0/temp/solr.core.TestArbitraryIndexDir_A357B17FF82D4672-001/init-core-data-001/index_temp
   [junit4]   2> 1391036 INFO  (coreCloseExecutor-3950-thread-1-processing-x:collection1) [    x:collection1] o.a.s.c.CachingDirectoryFactory looking to close /x1/jenkins/jenkins-slave/workspace/Lucene-Solr-Tests-6.2/solr/build/solr-core/test/J0/temp/solr.core.TestArbitraryIndexDir_A357B17FF82D4672-001/init-core-data-001/snapshot_metadata [CachedDir<<refCount=0;path=/x1/jenkins/jenkins-slave/workspace/Lucene-Solr-Tests-6.2/solr/build/solr-core/test/J0/temp/solr.core.TestArbitraryIndexDir_A357B17FF82D4672-001/init-core-data-001/snapshot_metadata;done=false>>]
   [junit4]   2> 1391036 INFO  (coreCloseExecutor-3950-thread-1-processing-x:collection1) [    x:collection1] o.a.s.c.CachingDirectoryFactory Closing directory, CoreContainer#isShutdown=true
   [junit4]   2> 1391036 INFO  (coreCloseExecutor-3950-thread-1-processing-x:collection1) [    x:collection1] o.a.s.c.CachingDirectoryFactory Closing directory: /x1/jenkins/jenkins-slave/workspace/Lucene-Solr-Tests-6.2/solr/build/solr-core/test/J0/temp/solr.core.TestArbitraryIndexDir_A357B17FF82D4672-001/init-core-data-001/snapshot_metadata
   [junit4]   2> NOTE: leaving temporary files on disk at: /x1/jenkins/jenkins-slave/workspace/Lucene-Solr-Tests-6.2/solr/build/solr-core/test/J0/temp/solr.core.TestArbitraryIndexDir_A357B17FF82D4672-001
   [junit4]   2> Aug 24, 2016 11:00:04 PM com.carrotsearch.randomizedtesting.ThreadLeakControl checkThreadLeaks
   [junit4]   2> WARNING: Will linger awaiting termination of 1 leaked thread(s).
   [junit4]   2> NOTE: test params are: codec=Asserting(Lucene62): {name=PostingsFormat(name=Direct), id=PostingsFormat(name=Direct)}, docValues:{}, maxPointsInLeafNode=1596, maxMBSortInHeap=6.520559792650511, sim=ClassicSimilarity, locale=sr-Latn, timezone=Antarctica/Mawson
   [junit4]   2> NOTE: Linux 3.13.0-85-generic amd64/Oracle Corporation 1.8.0_102 (64-bit)/cpus=4,threads=1,free=235241728,total=533725184
   [junit4]   2> NOTE: All tests run in this JVM: [TestCSVLoader, TestCustomSort, TestSSLRandomization, TestFoldingMultitermQuery, TestDistributedStatsComponentCardinality, HttpPartitionTest, DistributedQueryComponentOptimizationTest, DataDrivenBlockJoinTest, OverseerTaskQueueTest, DistributedFacetPivotSmallTest, ShardSplitTest, HLLUtilTest, DateRangeFieldTest, PathHierarchyTokenizerFactoryTest, TestNumericTerms32, TestSolrConfigHandlerConcurrent, PeerSyncTest, TestOmitPositions, HdfsRecoverLeaseTest, HdfsUnloadDistributedZkTest, TestComponentsName, TestCloudInspectUtil, TestSlowCompositeReaderWrapper, SyncSliceTest, TestRandomDVFaceting, TestChildDocTransformer, RequiredFieldsTest, ReturnFieldsTest, TestUseDocValuesAsStored, TestConfigSets, TestSmileRequest, OutOfBoxZkACLAndCredentialsProvidersTest, DistributedQueueTest, DefaultValueUpdateProcessorTest, TestMaxScoreQueryParser, AsyncCallRequestStatusResponseTest, JsonLoaderTest, TestIntervalFaceting, RankQueryTest, AtomicUpdatesTest, SpatialRPTFieldTypeTest, TestMergePolicyConfig, UUIDFieldTest, TestLuceneMatchVersion, TestSerializedLuceneMatchVersion, TestLRUCache, DisMaxRequestHandlerTest, TestBadConfig, SOLR749Test, TestRandomFlRTGCloud, SystemInfoHandlerTest, BasicAuthIntegrationTest, ActionThrottleTest, TestConfigSetsAPIZkFailure, DistributedQueryElevationComponentTest, SolrRequestParserTest, FileBasedSpellCheckerTest, CollectionsAPISolrJTest, OverseerModifyCollectionTest, TestRemoteStreaming, TestValueSourceCache, TestCollectionAPI, DistributedSpellCheckComponentTest, SolrCoreTest, TestDownShardTolerantSearch, BlobRepositoryCloudTest, TestLazyCores, BlockJoinFacetSimpleTest, CacheHeaderTest, TestFunctionQuery, TestHdfsBackupRestoreCore, HdfsDirectoryFactoryTest, TestGraphTermsQParserPlugin, BadCopyFieldTest, ReplaceNodeTest, OutputWriterTest, AddBlockUpdateTest, CopyFieldTest, TestRawTransformer, TestHighlightDedupGrouping, TestFieldTypeCollectionResource, TestRTGBase, TestScoreJoinQPScore, TestCrossCoreJoin, TestInfoStreamLogging, TestSolrCloudWithDelegationTokens, URLClassifyProcessorTest, TestBinaryField, TestHighFrequencyDictionaryFactory, TestRTimerTree, PrimUtilsTest, XsltUpdateRequestHandlerTest, TestCopyFieldCollectionResource, TestStressLucene, TestBlendedInfixSuggestions, CdcrRequestHandlerTest, CdcrBootstrapTest, TestSubQueryTransformerDistrib, PreAnalyzedUpdateProcessorTest, TestDistributedSearch, DirectUpdateHandlerOptimizeTest, DocValuesMultiTest, DistanceFunctionTest, DebugComponentTest, LukeRequestHandlerTest, DocumentAnalysisRequestHandlerTest, TestArbitraryIndexDir]
   [junit4] Completed [382/629 (1!)] on J0 in 1.25s, 1 test, 1 error <<< FAILURES!

[...truncated 60910 lines...]



Mime
View raw message