lucene-dev mailing list archives

Site index · List index
Message view « Date » · « Thread »
Top « Date » · « Thread »
From Apache Jenkins Server <jenk...@builds.apache.org>
Subject [JENKINS] Lucene-Solr-Tests-6.x - Build # 374 - Unstable
Date Fri, 05 Aug 2016 07:12:13 GMT
Build: https://builds.apache.org/job/Lucene-Solr-Tests-6.x/374/

1 tests failed.
FAILED:  junit.framework.TestSuite.org.apache.solr.util.TestSolrCLIRunExample

Error Message:
ObjectTracker found 4 object(s) that were not released!!! [MockDirectoryWrapper, MockDirectoryWrapper, MockDirectoryWrapper, SolrCore]

Stack Trace:
java.lang.AssertionError: ObjectTracker found 4 object(s) that were not released!!! [MockDirectoryWrapper, MockDirectoryWrapper, MockDirectoryWrapper, SolrCore]
	at __randomizedtesting.SeedInfo.seed([3F356DF6A68E3236]:0)
	at org.junit.Assert.fail(Assert.java:93)
	at org.junit.Assert.assertTrue(Assert.java:43)
	at org.junit.Assert.assertNull(Assert.java:551)
	at org.apache.solr.SolrTestCaseJ4.teardownTestCases(SolrTestCaseJ4.java:258)
	at sun.reflect.GeneratedMethodAccessor23.invoke(Unknown Source)
	at sun.reflect.DelegatingMethodAccessorImpl.invoke(DelegatingMethodAccessorImpl.java:43)
	at java.lang.reflect.Method.invoke(Method.java:498)
	at com.carrotsearch.randomizedtesting.RandomizedRunner.invoke(RandomizedRunner.java:1764)
	at com.carrotsearch.randomizedtesting.RandomizedRunner$7.evaluate(RandomizedRunner.java:834)
	at com.carrotsearch.randomizedtesting.rules.StatementAdapter.evaluate(StatementAdapter.java:36)
	at com.carrotsearch.randomizedtesting.rules.SystemPropertiesRestoreRule$1.evaluate(SystemPropertiesRestoreRule.java:57)
	at org.apache.lucene.util.AbstractBeforeAfterRule$1.evaluate(AbstractBeforeAfterRule.java:45)
	at com.carrotsearch.randomizedtesting.rules.StatementAdapter.evaluate(StatementAdapter.java:36)
	at org.apache.lucene.util.TestRuleStoreClassName$1.evaluate(TestRuleStoreClassName.java:41)
	at com.carrotsearch.randomizedtesting.rules.NoShadowingOrOverridesOnMethodsRule$1.evaluate(NoShadowingOrOverridesOnMethodsRule.java:40)
	at com.carrotsearch.randomizedtesting.rules.NoShadowingOrOverridesOnMethodsRule$1.evaluate(NoShadowingOrOverridesOnMethodsRule.java:40)
	at com.carrotsearch.randomizedtesting.rules.StatementAdapter.evaluate(StatementAdapter.java:36)
	at com.carrotsearch.randomizedtesting.rules.StatementAdapter.evaluate(StatementAdapter.java:36)
	at com.carrotsearch.randomizedtesting.rules.StatementAdapter.evaluate(StatementAdapter.java:36)
	at org.apache.lucene.util.TestRuleAssertionsRequired$1.evaluate(TestRuleAssertionsRequired.java:53)
	at org.apache.lucene.util.TestRuleMarkFailure$1.evaluate(TestRuleMarkFailure.java:47)
	at org.apache.lucene.util.TestRuleIgnoreAfterMaxFailures$1.evaluate(TestRuleIgnoreAfterMaxFailures.java:64)
	at org.apache.lucene.util.TestRuleIgnoreTestSuites$1.evaluate(TestRuleIgnoreTestSuites.java:54)
	at com.carrotsearch.randomizedtesting.rules.StatementAdapter.evaluate(StatementAdapter.java:36)
	at com.carrotsearch.randomizedtesting.ThreadLeakControl$StatementRunner.run(ThreadLeakControl.java:367)
	at java.lang.Thread.run(Thread.java:745)




Build Log:
[...truncated 11060 lines...]
   [junit4] Suite: org.apache.solr.util.TestSolrCLIRunExample
   [junit4]   2> Creating dataDir: /x1/jenkins/jenkins-slave/workspace/Lucene-Solr-Tests-6.x/solr/build/solr-core/test/J1/temp/solr.util.TestSolrCLIRunExample_3F356DF6A68E3236-001/init-core-data-001
   [junit4]   2> 384503 INFO  (SUITE-TestSolrCLIRunExample-seed#[3F356DF6A68E3236]-worker) [    ] o.a.s.SolrTestCaseJ4 Randomized ssl (false) and clientAuth (false) via: @org.apache.solr.SolrTestCaseJ4$SuppressSSL(bugUrl=https://issues.apache.org/jira/browse/SOLR-5776)
   [junit4]   2> 384504 INFO  (TEST-TestSolrCLIRunExample.testSchemalessExample-seed#[3F356DF6A68E3236]) [    ] o.a.s.SolrTestCaseJ4 ###Starting testSchemalessExample
   [junit4]   2> 384505 INFO  (TEST-TestSolrCLIRunExample.testSchemalessExample-seed#[3F356DF6A68E3236]) [    ] o.a.s.u.TestSolrCLIRunExample Selected port 46271 to start schemaless example Solr instance on ...
   [junit4]   2> 384540 INFO  (Thread-754) [    ] o.e.j.s.Server jetty-9.3.8.v20160314
   [junit4]   2> 384555 INFO  (Thread-754) [    ] o.e.j.s.h.ContextHandler Started o.e.j.s.ServletContextHandler@797d62b4{/solr,null,AVAILABLE}
   [junit4]   2> 384556 INFO  (Thread-754) [    ] o.e.j.s.ServerConnector Started ServerConnector@7ae9251{HTTP/1.1,[http/1.1]}{127.0.0.1:46271}
   [junit4]   2> 384556 INFO  (Thread-754) [    ] o.e.j.s.Server Started @387015ms
   [junit4]   2> 384556 INFO  (Thread-754) [    ] o.a.s.c.s.e.JettySolrRunner Jetty properties: {hostContext=/solr, hostPort=46271}
   [junit4]   2> 384556 INFO  (Thread-754) [    ] o.a.s.s.SolrDispatchFilter SolrDispatchFilter.init(): sun.misc.Launcher$AppClassLoader@73d16e93
   [junit4]   2> 384556 INFO  (Thread-754) [    ] o.a.s.c.SolrResourceLoader new SolrResourceLoader for directory: '/x1/jenkins/jenkins-slave/workspace/Lucene-Solr-Tests-6.x/solr/build/solr-core/test/J1/temp/solr.util.TestSolrCLIRunExample_3F356DF6A68E3236-001/tempDir-001/schemaless/solr'
   [junit4]   2> 384557 INFO  (Thread-754) [    ] o.a.s.c.SolrResourceLoader JNDI not configured for solr (NoInitialContextEx)
   [junit4]   2> 384557 INFO  (Thread-754) [    ] o.a.s.c.SolrResourceLoader solr home defaulted to 'solr/' (could not find system property or JNDI)
   [junit4]   2> 384561 INFO  (Thread-754) [    ] o.a.s.c.SolrXmlConfig Loading container configuration from /x1/jenkins/jenkins-slave/workspace/Lucene-Solr-Tests-6.x/solr/build/solr-core/test/J1/temp/solr.util.TestSolrCLIRunExample_3F356DF6A68E3236-001/tempDir-001/schemaless/solr/solr.xml
   [junit4]   2> 384573 ERROR (qtp1338609260-3087) [    ] o.a.s.s.SolrDispatchFilter Error processing the request. CoreContainer is either not initialized or shutting down.
   [junit4]   2> 384573 WARN  (qtp1338609260-3087) [    ] o.e.j.s.ServletHandler /solr/admin/info/system
   [junit4]   2> org.apache.solr.common.SolrException: Error processing the request. CoreContainer is either not initialized or shutting down.
   [junit4]   2> 	at org.apache.solr.servlet.SolrDispatchFilter.doFilter(SolrDispatchFilter.java:217)
   [junit4]   2> 	at org.apache.solr.servlet.SolrDispatchFilter.doFilter(SolrDispatchFilter.java:208)
   [junit4]   2> 	at org.eclipse.jetty.servlet.ServletHandler$CachedChain.doFilter(ServletHandler.java:1676)
   [junit4]   2> 	at org.apache.solr.client.solrj.embedded.JettySolrRunner$DebugFilter.doFilter(JettySolrRunner.java:108)
   [junit4]   2> 	at org.eclipse.jetty.servlet.ServletHandler$CachedChain.doFilter(ServletHandler.java:1676)
   [junit4]   2> 	at org.eclipse.jetty.servlet.ServletHandler.doHandle(ServletHandler.java:581)
   [junit4]   2> 	at org.eclipse.jetty.server.session.SessionHandler.doHandle(SessionHandler.java:224)
   [junit4]   2> 	at org.eclipse.jetty.server.handler.ContextHandler.doHandle(ContextHandler.java:1160)
   [junit4]   2> 	at org.eclipse.jetty.servlet.ServletHandler.doScope(ServletHandler.java:511)
   [junit4]   2> 	at org.eclipse.jetty.server.session.SessionHandler.doScope(SessionHandler.java:185)
   [junit4]   2> 	at org.eclipse.jetty.server.handler.ContextHandler.doScope(ContextHandler.java:1092)
   [junit4]   2> 	at org.eclipse.jetty.server.handler.ScopedHandler.handle(ScopedHandler.java:141)
   [junit4]   2> 	at org.eclipse.jetty.server.handler.gzip.GzipHandler.handle(GzipHandler.java:462)
   [junit4]   2> 	at org.eclipse.jetty.server.handler.HandlerWrapper.handle(HandlerWrapper.java:134)
   [junit4]   2> 	at org.eclipse.jetty.server.Server.handle(Server.java:518)
   [junit4]   2> 	at org.eclipse.jetty.server.HttpChannel.handle(HttpChannel.java:308)
   [junit4]   2> 	at org.eclipse.jetty.server.HttpConnection.onFillable(HttpConnection.java:244)
   [junit4]   2> 	at org.eclipse.jetty.io.AbstractConnection$ReadCallback.succeeded(AbstractConnection.java:273)
   [junit4]   2> 	at org.eclipse.jetty.io.FillInterest.fillable(FillInterest.java:95)
   [junit4]   2> 	at org.eclipse.jetty.io.SelectChannelEndPoint$2.run(SelectChannelEndPoint.java:93)
   [junit4]   2> 	at org.eclipse.jetty.util.thread.strategy.ExecuteProduceConsume.produceAndRun(ExecuteProduceConsume.java:246)
   [junit4]   2> 	at org.eclipse.jetty.util.thread.strategy.ExecuteProduceConsume.run(ExecuteProduceConsume.java:156)
   [junit4]   2> 	at org.eclipse.jetty.util.thread.QueuedThreadPool.runJob(QueuedThreadPool.java:654)
   [junit4]   2> 	at org.eclipse.jetty.util.thread.QueuedThreadPool$3.run(QueuedThreadPool.java:572)
   [junit4]   2> 	at java.lang.Thread.run(Thread.java:745)
   [junit4]   2> 384576 INFO  (Thread-754) [    ] o.a.s.c.CorePropertiesLocator Config-defined core root directory: /x1/jenkins/jenkins-slave/workspace/Lucene-Solr-Tests-6.x/solr/build/solr-core/test/J1/temp/solr.util.TestSolrCLIRunExample_3F356DF6A68E3236-001/tempDir-001/schemaless/solr
   [junit4]   2> 384576 INFO  (Thread-754) [    ] o.a.s.c.CoreContainer New CoreContainer 1366241050
   [junit4]   2> 384576 INFO  (Thread-754) [    ] o.a.s.c.CoreContainer Loading cores into CoreContainer [instanceDir=/x1/jenkins/jenkins-slave/workspace/Lucene-Solr-Tests-6.x/solr/build/solr-core/test/J1/temp/solr.util.TestSolrCLIRunExample_3F356DF6A68E3236-001/tempDir-001/schemaless/solr]
   [junit4]   2> 384576 WARN  (Thread-754) [    ] o.a.s.c.CoreContainer Couldn't add files from /x1/jenkins/jenkins-slave/workspace/Lucene-Solr-Tests-6.x/solr/build/solr-core/test/J1/temp/solr.util.TestSolrCLIRunExample_3F356DF6A68E3236-001/tempDir-001/schemaless/solr/lib to classpath: /x1/jenkins/jenkins-slave/workspace/Lucene-Solr-Tests-6.x/solr/build/solr-core/test/J1/temp/solr.util.TestSolrCLIRunExample_3F356DF6A68E3236-001/tempDir-001/schemaless/solr/lib
   [junit4]   2> 384576 INFO  (Thread-754) [    ] o.a.s.h.c.HttpShardHandlerFactory created with socketTimeout : 600000,connTimeout : 60000,maxConnectionsPerHost : 20,maxConnections : 10000,corePoolSize : 0,maximumPoolSize : 2147483647,maxThreadIdleTime : 5,sizeOfQueue : -1,fairnessPolicy : false,useRetries : false,connectionsEvictorSleepDelay : 5000,maxConnectionIdleTime : 40000,
   [junit4]   2> 384576 INFO  (Thread-754) [    ] o.a.s.u.UpdateShardHandler Creating UpdateShardHandler HTTP client with params: socketTimeout=600000&connTimeout=60000&retry=true
   [junit4]   2> 384581 INFO  (Thread-754) [    ] o.a.s.l.LogWatcher SLF4J impl is org.slf4j.impl.Log4jLoggerFactory
   [junit4]   2> 384581 INFO  (Thread-754) [    ] o.a.s.l.LogWatcher Registering Log Listener [Log4j (org.slf4j.impl.Log4jLoggerFactory)]
   [junit4]   2> 384581 INFO  (Thread-754) [    ] o.a.s.c.CoreContainer Security conf doesn't exist. Skipping setup for authorization module.
   [junit4]   2> 384581 INFO  (Thread-754) [    ] o.a.s.c.CoreContainer No authentication plugin used.
   [junit4]   2> 384581 INFO  (Thread-754) [    ] o.a.s.c.CorePropertiesLocator Looking for core definitions underneath /x1/jenkins/jenkins-slave/workspace/Lucene-Solr-Tests-6.x/solr/build/solr-core/test/J1/temp/solr.util.TestSolrCLIRunExample_3F356DF6A68E3236-001/tempDir-001/schemaless/solr
   [junit4]   2> 384581 INFO  (Thread-754) [    ] o.a.s.c.CorePropertiesLocator Found 0 core definitions
   [junit4]   2> 384582 INFO  (Thread-754) [    ] o.a.s.s.SolrDispatchFilter user.dir=/x1/jenkins/jenkins-slave/workspace/Lucene-Solr-Tests-6.x/solr/build/solr-core/test/J1
   [junit4]   2> 384582 INFO  (Thread-754) [    ] o.a.s.s.SolrDispatchFilter SolrDispatchFilter.init() done
   [junit4]   2> 386597 INFO  (qtp1338609260-3090) [    ] o.a.s.s.HttpSolrCall [admin] webapp=null path=/admin/info/system params={wt=json} status=0 QTime=18
   [junit4]   2> 386602 INFO  (qtp1338609260-3087) [    ] o.a.s.s.HttpSolrCall [admin] webapp=null path=/admin/cores params={core=gettingstarted&action=STATUS&wt=json} status=0 QTime=0
   [junit4]   2> 386707 INFO  (qtp1338609260-3084) [    ] o.a.s.s.HttpSolrCall [admin] webapp=null path=/admin/info/system params={wt=json} status=0 QTime=6
   [junit4]   2> 386724 INFO  (qtp1338609260-3085) [    ] o.a.s.s.HttpSolrCall [admin] webapp=null path=/admin/info/system params={wt=json} status=0 QTime=12
   [junit4]   2> 386727 INFO  (qtp1338609260-3088) [    ] o.a.s.s.HttpSolrCall [admin] webapp=null path=/admin/cores params={core=gettingstarted&action=STATUS&wt=json} status=0 QTime=0
   [junit4]   2> 386740 INFO  (qtp1338609260-3089) [    ] o.a.s.h.a.CoreAdminOperation core create command name=gettingstarted&action=CREATE&instanceDir=gettingstarted&wt=json
   [junit4]   2> 386740 INFO  (qtp1338609260-3089) [    ] o.a.s.c.CoreDescriptor Created CoreDescriptor: {name=gettingstarted, config=solrconfig.xml, loadOnStartup=true, schema=schema.xml, configSetProperties=configsetprops.json, transient=false, dataDir=data/}
   [junit4]   2> 386740 INFO  (qtp1338609260-3089) [    ] o.a.s.c.SolrResourceLoader new SolrResourceLoader for directory: '/x1/jenkins/jenkins-slave/workspace/Lucene-Solr-Tests-6.x/solr/build/solr-core/test/J1/temp/solr.util.TestSolrCLIRunExample_3F356DF6A68E3236-001/tempDir-001/schemaless/solr/gettingstarted'
   [junit4]   2> 386740 INFO  (qtp1338609260-3089) [    ] o.a.s.c.SolrResourceLoader JNDI not configured for solr (NoInitialContextEx)
   [junit4]   2> 386740 INFO  (qtp1338609260-3089) [    ] o.a.s.c.SolrResourceLoader solr home defaulted to 'solr/' (could not find system property or JNDI)
   [junit4]   2> 386746 INFO  (qtp1338609260-3089) [    ] o.a.s.c.SolrConfig current version of requestparams : 0
   [junit4]   2> 386746 INFO  (qtp1338609260-3089) [    ] o.a.s.c.SolrConfig Adding specified lib dirs to ClassLoader
   [junit4]   2> 386747 WARN  (qtp1338609260-3089) [    ] o.a.s.c.SolrConfig Couldn't add files from /x1/jenkins/jenkins-slave/workspace/Lucene-Solr-Tests-6.x/solr/build/solr-core/test/J1/temp/solr.util.TestSolrCLIRunExample_3F356DF6A68E3236-001/tempDir-001/schemaless/solr/gettingstarted/../../../../contrib/extraction/lib filtered by .*\.jar to classpath: /x1/jenkins/jenkins-slave/workspace/Lucene-Solr-Tests-6.x/solr/build/solr-core/test/J1/temp/solr.util.TestSolrCLIRunExample_3F356DF6A68E3236-001/tempDir-001/schemaless/solr/gettingstarted/../../../../contrib/extraction/lib
   [junit4]   2> 386747 WARN  (qtp1338609260-3089) [    ] o.a.s.c.SolrConfig Couldn't add files from /x1/jenkins/jenkins-slave/workspace/Lucene-Solr-Tests-6.x/solr/build/solr-core/test/J1/temp/solr.util.TestSolrCLIRunExample_3F356DF6A68E3236-001/tempDir-001/schemaless/solr/gettingstarted/../../../../dist filtered by solr-cell-\d.*\.jar to classpath: /x1/jenkins/jenkins-slave/workspace/Lucene-Solr-Tests-6.x/solr/build/solr-core/test/J1/temp/solr.util.TestSolrCLIRunExample_3F356DF6A68E3236-001/tempDir-001/schemaless/solr/gettingstarted/../../../../dist
   [junit4]   2> 386748 WARN  (qtp1338609260-3089) [    ] o.a.s.c.SolrConfig Couldn't add files from /x1/jenkins/jenkins-slave/workspace/Lucene-Solr-Tests-6.x/solr/build/solr-core/test/J1/temp/solr.util.TestSolrCLIRunExample_3F356DF6A68E3236-001/tempDir-001/schemaless/solr/gettingstarted/../../../../contrib/clustering/lib filtered by .*\.jar to classpath: /x1/jenkins/jenkins-slave/workspace/Lucene-Solr-Tests-6.x/solr/build/solr-core/test/J1/temp/solr.util.TestSolrCLIRunExample_3F356DF6A68E3236-001/tempDir-001/schemaless/solr/gettingstarted/../../../../contrib/clustering/lib
   [junit4]   2> 386748 WARN  (qtp1338609260-3089) [    ] o.a.s.c.SolrConfig Couldn't add files from /x1/jenkins/jenkins-slave/workspace/Lucene-Solr-Tests-6.x/solr/build/solr-core/test/J1/temp/solr.util.TestSolrCLIRunExample_3F356DF6A68E3236-001/tempDir-001/schemaless/solr/gettingstarted/../../../../dist filtered by solr-clustering-\d.*\.jar to classpath: /x1/jenkins/jenkins-slave/workspace/Lucene-Solr-Tests-6.x/solr/build/solr-core/test/J1/temp/solr.util.TestSolrCLIRunExample_3F356DF6A68E3236-001/tempDir-001/schemaless/solr/gettingstarted/../../../../dist
   [junit4]   2> 386748 WARN  (qtp1338609260-3089) [    ] o.a.s.c.SolrConfig Couldn't add files from /x1/jenkins/jenkins-slave/workspace/Lucene-Solr-Tests-6.x/solr/build/solr-core/test/J1/temp/solr.util.TestSolrCLIRunExample_3F356DF6A68E3236-001/tempDir-001/schemaless/solr/gettingstarted/../../../../contrib/langid/lib filtered by .*\.jar to classpath: /x1/jenkins/jenkins-slave/workspace/Lucene-Solr-Tests-6.x/solr/build/solr-core/test/J1/temp/solr.util.TestSolrCLIRunExample_3F356DF6A68E3236-001/tempDir-001/schemaless/solr/gettingstarted/../../../../contrib/langid/lib
   [junit4]   2> 386748 WARN  (qtp1338609260-3089) [    ] o.a.s.c.SolrConfig Couldn't add files from /x1/jenkins/jenkins-slave/workspace/Lucene-Solr-Tests-6.x/solr/build/solr-core/test/J1/temp/solr.util.TestSolrCLIRunExample_3F356DF6A68E3236-001/tempDir-001/schemaless/solr/gettingstarted/../../../../dist filtered by solr-langid-\d.*\.jar to classpath: /x1/jenkins/jenkins-slave/workspace/Lucene-Solr-Tests-6.x/solr/build/solr-core/test/J1/temp/solr.util.TestSolrCLIRunExample_3F356DF6A68E3236-001/tempDir-001/schemaless/solr/gettingstarted/../../../../dist
   [junit4]   2> 386748 WARN  (qtp1338609260-3089) [    ] o.a.s.c.SolrConfig Couldn't add files from /x1/jenkins/jenkins-slave/workspace/Lucene-Solr-Tests-6.x/solr/build/solr-core/test/J1/temp/solr.util.TestSolrCLIRunExample_3F356DF6A68E3236-001/tempDir-001/schemaless/solr/gettingstarted/../../../../contrib/velocity/lib filtered by .*\.jar to classpath: /x1/jenkins/jenkins-slave/workspace/Lucene-Solr-Tests-6.x/solr/build/solr-core/test/J1/temp/solr.util.TestSolrCLIRunExample_3F356DF6A68E3236-001/tempDir-001/schemaless/solr/gettingstarted/../../../../contrib/velocity/lib
   [junit4]   2> 386748 WARN  (qtp1338609260-3089) [    ] o.a.s.c.SolrConfig Couldn't add files from /x1/jenkins/jenkins-slave/workspace/Lucene-Solr-Tests-6.x/solr/build/solr-core/test/J1/temp/solr.util.TestSolrCLIRunExample_3F356DF6A68E3236-001/tempDir-001/schemaless/solr/gettingstarted/../../../../dist filtered by solr-velocity-\d.*\.jar to classpath: /x1/jenkins/jenkins-slave/workspace/Lucene-Solr-Tests-6.x/solr/build/solr-core/test/J1/temp/solr.util.TestSolrCLIRunExample_3F356DF6A68E3236-001/tempDir-001/schemaless/solr/gettingstarted/../../../../dist
   [junit4]   2> 386760 INFO  (qtp1338609260-3089) [    ] o.a.s.c.SolrConfig Using Lucene MatchVersion: 6.2.0
   [junit4]   2> 386788 INFO  (qtp1338609260-3089) [    ] o.a.s.c.SolrConfig Loaded SolrConfig: solrconfig.xml
   [junit4]   2> 386793 INFO  (qtp1338609260-3089) [    ] o.a.s.s.IndexSchema [gettingstarted] Schema name=example-data-driven-schema
   [junit4]   2> 386952 INFO  (qtp1338609260-3089) [    ] o.a.s.s.IndexSchema unique key field: id
   [junit4]   2> 387037 INFO  (qtp1338609260-3089) [    ] o.a.s.s.FileExchangeRateProvider Reloading exchange rates from file currency.xml
   [junit4]   2> 387045 INFO  (qtp1338609260-3089) [    ] o.a.s.s.FileExchangeRateProvider Reloading exchange rates from file currency.xml
   [junit4]   2> 387060 INFO  (qtp1338609260-3089) [    ] o.a.s.c.ConfigSetProperties Did not find ConfigSet properties, assuming default properties: Can't find resource 'configsetprops.json' in classpath or '/x1/jenkins/jenkins-slave/workspace/Lucene-Solr-Tests-6.x/solr/build/solr-core/test/J1/temp/solr.util.TestSolrCLIRunExample_3F356DF6A68E3236-001/tempDir-001/schemaless/solr/gettingstarted'
   [junit4]   2> 387060 INFO  (qtp1338609260-3089) [    ] o.a.s.c.CoreContainer Creating SolrCore 'gettingstarted' using configuration from instancedir /x1/jenkins/jenkins-slave/workspace/Lucene-Solr-Tests-6.x/solr/build/solr-core/test/J1/temp/solr.util.TestSolrCLIRunExample_3F356DF6A68E3236-001/tempDir-001/schemaless/solr/gettingstarted
   [junit4]   2> 387060 INFO  (qtp1338609260-3089) [    x:gettingstarted] o.a.s.c.SolrCore org.apache.solr.core.MockDirectoryFactory
   [junit4]   2> 387061 INFO  (qtp1338609260-3089) [    x:gettingstarted] o.a.s.c.SolrCore [[gettingstarted] ] Opening new SolrCore at [/x1/jenkins/jenkins-slave/workspace/Lucene-Solr-Tests-6.x/solr/build/solr-core/test/J1/temp/solr.util.TestSolrCLIRunExample_3F356DF6A68E3236-001/tempDir-001/schemaless/solr/gettingstarted], dataDir=[/x1/jenkins/jenkins-slave/workspace/Lucene-Solr-Tests-6.x/solr/build/solr-core/test/J1/temp/solr.util.TestSolrCLIRunExample_3F356DF6A68E3236-001/tempDir-001/schemaless/solr/gettingstarted/data/]
   [junit4]   2> 387061 INFO  (qtp1338609260-3089) [    x:gettingstarted] o.a.s.c.JmxMonitoredMap JMX monitoring is enabled. Adding Solr mbeans to JMX Server: com.sun.jmx.mbeanserver.JmxMBeanServer@7a57f18a
   [junit4]   2> 387061 INFO  (qtp1338609260-3089) [    x:gettingstarted] o.a.s.c.SolrCore [[gettingstarted] ] Added SolrEventListener for newSearcher: [org.apache.solr.core.QuerySenderListener{queries=[]}]
   [junit4]   2> 387061 INFO  (qtp1338609260-3089) [    x:gettingstarted] o.a.s.c.SolrCore [[gettingstarted] ] Added SolrEventListener for firstSearcher: [org.apache.solr.core.QuerySenderListener{queries=[]}]
   [junit4]   2> 387062 INFO  (qtp1338609260-3089) [    x:gettingstarted] o.a.s.c.CachingDirectoryFactory return new directory for /x1/jenkins/jenkins-slave/workspace/Lucene-Solr-Tests-6.x/solr/build/solr-core/test/J1/temp/solr.util.TestSolrCLIRunExample_3F356DF6A68E3236-001/tempDir-001/schemaless/solr/gettingstarted/data/snapshot_metadata
   [junit4]   2> 387062 INFO  (qtp1338609260-3089) [    x:gettingstarted] o.a.s.c.s.SolrSnapshotMetaDataManager Loading from snapshot metadata file...
   [junit4]   2> 387062 INFO  (qtp1338609260-3089) [    x:gettingstarted] o.a.s.c.SchemaCodecFactory Using default compressionMode: BEST_SPEED
   [junit4]   2> 387062 INFO  (qtp1338609260-3089) [    x:gettingstarted] o.a.s.c.CachingDirectoryFactory return new directory for /x1/jenkins/jenkins-slave/workspace/Lucene-Solr-Tests-6.x/solr/build/solr-core/test/J1/temp/solr.util.TestSolrCLIRunExample_3F356DF6A68E3236-001/tempDir-001/schemaless/solr/gettingstarted/data
   [junit4]   2> 387062 INFO  (qtp1338609260-3089) [    x:gettingstarted] o.a.s.c.SolrCore New index directory detected: old=null new=/x1/jenkins/jenkins-slave/workspace/Lucene-Solr-Tests-6.x/solr/build/solr-core/test/J1/temp/solr.util.TestSolrCLIRunExample_3F356DF6A68E3236-001/tempDir-001/schemaless/solr/gettingstarted/data/index/
   [junit4]   2> 387062 WARN  (qtp1338609260-3089) [    x:gettingstarted] o.a.s.c.SolrCore [gettingstarted] Solr index directory '/x1/jenkins/jenkins-slave/workspace/Lucene-Solr-Tests-6.x/solr/build/solr-core/test/J1/temp/solr.util.TestSolrCLIRunExample_3F356DF6A68E3236-001/tempDir-001/schemaless/solr/gettingstarted/data/index' doesn't exist. Creating new index...
   [junit4]   2> 387063 INFO  (qtp1338609260-3089) [    x:gettingstarted] o.a.s.c.CachingDirectoryFactory return new directory for /x1/jenkins/jenkins-slave/workspace/Lucene-Solr-Tests-6.x/solr/build/solr-core/test/J1/temp/solr.util.TestSolrCLIRunExample_3F356DF6A68E3236-001/tempDir-001/schemaless/solr/gettingstarted/data/index
   [junit4]   2> 387063 INFO  (qtp1338609260-3089) [    x:gettingstarted] o.a.s.c.SolrDeletionPolicy SolrDeletionPolicy.onCommit: commits: num=1
   [junit4]   2> 	commit{dir=MockDirectoryWrapper(RAMDirectory@61e85713 lockFactory=org.apache.lucene.store.SingleInstanceLockFactory@49fd5dc8),segFN=segments_1,generation=1}
   [junit4]   2> 387063 INFO  (qtp1338609260-3089) [    x:gettingstarted] o.a.s.c.SolrDeletionPolicy newest commit generation = 1
   [junit4]   2> 387073 INFO  (OldIndexDirectoryCleanupThreadForCore-gettingstarted) [    x:gettingstarted] o.a.s.c.SolrCore Looking for old index directories to cleanup for core gettingstarted in /x1/jenkins/jenkins-slave/workspace/Lucene-Solr-Tests-6.x/solr/build/solr-core/test/J1/temp/solr.util.TestSolrCLIRunExample_3F356DF6A68E3236-001/tempDir-001/schemaless/solr/gettingstarted/data/
   [junit4]   2> 387073 WARN  (OldIndexDirectoryCleanupThreadForCore-gettingstarted) [    x:gettingstarted] o.a.s.c.DirectoryFactory /x1/jenkins/jenkins-slave/workspace/Lucene-Solr-Tests-6.x/solr/build/solr-core/test/J1/temp/solr.util.TestSolrCLIRunExample_3F356DF6A68E3236-001/tempDir-001/schemaless/solr/gettingstarted/data/ does not point to a valid data directory; skipping clean-up of old index directories.
   [junit4]   2> 387078 INFO  (qtp1338609260-3089) [    x:gettingstarted] o.a.s.c.PluginBag queryResponseWriter : 'velocity' created with startup=lazy 
   [junit4]   2> 387083 INFO  (qtp1338609260-3089) [    x:gettingstarted] o.a.s.r.XSLTResponseWriter xsltCacheLifetimeSeconds=5
   [junit4]   2> 387114 INFO  (qtp1338609260-3089) [    x:gettingstarted] o.a.s.u.p.UpdateRequestProcessorChain creating updateRequestProcessorChain "add-unknown-fields-to-the-schema"
   [junit4]   2> 387220 INFO  (qtp1338609260-3089) [    x:gettingstarted] o.a.s.c.SolrCore no updateRequestProcessorChain defined as default, creating implicit default
   [junit4]   2> 387222 INFO  (qtp1338609260-3089) [    x:gettingstarted] o.a.s.h.l.XMLLoader xsltCacheLifetimeSeconds=60
   [junit4]   2> 387223 INFO  (qtp1338609260-3089) [    x:gettingstarted] o.a.s.h.l.XMLLoader xsltCacheLifetimeSeconds=60
   [junit4]   2> 387224 INFO  (qtp1338609260-3089) [    x:gettingstarted] o.a.s.h.l.XMLLoader xsltCacheLifetimeSeconds=60
   [junit4]   2> 387224 INFO  (qtp1338609260-3089) [    x:gettingstarted] o.a.s.h.l.XMLLoader xsltCacheLifetimeSeconds=60
   [junit4]   2> 387227 INFO  (qtp1338609260-3089) [    x:gettingstarted] o.a.s.c.PluginBag requestHandler : '/terms' created with startup=lazy 
   [junit4]   2> 387227 INFO  (qtp1338609260-3089) [    x:gettingstarted] o.a.s.c.PluginBag requestHandler : '/update/extract' created with startup=lazy 
   [junit4]   2> 387227 INFO  (qtp1338609260-3089) [    x:gettingstarted] o.a.s.c.PluginBag requestHandler : '/analysis/field' created with startup=lazy 
   [junit4]   2> 387227 INFO  (qtp1338609260-3089) [    x:gettingstarted] o.a.s.c.PluginBag requestHandler : '/analysis/document' created with startup=lazy 
   [junit4]   2> 387228 INFO  (qtp1338609260-3089) [    x:gettingstarted] o.a.s.c.PluginBag requestHandler : '/spell' created with startup=lazy 
   [junit4]   2> 387228 INFO  (qtp1338609260-3089) [    x:gettingstarted] o.a.s.c.PluginBag requestHandler : '/tvrh' created with startup=lazy 
   [junit4]   2> 387228 INFO  (qtp1338609260-3089) [    x:gettingstarted] o.a.s.c.PluginBag requestHandler : '/elevate' created with startup=lazy 
   [junit4]   2> 387228 INFO  (qtp1338609260-3089) [    x:gettingstarted] o.a.s.c.RequestHandlers Registered paths: /admin/mbeans,/browse,/update/json/docs,/admin/luke,/export,/get,/admin/properties,/elevate,/update/json,/admin/threads,/query,/analysis/field,/analysis/document,/spell,/update/csv,/sql,/graph,/tvrh,/select,/admin/segments,/admin/system,/replication,/config,/stream,/schema,/admin/plugins,/admin/logging,/admin/ping,/update,/admin/file,/terms,/debug/dump,/update/extract
   [junit4]   2> 387228 INFO  (qtp1338609260-3089) [    x:gettingstarted] o.a.s.c.SolrCore Using default statsCache cache: org.apache.solr.search.stats.LocalStatsCache
   [junit4]   2> 387228 INFO  (qtp1338609260-3089) [    x:gettingstarted] o.a.s.u.UpdateHandler Using UpdateLog implementation: org.apache.solr.update.UpdateLog
   [junit4]   2> 387228 INFO  (qtp1338609260-3089) [    x:gettingstarted] o.a.s.u.UpdateLog Initializing UpdateLog: dataDir= defaultSyncLevel=FLUSH numRecordsToKeep=100 maxNumLogsToKeep=10 numVersionBuckets=65536
   [junit4]   2> 387229 INFO  (qtp1338609260-3089) [    x:gettingstarted] o.a.s.u.CommitTracker Hard AutoCommit: if uncommited for 15000ms; 
   [junit4]   2> 387229 INFO  (qtp1338609260-3089) [    x:gettingstarted] o.a.s.u.CommitTracker Soft AutoCommit: disabled
   [junit4]   2> 387229 INFO  (qtp1338609260-3089) [    x:gettingstarted] o.a.s.c.SolrDeletionPolicy SolrDeletionPolicy.onInit: commits: num=1
   [junit4]   2> 	commit{dir=MockDirectoryWrapper(RAMDirectory@61e85713 lockFactory=org.apache.lucene.store.SingleInstanceLockFactory@49fd5dc8),segFN=segments_1,generation=1}
   [junit4]   2> 387229 INFO  (qtp1338609260-3089) [    x:gettingstarted] o.a.s.c.SolrDeletionPolicy newest commit generation = 1
   [junit4]   2> 387229 INFO  (qtp1338609260-3089) [    x:gettingstarted] o.a.s.s.SolrIndexSearcher Opening [Searcher@cc23448[gettingstarted] main]
   [junit4]   2> 387230 INFO  (qtp1338609260-3089) [    x:gettingstarted] o.a.s.r.ManagedResourceStorage File-based storage initialized to use dir: /x1/jenkins/jenkins-slave/workspace/Lucene-Solr-Tests-6.x/solr/build/solr-core/test/J1/temp/solr.util.TestSolrCLIRunExample_3F356DF6A68E3236-001/tempDir-001/schemaless/solr/gettingstarted/conf
   [junit4]   2> 387230 INFO  (qtp1338609260-3089) [    x:gettingstarted] o.a.s.r.RestManager Initializing RestManager with initArgs: {storageDir=/x1/jenkins/jenkins-slave/workspace/Lucene-Solr-Tests-6.x/solr/build/solr-core/test/J1/temp/solr.util.TestSolrCLIRunExample_3F356DF6A68E3236-001/tempDir-001/schemaless/solr/gettingstarted/conf}
   [junit4]   2> 387230 INFO  (qtp1338609260-3089) [    x:gettingstarted] o.a.s.r.ManagedResourceStorage Reading _rest_managed.json using file:dir=/x1/jenkins/jenkins-slave/workspace/Lucene-Solr-Tests-6.x/solr/build/solr-core/test/J1/temp/solr.util.TestSolrCLIRunExample_3F356DF6A68E3236-001/tempDir-001/schemaless/solr/gettingstarted/conf
   [junit4]   2> 387230 INFO  (qtp1338609260-3089) [    x:gettingstarted] o.a.s.r.RestManager Initializing 0 registered ManagedResources
   [junit4]   2> 387230 INFO  (qtp1338609260-3089) [    x:gettingstarted] o.a.s.h.c.SpellCheckComponent Initializing spell checkers
   [junit4]   2> 387237 INFO  (qtp1338609260-3089) [    x:gettingstarted] o.a.s.s.DirectSolrSpellChecker init: {name=default,field=_text_,classname=solr.DirectSolrSpellChecker,distanceMeasure=internal,accuracy=0.5,maxEdits=2,minPrefix=1,maxInspections=5,minQueryLength=4,maxQueryFrequency=0.01}
   [junit4]   2> 387237 INFO  (qtp1338609260-3089) [    x:gettingstarted] o.a.s.h.c.SpellCheckComponent No queryConverter defined, using default converter
   [junit4]   2> 387237 INFO  (qtp1338609260-3089) [    x:gettingstarted] o.a.s.h.c.QueryElevationComponent Loading QueryElevation from: /x1/jenkins/jenkins-slave/workspace/Lucene-Solr-Tests-6.x/solr/build/solr-core/test/J1/temp/solr.util.TestSolrCLIRunExample_3F356DF6A68E3236-001/tempDir-001/schemaless/solr/gettingstarted/conf/elevate.xml
   [junit4]   2> 387248 INFO  (qtp1338609260-3089) [    x:gettingstarted] o.a.s.h.ReplicationHandler Commits will be reserved for  10000
   [junit4]   2> 387248 INFO  (searcherExecutor-1285-thread-1-processing-x:gettingstarted) [    x:gettingstarted] o.a.s.c.QuerySenderListener QuerySenderListener sending requests to Searcher@cc23448[gettingstarted] main{ExitableDirectoryReader(UninvertingDirectoryReader())}
   [junit4]   2> 387248 INFO  (searcherExecutor-1285-thread-1-processing-x:gettingstarted) [    x:gettingstarted] o.a.s.c.QuerySenderListener QuerySenderListener done.
   [junit4]   2> 387248 INFO  (searcherExecutor-1285-thread-1-processing-x:gettingstarted) [    x:gettingstarted] o.a.s.h.c.SpellCheckComponent Loading spell index for spellchecker: default
   [junit4]   2> 387249 INFO  (searcherExecutor-1285-thread-1-processing-x:gettingstarted) [    x:gettingstarted] o.a.s.c.SolrCore [gettingstarted] Registered new searcher Searcher@cc23448[gettingstarted] main{ExitableDirectoryReader(UninvertingDirectoryReader())}
   [junit4]   2> 387250 INFO  (qtp1338609260-3089) [    x:gettingstarted] o.a.s.u.UpdateLog Looking up max value of version field to seed version buckets
   [junit4]   2> 387250 INFO  (qtp1338609260-3089) [    x:gettingstarted] o.a.s.u.VersionInfo Refreshing highest value of _version_ for 65536 version buckets from index
   [junit4]   2> 387250 INFO  (qtp1338609260-3089) [    x:gettingstarted] o.a.s.u.VersionInfo No terms found for _version_, cannot seed version bucket highest value from index
   [junit4]   2> 387250 INFO  (qtp1338609260-3089) [    x:gettingstarted] o.a.s.u.UpdateLog Could not find max version in index or recent updates, using new clock 1541803668012007424
   [junit4]   2> 387251 INFO  (qtp1338609260-3089) [    x:gettingstarted] o.a.s.u.UpdateLog Took 1.0ms to seed version buckets with highest version 1541803668012007424
   [junit4]   2> 387252 INFO  (qtp1338609260-3089) [    x:gettingstarted] o.a.s.c.CoreContainer registering core: gettingstarted
   [junit4]   2> 387252 INFO  (qtp1338609260-3089) [    x:gettingstarted] o.a.s.s.HttpSolrCall [admin] webapp=null path=/admin/cores params={name=gettingstarted&action=CREATE&instanceDir=gettingstarted&wt=json} status=0 QTime=512
   [junit4]   2> 387254 INFO  (TEST-TestSolrCLIRunExample.testSchemalessExample-seed#[3F356DF6A68E3236]) [    ] o.e.j.s.ServerConnector Stopped ServerConnector@7ae9251{HTTP/1.1,[http/1.1]}{127.0.0.1:46271}
   [junit4]   2> 387254 INFO  (TEST-TestSolrCLIRunExample.testSchemalessExample-seed#[3F356DF6A68E3236]) [    ] o.a.s.c.CoreContainer Shutting down CoreContainer instance=1366241050
   [junit4]   2> 387257 INFO  (coreCloseExecutor-1290-thread-1) [    x:gettingstarted] o.a.s.c.SolrCore [gettingstarted]  CLOSING SolrCore org.apache.solr.core.SolrCore@534027a7
   [junit4]   2> 387261 INFO  (coreCloseExecutor-1290-thread-1) [    x:gettingstarted] o.a.s.u.DirectUpdateHandler2 closing DirectUpdateHandler2{commits=0,autocommit maxTime=15000ms,autocommits=0,soft autocommits=0,optimizes=0,rollbacks=0,expungeDeletes=0,docsPending=0,adds=0,deletesById=0,deletesByQuery=0,errors=0,cumulative_adds=0,cumulative_deletesById=0,cumulative_deletesByQuery=0,cumulative_errors=0,transaction_logs_total_size=0,transaction_logs_total_number=0}
   [junit4]   2> 387261 INFO  (coreCloseExecutor-1290-thread-1) [    x:gettingstarted] o.a.s.u.SolrCoreState Closing SolrCoreState
   [junit4]   2> 387261 INFO  (coreCloseExecutor-1290-thread-1) [    x:gettingstarted] o.a.s.u.DefaultSolrCoreState SolrCoreState ref count has reached 0 - closing IndexWriter
   [junit4]   2> 387261 INFO  (coreCloseExecutor-1290-thread-1) [    x:gettingstarted] o.a.s.u.DefaultSolrCoreState closing IndexWriter with IndexWriterCloser
   [junit4]   2> 387262 INFO  (coreCloseExecutor-1290-thread-1) [    x:gettingstarted] o.a.s.c.SolrCore [gettingstarted] Closing main searcher on request.
   [junit4]   2> 387267 INFO  (coreCloseExecutor-1290-thread-1) [    x:gettingstarted] o.a.s.c.CachingDirectoryFactory Closing MockDirectoryFactory - 3 directories currently being tracked
   [junit4]   2> 387267 INFO  (coreCloseExecutor-1290-thread-1) [    x:gettingstarted] o.a.s.c.CachingDirectoryFactory looking to close /x1/jenkins/jenkins-slave/workspace/Lucene-Solr-Tests-6.x/solr/build/solr-core/test/J1/temp/solr.util.TestSolrCLIRunExample_3F356DF6A68E3236-001/tempDir-001/schemaless/solr/gettingstarted/data/snapshot_metadata [CachedDir<<refCount=0;path=/x1/jenkins/jenkins-slave/workspace/Lucene-Solr-Tests-6.x/solr/build/solr-core/test/J1/temp/solr.util.TestSolrCLIRunExample_3F356DF6A68E3236-001/tempDir-001/schemaless/solr/gettingstarted/data/snapshot_metadata;done=false>>]
   [junit4]   2> 387267 INFO  (coreCloseExecutor-1290-thread-1) [    x:gettingstarted] o.a.s.c.CachingDirectoryFactory Closing directory, CoreContainer#isShutdown=true
   [junit4]   2> 387267 INFO  (coreCloseExecutor-1290-thread-1) [    x:gettingstarted] o.a.s.c.CachingDirectoryFactory Closing directory: /x1/jenkins/jenkins-slave/workspace/Lucene-Solr-Tests-6.x/solr/build/solr-core/test/J1/temp/solr.util.TestSolrCLIRunExample_3F356DF6A68E3236-001/tempDir-001/schemaless/solr/gettingstarted/data/snapshot_metadata
   [junit4]   2> 387267 INFO  (coreCloseExecutor-1290-thread-1) [    x:gettingstarted] o.a.s.c.CachingDirectoryFactory looking to close /x1/jenkins/jenkins-slave/workspace/Lucene-Solr-Tests-6.x/solr/build/solr-core/test/J1/temp/solr.util.TestSolrCLIRunExample_3F356DF6A68E3236-001/tempDir-001/schemaless/solr/gettingstarted/data [CachedDir<<refCount=0;path=/x1/jenkins/jenkins-slave/workspace/Lucene-Solr-Tests-6.x/solr/build/solr-core/test/J1/temp/solr.util.TestSolrCLIRunExample_3F356DF6A68E3236-001/tempDir-001/schemaless/solr/gettingstarted/data;done=false>>]
   [junit4]   2> 387267 INFO  (coreCloseExecutor-1290-thread-1) [    x:gettingstarted] o.a.s.c.CachingDirectoryFactory Closing directory, CoreContainer#isShutdown=true
   [junit4]   2> 387267 INFO  (coreCloseExecutor-1290-thread-1) [    x:gettingstarted] o.a.s.c.CachingDirectoryFactory Closing directory: /x1/jenkins/jenkins-slave/workspace/Lucene-Solr-Tests-6.x/solr/build/solr-core/test/J1/temp/solr.util.TestSolrCLIRunExample_3F356DF6A68E3236-001/tempDir-001/schemaless/solr/gettingstarted/data
   [junit4]   2> 387267 INFO  (coreCloseExecutor-1290-thread-1) [    x:gettingstarted] o.a.s.c.CachingDirectoryFactory looking to close /x1/jenkins/jenkins-slave/workspace/Lucene-Solr-Tests-6.x/solr/build/solr-core/test/J1/temp/solr.util.TestSolrCLIRunExample_3F356DF6A68E3236-001/tempDir-001/schemaless/solr/gettingstarted/data/index [CachedDir<<refCount=0;path=/x1/jenkins/jenkins-slave/workspace/Lucene-Solr-Tests-6.x/solr/build/solr-core/test/J1/temp/solr.util.TestSolrCLIRunExample_3F356DF6A68E3236-001/tempDir-001/schemaless/solr/gettingstarted/data/index;done=false>>]
   [junit4]   2> 387267 INFO  (coreCloseExecutor-1290-thread-1) [    x:gettingstarted] o.a.s.c.CachingDirectoryFactory Closing directory, CoreContainer#isShutdown=true
   [junit4]   2> 387267 INFO  (coreCloseExecutor-1290-thread-1) [    x:gettingstarted] o.a.s.c.CachingDirectoryFactory Closing directory: /x1/jenkins/jenkins-slave/workspace/Lucene-Solr-Tests-6.x/solr/build/solr-core/test/J1/temp/solr.util.TestSolrCLIRunExample_3F356DF6A68E3236-001/tempDir-001/schemaless/solr/gettingstarted/data/index
   [junit4]   2> 387268 INFO  (TEST-TestSolrCLIRunExample.testSchemalessExample-seed#[3F356DF6A68E3236]) [    ] o.e.j.s.h.ContextHandler Stopped o.e.j.s.ServletContextHandler@797d62b4{/solr,null,UNAVAILABLE}
   [junit4]   2> 387273 INFO  (TEST-TestSolrCLIRunExample.testSchemalessExample-seed#[3F356DF6A68E3236]) [    ] o.a.s.u.TestSolrCLIRunExample Stopped standalone Solr instance running on port 46271
   [junit4]   2> 387273 INFO  (TEST-TestSolrCLIRunExample.testSchemalessExample-seed#[3F356DF6A68E3236]) [    ] o.a.s.SolrTestCaseJ4 ###Ending testSchemalessExample
   [junit4]   2> 387274 INFO  (TEST-TestSolrCLIRunExample.testInteractiveSolrCloudExample-seed#[3F356DF6A68E3236]) [    ] o.a.s.SolrTestCaseJ4 ###Starting testInteractiveSolrCloudExample
   [junit4]   2> 387279 INFO  (TEST-TestSolrCLIRunExample.testInteractiveSolrCloudExample-seed#[3F356DF6A68E3236]) [    ] o.a.s.c.ZkTestServer STARTING ZK TEST SERVER
   [junit4]   2> 387279 INFO  (Thread-764) [    ] o.a.s.c.ZkTestServer client port:0.0.0.0/0.0.0.0:0
   [junit4]   2> 387279 INFO  (Thread-764) [    ] o.a.s.c.ZkTestServer Starting server
   [junit4]   2> 387379 INFO  (TEST-TestSolrCLIRunExample.testInteractiveSolrCloudExample-seed#[3F356DF6A68E3236]) [    ] o.a.s.c.ZkTestServer start zk server on port:36820
   [junit4]   2> 387379 INFO  (TEST-TestSolrCLIRunExample.testInteractiveSolrCloudExample-seed#[3F356DF6A68E3236]) [    ] o.a.s.c.c.SolrZkClient Using default ZkCredentialsProvider
   [junit4]   2> 387386 INFO  (TEST-TestSolrCLIRunExample.testInteractiveSolrCloudExample-seed#[3F356DF6A68E3236]) [    ] o.a.s.c.c.ConnectionManager Waiting for client to connect to ZooKeeper
   [junit4]   2> 387406 INFO  (zkCallback-474-thread-1) [    ] o.a.s.c.c.ConnectionManager Watcher org.apache.solr.common.cloud.ConnectionManager@259eea3 name:ZooKeeperConnection Watcher:127.0.0.1:36820 got event WatchedEvent state:SyncConnected type:None path:null path:null type:None
   [junit4]   2> 387406 INFO  (TEST-TestSolrCLIRunExample.testInteractiveSolrCloudExample-seed#[3F356DF6A68E3236]) [    ] o.a.s.c.c.ConnectionManager Client is connected to ZooKeeper
   [junit4]   2> 387406 INFO  (TEST-TestSolrCLIRunExample.testInteractiveSolrCloudExample-seed#[3F356DF6A68E3236]) [    ] o.a.s.c.c.SolrZkClient Using default ZkACLProvider
   [junit4]   2> 387406 INFO  (TEST-TestSolrCLIRunExample.testInteractiveSolrCloudExample-seed#[3F356DF6A68E3236]) [    ] o.a.s.c.c.SolrZkClient makePath: /solr/solr.xml
   [junit4]   2> 387416 INFO  (jetty-launcher-473-thread-1) [    ] o.e.j.s.Server jetty-9.3.8.v20160314
   [junit4]   2> 387417 INFO  (jetty-launcher-473-thread-1) [    ] o.e.j.s.h.ContextHandler Started o.e.j.s.ServletContextHandler@38e8dd90{/solr,null,AVAILABLE}
   [junit4]   2> 387418 INFO  (jetty-launcher-473-thread-1) [    ] o.e.j.s.ServerConnector Started ServerConnector@d390e8a{HTTP/1.1,[http/1.1]}{127.0.0.1:35792}
   [junit4]   2> 387418 INFO  (jetty-launcher-473-thread-1) [    ] o.e.j.s.Server Started @389876ms
   [junit4]   2> 387425 INFO  (jetty-launcher-473-thread-1) [    ] o.a.s.c.s.e.JettySolrRunner Jetty properties: {hostContext=/solr, hostPort=35792}
   [junit4]   2> 387425 INFO  (jetty-launcher-473-thread-1) [    ] o.a.s.s.SolrDispatchFilter SolrDispatchFilter.init(): sun.misc.Launcher$AppClassLoader@73d16e93
   [junit4]   2> 387425 INFO  (jetty-launcher-473-thread-1) [    ] o.a.s.c.SolrResourceLoader new SolrResourceLoader for directory: '/x1/jenkins/jenkins-slave/workspace/Lucene-Solr-Tests-6.x/solr/build/solr-core/test/J1/temp/solr.util.TestSolrCLIRunExample_3F356DF6A68E3236-001/tempDir-003/node1'
   [junit4]   2> 387425 INFO  (jetty-launcher-473-thread-1) [    ] o.a.s.c.SolrResourceLoader JNDI not configured for solr (NoInitialContextEx)
   [junit4]   2> 387425 INFO  (jetty-launcher-473-thread-1) [    ] o.a.s.c.SolrResourceLoader solr home defaulted to 'solr/' (could not find system property or JNDI)
   [junit4]   2> 387425 INFO  (jetty-launcher-473-thread-1) [    ] o.a.s.c.c.SolrZkClient Using default ZkCredentialsProvider
   [junit4]   2> 387426 INFO  (jetty-launcher-473-thread-1) [    ] o.a.s.c.c.ConnectionManager Waiting for client to connect to ZooKeeper
   [junit4]   2> 387428 INFO  (zkCallback-475-thread-1) [    ] o.a.s.c.c.ConnectionManager Watcher org.apache.solr.common.cloud.ConnectionManager@8429c49 name:ZooKeeperConnection Watcher:127.0.0.1:36820/solr got event WatchedEvent state:SyncConnected type:None path:null path:null type:None
   [junit4]   2> 387428 INFO  (jetty-launcher-473-thread-1) [    ] o.a.s.c.c.ConnectionManager Client is connected to ZooKeeper
   [junit4]   2> 387428 INFO  (jetty-launcher-473-thread-1) [    ] o.a.s.c.c.SolrZkClient Using default ZkACLProvider
   [junit4]   2> 387429 INFO  (jetty-launcher-473-thread-1) [    ] o.a.s.s.SolrDispatchFilter solr.xml found in ZooKeeper. Loading...
   [junit4]   2> 387433 INFO  (jetty-launcher-473-thread-1) [    ] o.a.s.c.CorePropertiesLocator Config-defined core root directory: /x1/jenkins/jenkins-slave/workspace/Lucene-Solr-Tests-6.x/solr/build/solr-core/test/J1/temp/solr.util.TestSolrCLIRunExample_3F356DF6A68E3236-001/tempDir-003/node1
   [junit4]   2> 387433 INFO  (jetty-launcher-473-thread-1) [    ] o.a.s.c.CoreContainer New CoreContainer 1009451731
   [junit4]   2> 387433 INFO  (jetty-launcher-473-thread-1) [    ] o.a.s.c.CoreContainer Loading cores into CoreContainer [instanceDir=/x1/jenkins/jenkins-slave/workspace/Lucene-Solr-Tests-6.x/solr/build/solr-core/test/J1/temp/solr.util.TestSolrCLIRunExample_3F356DF6A68E3236-001/tempDir-003/node1]
   [junit4]   2> 387433 WARN  (jetty-launcher-473-thread-1) [    ] o.a.s.c.CoreContainer Couldn't add files from /x1/jenkins/jenkins-slave/workspace/Lucene-Solr-Tests-6.x/solr/build/solr-core/test/J1/temp/solr.util.TestSolrCLIRunExample_3F356DF6A68E3236-001/tempDir-003/node1/lib to classpath: /x1/jenkins/jenkins-slave/workspace/Lucene-Solr-Tests-6.x/solr/build/solr-core/test/J1/temp/solr.util.TestSolrCLIRunExample_3F356DF6A68E3236-001/tempDir-003/node1/lib
   [junit4]   2> 387433 INFO  (jetty-launcher-473-thread-1) [    ] o.a.s.h.c.HttpShardHandlerFactory created with socketTimeout : 600000,connTimeout : 60000,maxConnectionsPerHost : 20,maxConnections : 10000,corePoolSize : 0,maximumPoolSize : 2147483647,maxThreadIdleTime : 5,sizeOfQueue : -1,fairnessPolicy : false,useRetries : false,connectionsEvictorSleepDelay : 5000,maxConnectionIdleTime : 40000,
   [junit4]   2> 387434 INFO  (jetty-launcher-473-thread-1) [    ] o.a.s.u.UpdateShardHandler Creating UpdateShardHandler HTTP client with params: socketTimeout=600000&connTimeout=60000&retry=true
   [junit4]   2> 387436 INFO  (jetty-launcher-473-thread-1) [    ] o.a.s.l.LogWatcher SLF4J impl is org.slf4j.impl.Log4jLoggerFactory
   [junit4]   2> 387436 INFO  (jetty-launcher-473-thread-1) [    ] o.a.s.l.LogWatcher Registering Log Listener [Log4j (org.slf4j.impl.Log4jLoggerFactory)]
   [junit4]   2> 387436 INFO  (jetty-launcher-473-thread-1) [    ] o.a.s.c.ZkContainer Zookeeper client=127.0.0.1:36820/solr
   [junit4]   2> 387436 INFO  (jetty-launcher-473-thread-1) [    ] o.a.s.c.ZkController zkHost includes chroot
   [junit4]   2> 387436 INFO  (jetty-launcher-473-thread-1) [    ] o.a.s.c.c.SolrZkClient Using default ZkCredentialsProvider
   [junit4]   2> 387437 INFO  (jetty-launcher-473-thread-1) [    ] o.a.s.c.c.ConnectionManager Waiting for client to connect to ZooKeeper
   [junit4]   2> 387438 INFO  (zkCallback-478-thread-1) [    ] o.a.s.c.c.ConnectionManager Watcher org.apache.solr.common.cloud.ConnectionManager@3429c935 name:ZooKeeperConnection Watcher:127.0.0.1:36820 got event WatchedEvent state:SyncConnected type:None path:null path:null type:None
   [junit4]   2> 387438 INFO  (jetty-launcher-473-thread-1) [    ] o.a.s.c.c.ConnectionManager Client is connected to ZooKeeper
   [junit4]   2> 387438 INFO  (jetty-launcher-473-thread-1) [    ] o.a.s.c.c.SolrZkClient Using default ZkACLProvider
   [junit4]   2> 387441 INFO  (jetty-launcher-473-thread-1) [n:localhost:35792_solr    ] o.a.s.c.ZkController Added new OnReconnect listener org.apache.solr.cloud.ZkController$$Lambda$69/413833094@b370e95
   [junit4]   2> 387445 INFO  (jetty-launcher-473-thread-1) [n:localhost:35792_solr    ] o.a.s.c.c.ConnectionManager Waiting for client to connect to ZooKeeper
   [junit4]   2> 387455 INFO  (zkCallback-479-thread-1-processing-n:localhost:35792_solr) [n:localhost:35792_solr    ] o.a.s.c.c.ConnectionManager Watcher org.apache.solr.common.cloud.ConnectionManager@5787fb22 name:ZooKeeperConnection Watcher:127.0.0.1:36820/solr got event WatchedEvent state:SyncConnected type:None path:null path:null type:None
   [junit4]   2> 387455 INFO  (jetty-launcher-473-thread-1) [n:localhost:35792_solr    ] o.a.s.c.c.ConnectionManager Client is connected to ZooKeeper
   [junit4]   2> 387456 INFO  (jetty-launcher-473-thread-1) [n:localhost:35792_solr    ] o.a.s.c.c.SolrZkClient makePath: /overseer/queue
   [junit4]   2> 387458 INFO  (jetty-launcher-473-thread-1) [n:localhost:35792_solr    ] o.a.s.c.c.SolrZkClient makePath: /overseer/collection-queue-work
   [junit4]   2> 387460 INFO  (jetty-launcher-473-thread-1) [n:localhost:35792_solr    ] o.a.s.c.c.SolrZkClient makePath: /overseer/collection-map-running
   [junit4]   2> 387461 INFO  (jetty-launcher-473-thread-1) [n:localhost:35792_solr    ] o.a.s.c.c.SolrZkClient makePath: /overseer/collection-map-completed
   [junit4]   2> 387462 INFO  (jetty-launcher-473-thread-1) [n:localhost:35792_solr    ] o.a.s.c.c.SolrZkClient makePath: /overseer/collection-map-failure
   [junit4]   2> 387463 INFO  (jetty-launcher-473-thread-1) [n:localhost:35792_solr    ] o.a.s.c.c.SolrZkClient makePath: /live_nodes
   [junit4]   2> 387464 INFO  (jetty-launcher-473-thread-1) [n:localhost:35792_solr    ] o.a.s.c.c.SolrZkClient makePath: /collections
   [junit4]   2> 387465 INFO  (jetty-launcher-473-thread-1) [n:localhost:35792_solr    ] o.a.s.c.c.SolrZkClient makePath: /aliases.json
   [junit4]   2> 387465 INFO  (jetty-launcher-473-thread-1) [n:localhost:35792_solr    ] o.a.s.c.c.SolrZkClient makePath: /clusterstate.json
   [junit4]   2> 387466 INFO  (jetty-launcher-473-thread-1) [n:localhost:35792_solr    ] o.a.s.c.c.SolrZkClient makePath: /security.json
   [junit4]   2> 387466 INFO  (jetty-launcher-473-thread-1) [n:localhost:35792_solr    ] o.a.s.c.c.ZkStateReader Updating cluster state from ZooKeeper... 
   [junit4]   2> 387467 INFO  (jetty-launcher-473-thread-1) [n:localhost:35792_solr    ] o.a.s.c.c.ZkStateReader Loaded empty cluster properties
   [junit4]   2> 387467 INFO  (jetty-launcher-473-thread-1) [n:localhost:35792_solr    ] o.a.s.c.c.ZkStateReader Updated live nodes from ZooKeeper... (0) -> (0)
   [junit4]   2> 387468 INFO  (jetty-launcher-473-thread-1) [n:localhost:35792_solr    ] o.a.s.c.c.SolrZkClient makePath: /overseer_elect
   [junit4]   2> 387469 INFO  (jetty-launcher-473-thread-1) [n:localhost:35792_solr    ] o.a.s.c.c.SolrZkClient makePath: /overseer_elect/election
   [junit4]   2> 387470 INFO  (jetty-launcher-473-thread-1) [n:localhost:35792_solr    ] o.a.s.c.Overseer Overseer (id=null) closing
   [junit4]   2> 387470 INFO  (jetty-launcher-473-thread-1) [n:localhost:35792_solr    ] o.a.s.c.LeaderElector Joined leadership election with path: /overseer_elect/election/96362729252716547-localhost:35792_solr-n_0000000000
   [junit4]   2> 387470 INFO  (jetty-launcher-473-thread-1) [n:localhost:35792_solr    ] o.a.s.c.OverseerElectionContext I am going to be the leader localhost:35792_solr
   [junit4]   2> 387470 INFO  (jetty-launcher-473-thread-1) [n:localhost:35792_solr    ] o.a.s.c.c.SolrZkClient makePath: /overseer_elect/leader
   [junit4]   2> 387471 INFO  (jetty-launcher-473-thread-1) [n:localhost:35792_solr    ] o.a.s.c.Overseer Overseer (id=96362729252716547-localhost:35792_solr-n_0000000000) starting
   [junit4]   2> 387472 INFO  (jetty-launcher-473-thread-1) [n:localhost:35792_solr    ] o.a.s.c.c.SolrZkClient makePath: /overseer/queue-work
   [junit4]   2> 387475 INFO  (jetty-launcher-473-thread-1) [n:localhost:35792_solr    ] o.a.s.c.OverseerAutoReplicaFailoverThread Starting OverseerAutoReplicaFailoverThread autoReplicaFailoverWorkLoopDelay=10000 autoReplicaFailoverWaitAfterExpiration=30000 autoReplicaFailoverBadNodeExpiration=60000
   [junit4]   2> 387476 INFO  (OverseerStateUpdate-96362729252716547-localhost:35792_solr-n_0000000000) [n:localhost:35792_solr    ] o.a.s.c.Overseer Starting to work on the main queue
   [junit4]   2> 387477 INFO  (OverseerCollectionConfigSetProcessor-96362729252716547-localhost:35792_solr-n_0000000000) [n:localhost:35792_solr    ] o.a.s.c.OverseerTaskProcessor Process current queue of overseer operations
   [junit4]   2> 387484 INFO  (OverseerStateUpdate-96362729252716547-localhost:35792_solr-n_0000000000) [n:localhost:35792_solr    ] o.a.s.c.c.ZkStateReader Updated live nodes from ZooKeeper... (0) -> (0)
   [junit4]   2> 387489 INFO  (jetty-launcher-473-thread-1) [n:localhost:35792_solr    ] o.a.s.c.ZkController Register node as live in ZooKeeper:/live_nodes/localhost:35792_solr
   [junit4]   2> 387489 INFO  (jetty-launcher-473-thread-1) [n:localhost:35792_solr    ] o.a.s.c.c.SolrZkClient makePath: /live_nodes/localhost:35792_solr
   [junit4]   2> 387490 INFO  (zkCallback-479-thread-1-processing-n:localhost:35792_solr) [n:localhost:35792_solr    ] o.a.s.c.c.ZkStateReader A live node change: [WatchedEvent state:SyncConnected type:NodeChildrenChanged path:/live_nodes], has occurred - updating... (live nodes size: [0])
   [junit4]   2> 387490 INFO  (zkCallback-479-thread-1-processing-n:localhost:35792_solr) [n:localhost:35792_solr    ] o.a.s.c.c.ZkStateReader Updated live nodes from ZooKeeper... (0) -> (1)
   [junit4]   2> 387502 INFO  (jetty-launcher-473-thread-1) [n:localhost:35792_solr    ] o.a.s.c.CoreContainer Security conf doesn't exist. Skipping setup for authorization module.
   [junit4]   2> 387503 INFO  (jetty-launcher-473-thread-1) [n:localhost:35792_solr    ] o.a.s.c.CoreContainer No authentication plugin used.
   [junit4]   2> 387503 INFO  (jetty-launcher-473-thread-1) [n:localhost:35792_solr    ] o.a.s.c.CorePropertiesLocator Looking for core definitions underneath /x1/jenkins/jenkins-slave/workspace/Lucene-Solr-Tests-6.x/solr/build/solr-core/test/J1/temp/solr.util.TestSolrCLIRunExample_3F356DF6A68E3236-001/tempDir-003/node1
   [junit4]   2> 387503 INFO  (jetty-launcher-473-thread-1) [n:localhost:35792_solr    ] o.a.s.c.CorePropertiesLocator Found 0 core definitions
   [junit4]   2> 387504 INFO  (jetty-launcher-473-thread-1) [n:localhost:35792_solr    ] o.a.s.s.SolrDispatchFilter user.dir=/x1/jenkins/jenkins-slave/workspace/Lucene-Solr-Tests-6.x/solr/build/solr-core/test/J1
   [junit4]   2> 387504 INFO  (jetty-launcher-473-thread-1) [n:localhost:35792_solr    ] o.a.s.s.SolrDispatchFilter SolrDispatchFilter.init() done
   [junit4]   2> 387504 INFO  (TEST-TestSolrCLIRunExample.testInteractiveSolrCloudExample-seed#[3F356DF6A68E3236]) [    ] o.a.s.c.c.SolrZkClient Using default ZkCredentialsProvider
   [junit4]   2> 387509 INFO  (TEST-TestSolrCLIRunExample.testInteractiveSolrCloudExample-seed#[3F356DF6A68E3236]) [    ] o.a.s.c.c.ConnectionManager Waiting for client to connect to ZooKeeper
   [junit4]   2> 387513 INFO  (zkCallback-481-thread-1) [    ] o.a.s.c.c.ConnectionManager Watcher org.apache.solr.common.cloud.ConnectionManager@d762fbd name:ZooKeeperConnection Watcher:127.0.0.1:36820 got event WatchedEvent state:SyncConnected type:None path:null path:null type:None
   [junit4]   2> 387513 INFO  (TEST-TestSolrCLIRunExample.testInteractiveSolrCloudExample-seed#[3F356DF6A68E3236]) [    ] o.a.s.c.c.ConnectionManager Client is connected to ZooKeeper
   [junit4]   2> 387513 INFO  (TEST-TestSolrCLIRunExample.testInteractiveSolrCloudExample-seed#[3F356DF6A68E3236]) [    ] o.a.s.c.c.SolrZkClient Using default ZkACLProvider
   [junit4]   2> 387524 INFO  (qtp882645468-3115) [n:localhost:35792_solr    ] o.a.s.s.HttpSolrCall [admin] webapp=null path=/admin/info/system params={wt=json} status=0 QTime=6
   [junit4]   2> 387527 INFO  (qtp882645468-3116) [n:localhost:35792_solr    ] o.a.s.h.a.CollectionsHandler Invoked Collection Action :clusterstatus with params action=CLUSTERSTATUS&wt=json and sendToOCPQueue=true
   [junit4]   2> 387529 INFO  (qtp882645468-3116) [n:localhost:35792_solr    ] o.a.s.s.HttpSolrCall [admin] webapp=null path=/admin/collections params={action=CLUSTERSTATUS&wt=json} status=0 QTime=1
   [junit4]   2> 387530 INFO  (TEST-TestSolrCLIRunExample.testInteractiveSolrCloudExample-seed#[3F356DF6A68E3236]) [    ] o.a.s.c.c.SolrZkClient Using default ZkCredentialsProvider
   [junit4]   2> 387561 INFO  (TEST-TestSolrCLIRunExample.testInteractiveSolrCloudExample-seed#[3F356DF6A68E3236]) [    ] o.a.s.c.c.ConnectionManager Waiting for client to connect to ZooKeeper
   [junit4]   2> 387569 INFO  (zkCallback-485-thread-1) [    ] o.a.s.c.c.ConnectionManager Watcher org.apache.solr.common.cloud.ConnectionManager@2d22dcc8 name:ZooKeeperConnection Watcher:127.0.0.1:36820/solr got event WatchedEvent state:SyncConnected type:None path:null path:null type:None
   [junit4]   2> 387569 INFO  (TEST-TestSolrCLIRunExample.testInteractiveSolrCloudExample-seed#[3F356DF6A68E3236]) [    ] o.a.s.c.c.ConnectionManager Client is connected to ZooKeeper
   [junit4]   2> 387569 INFO  (TEST-TestSolrCLIRunExample.testInteractiveSolrCloudExample-seed#[3F356DF6A68E3236]) [    ] o.a.s.c.c.SolrZkClient Using default ZkACLProvider
   [junit4]   2> 387569 INFO  (TEST-TestSolrCLIRunExample.testInteractiveSolrCloudExample-seed#[3F356DF6A68E3236]) [    ] o.a.s.c.c.ZkStateReader Updating cluster state from ZooKeeper... 
   [junit4]   2> 387570 INFO  (TEST-TestSolrCLIRunExample.testInteractiveSolrCloudExample-seed#[3F356DF6A68E3236]) [    ] o.a.s.c.c.ZkStateReader Loaded empty cluster properties
   [junit4]   2> 387570 INFO  (TEST-TestSolrCLIRunExample.testInteractiveSolrCloudExample-seed#[3F356DF6A68E3236]) [    ] o.a.s.c.c.ZkStateReader Updated live nodes from ZooKeeper... (0) -> (1)
   [junit4]   2> 387580 INFO  (qtp882645468-3113) [n:localhost:35792_solr    ] o.a.s.h.a.CollectionsHandler Invoked Collection Action :list with params action=list&wt=json and sendToOCPQueue=true
   [junit4]   2> 387581 INFO  (qtp882645468-3113) [n:localhost:35792_solr    ] o.a.s.s.HttpSolrCall [admin] webapp=null path=/admin/collections params={action=list&wt=json} status=0 QTime=0
   [junit4]   2> 387590 INFO  (qtp882645468-3117) [n:localhost:35792_solr    ] o.a.s.s.HttpSolrCall [admin] webapp=null path=/admin/info/system params={wt=json} status=0 QTime=6
   [junit4]   2> 387592 INFO  (qtp882645468-3115) [n:localhost:35792_solr    ] o.a.s.h.a.CollectionsHandler Invoked Collection Action :clusterstatus with params action=CLUSTERSTATUS&wt=json and sendToOCPQueue=true
   [junit4]   2> 387593 INFO  (qtp882645468-3115) [n:localhost:35792_solr    ] o.a.s.s.HttpSolrCall [admin] webapp=null path=/admin/collections params={action=CLUSTERSTATUS&wt=json} status=0 QTime=0
   [junit4]   2> 387594 INFO  (TEST-TestSolrCLIRunExample.testInteractiveSolrCloudExample-seed#[3F356DF6A68E3236]) [    ] o.a.s.c.c.SolrZkClient Using default ZkCredentialsProvider
   [junit4]   2> 387599 INFO  (TEST-TestSolrCLIRunExample.testInteractiveSolrCloudExample-seed#[3F356DF6A68E3236]) [    ] o.a.s.c.c.ConnectionManager Waiting for client to connect to ZooKeeper
   [junit4]   2> 387599 INFO  (zkCallback-488-thread-1) [    ] o.a.s.c.c.ConnectionManager Watcher org.apache.solr.common.cloud.ConnectionManager@6d69bc5b name:ZooKeeperConnection Watcher:127.0.0.1:36820/solr got event WatchedEvent state:SyncConnected type:None path:null path:null type:None
   [junit4]   2> 387599 INFO  (TEST-TestSolrCLIRunExample.testInteractiveSolrCloudExample-seed#[3F356DF6A68E3236]) [    ] o.a.s.c.c.ConnectionManager Client is connected to ZooKeeper
   [junit4]   2> 387599 INFO  (TEST-TestSolrCLIRunExample.testInteractiveSolrCloudExample-seed#[3F356DF6A68E3236]) [    ] o.a.s.c.c.SolrZkClient Using default ZkACLProvider
   [junit4]   2> 387599 INFO  (TEST-TestSolrCLIRunExample.testInteractiveSolrCloudExample-seed#[3F356DF6A68E3236]) [    ] o.a.s.c.c.ZkStateReader Updating cluster state from ZooKeeper... 
   [junit4]   2> 387600 INFO  (TEST-TestSolrCLIRunExample.testInteractiveSolrCloudExample-seed#[3F356DF6A68E3236]) [    ] o.a.s.c.c.ZkStateReader Loaded empty cluster properties
   [junit4]   2> 387600 INFO  (TEST-TestSolrCLIRunExample.testInteractiveSolrCloudExample-seed#[3F356DF6A68E3236]) [    ] o.a.s.c.c.ZkStateReader Updated live nodes from ZooKeeper... (0) -> (1)
   [junit4]   2> 387601 INFO  (TEST-TestSolrCLIRunExample.testInteractiveSolrCloudExample-seed#[3F356DF6A68E3236]) [    ] o.a.s.c.c.SolrZkClient makePath: /configs/testCloudExamplePrompt/managed-schema
   [junit4]   2> 387609 INFO  (TEST-TestSolrCLIRunExample.testInteractiveSolrCloudExample-seed#[3F356DF6A68E3236]) [    ] o.a.s.c.c.SolrZkClient makePath: /configs/testCloudExamplePrompt/elevate.xml
   [junit4]   2> 387610 INFO  (TEST-TestSolrCLIRunExample.testInteractiveSolrCloudExample-seed#[3F356DF6A68E3236]) [    ] o.a.s.c.c.SolrZkClient makePath: /configs/testCloudExamplePrompt/synonyms.txt
   [junit4]   2> 387610 INFO  (TEST-TestSolrCLIRunExample.testInteractiveSolrCloudExample-seed#[3F356DF6A68E3236]) [    ] o.a.s.c.c.SolrZkClient makePath: /configs/testCloudExamplePrompt/lang/stopwords_en.txt
   [junit4]   2> 387611 INFO  (TEST-TestSolrCLIRunExample.testInteractiveSolrCloudExample-seed#[3F356DF6A68E3236]) [    ] o.a.s.c.c.SolrZkClient makePath: /configs/testCloudExamplePrompt/lang/stopwords_ro.txt
   [junit4]   2> 387612 INFO  (TEST-TestSolrCLIRunExample.testInteractiveSolrCloudExample-seed#[3F356DF6A68E3236]) [    ] o.a.s.c.c.SolrZkClient makePath: /configs/testCloudExamplePrompt/lang/stopwords_ca.txt
   [junit4]   2> 387613 INFO  (TEST-TestSolrCLIRunExample.testInteractiveSolrCloudExample-seed#[3F356DF6A68E3236]) [    ] o.a.s.c.c.SolrZkClient makePath: /configs/testCloudExamplePrompt/lang/stopwords_bg.txt
   [junit4]   2> 387614 INFO  (TEST-TestSolrCLIRunExample.testInteractiveSolrCloudExample-seed#[3F356DF6A68E3236]) [    ] o.a.s.c.c.SolrZkClient makePath: /configs/testCloudExamplePrompt/lang/stopwords_es.txt
   [junit4]   2> 387614 INFO  (TEST-TestSolrCLIRunExample.testInteractiveSolrCloudExample-seed#[3F356DF6A68E3236]) [    ] o.a.s.c.c.SolrZkClient makePath: /configs/testCloudExamplePrompt/lang/stopwords_ja.txt
   [junit4]   2> 387615 INFO  (TEST-TestSolrCLIRunExample.testInteractiveSolrCloudExample-seed#[3F356DF6A68E3236]) [    ] o.a.s.c.c.SolrZkClient makePath: /configs/testCloudExamplePrompt/lang/stopwords_gl.txt
   [junit4]   2> 387616 INFO  (TEST-TestSolrCLIRunExample.testInteractiveSolrCloudExample-seed#[3F356DF6A68E3236]) [    ] o.a.s.c.c.SolrZkClient makePath: /configs/testCloudExamplePrompt/lang/stopwords_lv.txt
   [junit4]   2> 387617 INFO  (TEST-TestSolrCLIRunExample.testInteractiveSolrCloudExample-seed#[3F356DF6A68E3236]) [    ] o.a.s.c.c.SolrZkClient makePath: /configs/testCloudExamplePrompt/lang/contractions_ca.txt
   [junit4]   2> 387618 INFO  (TEST-TestSolrCLIRunExample.testInteractiveSolrCloudExample-seed#[3F356DF6A68E3236]) [    ] o.a.s.c.c.SolrZkClient makePath: /configs/testCloudExamplePrompt/lang/stopwords_id.txt
   [junit4]   2> 387618 INFO  (TEST-TestSolrCLIRunExample.testInteractiveSolrCloudExample-seed#[3F356DF6A68E3236]) [    ] o.a.s.c.c.SolrZkClient makePath: /configs/testCloudExamplePrompt/lang/stopwords_hi.txt
   [junit4]   2> 387619 INFO  (TEST-TestSolrCLIRunExample.testInteractiveSolrCloudExample-seed#[3F356DF6A68E3236]) [    ] o.a.s.c.c.SolrZkClient makePath: /configs/testCloudExamplePrompt/lang/stopwords_de.txt
   [junit4]   2> 387620 INFO  (TEST-TestSolrCLIRunExample.testInteractiveSolrCloudExample-seed#[3F356DF6A68E3236]) [    ] o.a.s.c.c.SolrZkClient makePath: /configs/testCloudExamplePrompt/lang/stopwords_cz.txt
   [junit4]   2> 387621 INFO  (TEST-TestSolrCLIRunExample.testInteractiveSolrCloudExample-seed#[3F356DF6A68E3236]) [    ] o.a.s.c.c.SolrZkClient makePath: /configs/testCloudExamplePrompt/lang/contractions_fr.txt
   [junit4]   2> 387621 INFO  (TEST-TestSolrCLIRunExample.testInteractiveSolrCloudExample-seed#[3F356DF6A68E3236]) [    ] o.a.s.c.c.SolrZkClient makePath: /configs/testCloudExamplePrompt/lang/stopwords_fa.txt
   [junit4]   2> 387622 INFO  (TEST-TestSolrCLIRunExample.testInteractiveSolrCloudExample-seed#[3F356DF6A68E3236]) [    ] o.a.s.c.c.SolrZkClient makePath: /configs/testCloudExamplePrompt/lang/stopwords_eu.txt
   [junit4]   2> 387623 INFO  (TEST-TestSolrCLIRunExample.testInteractiveSolrCloudExample-seed#[3F356DF6A68E3236]) [    ] o.a.s.c.c.SolrZkClient makePath: /configs/testCloudExamplePrompt/lang/stopwords_ga.txt
   [junit4]   2> 387623 INFO  (TEST-TestSolrCLIRunExample.testInteractiveSolrCloudExample-seed#[3F356DF6A68E3236]) [    ] o.a.s.c.c.SolrZkClient makePath: /configs/testCloudExamplePrompt/lang/contractions_it.txt
   [junit4]   2> 387624 INFO  (TEST-TestSolrCLIRunExample.testInteractiveSolrCloudExample-seed#[3F356DF6A68E3236]) [    ] o.a.s.c.c.SolrZkClient makePath: /configs/testCloudExamplePrompt/lang/stopwords_ar.txt
   [junit4]   2> 387626 INFO  (TEST-TestSolrCLIRunExample.testInteractiveSolrCloudExample-seed#[3F356DF6A68E3236]) [    ] o.a.s.c.c.SolrZkClient makePath: /configs/testCloudExamplePrompt/lang/stopwords_ru.txt
   [junit4]   2> 387627 INFO  (TEST-TestSolrCLIRunExample.testInteractiveSolrCloudExample-seed#[3F356DF6A68E3236]) [    ] o.a.s.c.c.SolrZkClient makePath: /configs/testCloudExamplePrompt/lang/stopwords_tr.txt
   [junit4]   2> 387628 INFO  (TEST-TestSolrCLIRunExample.testInteractiveSolrCloudExample-seed#[3F356DF6A68E3236]) [    ] o.a.s.c.c.SolrZkClient makePath: /configs/testCloudExamplePrompt/lang/stoptags_ja.txt
   [junit4]   2> 387628 INFO  (TEST-TestSolrCLIRunExample.testInteractiveSolrCloudExample-seed#[3F356DF6A68E3236]) [    ] o.a.s.c.c.SolrZkClient makePath: /configs/testCloudExamplePrompt/lang/stopwords_fi.txt
   [junit4]   2> 387633 INFO  (TEST-TestSolrCLIRunExample.testInteractiveSolrCloudExample-seed#[3F356DF6A68E3236]) [    ] o.a.s.c.c.SolrZkClient makePath: /configs/testCloudExamplePrompt/lang/stopwords_nl.txt
   [junit4]   2> 387634 INFO  (TEST-TestSolrCLIRunExample.testInteractiveSolrCloudExample-seed#[3F356DF6A68E3236]) [    ] o.a.s.c.c.SolrZkClient makePath: /configs/testCloudExamplePrompt/lang/hyphenations_ga.txt
   [junit4]   2> 387635 INFO  (TEST-TestSolrCLIRunExample.testInteractiveSolrCloudExample-seed#[3F356DF6A68E3236]) [    ] o.a.s.c.c.SolrZkClient makePath: /configs/testCloudExamplePrompt/lang/stopwords_hu.txt
   [junit4]   2> 387635 INFO  (TEST-TestSolrCLIRunExample.testInteractiveSolrCloudExample-seed#[3F356DF6A68E3236]) [    ] o.a.s.c.c.SolrZkClient makePath: /configs/testCloudExamplePrompt/lang/stopwords_el.txt
   [junit4]   2> 387636 INFO  (TEST-TestSolrCLIRunExample.testInteractiveSolrCloudExample-seed#[3F356DF6A68E3236]) [    ] o.a.s.c.c.SolrZkClient makePath: /configs/testCloudExamplePrompt/lang/stemdict_nl.txt
   [junit4]   2> 387637 INFO  (TEST-TestSolrCLIRunExample.testInteractiveSolrCloudExample-seed#[3F356DF6A68E3236]) [    ] o.a.s.c.c.SolrZkClient makePath: /configs/testCloudExamplePrompt/lang/contractions_ga.txt
   [junit4]   2> 387640 INFO  (TEST-TestSolrCLIRunExample.testInteractiveSolrCloudExample-seed#[3F356DF6A68E3236]) [    ] o.a.s.c.c.SolrZkClient makePath: /configs/testCloudExamplePrompt/lang/stopwords_no.txt
   [junit4]   2> 387651 INFO  (TEST-TestSolrCLIRunExample.testInteractiveSolrCloudExample-seed#[3F356DF6A68E3236]) [    ] o.a.s.c.c.SolrZkClient makePath: /configs/testCloudExamplePrompt/lang/stopwords_pt.txt
   [junit4]   2> 387652 INFO  (TEST-TestSolrCLIRunExample.testInteractiveSolrCloudExample-seed#[3F356DF6A68E3236]) [    ] o.a.s.c.c.SolrZkClient makePath: /configs/testCloudExamplePrompt/lang/stopwords_da.txt
   [junit4]   2> 387653 INFO  (TEST-TestSolrCLIRunExample.testInteractiveSolrCloudExample-seed#[3F356DF6A68E3236]) [    ] o.a.s.c.c.SolrZkClient makePath: /configs/testCloudExamplePrompt/lang/stopwords_sv.txt
   [junit4]   2> 387653 INFO  (TEST-TestSolrCLIRunExample.testInteractiveSolrCloudExample-seed#[3F356DF6A68E3236]) [    ] o.a.s.c.c.SolrZkClient makePath: /configs/testCloudExamplePrompt/lang/userdict_ja.txt
   [junit4]   2> 387654 INFO  (TEST-TestSolrCLIRunExample.testInteractiveSolrCloudExample-seed#[3F356DF6A68E3236]) [    ] o.a.s.c.c.SolrZkClient makePath: /configs/testCloudExamplePrompt/lang/stopwords_th.txt
   [junit4]   2> 387655 INFO  (TEST-TestSolrCLIRunExample.testInteractiveSolrCloudExample-seed#[3F356DF6A68E3236]) [    ] o.a.s.c.c.SolrZkClient makePath: /configs/testCloudExamplePrompt/lang/stopwords_hy.txt
   [junit4]   2> 387655 INFO  (TEST-TestSolrCLIRunExample.testInteractiveSolrCloudExample-seed#[3F356DF6A68E3236]) [    ] o.a.s.c.c.SolrZkClient makePath: /configs/testCloudExamplePrompt/lang/stopwords_fr.txt
   [junit4]   2> 387656 INFO  (TEST-TestSolrCLIRunExample.testInteractiveSolrCloudExample-seed#[3F356DF6A68E3236]) [    ] o.a.s.c.c.SolrZkClient makePath: /configs/testCloudExamplePrompt/lang/stopwords_it.txt
   [junit4]   2> 387657 INFO  (TEST-TestSolrCLIRunExample.testInteractiveSolrCloudExample-seed#[3F356DF6A68E3236]) [    ] o.a.s.c.c.SolrZkClient makePath: /configs/testCloudExamplePrompt/currency.xml
   [junit4]   2> 387658 INFO  (TEST-TestSolrCLIRunExample.testInteractiveSolrCloudExample-seed#[3F356DF6A68E3236]) [    ] o.a.s.c.c.SolrZkClient makePath: /configs/testCloudExamplePrompt/stopwords.txt
   [junit4]   2> 387658 INFO  (TEST-TestSolrCLIRunExample.testInteractiveSolrCloudExample-seed#[3F356DF6A68E3236]) [    ] o.a.s.c.c.SolrZkClient makePath: /configs/testCloudExamplePrompt/params.json
   [junit4]   2> 387659 INFO  (TEST-TestSolrCLIRunExample.testInteractiveSolrCloudExample-seed#[3F356DF6A68E3236]) [    ] o.a.s.c.c.SolrZkClient makePath: /configs/testCloudExamplePrompt/solrconfig.xml
   [junit4]   2> 387660 INFO  (TEST-TestSolrCLIRunExample.testInteractiveSolrCloudExample-seed#[3F356DF6A68E3236]) [    ] o.a.s.c.c.SolrZkClient makePath: /configs/testCloudExamplePrompt/protwords.txt
   [junit4]   2> 387664 INFO  (qtp882645468-3113) [n:localhost:35792_solr    ] o.a.s.h.a.CollectionsHandler Invoked Collection Action :list with params action=list&wt=json and sendToOCPQueue=true
   [junit4]   2> 387664 INFO  (qtp882645468-3113) [n:localhost:35792_solr    ] o.a.s.s.HttpSolrCall [admin] webapp=null path=/admin/collections params={action=list&wt=json} status=0 QTime=0
   [junit4]   2> 387666 INFO  (qtp882645468-3116) [n:localhost:35792_solr    ] o.a.s.h.a.CollectionsHandler Invoked Collection Action :create with params replicationFactor=2&maxShardsPerNode=4&collection.configName=testCloudExamplePrompt&name=testCloudExamplePrompt&action=CREATE&numShards=2&wt=json and sendToOCPQueue=true
   [junit4]   2> 387668 INFO  (OverseerCollectionConfigSetProcessor-96362729252716547-localhost:35792_solr-n_0000000000) [n:localhost:35792_solr    ] o.a.s.c.OverseerTaskProcessor Overseer Collection Message Handler: Get the message id:/overseer/collection-queue-work/qn-0000000000 message:{
   [junit4]   2>   "name":"testCloudExamplePrompt",
   [junit4]   2>   "fromApi":"true",
   [junit4]   2>   "replicationFactor":"2",
   [junit4]   2>   "collection.configName":"testCloudExamplePrompt",
   [junit4]   2>   "numShards":"2",
   [junit4]   2>   "maxShardsPerNode":"4",
   [junit4]   2>   "stateFormat":"2",
   [junit4]   2>   "operation":"create"}
   [junit4]   2> 387678 INFO  (OverseerThreadFactory-1296-thread-1-processing-n:localhost:35792_solr) [n:localhost:35792_solr    ] o.a.s.c.OverseerCollectionMessageHandler OverseerCollectionMessageHandler.processMessage : create , {
   [junit4]   2>   "name":"testCloudExamplePrompt",
   [junit4]   2>   "fromApi":"true",
   [junit4]   2>   "replicationFactor":"2",
   [junit4]   2>   "collection.configName":"testCloudExamplePrompt",
   [junit4]   2>   "numShards":"2",
   [junit4]   2>   "maxShardsPerNode":"4",
   [junit4]   2>   "stateFormat":"2",
   [junit4]   2>   "operation":"create"}
   [junit4]   2> 387678 INFO  (OverseerThreadFactory-1296-thread-1-processing-n:localhost:35792_solr) [n:localhost:35792_solr    ] o.a.s.c.OverseerCollectionMessageHandler Create collection testCloudExamplePrompt
   [junit4]   2> 387680 WARN  (OverseerThreadFactory-1296-thread-1-processing-n:localhost:35792_solr) [n:localhost:35792_solr    ] o.a.s.c.OverseerCollectionMessageHandler Specified replicationFactor of 2 on collection testCloudExamplePrompt is higher than or equal to the number of Solr instances currently live or live and part of your createNodeSet(1). It's unusual to run two replica of the same slice on the same Solr-instance.
   [junit4]   2> 387680 INFO  (OverseerThreadFactory-1296-thread-1-processing-n:localhost:35792_solr) [n:localhost:35792_solr    ] o.a.s.c.OverseerCollectionMessageHandler creating collections conf node /collections/testCloudExamplePrompt 
   [junit4]   2> 387681 INFO  (OverseerThreadFactory-1296-thread-1-processing-n:localhost:35792_solr) [n:localhost:35792_solr    ] o.a.s.c.c.SolrZkClient makePath: /collections/testCloudExamplePrompt
   [junit4]   2> 387682 INFO  (zkCallback-479-thread-1-processing-n:localhost:35792_solr) [n:localhost:35792_solr    ] o.a.s.c.c.ZkStateReader A collections change: [WatchedEvent state:SyncConnected type:NodeChildrenChanged path:/collections], has occurred - updating...
   [junit4]   2> 387682 INFO  (zkCallback-488-thread-1) [    ] o.a.s.c.c.ZkStateReader A collections change: [WatchedEvent state:SyncConnected type:NodeChildrenChanged path:/collections], has occurred - updating...
   [junit4]   2> 387683 INFO  (OverseerStateUpdate-96362729252716547-localhost:35792_solr-n_0000000000) [n:localhost:35792_solr    ] o.a.s.c.Overseer processMessage: queueSize: 1, message = {
   [junit4]   2>   "name":"testCloudExamplePrompt",
   [junit4]   2>   "fromApi":"true",
   [junit4]   2>   "replicationFactor":"2",
   [junit4]   2>   "collection.configName":"testCloudExamplePrompt",
   [junit4]   2>   "numShards":"2",
   [junit4]   2>   "maxShardsPerNode":"4",
   [junit4]   2>   "stateFormat":"2",
   [junit4]   2>   "operation":"create"} current state version: 0
   [junit4]   2> 387683 INFO  (OverseerStateUpdate-96362729252716547-localhost:35792_solr-n_0000000000) [n:localhost:35792_solr    ] o.a.s.c.o.ClusterStateMutator building a new cName: testCloudExamplePrompt
   [junit4]   2> 387684 INFO  (OverseerStateUpdate-96362729252716547-localhost:35792_solr-n_0000000000) [n:localhost:35792_solr    ] o.a.s.c.o.ZkStateWriter going to create_collection /collections/testCloudExamplePrompt/state.json
   [junit4]   2> 387784 INFO  (OverseerThreadFactory-1296-thread-1-processing-n:localhost:35792_solr) [n:localhost:35792_solr    ] o.a.s.c.OverseerCollectionMessageHandler Creating SolrCores for new collection testCloudExamplePrompt, shardNames [shard1, shard2] , replicationFactor : 2
   [junit4]   2> 387784 INFO  (OverseerThreadFactory-1296-thread-1-processing-n:localhost:35792_solr) [n:localhost:35792_solr    ] o.a.s.c.OverseerCollectionMessageHandler Creating core testCloudExamplePrompt_shard2_replica1 as part of shard shard2 of collection testCloudExamplePrompt on localhost:35792_solr
   [junit4]   2> 387784 INFO  (OverseerThreadFactory-1296-thread-1-processing-n:localhost:35792_solr) [n:localhost:35792_solr    ] o.a.s.c.OverseerCollectionMessageHandler Creating core testCloudExamplePrompt_shard2_replica2 as part of shard shard2 of collection testCloudExamplePrompt on localhost:35792_solr
   [junit4]   2> 387784 INFO  (OverseerThreadFactory-1296-thread-1-processing-n:localhost:35792_solr) [n:localhost:35792_solr    ] o.a.s.c.OverseerCollectionMessageHandler Creating core testCloudExamplePrompt_shard1_replica2 as part of shard shard1 of collection testCloudExamplePrompt on localhost:35792_solr
   [junit4]   2> 387789 INFO  (OverseerThreadFactory-1296-thread-1-processing-n:localhost:35792_solr) [n:localhost:35792_solr    ] o.a.s.c.OverseerCollectionMessageHandler Creating core testCloudExamplePrompt_shard1_replica1 as part of shard shard1 of collection testCloudExamplePrompt on localhost:35792_solr
   [junit4]   2> 387793 INFO  (qtp882645468-3113) [n:localhost:35792_solr    ] o.a.s.h.a.CoreAdminOperation core create command qt=/admin/cores&collection.configName=testCloudExamplePrompt&name=testCloudExamplePrompt_shard1_replica1&action=CREATE&numShards=2&collection=testCloudExamplePrompt&shard=shard1&wt=javabin&version=2
   [junit4]   2> 387794 INFO  (qtp882645468-3113) [n:localhost:35792_solr    ] o.a.s.c.CoreDescriptor Created CoreDescriptor: {name=testCloudExamplePrompt_shard1_replica1, collection.configName=testCloudExamplePrompt, config=solrconfig.xml, transient=false, schema=schema.xml, loadOnStartup=true, configSetProperties=configsetprops.json, collection=testCloudExamplePrompt, numShards=2, dataDir=data/, shard=shard1}
   [junit4]   2> 387794 INFO  (qtp882645468-3113) [n:localhost:35792_solr c:testCloudExamplePrompt s:shard1  x:testCloudExamplePrompt_shard1_replica1] o.a.s.c.ZkController publishing state=down
   [junit4]   2> 387795 INFO  (qtp882645468-3113) [n:localhost:35792_solr c:testCloudExamplePrompt s:shard1  x:testCloudExamplePrompt_shard1_replica1] o.a.s.c.ZkController Registering watch for collection testCloudExamplePrompt
   [junit4]   2> 387795 INFO  (qtp882645468-3118) [n:localhost:35792_solr    ] o.a.s.h.a.CoreAdminOperation core create command qt=/admin/cores&collection.configName=testCloudExamplePrompt&name=testCloudExamplePrompt_shard2_replica2&action=CREATE&numShards=2&collection=testCloudExamplePrompt&shard=shard2&wt=javabin&version=2
   [junit4]   2> 387795 INFO  (qtp882645468-3115) [n:localhost:35792_solr    ] o.a.s.h.a.CoreAdminOperation core create command qt=/admin/cores&collection.configName=testCloudExamplePrompt&name=testCloudExamplePrompt_shard1_replica2&action=CREATE&numShards=2&collection=testCloudExamplePrompt&shard=shard1&wt=javabin&version=2
   [junit4]   2> 387796 INFO  (qtp882645468-3118) [n:localhost:35792_solr    ] o.a.s.c.CoreDescriptor Created CoreDescriptor: {name=testCloudExamplePrompt_shard2_replica2, collection.configName=testCloudExamplePrompt, config=solrconfig.xml, transient=false, schema=schema.xml, loadOnStartup=true, configSetProperties=configsetprops.json, collection=testCloudExamplePrompt, numShards=2, dataDir=data/, shard=shard2}
   [junit4]   2> 387796 INFO  (qtp882645468-3115) [n:localhost:35792_solr    ] o.a.s.c.CoreDescriptor Created CoreDescriptor: {name=testCloudExamplePrompt_shard1_replica2, collection.configName=testCloudExamplePrompt, config=solrconfig.xml, transient=false, schema=schema.xml, loadOnStartup=true, configSetProperties=configsetprops.json, collection=testCloudExamplePrompt, numShards=2, dataDir=data/, shard=shard1}
   [junit4]   2> 387796 INFO  (qtp882645468-3119) [n:localhost:35792_solr    ] o.a.s.h.a.CoreAdminOperation core create command qt=/admin/cores&collection.configName=testCloudExamplePrompt&name=testCloudExamplePrompt_shard2_replica1&action=CREATE&numShards=2&collection=testCloudExamplePrompt&shard=shard2&wt=javabin&version=2
   [junit4]   2> 387796 INFO  (qtp882645468-3119) [n:localhost:35792_solr    ] o.a.s.c.CoreDescriptor Created CoreDescriptor: {name=testCloudExamplePrompt_shard2_replica1, collection.configName=testCloudExamplePrompt, config=solrconfig.xml, transient=false, schema=schema.xml, loadOnStartup=true, configSetProperties=configsetprops.json, collection=testCloudExamplePrompt, numShards=2, dataDir=data/, shard=shard2}
   [junit4]   2> 387798 INFO  (qtp882645468-3119) [n:localhost:35792_solr c:testCloudExamplePrompt s:shard2  x:testCloudExamplePrompt_shard2_replica1] o.a.s.c.ZkController publishing state=down
   [junit4]   2> 387798 INFO  (qtp882645468-3113) [n:localhost:35792_solr c:testCloudExamplePrompt s:shard1  x:testCloudExamplePrompt_shard1_replica1] o.a.s.c.c.ZkStateReader Add data for [testCloudExamplePrompt] ver [0]
   [junit4]   2> 387801 INFO  (qtp882645468-3118) [n:localhost:35792_solr c:testCloudExamplePrompt s:shard2  x:testCloudExamplePrompt_shard2_replica2] o.a.s.c.ZkController publishing state=down
   [junit4]   2> 387801 INFO  (OverseerStateUpdate-96362729252716547-localhost:35792_solr-n_0000000000) [n:localhost:35792_solr    ] o.a.s.c.Overseer processMessage: queueSize: 1, message = {
   [junit4]   2>   "core":"testCloudExamplePrompt_shard1_replica1",
   [junit4]   2>   "roles":null,
   [junit4]   2>   "base_url":"http://localhost:35792/solr",
   [junit4]   2>   "node_name":"localhost:35792_solr",
   [junit4]   2>   "numShards":"2",
   [junit4]   2>   "state":"down",
   [junit4]   2>   "shard":"shard1",
   [junit4]   2>   "collection":"testCloudExamplePrompt",
   [junit4]   2>   "operation":"state"} current state version: 0
   [junit4]   2> 387801 INFO  (qtp882645468-3115) [n:localhost:35792_solr c:testCloudExamplePrompt s:shard1  x:testCloudExamplePrompt_shard1_replica2] o.a.s.c.ZkController publishing state=down
   [junit4]   2> 387801 INFO  (OverseerStateUpdate-96362729252716547-localhost:35792_solr-n_0000000000) [n:localhost:35792_solr    ] o.a.s.c.o.ReplicaMutator Update state numShards=2 message={
   [junit4]   2>   "core":"testCloudExamplePrompt_shard1_replica1",
   [junit4]   2>   "roles":null,
   [junit4]   2>   "base_url":"http://localhost:35792/solr",
   [junit4]   2>   "node_name":"localhost:35792_solr",
   [junit4]   2>   "numShards":"2",
   [junit4]   2>   "state":"down",
   [junit4]   2>   "shard":"shard1",
   [junit4]   2>   "collection":"testCloudExamplePrompt",
   [junit4]   2>   "operation":"state"}
   [junit4]   2> 387801 INFO  (qtp882645468-3119) [n:localhost:35792_solr c:testCloudExamplePrompt s:shard2  x:testCloudExamplePrompt_shard2_replica1] o.a.s.c.ZkController Registering watch for collection testCloudExamplePrompt
   [junit4]   2> 387801 INFO  (qtp882645468-3115) [n:localhost:35792_solr c:testCloudExamplePrompt s:shard1  x:testCloudExamplePrompt_shard1_replica2] o.a.s.c.ZkController Registering watch for collection testCloudExamplePrompt
   [junit4]   2> 387801 INFO  (qtp882645468-3118) [n:localhost:35792_solr c:testCloudExamplePrompt s:shard2  x:testCloudExamplePrompt_shard2_replica2] o.a.s.c.ZkController Registering watch for collection testCloudExamplePrompt
   [junit4]   2> 387802 INFO  (qtp882645468-3119) [n:localhost:35792_solr c:testCloudExamplePrompt s:shard2  x:testCloudExamplePrompt_shard2_replica1] o.a.s.c.ZkController look for our core node name
   [junit4]   2> 387802 INFO  (qtp882645468-3118) [n:localhost:35792_solr c:testCloudExamplePrompt s:shard2  x:testCloudExamplePrompt_shard2_replica2] o.a.s.c.ZkController look for our core node name
   [junit4]   2> 387805 INFO  (qtp882645468-3115) [n:localhost:35792_solr c:testCloudExamplePrompt s:shard1  x:testCloudExamplePrompt_shard1_replica2] o.a.s.c.ZkController look for our core node name
   [junit4]   2> 387805 INFO  (OverseerStateUpdate-96362729252716547-localhost:35792_solr-n_0000000000) [n:localhost:35792_solr    ] o.a.s.c.Overseer processMessage: queueSize: 4, message = {
   [junit4]   2>   "core":"testCloudExamplePrompt_shard2_replica1",
   [junit4]   2>   "roles":null,
   [junit4]   2>   "base_url":"http://localhost:35792/solr",
   [junit4]   2>   "node_name":"localhost:35792_solr",
   [junit4]   2>   "numShards":"2",
   [junit4]   2>   "state":"down",
   [junit4]   2>   "shard":"shard2",
   [junit4]   2>   "collection":"testCloudExamplePrompt",
   [junit4]   2>   "operation":"state"} current state version: 0
   [junit4]   2> 387805 INFO  (OverseerStateUpdate-96362729252716547-localhost:35792_solr-n_0000000000) [n:localhost:35792_solr    ] o.a.s.c.o.ReplicaMutator Update state numShards=2 message={
   [junit4]   2>   "core":"testCloudExamplePrompt_shard2_replica1",
   [junit4]   2>   "roles":null,
   [junit4]   2>   "base_url":"http://localhost:35792/solr",
   [junit4]   2>   "node_name":"localhost:35792_solr",
   [junit4]   2>   "numShards":"2",
   [junit4]   2>   "state":"down",
   [junit4]   2>   "shard":"shard2",
   [junit4]   2>   "collection":"testCloudExamplePrompt",
   [junit4]   2>   "operation":"state"}
   [junit4]   2> 387805 INFO  (qtp882645468-3113) [n:localhost:35792_solr c:testCloudExamplePrompt s:shard1  x:testCloudExamplePrompt_shard1_replica1] o.a.s.c.ZkController look for our core node name
   [junit4]   2> 387806 INFO  (OverseerStateUpdate-96362729252716547-localhost:35792_solr-n_0000000000) [n:localhost:35792_solr    ] o.a.s.c.Overseer processMessage: queueSize: 4, message = {
   [junit4]   2>   "core":"testCloudExamplePrompt_shard2_replica2",
   [junit4]   2>   "roles":null,
   [junit4]   2>   "base_url":"http://localhost:35792/solr",
   [junit4]   2>   "node_name":"localhost:35792_solr",
   [junit4]   2>   "numShards":"2",
   [junit4]   2>   "state":"down",
   [junit4]   2>   "shard":"shard2",
   [junit4]   2>   "collection":"testCloudExamplePrompt",
   [junit4]   2>   "operation":"state"} current state version: 0
   [junit4]   2> 387806 INFO  (OverseerStateUpdate-96362729252716547-localhost:35792_solr-n_0000000000) [n:localhost:35792_solr    ] o.a.s.c.o.ReplicaMutator Update state numShards=2 message={
   [junit4]   2>   "core":"testCloudExamplePrompt_shard2_replica2",
   [junit4]   2>   "roles":null,
   [junit4]   2>   "base_url":"http://localhost:35792/solr",
   [junit4]   2>   "node_name":"localhost:35792_solr",
   [junit4]   2>   "numShards":"2",
   [junit4]   2>   "state":"down",
   [junit4]   2>   "shard":"shard2",
   [junit4]   2>   "collection":"testCloudExamplePrompt",
   [junit4]   2>   "operation":"state"}
   [junit4]   2> 387807 INFO  (OverseerStateUpdate-96362729252716547-localhost:35792_solr-n_0000000000) [n:localhost:35792_solr    ] o.a.s.c.Overseer processMessage: queueSize: 4, message = {
   [junit4]   2>   "core":"testCloudExamplePrompt_shard1_replica2",
   [junit4]   2>   "roles":null,
   [junit4]   2>   "base_url":"http://localhost:35792/solr",
   [junit4]   2>   "node_name":"localhost:35792_solr",
   [junit4]   2>   "numShards":"2",
   [junit4]   2>   "state":"down",
   [junit4]   2>   "shard":"shard1",
   [junit4]   2>   "collection":"testCloudExamplePrompt",
   [junit4]   2>   "operation":"state"} current state version: 0
   [junit4]   2> 387807 INFO  (OverseerStateUpdate-96362729252716547-localhost:35792_solr-n_0000000000) [n:localhost:35792_solr    ] o.a.s.c.o.ReplicaMutator Update state numShards=2 message={
   [junit4]   2>   "core":"testCloudExamplePrompt_shard1_replica2",
   [junit4]   2>   "roles":null,
   [junit4]   2>   "base_url":"http://localhost:35792/solr",
   [junit4]   2>   "node_name":"localhost:35792_solr",
   [junit4]   2>   "numShards":"2",
   [junit4]   2>   "state":"down",
   [junit4]   2>   "shard":"shard1",
   [junit4]   2>   "collection":"testCloudExamplePrompt",
   [junit4]   2>   "operation":"state"}
   [junit4]   2> 387908 INFO  (OverseerStateUpdate-96362729252716547-localhost:35792_solr-n_0000000000) [n:localhost:35792_solr    ] o.a.s.c.o.ZkStateWriter going to update_collection /collections/testCloudExamplePrompt/state.json version: 0
   [junit4]   2> 387908 INFO  (zkCallback-479-thread-2-processing-n:localhost:35792_solr) [n:localhost:35792_solr    ] o.a.s.c.c.ZkStateReader A cluster state change: [WatchedEvent state:SyncConnected type:NodeDataChanged path:/collections/testCloudExamplePrompt/state.json] for collection [testCloudExamplePrompt] has occurred - updating... (live nodes size: [1])
   [junit4]   2> 387917 INFO  (zkCallback-479-thread-2-processing-n:localhost:35792_solr) [n:localhost:35792_solr    ] o.a.s.c.c.ZkStateReader Updating data for [testCloudExamplePrompt] from [0] to [1]
   [junit4]   2> 388802 INFO  (qtp882645468-3119) [n:localhost:35792_solr c:testCloudExamplePrompt s:shard2  x:testCloudExamplePrompt_shard2_replica1] o.a.s.c.ZkController waiting to find shard id in clusterstate for testCloudExamplePrompt_shard2_replica1
   [junit4]   2> 388802 INFO  (qtp882645468-3119) [n:localhost:35792_solr c:testCloudExamplePrompt s:shard2  x:testCloudExamplePrompt_shard2_replica1] o.a.s.c.ZkController Check for collection zkNode:testCloudExamplePrompt
   [junit4]   2> 388802 INFO  (qtp882645468-3118) [n:localhost:35792_solr c:testCloudExamplePrompt s:shard2  x:testCloudExamplePrompt_shard2_replica2] o.a.s.c.ZkController waiting to find shard id in clusterstate for testCloudExamplePrompt_shard2_replica2
   [junit4]   2> 388802 INFO  (qtp882645468-3118) [n:localhost:35792_solr c:testCloudExamplePrompt s:shard2  x:testCloudExamplePrompt_shard2_replica2] o.a.s.c.ZkController Check for collection zkNode:testCloudExamplePrompt
   [junit4]   2> 388803 INFO  (qtp882645468-3118) [n:localhost:35792_solr c:testCloudExamplePrompt s:shard2  x:testCloudExamplePrompt_shard2_replica2] o.a.s.c.ZkController Collection zkNode exists
   [junit4]   2> 388803 INFO  (qtp882645468-3118) [n:localhost:35792_solr c:testCloudExamplePrompt s:shard2  x:testCloudExamplePrompt_shard2_replica2] o.a.s.c.c.ZkStateReader Load collection config from: [/collections/testCloudExamplePrompt]
   [junit4]   2> 388803 INFO  (qtp882645468-3119) [n:localhost:35792_solr c:testCloudExamplePrompt s:shard2  x:testCloudExamplePrompt_shard2_replica1] o.a.s.c.ZkController Collection zkNode exists
   [junit4]   2> 388803 INFO  (qtp882645468-3119) [n:localhost:35792_solr c:testCloudExamplePrompt s:shard2  x:testCloudExamplePrompt_shard2_replica1] o.a.s.c.c.ZkStateReader Load collection config from: [/collections/testCloudExamplePrompt]
   [junit4]   2> 388803 INFO  (qtp882645468-3118) [n:localhost:35792_solr c:testCloudExamplePrompt s:shard2  x:testCloudExamplePrompt_shard2_replica2] o.a.s.c.c.ZkStateReader path=[/collections/testCloudExamplePrompt] [configName]=[testCloudExamplePrompt] specified config exists in ZooKeeper
   [junit4]   2> 388803 INFO  (qtp882645468-3118) [n:localhost:35792_solr c:testCloudExamplePrompt s:shard2  x:testCloudExamplePrompt_shard2_replica2] o.a.s.c.SolrResourceLoader new SolrResourceLoader for directory: '/x1/jenkins/jenkins-slave/workspace/Lucene-Solr-Tests-6.x/solr/build/solr-core/test/J1/temp/solr.util.TestSolrCLIRunExample_3F356DF6A68E3236-001/tempDir-003/node1/testCloudExamplePrompt_shard2_replica2'
   [junit4]   2> 388803 INFO  (qtp882645468-3118) [n:localhost:35792_solr c:testCloudExamplePrompt s:shard2  x:testCloudExamplePrompt_shard2_replica2] o.a.s.c.SolrResourceLoader JNDI not configured for solr (NoInitialContextEx)
   [junit4]   2> 388803 INFO  (qtp882645468-3118) [n:localhost:35792_solr c:testCloudExamplePrompt s:shard2  x:testCloudExamplePrompt_shard2_replica2] o.a.s.c.SolrResourceLoader solr home defaulted to 'solr/' (could not find system property or JNDI)
   [junit4]   2> 388804 INFO  (qtp882645468-3119) [n:localhost:35792_solr c:testCloudExamplePrompt s:shard2  x:testCloudExamplePrompt_shard2_replica1] o.a.s.c.c.ZkStateReader path=[/collections/testCloudExamplePrompt] [configName]=[testCloudExamplePrompt] specified config exists in ZooKeeper
   [junit4]   2> 388804 INFO  (qtp882645468-3119) [n:localhost:35792_solr c:testCloudExamplePrompt s:shard2  x:testCloudExamplePrompt_shard2_replica1] o.a.s.c.SolrResourceLoader new SolrResourceLoader for directory: '/x1/jenkins/jenkins-slave/workspace/Lucene-Solr-Tests-6.x/solr/build/solr-core/test/J1/temp/solr.util.TestSolrCLIRunExample_3F356DF6A68E3236-001/tempDir-003/node1/testCloudExamplePrompt_shard2_replica1'
   [junit4]   2> 388804 INFO  (qtp882645468-3119) [n:localhost:35792_solr c:testCloudExamplePrompt s:shard2  x:testCloudExamplePrompt_shard2_replica1] o.a.s.c.SolrResourceLoader JNDI not configured for solr (NoInitialContextEx)
   [junit4]   2> 388805 INFO  (qtp882645468-3119) [n:localhost:35792_solr c:testCloudExamplePrompt s:shard2  x:testCloudExamplePrompt_shard2_replica1] o.a.s.c.SolrResourceLoader solr home defaulted to 'solr/' (could not find system property or JNDI)
   [junit4]   2> 388805 INFO  (qtp882645468-3115) [n:localhost:35792_solr c:testCloudExamplePrompt s:shard1  x:testCloudExamplePrompt_shard1_replica2] o.a.s.c.ZkController waiting to find shard id in clusterstate for testCloudExamplePrompt_shard1_replica2
   [junit4]   2> 388805 INFO  (qtp882645468-3115) [n:localhost:35792_solr c:testCloudExamplePrompt s:shard1  x:testCloudExamplePrompt_shard1_replica2] o.a.s.c.ZkController Check for collection zkNode:testCloudExamplePrompt
   [junit4]   2> 388805 INFO  (qtp882645468-3115) [n:localhost:35792_solr c:testCloudExamplePrompt s:shard1  x:testCloudExamplePrompt_shard1_replica2] o.

[...truncated too long message...]

:1092)
   [junit4]   2> 	at org.eclipse.jetty.server.handler.ScopedHandler.handle(ScopedHandler.java:141)
   [junit4]   2> 	at org.eclipse.jetty.server.handler.gzip.GzipHandler.handle(GzipHandler.java:399)
   [junit4]   2> 	at org.eclipse.jetty.server.handler.HandlerWrapper.handle(HandlerWrapper.java:134)
   [junit4]   2> 	at org.eclipse.jetty.server.Server.handle(Server.java:518)
   [junit4]   2> 	at org.eclipse.jetty.server.HttpChannel.handle(HttpChannel.java:308)
   [junit4]   2> 	at org.eclipse.jetty.server.HttpConnection.onFillable(HttpConnection.java:244)
   [junit4]   2> 	at org.eclipse.jetty.io.AbstractConnection$ReadCallback.succeeded(AbstractConnection.java:273)
   [junit4]   2> 	at org.eclipse.jetty.io.FillInterest.fillable(FillInterest.java:95)
   [junit4]   2> 	at org.eclipse.jetty.io.SelectChannelEndPoint$2.run(SelectChannelEndPoint.java:93)
   [junit4]   2> 	at org.eclipse.jetty.util.thread.strategy.ExecuteProduceConsume.produceAndRun(ExecuteProduceConsume.java:246)
   [junit4]   2> 	at org.eclipse.jetty.util.thread.strategy.ExecuteProduceConsume.run(ExecuteProduceConsume.java:156)
   [junit4]   2> 	at org.eclipse.jetty.util.thread.QueuedThreadPool.runJob(QueuedThreadPool.java:654)
   [junit4]   2> 	at org.eclipse.jetty.util.thread.QueuedThreadPool$3.run(QueuedThreadPool.java:572)
   [junit4]   2> 	at java.lang.Thread.run(Thread.java:745)
   [junit4]   2> 
   [junit4]   2> org.apache.solr.common.util.ObjectReleaseTracker$ObjectTrackerException
   [junit4]   2> 	at org.apache.solr.common.util.ObjectReleaseTracker.track(ObjectReleaseTracker.java:42)
   [junit4]   2> 	at org.apache.solr.core.SolrCore.<init>(SolrCore.java:850)
   [junit4]   2> 	at org.apache.solr.core.SolrCore.reload(SolrCore.java:503)
   [junit4]   2> 	at org.apache.solr.core.CoreContainer.reload(CoreContainer.java:940)
   [junit4]   2> 	at org.apache.solr.core.SolrCore.lambda$getConfListener$6(SolrCore.java:2578)
   [junit4]   2> 	at org.apache.solr.cloud.ZkController.lambda$fireEventListeners$3(ZkController.java:2443)
   [junit4]   2> 	at java.lang.Thread.run(Thread.java:745)
   [junit4]   2> 
   [junit4]   2> 402025 INFO  (Thread-783) [n:localhost:35792_solr    ] o.a.s.c.CachingDirectoryFactory Closing MockDirectoryFactory - 3 directories currently being tracked
   [junit4]   2> 402025 INFO  (Thread-783) [n:localhost:35792_solr    ] o.a.s.c.CachingDirectoryFactory looking to close /x1/jenkins/jenkins-slave/workspace/Lucene-Solr-Tests-6.x/solr/build/solr-core/test/J1/temp/solr.util.TestSolrCLIRunExample_3F356DF6A68E3236-001/tempDir-003/node1/testCloudExamplePrompt_shard1_replica2/data/snapshot_metadata [CachedDir<<refCount=0;path=/x1/jenkins/jenkins-slave/workspace/Lucene-Solr-Tests-6.x/solr/build/solr-core/test/J1/temp/solr.util.TestSolrCLIRunExample_3F356DF6A68E3236-001/tempDir-003/node1/testCloudExamplePrompt_shard1_replica2/data/snapshot_metadata;done=false>>]
   [junit4]   2> 402025 INFO  (Thread-783) [n:localhost:35792_solr    ] o.a.s.c.CachingDirectoryFactory Closing directory, CoreContainer#isShutdown=true
   [junit4]   2> 402025 INFO  (Thread-783) [n:localhost:35792_solr    ] o.a.s.c.CachingDirectoryFactory Closing directory: /x1/jenkins/jenkins-slave/workspace/Lucene-Solr-Tests-6.x/solr/build/solr-core/test/J1/temp/solr.util.TestSolrCLIRunExample_3F356DF6A68E3236-001/tempDir-003/node1/testCloudExamplePrompt_shard1_replica2/data/snapshot_metadata
   [junit4]   2> 402026 INFO  (Thread-783) [n:localhost:35792_solr    ] o.a.s.c.CachingDirectoryFactory looking to close /x1/jenkins/jenkins-slave/workspace/Lucene-Solr-Tests-6.x/solr/build/solr-core/test/J1/temp/solr.util.TestSolrCLIRunExample_3F356DF6A68E3236-001/tempDir-003/node1/testCloudExamplePrompt_shard1_replica2/data/index [CachedDir<<refCount=0;path=/x1/jenkins/jenkins-slave/workspace/Lucene-Solr-Tests-6.x/solr/build/solr-core/test/J1/temp/solr.util.TestSolrCLIRunExample_3F356DF6A68E3236-001/tempDir-003/node1/testCloudExamplePrompt_shard1_replica2/data/index;done=false>>]
   [junit4]   2> 402026 INFO  (Thread-783) [n:localhost:35792_solr    ] o.a.s.c.CachingDirectoryFactory Closing directory, CoreContainer#isShutdown=true
   [junit4]   2> 402026 INFO  (Thread-783) [n:localhost:35792_solr    ] o.a.s.c.CachingDirectoryFactory Closing directory: /x1/jenkins/jenkins-slave/workspace/Lucene-Solr-Tests-6.x/solr/build/solr-core/test/J1/temp/solr.util.TestSolrCLIRunExample_3F356DF6A68E3236-001/tempDir-003/node1/testCloudExamplePrompt_shard1_replica2/data/index
   [junit4]   2> 402026 INFO  (Thread-783) [n:localhost:35792_solr    ] o.a.s.c.CachingDirectoryFactory looking to close /x1/jenkins/jenkins-slave/workspace/Lucene-Solr-Tests-6.x/solr/build/solr-core/test/J1/temp/solr.util.TestSolrCLIRunExample_3F356DF6A68E3236-001/tempDir-003/node1/testCloudExamplePrompt_shard1_replica2/data [CachedDir<<refCount=0;path=/x1/jenkins/jenkins-slave/workspace/Lucene-Solr-Tests-6.x/solr/build/solr-core/test/J1/temp/solr.util.TestSolrCLIRunExample_3F356DF6A68E3236-001/tempDir-003/node1/testCloudExamplePrompt_shard1_replica2/data;done=false>>]
   [junit4]   2> 402026 INFO  (Thread-783) [n:localhost:35792_solr    ] o.a.s.c.CachingDirectoryFactory Closing directory, CoreContainer#isShutdown=true
   [junit4]   2> 402026 INFO  (Thread-783) [n:localhost:35792_solr    ] o.a.s.c.CachingDirectoryFactory Closing directory: /x1/jenkins/jenkins-slave/workspace/Lucene-Solr-Tests-6.x/solr/build/solr-core/test/J1/temp/solr.util.TestSolrCLIRunExample_3F356DF6A68E3236-001/tempDir-003/node1/testCloudExamplePrompt_shard1_replica2/data
   [junit4]   2> 402026 INFO  (Thread-783) [n:localhost:35792_solr    ] o.a.s.c.CachingDirectoryFactory Removing directory after core close: /x1/jenkins/jenkins-slave/workspace/Lucene-Solr-Tests-6.x/solr/build/solr-core/test/J1/temp/solr.util.TestSolrCLIRunExample_3F356DF6A68E3236-001/tempDir-003/node1/testCloudExamplePrompt_shard1_replica2/data
   [junit4]   2> 402026 WARN  (Thread-783) [n:localhost:35792_solr    ] o.a.s.c.SolrCore 
   [junit4]   2> org.apache.solr.core.SolrResourceNotFoundException: Can't find resource 'managed-schema' in classpath or '/configs/testCloudExamplePrompt', cwd=/x1/jenkins/jenkins-slave/workspace/Lucene-Solr-Tests-6.x/solr/build/solr-core/test/J1
   [junit4]   2> 	at org.apache.solr.cloud.ZkSolrResourceLoader.openResource(ZkSolrResourceLoader.java:130)
   [junit4]   2> 	at org.apache.solr.schema.SchemaManager.getFreshManagedSchema(SchemaManager.java:429)
   [junit4]   2> 	at org.apache.solr.core.SolrCore.lambda$getConfListener$6(SolrCore.java:2571)
   [junit4]   2> 	at org.apache.solr.cloud.ZkController.lambda$fireEventListeners$3(ZkController.java:2443)
   [junit4]   2> 	at java.lang.Thread.run(Thread.java:745)
   [junit4]   2> 402026 INFO  (Thread-783) [n:localhost:35792_solr    ] o.a.s.c.SolrCore core reload testCloudExamplePrompt_shard1_replica2
   [junit4]   2> 402026 WARN  (Thread-783) [n:localhost:35792_solr    ] o.a.s.c.ZkController listener throws error
   [junit4]   2> org.apache.solr.common.SolrException: No such core: testCloudExamplePrompt_shard1_replica2
   [junit4]   2> 	at org.apache.solr.core.CoreContainer.reload(CoreContainer.java:933)
   [junit4]   2> 	at org.apache.solr.core.SolrCore.lambda$getConfListener$6(SolrCore.java:2578)
   [junit4]   2> 	at org.apache.solr.cloud.ZkController.lambda$fireEventListeners$3(ZkController.java:2443)
   [junit4]   2> 	at java.lang.Thread.run(Thread.java:745)
   [junit4]   2> Aug 05, 2016 6:29:33 AM com.carrotsearch.randomizedtesting.ThreadLeakControl checkThreadLeaks
   [junit4]   2> WARNING: Will linger awaiting termination of 2 leaked thread(s).
   [junit4]   2> NOTE: test params are: codec=Asserting(Lucene62): {}, docValues:{}, maxPointsInLeafNode=1713, maxMBSortInHeap=6.7341059023137895, sim=ClassicSimilarity, locale=lt, timezone=Europe/Kaliningrad
   [junit4]   2> NOTE: Linux 3.13.0-85-generic amd64/Oracle Corporation 1.8.0_74 (64-bit)/cpus=4,threads=1,free=302636448,total=512229376
   [junit4]   2> NOTE: All tests run in this JVM: [MoreLikeThisHandlerTest, TriLevelCompositeIdRoutingTest, TestSystemIdResolver, TestManagedSchemaAPI, TestUseDocValuesAsStored2, TestFieldSortValues, QueryResultKeyTest, TestStressVersions, TestQueryWrapperFilter, OverseerModifyCollectionTest, ChaosMonkeyNothingIsSafeTest, OverseerTaskQueueTest, TestCodecSupport, TestQuerySenderListener, TestSolrDeletionPolicy2, TestSolrCloudWithKerberosAlt, IgnoreCommitOptimizeUpdateProcessorFactoryTest, TestReRankQParserPlugin, TestSolrXml, DistributedSuggestComponentTest, ZkSolrClientTest, TestSimpleTrackingShardHandler, TestRuleBasedAuthorizationPlugin, VersionInfoTest, SSLMigrationTest, TestOrdValues, TestSubQueryTransformer, TestMacros, ClusterStateUpdateTest, TestFieldCollectionResource, TestDistributedGrouping, HdfsBasicDistributedZkTest, TestQuerySenderNoQuery, BigEndianAscendingWordSerializerTest, TestCloudPivotFacet, AliasIntegrationTest, TestSolr4Spatial2, DOMUtilTest, DistributedIntervalFacetingTest, ZkControllerTest, TestSolrQueryResponse, DistanceFunctionTest, AsyncMigrateRouteKeyTest, SpellingQueryConverterTest, TestFieldCacheWithThreads, TestSolrCLIRunExample]
   [junit4]   2> NOTE: reproduce with: ant test  -Dtestcase=TestSolrCLIRunExample -Dtests.seed=3F356DF6A68E3236 -Dtests.multiplier=2 -Dtests.slow=true -Dtests.locale=lt -Dtests.timezone=Europe/Kaliningrad -Dtests.asserts=true -Dtests.file.encoding=UTF-8
   [junit4] ERROR   0.00s J1 | TestSolrCLIRunExample (suite) <<<
   [junit4]    > Throwable #1: java.lang.AssertionError: ObjectTracker found 4 object(s) that were not released!!! [MockDirectoryWrapper, MockDirectoryWrapper, MockDirectoryWrapper, SolrCore]
   [junit4]    > 	at __randomizedtesting.SeedInfo.seed([3F356DF6A68E3236]:0)
   [junit4]    > 	at org.apache.solr.SolrTestCaseJ4.teardownTestCases(SolrTestCaseJ4.java:258)
   [junit4]    > 	at java.lang.Thread.run(Thread.java:745)
   [junit4] Completed [141/626 (1!)] on J1 in 17.79s, 3 tests, 1 failure, 1 skipped <<< FAILURES!

[...truncated 61660 lines...]



Mime
View raw message