lucene-dev mailing list archives

Site index · List index
Message view « Date » · « Thread »
Top « Date » · « Thread »
From Policeman Jenkins Server <jenk...@thetaphi.de>
Subject [JENKINS-EA] Lucene-Solr-6.x-Linux (64bit/jdk-9-ea+127) - Build # 1200 - Unstable!
Date Tue, 19 Jul 2016 01:33:23 GMT
Build: http://jenkins.thetaphi.de/job/Lucene-Solr-6.x-Linux/1200/
Java: 64bit/jdk-9-ea+127 -XX:-UseCompressedOops -XX:+UseG1GC

1 tests failed.
FAILED:  org.apache.solr.cloud.LeaderFailoverAfterPartitionTest.test

Error Message:
No live SolrServers available to handle this request:[http://127.0.0.1:38421/c8n_1x3_lf_shard1_replica2]

Stack Trace:
org.apache.solr.client.solrj.impl.CloudSolrClient$RouteException: No live SolrServers available to handle this request:[http://127.0.0.1:38421/c8n_1x3_lf_shard1_replica2]
	at __randomizedtesting.SeedInfo.seed([CBC62745B607978D:4392189F18FBFA75]:0)
	at org.apache.solr.client.solrj.impl.CloudSolrClient.directUpdate(CloudSolrClient.java:739)
	at org.apache.solr.client.solrj.impl.CloudSolrClient.sendRequest(CloudSolrClient.java:1151)
	at org.apache.solr.client.solrj.impl.CloudSolrClient.requestWithRetryOnStaleState(CloudSolrClient.java:1040)
	at org.apache.solr.client.solrj.impl.CloudSolrClient.request(CloudSolrClient.java:976)
	at org.apache.solr.client.solrj.SolrClient.request(SolrClient.java:1219)
	at org.apache.solr.cloud.HttpPartitionTest.sendDoc(HttpPartitionTest.java:592)
	at org.apache.solr.cloud.HttpPartitionTest.sendDoc(HttpPartitionTest.java:578)
	at org.apache.solr.cloud.LeaderFailoverAfterPartitionTest.testRf3WithLeaderFailover(LeaderFailoverAfterPartitionTest.java:174)
	at org.apache.solr.cloud.LeaderFailoverAfterPartitionTest.test(LeaderFailoverAfterPartitionTest.java:55)
	at jdk.internal.reflect.NativeMethodAccessorImpl.invoke0(java.base@9-ea/Native Method)
	at jdk.internal.reflect.NativeMethodAccessorImpl.invoke(java.base@9-ea/NativeMethodAccessorImpl.java:62)
	at jdk.internal.reflect.DelegatingMethodAccessorImpl.invoke(java.base@9-ea/DelegatingMethodAccessorImpl.java:43)
	at java.lang.reflect.Method.invoke(java.base@9-ea/Method.java:533)
	at com.carrotsearch.randomizedtesting.RandomizedRunner.invoke(RandomizedRunner.java:1764)
	at com.carrotsearch.randomizedtesting.RandomizedRunner$8.evaluate(RandomizedRunner.java:871)
	at com.carrotsearch.randomizedtesting.RandomizedRunner$9.evaluate(RandomizedRunner.java:907)
	at com.carrotsearch.randomizedtesting.RandomizedRunner$10.evaluate(RandomizedRunner.java:921)
	at org.apache.solr.BaseDistributedSearchTestCase$ShardsRepeatRule$ShardsFixedStatement.callStatement(BaseDistributedSearchTestCase.java:992)
	at org.apache.solr.BaseDistributedSearchTestCase$ShardsRepeatRule$ShardsStatement.evaluate(BaseDistributedSearchTestCase.java:967)
	at com.carrotsearch.randomizedtesting.rules.SystemPropertiesRestoreRule$1.evaluate(SystemPropertiesRestoreRule.java:57)
	at org.apache.lucene.util.TestRuleSetupTeardownChained$1.evaluate(TestRuleSetupTeardownChained.java:49)
	at org.apache.lucene.util.AbstractBeforeAfterRule$1.evaluate(AbstractBeforeAfterRule.java:45)
	at org.apache.lucene.util.TestRuleThreadAndTestName$1.evaluate(TestRuleThreadAndTestName.java:48)
	at org.apache.lucene.util.TestRuleIgnoreAfterMaxFailures$1.evaluate(TestRuleIgnoreAfterMaxFailures.java:64)
	at org.apache.lucene.util.TestRuleMarkFailure$1.evaluate(TestRuleMarkFailure.java:47)
	at com.carrotsearch.randomizedtesting.rules.StatementAdapter.evaluate(StatementAdapter.java:36)
	at com.carrotsearch.randomizedtesting.ThreadLeakControl$StatementRunner.run(ThreadLeakControl.java:367)
	at com.carrotsearch.randomizedtesting.ThreadLeakControl.forkTimeoutingTask(ThreadLeakControl.java:809)
	at com.carrotsearch.randomizedtesting.ThreadLeakControl$3.evaluate(ThreadLeakControl.java:460)
	at com.carrotsearch.randomizedtesting.RandomizedRunner.runSingleTest(RandomizedRunner.java:880)
	at com.carrotsearch.randomizedtesting.RandomizedRunner$5.evaluate(RandomizedRunner.java:781)
	at com.carrotsearch.randomizedtesting.RandomizedRunner$6.evaluate(RandomizedRunner.java:816)
	at com.carrotsearch.randomizedtesting.RandomizedRunner$7.evaluate(RandomizedRunner.java:827)
	at com.carrotsearch.randomizedtesting.rules.StatementAdapter.evaluate(StatementAdapter.java:36)
	at com.carrotsearch.randomizedtesting.rules.SystemPropertiesRestoreRule$1.evaluate(SystemPropertiesRestoreRule.java:57)
	at org.apache.lucene.util.AbstractBeforeAfterRule$1.evaluate(AbstractBeforeAfterRule.java:45)
	at com.carrotsearch.randomizedtesting.rules.StatementAdapter.evaluate(StatementAdapter.java:36)
	at org.apache.lucene.util.TestRuleStoreClassName$1.evaluate(TestRuleStoreClassName.java:41)
	at com.carrotsearch.randomizedtesting.rules.NoShadowingOrOverridesOnMethodsRule$1.evaluate(NoShadowingOrOverridesOnMethodsRule.java:40)
	at com.carrotsearch.randomizedtesting.rules.NoShadowingOrOverridesOnMethodsRule$1.evaluate(NoShadowingOrOverridesOnMethodsRule.java:40)
	at com.carrotsearch.randomizedtesting.rules.StatementAdapter.evaluate(StatementAdapter.java:36)
	at com.carrotsearch.randomizedtesting.rules.StatementAdapter.evaluate(StatementAdapter.java:36)
	at com.carrotsearch.randomizedtesting.rules.StatementAdapter.evaluate(StatementAdapter.java:36)
	at org.apache.lucene.util.TestRuleAssertionsRequired$1.evaluate(TestRuleAssertionsRequired.java:53)
	at org.apache.lucene.util.TestRuleMarkFailure$1.evaluate(TestRuleMarkFailure.java:47)
	at org.apache.lucene.util.TestRuleIgnoreAfterMaxFailures$1.evaluate(TestRuleIgnoreAfterMaxFailures.java:64)
	at org.apache.lucene.util.TestRuleIgnoreTestSuites$1.evaluate(TestRuleIgnoreTestSuites.java:54)
	at com.carrotsearch.randomizedtesting.rules.StatementAdapter.evaluate(StatementAdapter.java:36)
	at com.carrotsearch.randomizedtesting.ThreadLeakControl$StatementRunner.run(ThreadLeakControl.java:367)
	at java.lang.Thread.run(java.base@9-ea/Thread.java:843)
Caused by: org.apache.solr.client.solrj.SolrServerException: No live SolrServers available to handle this request:[http://127.0.0.1:38421/c8n_1x3_lf_shard1_replica2]
	at org.apache.solr.client.solrj.impl.LBHttpSolrClient.request(LBHttpSolrClient.java:383)
	at org.apache.solr.client.solrj.impl.CloudSolrClient.lambda$directUpdate$0(CloudSolrClient.java:714)
	at java.util.concurrent.FutureTask.run(java.base@9-ea/FutureTask.java:266)
	at org.apache.solr.common.util.ExecutorUtil$MDCAwareThreadPoolExecutor.lambda$execute$0(ExecutorUtil.java:229)
	at java.util.concurrent.ThreadPoolExecutor.runWorker(java.base@9-ea/ThreadPoolExecutor.java:1158)
	at java.util.concurrent.ThreadPoolExecutor$Worker.run(java.base@9-ea/ThreadPoolExecutor.java:632)
	... 1 more
Caused by: org.apache.solr.client.solrj.SolrServerException: Server refused connection at: http://127.0.0.1:38421/c8n_1x3_lf_shard1_replica2
	at org.apache.solr.client.solrj.impl.HttpSolrClient.executeMethod(HttpSolrClient.java:597)
	at org.apache.solr.client.solrj.impl.HttpSolrClient.request(HttpSolrClient.java:259)
	at org.apache.solr.client.solrj.impl.HttpSolrClient.request(HttpSolrClient.java:248)
	at org.apache.solr.client.solrj.impl.LBHttpSolrClient.doRequest(LBHttpSolrClient.java:403)
	at org.apache.solr.client.solrj.impl.LBHttpSolrClient.request(LBHttpSolrClient.java:356)
	... 6 more
Caused by: java.net.ConnectException: Connection refused
	at java.net.PlainSocketImpl.socketConnect(java.base@9-ea/Native Method)
	at java.net.AbstractPlainSocketImpl.doConnect(java.base@9-ea/AbstractPlainSocketImpl.java:400)
	at java.net.AbstractPlainSocketImpl.connectToAddress(java.base@9-ea/AbstractPlainSocketImpl.java:243)
	at java.net.AbstractPlainSocketImpl.connect(java.base@9-ea/AbstractPlainSocketImpl.java:225)
	at java.net.SocksSocketImpl.connect(java.base@9-ea/SocksSocketImpl.java:402)
	at java.net.Socket.connect(java.base@9-ea/Socket.java:591)
	at org.apache.http.conn.scheme.PlainSocketFactory.connectSocket(PlainSocketFactory.java:117)
	at org.apache.http.impl.conn.DefaultClientConnectionOperator.openConnection(DefaultClientConnectionOperator.java:177)
	at org.apache.http.impl.conn.ManagedClientConnectionImpl.open(ManagedClientConnectionImpl.java:304)
	at org.apache.http.impl.client.DefaultRequestDirector.tryConnect(DefaultRequestDirector.java:611)
	at org.apache.http.impl.client.DefaultRequestDirector.execute(DefaultRequestDirector.java:446)
	at org.apache.http.impl.client.AbstractHttpClient.doExecute(AbstractHttpClient.java:882)
	at org.apache.http.impl.client.CloseableHttpClient.execute(CloseableHttpClient.java:82)
	at org.apache.http.impl.client.CloseableHttpClient.execute(CloseableHttpClient.java:107)
	at org.apache.http.impl.client.CloseableHttpClient.execute(CloseableHttpClient.java:55)
	at org.apache.solr.client.solrj.impl.HttpSolrClient.executeMethod(HttpSolrClient.java:495)
	... 10 more




Build Log:
[...truncated 10721 lines...]
   [junit4] Suite: org.apache.solr.cloud.LeaderFailoverAfterPartitionTest
   [junit4]   2> Creating dataDir: /home/jenkins/workspace/Lucene-Solr-6.x-Linux/solr/build/solr-core/test/J2/temp/solr.cloud.LeaderFailoverAfterPartitionTest_CBC62745B607978D-001/init-core-data-001
   [junit4]   2> 117618 INFO  (SUITE-LeaderFailoverAfterPartitionTest-seed#[CBC62745B607978D]-worker) [    ] o.a.s.SolrTestCaseJ4 Randomized ssl (false) and clientAuth (false) via: @org.apache.solr.SolrTestCaseJ4$SuppressSSL(bugUrl=https://issues.apache.org/jira/browse/SOLR-5776)
   [junit4]   2> 117619 INFO  (SUITE-LeaderFailoverAfterPartitionTest-seed#[CBC62745B607978D]-worker) [    ] o.a.s.BaseDistributedSearchTestCase Setting hostContext system property: /
   [junit4]   2> 117620 INFO  (TEST-LeaderFailoverAfterPartitionTest.test-seed#[CBC62745B607978D]) [    ] o.a.s.c.ZkTestServer STARTING ZK TEST SERVER
   [junit4]   2> 117620 INFO  (Thread-199) [    ] o.a.s.c.ZkTestServer client port:0.0.0.0/0.0.0.0:0
   [junit4]   2> 117620 INFO  (Thread-199) [    ] o.a.s.c.ZkTestServer Starting server
   [junit4]   2> 117720 INFO  (TEST-LeaderFailoverAfterPartitionTest.test-seed#[CBC62745B607978D]) [    ] o.a.s.c.ZkTestServer start zk server on port:44245
   [junit4]   2> 117720 INFO  (TEST-LeaderFailoverAfterPartitionTest.test-seed#[CBC62745B607978D]) [    ] o.a.s.c.c.SolrZkClient Using default ZkCredentialsProvider
   [junit4]   2> 117721 INFO  (TEST-LeaderFailoverAfterPartitionTest.test-seed#[CBC62745B607978D]) [    ] o.a.s.c.c.ConnectionManager Waiting for client to connect to ZooKeeper
   [junit4]   2> 117722 INFO  (zkCallback-17766-thread-1) [    ] o.a.s.c.c.ConnectionManager Watcher org.apache.solr.common.cloud.ConnectionManager@45cc845a name:ZooKeeperConnection Watcher:127.0.0.1:44245 got event WatchedEvent state:SyncConnected type:None path:null path:null type:None
   [junit4]   2> 117722 INFO  (TEST-LeaderFailoverAfterPartitionTest.test-seed#[CBC62745B607978D]) [    ] o.a.s.c.c.ConnectionManager Client is connected to ZooKeeper
   [junit4]   2> 117722 INFO  (TEST-LeaderFailoverAfterPartitionTest.test-seed#[CBC62745B607978D]) [    ] o.a.s.c.c.SolrZkClient Using default ZkACLProvider
   [junit4]   2> 117722 INFO  (TEST-LeaderFailoverAfterPartitionTest.test-seed#[CBC62745B607978D]) [    ] o.a.s.c.c.SolrZkClient makePath: /solr
   [junit4]   2> 117723 INFO  (TEST-LeaderFailoverAfterPartitionTest.test-seed#[CBC62745B607978D]) [    ] o.a.s.c.c.SolrZkClient Using default ZkCredentialsProvider
   [junit4]   2> 117723 INFO  (TEST-LeaderFailoverAfterPartitionTest.test-seed#[CBC62745B607978D]) [    ] o.a.s.c.c.ConnectionManager Waiting for client to connect to ZooKeeper
   [junit4]   2> 117723 INFO  (zkCallback-17767-thread-1) [    ] o.a.s.c.c.ConnectionManager Watcher org.apache.solr.common.cloud.ConnectionManager@2a8b2541 name:ZooKeeperConnection Watcher:127.0.0.1:44245/solr got event WatchedEvent state:SyncConnected type:None path:null path:null type:None
   [junit4]   2> 117723 INFO  (TEST-LeaderFailoverAfterPartitionTest.test-seed#[CBC62745B607978D]) [    ] o.a.s.c.c.ConnectionManager Client is connected to ZooKeeper
   [junit4]   2> 117724 INFO  (TEST-LeaderFailoverAfterPartitionTest.test-seed#[CBC62745B607978D]) [    ] o.a.s.c.c.SolrZkClient Using default ZkACLProvider
   [junit4]   2> 117724 INFO  (TEST-LeaderFailoverAfterPartitionTest.test-seed#[CBC62745B607978D]) [    ] o.a.s.c.c.SolrZkClient makePath: /collections/collection1
   [junit4]   2> 117724 INFO  (TEST-LeaderFailoverAfterPartitionTest.test-seed#[CBC62745B607978D]) [    ] o.a.s.c.c.SolrZkClient makePath: /collections/collection1/shards
   [junit4]   2> 117724 INFO  (TEST-LeaderFailoverAfterPartitionTest.test-seed#[CBC62745B607978D]) [    ] o.a.s.c.c.SolrZkClient makePath: /collections/control_collection
   [junit4]   2> 117725 INFO  (TEST-LeaderFailoverAfterPartitionTest.test-seed#[CBC62745B607978D]) [    ] o.a.s.c.c.SolrZkClient makePath: /collections/control_collection/shards
   [junit4]   2> 117725 INFO  (TEST-LeaderFailoverAfterPartitionTest.test-seed#[CBC62745B607978D]) [    ] o.a.s.c.AbstractZkTestCase put /home/jenkins/workspace/Lucene-Solr-6.x-Linux/solr/core/src/test-files/solr/collection1/conf/solrconfig-tlog.xml to /configs/conf1/solrconfig.xml
   [junit4]   2> 117725 INFO  (TEST-LeaderFailoverAfterPartitionTest.test-seed#[CBC62745B607978D]) [    ] o.a.s.c.c.SolrZkClient makePath: /configs/conf1/solrconfig.xml
   [junit4]   2> 117726 INFO  (TEST-LeaderFailoverAfterPartitionTest.test-seed#[CBC62745B607978D]) [    ] o.a.s.c.AbstractZkTestCase put /home/jenkins/workspace/Lucene-Solr-6.x-Linux/solr/core/src/test-files/solr/collection1/conf/schema.xml to /configs/conf1/schema.xml
   [junit4]   2> 117726 INFO  (TEST-LeaderFailoverAfterPartitionTest.test-seed#[CBC62745B607978D]) [    ] o.a.s.c.c.SolrZkClient makePath: /configs/conf1/schema.xml
   [junit4]   2> 117727 INFO  (TEST-LeaderFailoverAfterPartitionTest.test-seed#[CBC62745B607978D]) [    ] o.a.s.c.AbstractZkTestCase put /home/jenkins/workspace/Lucene-Solr-6.x-Linux/solr/core/src/test-files/solr/collection1/conf/solrconfig.snippet.randomindexconfig.xml to /configs/conf1/solrconfig.snippet.randomindexconfig.xml
   [junit4]   2> 117727 INFO  (TEST-LeaderFailoverAfterPartitionTest.test-seed#[CBC62745B607978D]) [    ] o.a.s.c.c.SolrZkClient makePath: /configs/conf1/solrconfig.snippet.randomindexconfig.xml
   [junit4]   2> 117727 INFO  (TEST-LeaderFailoverAfterPartitionTest.test-seed#[CBC62745B607978D]) [    ] o.a.s.c.AbstractZkTestCase put /home/jenkins/workspace/Lucene-Solr-6.x-Linux/solr/core/src/test-files/solr/collection1/conf/stopwords.txt to /configs/conf1/stopwords.txt
   [junit4]   2> 117727 INFO  (TEST-LeaderFailoverAfterPartitionTest.test-seed#[CBC62745B607978D]) [    ] o.a.s.c.c.SolrZkClient makePath: /configs/conf1/stopwords.txt
   [junit4]   2> 117728 INFO  (TEST-LeaderFailoverAfterPartitionTest.test-seed#[CBC62745B607978D]) [    ] o.a.s.c.AbstractZkTestCase put /home/jenkins/workspace/Lucene-Solr-6.x-Linux/solr/core/src/test-files/solr/collection1/conf/protwords.txt to /configs/conf1/protwords.txt
   [junit4]   2> 117728 INFO  (TEST-LeaderFailoverAfterPartitionTest.test-seed#[CBC62745B607978D]) [    ] o.a.s.c.c.SolrZkClient makePath: /configs/conf1/protwords.txt
   [junit4]   2> 117728 INFO  (TEST-LeaderFailoverAfterPartitionTest.test-seed#[CBC62745B607978D]) [    ] o.a.s.c.AbstractZkTestCase put /home/jenkins/workspace/Lucene-Solr-6.x-Linux/solr/core/src/test-files/solr/collection1/conf/currency.xml to /configs/conf1/currency.xml
   [junit4]   2> 117728 INFO  (TEST-LeaderFailoverAfterPartitionTest.test-seed#[CBC62745B607978D]) [    ] o.a.s.c.c.SolrZkClient makePath: /configs/conf1/currency.xml
   [junit4]   2> 117730 INFO  (TEST-LeaderFailoverAfterPartitionTest.test-seed#[CBC62745B607978D]) [    ] o.a.s.c.AbstractZkTestCase put /home/jenkins/workspace/Lucene-Solr-6.x-Linux/solr/core/src/test-files/solr/collection1/conf/enumsConfig.xml to /configs/conf1/enumsConfig.xml
   [junit4]   2> 117730 INFO  (TEST-LeaderFailoverAfterPartitionTest.test-seed#[CBC62745B607978D]) [    ] o.a.s.c.c.SolrZkClient makePath: /configs/conf1/enumsConfig.xml
   [junit4]   2> 117730 INFO  (TEST-LeaderFailoverAfterPartitionTest.test-seed#[CBC62745B607978D]) [    ] o.a.s.c.AbstractZkTestCase put /home/jenkins/workspace/Lucene-Solr-6.x-Linux/solr/core/src/test-files/solr/collection1/conf/open-exchange-rates.json to /configs/conf1/open-exchange-rates.json
   [junit4]   2> 117730 INFO  (TEST-LeaderFailoverAfterPartitionTest.test-seed#[CBC62745B607978D]) [    ] o.a.s.c.c.SolrZkClient makePath: /configs/conf1/open-exchange-rates.json
   [junit4]   2> 117731 INFO  (TEST-LeaderFailoverAfterPartitionTest.test-seed#[CBC62745B607978D]) [    ] o.a.s.c.AbstractZkTestCase put /home/jenkins/workspace/Lucene-Solr-6.x-Linux/solr/core/src/test-files/solr/collection1/conf/mapping-ISOLatin1Accent.txt to /configs/conf1/mapping-ISOLatin1Accent.txt
   [junit4]   2> 117731 INFO  (TEST-LeaderFailoverAfterPartitionTest.test-seed#[CBC62745B607978D]) [    ] o.a.s.c.c.SolrZkClient makePath: /configs/conf1/mapping-ISOLatin1Accent.txt
   [junit4]   2> 117731 INFO  (TEST-LeaderFailoverAfterPartitionTest.test-seed#[CBC62745B607978D]) [    ] o.a.s.c.AbstractZkTestCase put /home/jenkins/workspace/Lucene-Solr-6.x-Linux/solr/core/src/test-files/solr/collection1/conf/old_synonyms.txt to /configs/conf1/old_synonyms.txt
   [junit4]   2> 117732 INFO  (TEST-LeaderFailoverAfterPartitionTest.test-seed#[CBC62745B607978D]) [    ] o.a.s.c.c.SolrZkClient makePath: /configs/conf1/old_synonyms.txt
   [junit4]   2> 117732 INFO  (TEST-LeaderFailoverAfterPartitionTest.test-seed#[CBC62745B607978D]) [    ] o.a.s.c.AbstractZkTestCase put /home/jenkins/workspace/Lucene-Solr-6.x-Linux/solr/core/src/test-files/solr/collection1/conf/synonyms.txt to /configs/conf1/synonyms.txt
   [junit4]   2> 117732 INFO  (TEST-LeaderFailoverAfterPartitionTest.test-seed#[CBC62745B607978D]) [    ] o.a.s.c.c.SolrZkClient makePath: /configs/conf1/synonyms.txt
   [junit4]   2> 117794 INFO  (TEST-LeaderFailoverAfterPartitionTest.test-seed#[CBC62745B607978D]) [    ] o.a.s.SolrTestCaseJ4 Writing core.properties file to /home/jenkins/workspace/Lucene-Solr-6.x-Linux/solr/build/solr-core/test/J2/temp/solr.cloud.LeaderFailoverAfterPartitionTest_CBC62745B607978D-001/control-001/cores/collection1
   [junit4]   2> 117796 INFO  (TEST-LeaderFailoverAfterPartitionTest.test-seed#[CBC62745B607978D]) [    ] o.e.j.s.Server jetty-9.3.8.v20160314
   [junit4]   2> 117796 INFO  (TEST-LeaderFailoverAfterPartitionTest.test-seed#[CBC62745B607978D]) [    ] o.e.j.s.h.ContextHandler Started o.e.j.s.ServletContextHandler@4556ef75{/,null,AVAILABLE}
   [junit4]   2> 117798 INFO  (TEST-LeaderFailoverAfterPartitionTest.test-seed#[CBC62745B607978D]) [    ] o.e.j.s.ServerConnector Started ServerConnector@192f9745{HTTP/1.1,[http/1.1]}{127.0.0.1:?????}
   [junit4]   2> 117799 INFO  (TEST-LeaderFailoverAfterPartitionTest.test-seed#[CBC62745B607978D]) [    ] o.e.j.s.Server Started @??????ms
   [junit4]   2> 117800 INFO  (TEST-LeaderFailoverAfterPartitionTest.test-seed#[CBC62745B607978D]) [    ] o.a.s.c.s.e.JettySolrRunner Jetty properties: {hostContext=/, solr.data.dir=/home/jenkins/workspace/Lucene-Solr-6.x-Linux/solr/build/solr-core/test/J2/temp/solr.cloud.LeaderFailoverAfterPartitionTest_CBC62745B607978D-001/tempDir-001/control/data, hostPort=45929, coreRootDirectory=/home/jenkins/workspace/Lucene-Solr-6.x-Linux/solr/build/solr-core/test/J2/temp/solr.cloud.LeaderFailoverAfterPartitionTest_CBC62745B607978D-001/control-001/cores}
   [junit4]   2> 117800 INFO  (TEST-LeaderFailoverAfterPartitionTest.test-seed#[CBC62745B607978D]) [    ] o.a.s.s.SolrDispatchFilter SolrDispatchFilter.init(): jdk.internal.loader.ClassLoaders$AppClassLoader@2cfb4a64
   [junit4]   2> 117800 INFO  (TEST-LeaderFailoverAfterPartitionTest.test-seed#[CBC62745B607978D]) [    ] o.a.s.c.SolrResourceLoader new SolrResourceLoader for directory: '/home/jenkins/workspace/Lucene-Solr-6.x-Linux/solr/build/solr-core/test/J2/temp/solr.cloud.LeaderFailoverAfterPartitionTest_CBC62745B607978D-001/control-001'
   [junit4]   2> 117801 INFO  (TEST-LeaderFailoverAfterPartitionTest.test-seed#[CBC62745B607978D]) [    ] o.a.s.c.SolrResourceLoader JNDI not configured for solr (NoInitialContextEx)
   [junit4]   2> 117801 INFO  (TEST-LeaderFailoverAfterPartitionTest.test-seed#[CBC62745B607978D]) [    ] o.a.s.c.SolrResourceLoader solr home defaulted to 'solr/' (could not find system property or JNDI)
   [junit4]   2> 117802 INFO  (TEST-LeaderFailoverAfterPartitionTest.test-seed#[CBC62745B607978D]) [    ] o.a.s.c.c.SolrZkClient Using default ZkCredentialsProvider
   [junit4]   2> 117802 INFO  (TEST-LeaderFailoverAfterPartitionTest.test-seed#[CBC62745B607978D]) [    ] o.a.s.c.c.ConnectionManager Waiting for client to connect to ZooKeeper
   [junit4]   2> 117803 INFO  (zkCallback-17768-thread-1) [    ] o.a.s.c.c.ConnectionManager Watcher org.apache.solr.common.cloud.ConnectionManager@13c9b4ca name:ZooKeeperConnection Watcher:127.0.0.1:44245/solr got event WatchedEvent state:SyncConnected type:None path:null path:null type:None
   [junit4]   2> 117803 INFO  (TEST-LeaderFailoverAfterPartitionTest.test-seed#[CBC62745B607978D]) [    ] o.a.s.c.c.ConnectionManager Client is connected to ZooKeeper
   [junit4]   2> 117804 INFO  (TEST-LeaderFailoverAfterPartitionTest.test-seed#[CBC62745B607978D]) [    ] o.a.s.c.c.SolrZkClient Using default ZkACLProvider
   [junit4]   2> 117806 INFO  (TEST-LeaderFailoverAfterPartitionTest.test-seed#[CBC62745B607978D]) [    ] o.a.s.s.SolrDispatchFilter Loading solr.xml from SolrHome (not found in ZooKeeper)
   [junit4]   2> 117806 INFO  (TEST-LeaderFailoverAfterPartitionTest.test-seed#[CBC62745B607978D]) [    ] o.a.s.c.SolrXmlConfig Loading container configuration from /home/jenkins/workspace/Lucene-Solr-6.x-Linux/solr/build/solr-core/test/J2/temp/solr.cloud.LeaderFailoverAfterPartitionTest_CBC62745B607978D-001/control-001/solr.xml
   [junit4]   2> 117811 INFO  (TEST-LeaderFailoverAfterPartitionTest.test-seed#[CBC62745B607978D]) [    ] o.a.s.c.CorePropertiesLocator Config-defined core root directory: /home/jenkins/workspace/Lucene-Solr-6.x-Linux/solr/build/solr-core/test/J2/temp/solr.cloud.LeaderFailoverAfterPartitionTest_CBC62745B607978D-001/control-001/cores
   [junit4]   2> 117811 INFO  (TEST-LeaderFailoverAfterPartitionTest.test-seed#[CBC62745B607978D]) [    ] o.a.s.c.CoreContainer New CoreContainer 1083656678
   [junit4]   2> 117811 INFO  (TEST-LeaderFailoverAfterPartitionTest.test-seed#[CBC62745B607978D]) [    ] o.a.s.c.CoreContainer Loading cores into CoreContainer [instanceDir=/home/jenkins/workspace/Lucene-Solr-6.x-Linux/solr/build/solr-core/test/J2/temp/solr.cloud.LeaderFailoverAfterPartitionTest_CBC62745B607978D-001/control-001]
   [junit4]   2> 117812 WARN  (TEST-LeaderFailoverAfterPartitionTest.test-seed#[CBC62745B607978D]) [    ] o.a.s.c.CoreContainer Couldn't add files from /home/jenkins/workspace/Lucene-Solr-6.x-Linux/solr/build/solr-core/test/J2/temp/solr.cloud.LeaderFailoverAfterPartitionTest_CBC62745B607978D-001/control-001/lib to classpath: /home/jenkins/workspace/Lucene-Solr-6.x-Linux/solr/build/solr-core/test/J2/temp/solr.cloud.LeaderFailoverAfterPartitionTest_CBC62745B607978D-001/control-001/lib
   [junit4]   2> 117812 INFO  (TEST-LeaderFailoverAfterPartitionTest.test-seed#[CBC62745B607978D]) [    ] o.a.s.h.c.HttpShardHandlerFactory created with socketTimeout : 90000,urlScheme : ,connTimeout : 15000,maxConnectionsPerHost : 20,maxConnections : 10000,corePoolSize : 0,maximumPoolSize : 2147483647,maxThreadIdleTime : 5,sizeOfQueue : -1,fairnessPolicy : false,useRetries : false,connectionsEvictorSleepDelay : 5000,maxConnectionIdleTime : 40000,
   [junit4]   2> 117813 INFO  (TEST-LeaderFailoverAfterPartitionTest.test-seed#[CBC62745B607978D]) [    ] o.a.s.u.UpdateShardHandler Creating UpdateShardHandler HTTP client with params: socketTimeout=340000&connTimeout=45000&retry=true
   [junit4]   2> 117814 INFO  (TEST-LeaderFailoverAfterPartitionTest.test-seed#[CBC62745B607978D]) [    ] o.a.s.l.LogWatcher SLF4J impl is org.slf4j.impl.Log4jLoggerFactory
   [junit4]   2> 117814 INFO  (TEST-LeaderFailoverAfterPartitionTest.test-seed#[CBC62745B607978D]) [    ] o.a.s.l.LogWatcher Registering Log Listener [Log4j (org.slf4j.impl.Log4jLoggerFactory)]
   [junit4]   2> 117814 INFO  (TEST-LeaderFailoverAfterPartitionTest.test-seed#[CBC62745B607978D]) [    ] o.a.s.c.ZkContainer Zookeeper client=127.0.0.1:44245/solr
   [junit4]   2> 117814 INFO  (TEST-LeaderFailoverAfterPartitionTest.test-seed#[CBC62745B607978D]) [    ] o.a.s.c.ZkController zkHost includes chroot
   [junit4]   2> 117814 INFO  (TEST-LeaderFailoverAfterPartitionTest.test-seed#[CBC62745B607978D]) [    ] o.a.s.c.c.SolrZkClient Using default ZkCredentialsProvider
   [junit4]   2> 117814 INFO  (TEST-LeaderFailoverAfterPartitionTest.test-seed#[CBC62745B607978D]) [    ] o.a.s.c.c.ConnectionManager Waiting for client to connect to ZooKeeper
   [junit4]   2> 117815 INFO  (zkCallback-17771-thread-1) [    ] o.a.s.c.c.ConnectionManager Watcher org.apache.solr.common.cloud.ConnectionManager@608ac125 name:ZooKeeperConnection Watcher:127.0.0.1:44245 got event WatchedEvent state:SyncConnected type:None path:null path:null type:None
   [junit4]   2> 117815 INFO  (TEST-LeaderFailoverAfterPartitionTest.test-seed#[CBC62745B607978D]) [    ] o.a.s.c.c.ConnectionManager Client is connected to ZooKeeper
   [junit4]   2> 117815 INFO  (TEST-LeaderFailoverAfterPartitionTest.test-seed#[CBC62745B607978D]) [    ] o.a.s.c.c.SolrZkClient Using default ZkACLProvider
   [junit4]   2> 117816 INFO  (TEST-LeaderFailoverAfterPartitionTest.test-seed#[CBC62745B607978D]) [    ] o.a.s.c.ZkController Added new OnReconnect listener org.apache.solr.cloud.ZkController$$Lambda$150/1448856410@3c524251
   [junit4]   2> 117816 INFO  (TEST-LeaderFailoverAfterPartitionTest.test-seed#[CBC62745B607978D]) [    ] o.a.s.c.c.ConnectionManager Waiting for client to connect to ZooKeeper
   [junit4]   2> 117817 INFO  (zkCallback-17772-thread-1) [    ] o.a.s.c.c.ConnectionManager Watcher org.apache.solr.common.cloud.ConnectionManager@677def06 name:ZooKeeperConnection Watcher:127.0.0.1:44245/solr got event WatchedEvent state:SyncConnected type:None path:null path:null type:None
   [junit4]   2> 117817 INFO  (TEST-LeaderFailoverAfterPartitionTest.test-seed#[CBC62745B607978D]) [    ] o.a.s.c.c.ConnectionManager Client is connected to ZooKeeper
   [junit4]   2> 117817 INFO  (TEST-LeaderFailoverAfterPartitionTest.test-seed#[CBC62745B607978D]) [    ] o.a.s.c.c.SolrZkClient makePath: /overseer/queue
   [junit4]   2> 117818 INFO  (TEST-LeaderFailoverAfterPartitionTest.test-seed#[CBC62745B607978D]) [    ] o.a.s.c.c.SolrZkClient makePath: /overseer/collection-queue-work
   [junit4]   2> 117819 INFO  (TEST-LeaderFailoverAfterPartitionTest.test-seed#[CBC62745B607978D]) [    ] o.a.s.c.c.SolrZkClient makePath: /overseer/collection-map-running
   [junit4]   2> 117820 INFO  (TEST-LeaderFailoverAfterPartitionTest.test-seed#[CBC62745B607978D]) [    ] o.a.s.c.c.SolrZkClient makePath: /overseer/collection-map-completed
   [junit4]   2> 117820 INFO  (TEST-LeaderFailoverAfterPartitionTest.test-seed#[CBC62745B607978D]) [    ] o.a.s.c.c.SolrZkClient makePath: /overseer/collection-map-failure
   [junit4]   2> 117821 INFO  (TEST-LeaderFailoverAfterPartitionTest.test-seed#[CBC62745B607978D]) [    ] o.a.s.c.c.SolrZkClient makePath: /live_nodes
   [junit4]   2> 117821 INFO  (TEST-LeaderFailoverAfterPartitionTest.test-seed#[CBC62745B607978D]) [    ] o.a.s.c.c.SolrZkClient makePath: /aliases.json
   [junit4]   2> 117822 INFO  (TEST-LeaderFailoverAfterPartitionTest.test-seed#[CBC62745B607978D]) [    ] o.a.s.c.c.SolrZkClient makePath: /clusterstate.json
   [junit4]   2> 117822 INFO  (TEST-LeaderFailoverAfterPartitionTest.test-seed#[CBC62745B607978D]) [    ] o.a.s.c.c.SolrZkClient makePath: /security.json
   [junit4]   2> 117823 INFO  (TEST-LeaderFailoverAfterPartitionTest.test-seed#[CBC62745B607978D]) [    ] o.a.s.c.c.ZkStateReader Updating cluster state from ZooKeeper... 
   [junit4]   2> 117823 INFO  (TEST-LeaderFailoverAfterPartitionTest.test-seed#[CBC62745B607978D]) [    ] o.a.s.c.c.ZkStateReader Loaded empty cluster properties
   [junit4]   2> 117823 INFO  (TEST-LeaderFailoverAfterPartitionTest.test-seed#[CBC62745B607978D]) [    ] o.a.s.c.c.ZkStateReader Updated live nodes from ZooKeeper... (0) -> (0)
   [junit4]   2> 117824 INFO  (TEST-LeaderFailoverAfterPartitionTest.test-seed#[CBC62745B607978D]) [    ] o.a.s.c.c.SolrZkClient makePath: /overseer_elect
   [junit4]   2> 117824 INFO  (TEST-LeaderFailoverAfterPartitionTest.test-seed#[CBC62745B607978D]) [    ] o.a.s.c.c.SolrZkClient makePath: /overseer_elect/election
   [junit4]   2> 117826 INFO  (TEST-LeaderFailoverAfterPartitionTest.test-seed#[CBC62745B607978D]) [    ] o.a.s.c.Overseer Overseer (id=null) closing
   [junit4]   2> 117826 INFO  (TEST-LeaderFailoverAfterPartitionTest.test-seed#[CBC62745B607978D]) [    ] o.a.s.c.LeaderElector Joined leadership election with path: /overseer_elect/election/96265162533896196-127.0.0.1:45929_-n_0000000000
   [junit4]   2> 117826 INFO  (TEST-LeaderFailoverAfterPartitionTest.test-seed#[CBC62745B607978D]) [    ] o.a.s.c.OverseerElectionContext I am going to be the leader 127.0.0.1:45929_
   [junit4]   2> 117826 INFO  (TEST-LeaderFailoverAfterPartitionTest.test-seed#[CBC62745B607978D]) [    ] o.a.s.c.c.SolrZkClient makePath: /overseer_elect/leader
   [junit4]   2> 117827 INFO  (TEST-LeaderFailoverAfterPartitionTest.test-seed#[CBC62745B607978D]) [    ] o.a.s.c.Overseer Overseer (id=96265162533896196-127.0.0.1:45929_-n_0000000000) starting
   [junit4]   2> 117828 INFO  (TEST-LeaderFailoverAfterPartitionTest.test-seed#[CBC62745B607978D]) [    ] o.a.s.c.c.SolrZkClient makePath: /overseer/queue-work
   [junit4]   2> 117830 INFO  (TEST-LeaderFailoverAfterPartitionTest.test-seed#[CBC62745B607978D]) [    ] o.a.s.c.OverseerAutoReplicaFailoverThread Starting OverseerAutoReplicaFailoverThread autoReplicaFailoverWorkLoopDelay=10000 autoReplicaFailoverWaitAfterExpiration=10000 autoReplicaFailoverBadNodeExpiration=60000
   [junit4]   2> 117830 INFO  (OverseerCollectionConfigSetProcessor-96265162533896196-127.0.0.1:45929_-n_0000000000) [    ] o.a.s.c.OverseerTaskProcessor Process current queue of overseer operations
   [junit4]   2> 117830 INFO  (TEST-LeaderFailoverAfterPartitionTest.test-seed#[CBC62745B607978D]) [    ] o.a.s.c.ZkController Register node as live in ZooKeeper:/live_nodes/127.0.0.1:45929_
   [junit4]   2> 117831 INFO  (TEST-LeaderFailoverAfterPartitionTest.test-seed#[CBC62745B607978D]) [    ] o.a.s.c.c.SolrZkClient makePath: /live_nodes/127.0.0.1:45929_
   [junit4]   2> 117831 INFO  (OverseerStateUpdate-96265162533896196-127.0.0.1:45929_-n_0000000000) [    ] o.a.s.c.Overseer Starting to work on the main queue
   [junit4]   2> 117832 INFO  (zkCallback-17772-thread-1) [    ] o.a.s.c.c.ZkStateReader A live node change: [WatchedEvent state:SyncConnected type:NodeChildrenChanged path:/live_nodes], has occurred - updating... (live nodes size: [0])
   [junit4]   2> 117832 INFO  (OverseerStateUpdate-96265162533896196-127.0.0.1:45929_-n_0000000000) [    ] o.a.s.c.c.ZkStateReader Updated live nodes from ZooKeeper... (0) -> (1)
   [junit4]   2> 117838 INFO  (TEST-LeaderFailoverAfterPartitionTest.test-seed#[CBC62745B607978D]) [    ] o.a.s.c.CoreContainer Security conf doesn't exist. Skipping setup for authorization module.
   [junit4]   2> 117838 INFO  (TEST-LeaderFailoverAfterPartitionTest.test-seed#[CBC62745B607978D]) [    ] o.a.s.c.CoreContainer No authentication plugin used.
   [junit4]   2> 117838 INFO  (TEST-LeaderFailoverAfterPartitionTest.test-seed#[CBC62745B607978D]) [    ] o.a.s.c.CorePropertiesLocator Looking for core definitions underneath /home/jenkins/workspace/Lucene-Solr-6.x-Linux/solr/build/solr-core/test/J2/temp/solr.cloud.LeaderFailoverAfterPartitionTest_CBC62745B607978D-001/control-001/cores
   [junit4]   2> 117839 INFO  (TEST-LeaderFailoverAfterPartitionTest.test-seed#[CBC62745B607978D]) [    ] o.a.s.c.CoreDescriptor Created CoreDescriptor: {schema=schema.xml, dataDir=data/, collection=control_collection, loadOnStartup=true, coreNodeName=, transient=false, name=collection1, shard=, config=solrconfig.xml, configSetProperties=configsetprops.json}
   [junit4]   2> 117839 INFO  (TEST-LeaderFailoverAfterPartitionTest.test-seed#[CBC62745B607978D]) [    ] o.a.s.c.CorePropertiesLocator Found core collection1 in /home/jenkins/workspace/Lucene-Solr-6.x-Linux/solr/build/solr-core/test/J2/temp/solr.cloud.LeaderFailoverAfterPartitionTest_CBC62745B607978D-001/control-001/cores/collection1
   [junit4]   2> 117839 INFO  (TEST-LeaderFailoverAfterPartitionTest.test-seed#[CBC62745B607978D]) [    ] o.a.s.c.CorePropertiesLocator Found 1 core definitions
   [junit4]   2> 117840 INFO  (TEST-LeaderFailoverAfterPartitionTest.test-seed#[CBC62745B607978D]) [    ] o.a.s.s.SolrDispatchFilter user.dir=/home/jenkins/workspace/Lucene-Solr-6.x-Linux/solr/build/solr-core/test/J2
   [junit4]   2> 117840 INFO  (TEST-LeaderFailoverAfterPartitionTest.test-seed#[CBC62745B607978D]) [    ] o.a.s.s.SolrDispatchFilter SolrDispatchFilter.init() done
   [junit4]   2> 117841 INFO  (coreLoadExecutor-3454-thread-1) [    ] o.a.s.c.ZkController publishing state=down
   [junit4]   2> 117841 INFO  (coreLoadExecutor-3454-thread-1) [    ] o.a.s.c.ZkController numShards not found on descriptor - reading it from system property
   [junit4]   2> 117846 INFO  (coreLoadExecutor-3454-thread-1) [    ] o.a.s.c.ZkController Collection control_collection not visible yet, but flagging it so a watch is registered when it becomes visible
   [junit4]   2> 117846 INFO  (OverseerStateUpdate-96265162533896196-127.0.0.1:45929_-n_0000000000) [    ] o.a.s.c.Overseer processMessage: queueSize: 1, message = {
   [junit4]   2>   "core":"collection1",
   [junit4]   2>   "roles":null,
   [junit4]   2>   "base_url":"http://127.0.0.1:45929",
   [junit4]   2>   "node_name":"127.0.0.1:45929_",
   [junit4]   2>   "numShards":"1",
   [junit4]   2>   "state":"down",
   [junit4]   2>   "shard":null,
   [junit4]   2>   "collection":"control_collection",
   [junit4]   2>   "operation":"state"} current state version: 0
   [junit4]   2> 117846 INFO  (OverseerStateUpdate-96265162533896196-127.0.0.1:45929_-n_0000000000) [    ] o.a.s.c.o.ReplicaMutator Update state numShards=1 message={
   [junit4]   2>   "core":"collection1",
   [junit4]   2>   "roles":null,
   [junit4]   2>   "base_url":"http://127.0.0.1:45929",
   [junit4]   2>   "node_name":"127.0.0.1:45929_",
   [junit4]   2>   "numShards":"1",
   [junit4]   2>   "state":"down",
   [junit4]   2>   "shard":null,
   [junit4]   2>   "collection":"control_collection",
   [junit4]   2>   "operation":"state"}
   [junit4]   2> 117847 INFO  (OverseerStateUpdate-96265162533896196-127.0.0.1:45929_-n_0000000000) [    ] o.a.s.c.o.ClusterStateMutator building a new cName: control_collection
   [junit4]   2> 117848 INFO  (coreLoadExecutor-3454-thread-1) [    ] o.a.s.c.c.ZkStateReader Deleting data for [control_collection]
   [junit4]   2> 117848 INFO  (OverseerStateUpdate-96265162533896196-127.0.0.1:45929_-n_0000000000) [    ] o.a.s.c.o.ReplicaMutator Assigning new node to shard shard=shard1
   [junit4]   2> 117851 INFO  (coreLoadExecutor-3454-thread-1) [    ] o.a.s.c.ZkController look for our core node name
   [junit4]   2> 117851 INFO  (zkCallback-17772-thread-1) [    ] o.a.s.c.c.ZkStateReader A cluster state change: [WatchedEvent state:SyncConnected type:NodeDataChanged path:/clusterstate.json], has occurred - updating... (live nodes size: [1])
   [junit4]   2> 118851 INFO  (coreLoadExecutor-3454-thread-1) [    ] o.a.s.c.ZkController waiting to find shard id in clusterstate for collection1
   [junit4]   2> 118851 INFO  (coreLoadExecutor-3454-thread-1) [    ] o.a.s.c.ZkController Check for collection zkNode:control_collection
   [junit4]   2> 118851 INFO  (coreLoadExecutor-3454-thread-1) [    ] o.a.s.c.ZkController Collection zkNode exists
   [junit4]   2> 118851 INFO  (coreLoadExecutor-3454-thread-1) [    ] o.a.s.c.c.ZkStateReader Load collection config from: [/collections/control_collection]
   [junit4]   2> 118852 INFO  (coreLoadExecutor-3454-thread-1) [    ] o.a.s.c.c.ZkStateReader path=[/collections/control_collection] [configName]=[conf1] specified config exists in ZooKeeper
   [junit4]   2> 118852 INFO  (coreLoadExecutor-3454-thread-1) [    ] o.a.s.c.SolrResourceLoader new SolrResourceLoader for directory: '/home/jenkins/workspace/Lucene-Solr-6.x-Linux/solr/build/solr-core/test/J2/temp/solr.cloud.LeaderFailoverAfterPartitionTest_CBC62745B607978D-001/control-001/cores/collection1'
   [junit4]   2> 118852 INFO  (coreLoadExecutor-3454-thread-1) [    ] o.a.s.c.SolrResourceLoader JNDI not configured for solr (NoInitialContextEx)
   [junit4]   2> 118852 INFO  (coreLoadExecutor-3454-thread-1) [    ] o.a.s.c.SolrResourceLoader solr home defaulted to 'solr/' (could not find system property or JNDI)
   [junit4]   2> 118852 INFO  (coreLoadExecutor-3454-thread-1) [    ] o.a.s.c.Config loaded config solrconfig.xml with version 0 
   [junit4]   2> 118857 INFO  (coreLoadExecutor-3454-thread-1) [    ] o.a.s.c.SolrConfig current version of requestparams : -1
   [junit4]   2> 118860 WARN  (coreLoadExecutor-3454-thread-1) [    ] o.a.s.c.Config Beginning with Solr 5.5, <mergePolicy> is deprecated, use <mergePolicyFactory> instead.
   [junit4]   2> 118860 INFO  (coreLoadExecutor-3454-thread-1) [    ] o.a.s.c.SolrConfig Using Lucene MatchVersion: 6.2.0
   [junit4]   2> 118867 INFO  (coreLoadExecutor-3454-thread-1) [    ] o.a.s.c.SolrConfig Loaded SolrConfig: solrconfig.xml
   [junit4]   2> 118872 INFO  (coreLoadExecutor-3454-thread-1) [    ] o.a.s.s.IndexSchema [collection1] Schema name=test
   [junit4]   2> 118952 INFO  (coreLoadExecutor-3454-thread-1) [    ] o.a.s.s.OpenExchangeRatesOrgProvider Initialized with rates=open-exchange-rates.json, refreshInterval=1440.
   [junit4]   2> 118958 INFO  (coreLoadExecutor-3454-thread-1) [    ] o.a.s.s.IndexSchema default search field in schema is text
   [junit4]   2> 118960 INFO  (coreLoadExecutor-3454-thread-1) [    ] o.a.s.s.IndexSchema unique key field: id
   [junit4]   2> 118967 INFO  (coreLoadExecutor-3454-thread-1) [    ] o.a.s.s.FileExchangeRateProvider Reloading exchange rates from file currency.xml
   [junit4]   2> 118968 INFO  (coreLoadExecutor-3454-thread-1) [    ] o.a.s.s.FileExchangeRateProvider Reloading exchange rates from file currency.xml
   [junit4]   2> 118970 INFO  (coreLoadExecutor-3454-thread-1) [    ] o.a.s.s.OpenExchangeRatesOrgProvider Reloading exchange rates from open-exchange-rates.json
   [junit4]   2> 118970 INFO  (coreLoadExecutor-3454-thread-1) [    ] o.a.s.s.OpenExchangeRatesOrgProvider Reloading exchange rates from open-exchange-rates.json
   [junit4]   2> 118971 INFO  (coreLoadExecutor-3454-thread-1) [    ] o.a.s.c.ConfigSetProperties Did not find ConfigSet properties, assuming default properties: Can't find resource 'configsetprops.json' in classpath or '/configs/conf1', cwd=/home/jenkins/workspace/Lucene-Solr-6.x-Linux/solr/build/solr-core/test/J2
   [junit4]   2> 118971 INFO  (coreLoadExecutor-3454-thread-1) [    ] o.a.s.c.CoreContainer Creating SolrCore 'collection1' using configuration from collection control_collection
   [junit4]   2> 118971 INFO  (coreLoadExecutor-3454-thread-1) [    ] o.a.s.c.SolrCore org.apache.solr.core.MockDirectoryFactory
   [junit4]   2> 118971 INFO  (coreLoadExecutor-3454-thread-1) [    ] o.a.s.c.SolrCore [[collection1] ] Opening new SolrCore at [/home/jenkins/workspace/Lucene-Solr-6.x-Linux/solr/build/solr-core/test/J2/temp/solr.cloud.LeaderFailoverAfterPartitionTest_CBC62745B607978D-001/control-001/cores/collection1], dataDir=[/home/jenkins/workspace/Lucene-Solr-6.x-Linux/solr/build/solr-core/test/J2/temp/solr.cloud.LeaderFailoverAfterPartitionTest_CBC62745B607978D-001/control-001/cores/collection1/data/]
   [junit4]   2> 118971 INFO  (coreLoadExecutor-3454-thread-1) [    ] o.a.s.c.JmxMonitoredMap JMX monitoring is enabled. Adding Solr mbeans to JMX Server: com.sun.jmx.mbeanserver.JmxMBeanServer@61aadad9
   [junit4]   2> 118972 INFO  (coreLoadExecutor-3454-thread-1) [    ] o.a.s.c.CachingDirectoryFactory return new directory for /home/jenkins/workspace/Lucene-Solr-6.x-Linux/solr/build/solr-core/test/J2/temp/solr.cloud.LeaderFailoverAfterPartitionTest_CBC62745B607978D-001/control-001/cores/collection1/data
   [junit4]   2> 118972 INFO  (coreLoadExecutor-3454-thread-1) [    ] o.a.s.c.SolrCore New index directory detected: old=null new=/home/jenkins/workspace/Lucene-Solr-6.x-Linux/solr/build/solr-core/test/J2/temp/solr.cloud.LeaderFailoverAfterPartitionTest_CBC62745B607978D-001/control-001/cores/collection1/data/index/
   [junit4]   2> 118972 WARN  (coreLoadExecutor-3454-thread-1) [    ] o.a.s.c.SolrCore [collection1] Solr index directory '/home/jenkins/workspace/Lucene-Solr-6.x-Linux/solr/build/solr-core/test/J2/temp/solr.cloud.LeaderFailoverAfterPartitionTest_CBC62745B607978D-001/control-001/cores/collection1/data/index' doesn't exist. Creating new index...
   [junit4]   2> 118972 INFO  (coreLoadExecutor-3454-thread-1) [    ] o.a.s.c.CachingDirectoryFactory return new directory for /home/jenkins/workspace/Lucene-Solr-6.x-Linux/solr/build/solr-core/test/J2/temp/solr.cloud.LeaderFailoverAfterPartitionTest_CBC62745B607978D-001/control-001/cores/collection1/data/index
   [junit4]   2> 118972 INFO  (coreLoadExecutor-3454-thread-1) [    ] o.a.s.u.RandomMergePolicy RandomMergePolicy wrapping class org.apache.lucene.index.TieredMergePolicy: [TieredMergePolicy: maxMergeAtOnce=21, maxMergeAtOnceExplicit=13, maxMergedSegmentMB=69.8095703125, floorSegmentMB=1.4951171875, forceMergeDeletesPctAllowed=1.3107217234842783, segmentsPerTier=23.0, maxCFSSegmentSizeMB=8.796093022207999E12, noCFSRatio=0.41114469618162264
   [junit4]   2> 118973 INFO  (coreLoadExecutor-3454-thread-1) [    ] o.a.s.c.SolrDeletionPolicy SolrDeletionPolicy.onCommit: commits: num=1
   [junit4]   2> 	commit{dir=MockDirectoryWrapper(NRTCachingDirectory(RAMDirectory@5fc7acd8 lockFactory=org.apache.lucene.store.SingleInstanceLockFactory@1f8071e3; maxCacheMB=0.8466796875 maxMergeSizeMB=0.9423828125)),segFN=segments_1,generation=1}
   [junit4]   2> 118973 INFO  (coreLoadExecutor-3454-thread-1) [    ] o.a.s.c.SolrDeletionPolicy newest commit generation = 1
   [junit4]   2> 118973 INFO  (OldIndexDirectoryCleanupThreadForCore-collection1) [    ] o.a.s.c.SolrCore Looking for old index directories to cleanup for core collection1 in /home/jenkins/workspace/Lucene-Solr-6.x-Linux/solr/build/solr-core/test/J2/temp/solr.cloud.LeaderFailoverAfterPartitionTest_CBC62745B607978D-001/control-001/cores/collection1/data/
   [junit4]   2> 118974 WARN  (OldIndexDirectoryCleanupThreadForCore-collection1) [    ] o.a.s.c.DirectoryFactory /home/jenkins/workspace/Lucene-Solr-6.x-Linux/solr/build/solr-core/test/J2/temp/solr.cloud.LeaderFailoverAfterPartitionTest_CBC62745B607978D-001/control-001/cores/collection1/data/ does not point to a valid data directory; skipping clean-up of old index directories.
   [junit4]   2> 118976 INFO  (coreLoadExecutor-3454-thread-1) [    ] o.a.s.u.p.UpdateRequestProcessorChain creating updateRequestProcessorChain "nodistrib"
   [junit4]   2> 118976 INFO  (coreLoadExecutor-3454-thread-1) [    ] o.a.s.u.p.UpdateRequestProcessorChain creating updateRequestProcessorChain "dedupe"
   [junit4]   2> 118977 INFO  (coreLoadExecutor-3454-thread-1) [    ] o.a.s.u.p.UpdateRequestProcessorChain inserting DistributedUpdateProcessorFactory into updateRequestProcessorChain "dedupe"
   [junit4]   2> 118977 INFO  (coreLoadExecutor-3454-thread-1) [    ] o.a.s.u.p.UpdateRequestProcessorChain creating updateRequestProcessorChain "stored_sig"
   [junit4]   2> 118977 INFO  (coreLoadExecutor-3454-thread-1) [    ] o.a.s.u.p.UpdateRequestProcessorChain inserting DistributedUpdateProcessorFactory into updateRequestProcessorChain "stored_sig"
   [junit4]   2> 118977 INFO  (coreLoadExecutor-3454-thread-1) [    ] o.a.s.u.p.UpdateRequestProcessorChain creating updateRequestProcessorChain "distrib-dup-test-chain-explicit"
   [junit4]   2> 118977 INFO  (coreLoadExecutor-3454-thread-1) [    ] o.a.s.u.p.UpdateRequestProcessorChain creating updateRequestProcessorChain "distrib-dup-test-chain-implicit"
   [junit4]   2> 118977 INFO  (coreLoadExecutor-3454-thread-1) [    ] o.a.s.u.p.UpdateRequestProcessorChain inserting DistributedUpdateProcessorFactory into updateRequestProcessorChain "distrib-dup-test-chain-implicit"
   [junit4]   2> 118977 INFO  (coreLoadExecutor-3454-thread-1) [    ] o.a.s.c.SolrCore no updateRequestProcessorChain defined as default, creating implicit default
   [junit4]   2> 118978 WARN  (coreLoadExecutor-3454-thread-1) [    ] o.a.s.c.RequestHandlers INVALID paramSet a in requestHandler {type = requestHandler,name = /dump,class = DumpRequestHandler,args = {defaults={a=A,b=B}}}
   [junit4]   2> 118979 INFO  (coreLoadExecutor-3454-thread-1) [    ] o.a.s.h.l.XMLLoader xsltCacheLifetimeSeconds=60
   [junit4]   2> 118980 INFO  (coreLoadExecutor-3454-thread-1) [    ] o.a.s.h.l.XMLLoader xsltCacheLifetimeSeconds=60
   [junit4]   2> 118981 INFO  (coreLoadExecutor-3454-thread-1) [    ] o.a.s.h.l.XMLLoader xsltCacheLifetimeSeconds=60
   [junit4]   2> 118982 INFO  (coreLoadExecutor-3454-thread-1) [    ] o.a.s.h.l.XMLLoader xsltCacheLifetimeSeconds=60
   [junit4]   2> 118986 INFO  (coreLoadExecutor-3454-thread-1) [    ] o.a.s.c.RequestHandlers Registered paths: /admin/mbeans,standard,/update/json/docs,/admin/luke,/export,/get,/admin/properties,/update/json,/admin/threads,/dump,/update/csv,/sql,/graph,/admin/segments,/admin/system,/replication,/config,/stream,/schema,/admin/plugins,/admin/logging,/admin/ping,/update,/admin/file,/terms
   [junit4]   2> 118986 INFO  (coreLoadExecutor-3454-thread-1) [    ] o.a.s.c.SolrCore Using default statsCache cache: org.apache.solr.search.stats.LocalStatsCache
   [junit4]   2> 118986 INFO  (coreLoadExecutor-3454-thread-1) [    ] o.a.s.u.UpdateHandler Using UpdateLog implementation: org.apache.solr.update.UpdateLog
   [junit4]   2> 118986 INFO  (coreLoadExecutor-3454-thread-1) [    ] o.a.s.u.UpdateLog Initializing UpdateLog: dataDir= defaultSyncLevel=FLUSH numRecordsToKeep=100 maxNumLogsToKeep=10 numVersionBuckets=65536
   [junit4]   2> 118987 INFO  (coreLoadExecutor-3454-thread-1) [    ] o.a.s.u.CommitTracker Hard AutoCommit: disabled
   [junit4]   2> 118987 INFO  (coreLoadExecutor-3454-thread-1) [    ] o.a.s.u.CommitTracker Soft AutoCommit: disabled
   [junit4]   2> 118988 INFO  (coreLoadExecutor-3454-thread-1) [    ] o.a.s.u.RandomMergePolicy RandomMergePolicy wrapping class org.apache.lucene.index.TieredMergePolicy: [TieredMergePolicy: maxMergeAtOnce=26, maxMergeAtOnceExplicit=45, maxMergedSegmentMB=42.5107421875, floorSegmentMB=1.5771484375, forceMergeDeletesPctAllowed=7.969286314135045, segmentsPerTier=49.0, maxCFSSegmentSizeMB=8.796093022207999E12, noCFSRatio=0.4967469623977846
   [junit4]   2> 118988 INFO  (coreLoadExecutor-3454-thread-1) [    ] o.a.s.c.SolrDeletionPolicy SolrDeletionPolicy.onInit: commits: num=1
   [junit4]   2> 	commit{dir=MockDirectoryWrapper(NRTCachingDirectory(RAMDirectory@5fc7acd8 lockFactory=org.apache.lucene.store.SingleInstanceLockFactory@1f8071e3; maxCacheMB=0.8466796875 maxMergeSizeMB=0.9423828125)),segFN=segments_1,generation=1}
   [junit4]   2> 118988 INFO  (coreLoadExecutor-3454-thread-1) [    ] o.a.s.c.SolrDeletionPolicy newest commit generation = 1
   [junit4]   2> 118988 INFO  (coreLoadExecutor-3454-thread-1) [    ] o.a.s.s.SolrIndexSearcher Opening [Searcher@61767a40[collection1] main]
   [junit4]   2> 118988 INFO  (coreLoadExecutor-3454-thread-1) [    ] o.a.s.c.c.ZkStateReader Load collection config from: [/collections/control_collection]
   [junit4]   2> 118989 INFO  (coreLoadExecutor-3454-thread-1) [    ] o.a.s.c.c.ZkStateReader path=[/collections/control_collection] [configName]=[conf1] specified config exists in ZooKeeper
   [junit4]   2> 118989 INFO  (coreLoadExecutor-3454-thread-1) [    ] o.a.s.r.ManagedResourceStorage Setting up ZooKeeper-based storage for the RestManager with znodeBase: /configs/conf1
   [junit4]   2> 118990 INFO  (coreLoadExecutor-3454-thread-1) [    ] o.a.s.r.ManagedResourceStorage Configured ZooKeeperStorageIO with znodeBase: /configs/conf1
   [junit4]   2> 118990 INFO  (coreLoadExecutor-3454-thread-1) [    ] o.a.s.r.RestManager Initializing RestManager with initArgs: {}
   [junit4]   2> 118990 INFO  (coreLoadExecutor-3454-thread-1) [    ] o.a.s.r.ManagedResourceStorage Reading _rest_managed.json using ZooKeeperStorageIO:path=/configs/conf1
   [junit4]   2> 118990 INFO  (coreLoadExecutor-3454-thread-1) [    ] o.a.s.r.ManagedResourceStorage No data found for znode /configs/conf1/_rest_managed.json
   [junit4]   2> 118990 INFO  (coreLoadExecutor-3454-thread-1) [    ] o.a.s.r.ManagedResourceStorage Loaded null at path _rest_managed.json using ZooKeeperStorageIO:path=/configs/conf1
   [junit4]   2> 118990 INFO  (coreLoadExecutor-3454-thread-1) [    ] o.a.s.r.RestManager Initializing 0 registered ManagedResources
   [junit4]   2> 118990 INFO  (coreLoadExecutor-3454-thread-1) [    ] o.a.s.h.ReplicationHandler Commits will be reserved for  10000
   [junit4]   2> 118991 INFO  (searcherExecutor-3455-thread-1) [    ] o.a.s.c.SolrCore [collection1] Registered new searcher Searcher@61767a40[collection1] main{ExitableDirectoryReader(UninvertingDirectoryReader())}
   [junit4]   2> 118991 INFO  (coreLoadExecutor-3454-thread-1) [    ] o.a.s.u.UpdateLog Looking up max value of version field to seed version buckets
   [junit4]   2> 118991 INFO  (coreLoadExecutor-3454-thread-1) [    ] o.a.s.u.VersionInfo Refreshing highest value of _version_ for 65536 version buckets from index
   [junit4]   2> 118991 INFO  (coreLoadExecutor-3454-thread-1) [    ] o.a.s.u.VersionInfo No terms found for _version_, cannot seed version bucket highest value from index
   [junit4]   2> 118991 INFO  (coreLoadExecutor-3454-thread-1) [    ] o.a.s.u.UpdateLog Could not find max version in index or recent updates, using new clock 1540242601978888192
   [junit4]   2> 118993 INFO  (coreLoadExecutor-3454-thread-1) [    ] o.a.s.u.UpdateLog Took 1.0ms to seed version buckets with highest version 1540242601978888192
   [junit4]   2> 118993 INFO  (coreLoadExecutor-3454-thread-1) [    ] o.a.s.c.ZkController watch zkdir /configs/conf1
   [junit4]   2> 118993 INFO  (coreLoadExecutor-3454-thread-1) [    ] o.a.s.c.CoreContainer registering core: collection1
   [junit4]   2> 118994 INFO  (coreZkRegister-3448-thread-1) [    ] o.a.s.c.ZkController Register replica - core:collection1 address:http://127.0.0.1:45929 collection:control_collection shard:shard1
   [junit4]   2> 118994 INFO  (coreZkRegister-3448-thread-1) [    ] o.a.s.c.c.SolrZkClient makePath: /collections/control_collection/leader_elect/shard1/election
   [junit4]   2> 118995 INFO  (coreZkRegister-3448-thread-1) [    ] o.a.s.c.LeaderElector Joined leadership election with path: /collections/control_collection/leader_elect/shard1/election/96265162533896196-core_node1-n_0000000000
   [junit4]   2> 118995 INFO  (coreZkRegister-3448-thread-1) [    ] o.a.s.c.ShardLeaderElectionContext Running the leader process for shard=shard1 and weAreReplacement=false and leaderVoteWait=10000
   [junit4]   2> 118996 INFO  (coreZkRegister-3448-thread-1) [    ] o.a.s.c.ShardLeaderElectionContext Enough replicas found to continue.
   [junit4]   2> 118996 INFO  (coreZkRegister-3448-thread-1) [    ] o.a.s.c.ShardLeaderElectionContext I may be the new leader - try and sync
   [junit4]   2> 118996 INFO  (coreZkRegister-3448-thread-1) [    ] o.a.s.c.SyncStrategy Sync replicas to http://127.0.0.1:45929/collection1/
   [junit4]   2> 118996 INFO  (coreZkRegister-3448-thread-1) [    ] o.a.s.c.SyncStrategy Sync Success - now sync replicas to me
   [junit4]   2> 118996 INFO  (coreZkRegister-3448-thread-1) [    ] o.a.s.c.SyncStrategy http://127.0.0.1:45929/collection1/ has no replicas
   [junit4]   2> 118996 INFO  (OverseerStateUpdate-96265162533896196-127.0.0.1:45929_-n_0000000000) [    ] o.a.s.c.Overseer processMessage: queueSize: 1, message = {
   [junit4]   2>   "operation":"leader",
   [junit4]   2>   "shard":"shard1",
   [junit4]   2>   "collection":"control_collection"} current state version: 1
   [junit4]   2> 118996 INFO  (coreZkRegister-3448-thread-1) [    ] o.a.s.c.c.SolrZkClient makePath: /collections/control_collection/leaders/shard1
   [junit4]   2> 118997 INFO  (coreZkRegister-3448-thread-1) [    ] o.a.s.c.ShardLeaderElectionContextBase Creating leader registration node /collections/control_collection/leaders/shard1/leader after winning as /collections/control_collection/leader_elect/shard1/election/96265162533896196-core_node1-n_0000000000
   [junit4]   2> 118998 INFO  (coreZkRegister-3448-thread-1) [    ] o.a.s.c.ShardLeaderElectionContext I am the new leader: http://127.0.0.1:45929/collection1/ shard1
   [junit4]   2> 118998 INFO  (OverseerStateUpdate-96265162533896196-127.0.0.1:45929_-n_0000000000) [    ] o.a.s.c.Overseer processMessage: queueSize: 1, message = {
   [junit4]   2>   "operation":"leader",
   [junit4]   2>   "shard":"shard1",
   [junit4]   2>   "collection":"control_collection",
   [junit4]   2>   "base_url":"http://127.0.0.1:45929",
   [junit4]   2>   "core":"collection1",
   [junit4]   2>   "state":"active"} current state version: 1
   [junit4]   2> 119100 INFO  (zkCallback-17772-thread-2) [    ] o.a.s.c.c.ZkStateReader A cluster state change: [WatchedEvent state:SyncConnected type:NodeDataChanged path:/clusterstate.json], has occurred - updating... (live nodes size: [1])
   [junit4]   2> 119149 INFO  (coreZkRegister-3448-thread-1) [    ] o.a.s.c.ZkController We are http://127.0.0.1:45929/collection1/ and leader is http://127.0.0.1:45929/collection1/
   [junit4]   2> 119149 INFO  (coreZkRegister-3448-thread-1) [    ] o.a.s.c.ZkController No LogReplay needed for core=collection1 baseURL=http://127.0.0.1:45929
   [junit4]   2> 119149 INFO  (coreZkRegister-3448-thread-1) [    ] o.a.s.c.ZkController I am the leader, no recovery necessary
   [junit4]   2> 119149 INFO  (coreZkRegister-3448-thread-1) [    ] o.a.s.c.ZkController publishing state=active
   [junit4]   2> 119149 INFO  (coreZkRegister-3448-thread-1) [    ] o.a.s.c.ZkController numShards not found on descriptor - reading it from system property
   [junit4]   2> 119149 INFO  (coreZkRegister-3448-thread-1) [    ] o.a.s.c.c.ZkStateReader Checking legacy cluster state for collection control_collection
   [junit4]   2> 119150 INFO  (OverseerStateUpdate-96265162533896196-127.0.0.1:45929_-n_0000000000) [    ] o.a.s.c.Overseer processMessage: queueSize: 1, message = {
   [junit4]   2>   "core":"collection1",
   [junit4]   2>   "core_node_name":"core_node1",
   [junit4]   2>   "roles":null,
   [junit4]   2>   "base_url":"http://127.0.0.1:45929",
   [junit4]   2>   "node_name":"127.0.0.1:45929_",
   [junit4]   2>   "numShards":"1",
   [junit4]   2>   "state":"active",
   [junit4]   2>   "shard":"shard1",
   [junit4]   2>   "collection":"control_collection",
   [junit4]   2>   "operation":"state"} current state version: 2
   [junit4]   2> 119150 INFO  (OverseerStateUpdate-96265162533896196-127.0.0.1:45929_-n_0000000000) [    ] o.a.s.c.o.ReplicaMutator Update state numShards=1 message={
   [junit4]   2>   "core":"collection1",
   [junit4]   2>   "core_node_name":"core_node1",
   [junit4]   2>   "roles":null,
   [junit4]   2>   "base_url":"http://127.0.0.1:45929",
   [junit4]   2>   "node_name":"127.0.0.1:45929_",
   [junit4]   2>   "numShards":"1",
   [junit4]   2>   "state":"active",
   [junit4]   2>   "shard":"shard1",
   [junit4]   2>   "collection":"control_collection",
   [junit4]   2>   "operation":"state"}
   [junit4]   2> 119251 INFO  (zkCallback-17772-thread-2) [    ] o.a.s.c.c.ZkStateReader A cluster state change: [WatchedEvent state:SyncConnected type:NodeDataChanged path:/clusterstate.json], has occurred - updating... (live nodes size: [1])
   [junit4]   2> 119342 INFO  (TEST-LeaderFailoverAfterPartitionTest.test-seed#[CBC62745B607978D]) [    ] o.a.s.c.c.SolrZkClient Using default ZkCredentialsProvider
   [junit4]   2> 119343 INFO  (TEST-LeaderFailoverAfterPartitionTest.test-seed#[CBC62745B607978D]) [    ] o.a.s.c.c.ConnectionManager Waiting for client to connect to ZooKeeper
   [junit4]   2> 119343 INFO  (zkCallback-17776-thread-1) [    ] o.a.s.c.c.ConnectionManager Watcher org.apache.solr.common.cloud.ConnectionManager@6f01761d name:ZooKeeperConnection Watcher:127.0.0.1:44245/solr got event WatchedEvent state:SyncConnected type:None path:null path:null type:None
   [junit4]   2> 119343 INFO  (TEST-LeaderFailoverAfterPartitionTest.test-seed#[CBC62745B607978D]) [    ] o.a.s.c.c.ConnectionManager Client is connected to ZooKeeper
   [junit4]   2> 119344 INFO  (TEST-LeaderFailoverAfterPartitionTest.test-seed#[CBC62745B607978D]) [    ] o.a.s.c.c.SolrZkClient Using default ZkACLProvider
   [junit4]   2> 119344 INFO  (TEST-LeaderFailoverAfterPartitionTest.test-seed#[CBC62745B607978D]) [    ] o.a.s.c.c.ZkStateReader Updating cluster state from ZooKeeper... 
   [junit4]   2> 119344 INFO  (TEST-LeaderFailoverAfterPartitionTest.test-seed#[CBC62745B607978D]) [    ] o.a.s.c.c.ZkStateReader Loaded empty cluster properties
   [junit4]   2> 119344 INFO  (TEST-LeaderFailoverAfterPartitionTest.test-seed#[CBC62745B607978D]) [    ] o.a.s.c.c.ZkStateReader Updated live nodes from ZooKeeper... (0) -> (1)
   [junit4]   2> 119345 INFO  (TEST-LeaderFailoverAfterPartitionTest.test-seed#[CBC62745B607978D]) [    ] o.a.s.c.ChaosMonkey monkey: init - expire sessions:false cause connection loss:false
   [junit4]   2> 119345 INFO  (TEST-LeaderFailoverAfterPartitionTest.test-seed#[CBC62745B607978D]) [    ] o.a.s.c.AbstractFullDistribZkTestBase Creating collection1 with stateFormat=2
   [junit4]   2> 119345 INFO  (TEST-LeaderFailoverAfterPartitionTest.test-seed#[CBC62745B607978D]) [    ] o.a.s.c.c.SolrZkClient Using default ZkCredentialsProvider
   [junit4]   2> 119345 INFO  (TEST-LeaderFailoverAfterPartitionTest.test-seed#[CBC62745B607978D]) [    ] o.a.s.c.c.ConnectionManager Waiting for client to connect to ZooKeeper
   [junit4]   2> 119346 INFO  (zkCallback-17777-thread-1) [    ] o.a.s.c.c.ConnectionManager Watcher org.apache.solr.common.cloud.ConnectionManager@7259483e name:ZooKeeperConnection Watcher:127.0.0.1:44245/solr got event WatchedEvent state:SyncConnected type:None path:null path:null type:None
   [junit4]   2> 119346 INFO  (TEST-LeaderFailoverAfterPartitionTest.test-seed#[CBC62745B607978D]) [    ] o.a.s.c.c.ConnectionManager Client is connected to ZooKeeper
   [junit4]   2> 119346 INFO  (TEST-LeaderFailoverAfterPartitionTest.test-seed#[CBC62745B607978D]) [    ] o.a.s.c.c.SolrZkClient Using default ZkACLProvider
   [junit4]   2> 119347 INFO  (OverseerStateUpdate-96265162533896196-127.0.0.1:45929_-n_0000000000) [    ] o.a.s.c.Overseer processMessage: queueSize: 1, message = {
   [junit4]   2>   "operation":"create",
   [junit4]   2>   "name":"collection1",
   [junit4]   2>   "numShards":"2",
   [junit4]   2>   "stateFormat":"2"} current state version: 3
   [junit4]   2> 119347 INFO  (OverseerStateUpdate-96265162533896196-127.0.0.1:45929_-n_0000000000) [    ] o.a.s.c.o.ClusterStateMutator building a new cName: collection1
   [junit4]   2> 119408 INFO  (TEST-LeaderFailoverAfterPartitionTest.test-seed#[CBC62745B607978D]) [    ] o.a.s.SolrTestCaseJ4 Writing core.properties file to /home/jenkins/workspace/Lucene-Solr-6.x-Linux/solr/build/solr-core/test/J2/temp/solr.cloud.LeaderFailoverAfterPartitionTest_CBC62745B607978D-001/shard-1-001/cores/collection1
   [junit4]   2> 119410 INFO  (TEST-LeaderFailoverAfterPartitionTest.test-seed#[CBC62745B607978D]) [    ] o.a.s.c.AbstractFullDistribZkTestBase create jetty 1 in directory /home/jenkins/workspace/Lucene-Solr-6.x-Linux/solr/build/solr-core/test/J2/temp/solr.cloud.LeaderFailoverAfterPartitionTest_CBC62745B607978D-001/shard-1-001
   [junit4]   2> 119411 INFO  (TEST-LeaderFailoverAfterPartitionTest.test-seed#[CBC62745B607978D]) [    ] o.e.j.s.Server jetty-9.3.8.v20160314
   [junit4]   2> 119418 INFO  (TEST-LeaderFailoverAfterPartitionTest.test-seed#[CBC62745B607978D]) [    ] o.e.j.s.h.ContextHandler Started o.e.j.s.ServletContextHandler@4c327ffd{/,null,AVAILABLE}
   [junit4]   2> 119418 INFO  (TEST-LeaderFailoverAfterPartitionTest.test-seed#[CBC62745B607978D]) [    ] o.e.j.s.ServerConnector Started ServerConnector@286d1c28{HTTP/1.1,[http/1.1]}{127.0.0.1:?????}
   [junit4]   2> 119419 INFO  (TEST-LeaderFailoverAfterPartitionTest.test-seed#[CBC62745B607978D]) [    ] o.e.j.s.Server Started @??????ms
   [junit4]   2> 119419 INFO  (TEST-LeaderFailoverAfterPartitionTest.test-seed#[CBC62745B607978D]) [    ] o.a.s.c.s.e.JettySolrRunner Jetty properties: {hostContext=/, solrconfig=solrconfig.xml, solr.data.dir=/home/jenkins/workspace/Lucene-Solr-6.x-Linux/solr/build/solr-core/test/J2/temp/solr.cloud.LeaderFailoverAfterPartitionTest_CBC62745B607978D-001/tempDir-001/jetty1, hostPort=37467, coreRootDirectory=/home/jenkins/workspace/Lucene-Solr-6.x-Linux/solr/build/solr-core/test/J2/temp/solr.cloud.LeaderFailoverAfterPartitionTest_CBC62745B607978D-001/shard-1-001/cores}
   [junit4]   2> 119419 INFO  (TEST-LeaderFailoverAfterPartitionTest.test-seed#[CBC62745B607978D]) [    ] o.a.s.s.SolrDispatchFilter SolrDispatchFilter.init(): jdk.internal.loader.ClassLoaders$AppClassLoader@2cfb4a64
   [junit4]   2> 119419 INFO  (TEST-LeaderFailoverAfterPartitionTest.test-seed#[CBC62745B607978D]) [    ] o.a.s.c.SolrResourceLoader new SolrResourceLoader for directory: '/home/jenkins/workspace/Lucene-Solr-6.x-Linux/solr/build/solr-core/test/J2/temp/solr.cloud.LeaderFailoverAfterPartitionTest_CBC62745B607978D-001/shard-1-001'
   [junit4]   2> 119419 INFO  (TEST-LeaderFailoverAfterPartitionTest.test-seed#[CBC62745B607978D]) [    ] o.a.s.c.SolrResourceLoader JNDI not configured for solr (NoInitialContextEx)
   [junit4]   2> 119420 INFO  (TEST-LeaderFailoverAfterPartitionTest.test-seed#[CBC62745B607978D]) [    ] o.a.s.c.SolrResourceLoader solr home defaulted to 'solr/' (could not find system property or JNDI)
   [junit4]   2> 119420 INFO  (TEST-LeaderFailoverAfterPartitionTest.test-seed#[CBC62745B607978D]) [    ] o.a.s.c.c.SolrZkClient Using default ZkCredentialsProvider
   [junit4]   2> 119420 INFO  (TEST-LeaderFailoverAfterPartitionTest.test-seed#[CBC62745B607978D]) [    ] o.a.s.c.c.ConnectionManager Waiting for client to connect to ZooKeeper
   [junit4]   2> 119421 INFO  (zkCallback-17778-thread-1) [    ] o.a.s.c.c.ConnectionManager Watcher org.apache.solr.common.cloud.ConnectionManager@2d759e2e name:ZooKeeperConnection Watcher:127.0.0.1:44245/solr got event WatchedEvent state:SyncConnected type:None path:null path:null type:None
   [junit4]   2> 119422 INFO  (TEST-LeaderFailoverAfterPartitionTest.test-seed#[CBC62745B607978D]) [    ] o.a.s.c.c.ConnectionManager Client is connected to ZooKeeper
   [junit4]   2> 119422 INFO  (TEST-LeaderFailoverAfterPartitionTest.test-seed#[CBC62745B607978D]) [    ] o.a.s.c.c.SolrZkClient Using default ZkACLProvider
   [junit4]   2> 119422 INFO  (TEST-LeaderFailoverAfterPartitionTest.test-seed#[CBC62745B607978D]) [    ] o.a.s.s.SolrDispatchFilter Loading solr.xml from SolrHome (not found in ZooKeeper)
   [junit4]   2> 119422 INFO  (TEST-LeaderFailoverAfterPartitionTest.test-seed#[CBC62745B607978D]) [    ] o.a.s.c.SolrXmlConfig Loading container configuration from /home/jenkins/workspace/Lucene-Solr-6.x-Linux/solr/build/solr-core/test/J2/temp/solr.cloud.LeaderFailoverAfterPartitionTest_CBC62745B607978D-001/shard-1-001/solr.xml
   [junit4]   2> 119426 INFO  (TEST-LeaderFailoverAfterPartitionTest.test-seed#[CBC62745B607978D]) [    ] o.a.s.c.CorePropertiesLocator Config-defined core root directory: /home/jenkins/workspace/Lucene-Solr-6.x-Linux/solr/build/solr-core/test/J2/temp/solr.cloud.LeaderFailoverAfterPartitionTest_CBC62745B607978D-001/shard-1-001/cores
   [junit4]   2> 119427 INFO  (TEST-LeaderFailoverAfterPartitionTest.test-seed#[CBC62745B607978D]) [    ] o.a.s.c.CoreContainer New CoreContainer 529881763
   [junit4]   2> 119427 INFO  (TEST-LeaderFailoverAfterPartitionTest.test-seed#[CBC62745B607978D]) [    ] o.a.s.c.CoreContainer Loading cores into CoreContainer [instanceDir=/home/jenkins/workspace/Lucene-Solr-6.x-Linux/solr/build/solr-core/test/J2/temp/solr.cloud.LeaderFailoverAfterPartitionTest_CBC62745B607978D-001/shard-1-001]
   [junit4]   2> 119427 WARN  (TEST-LeaderFailoverAfterPartitionTest.test-seed#[CBC62745B607978D]) [    ] o.a.s.c.CoreContainer Couldn't add files from /home/jenkins/workspace/Lucene-Solr-6.x-Linux/solr/build/solr-core/test/J2/temp/solr.cloud.LeaderFailoverAfterPartitionTest_CBC62745B607978D-001/shard-1-001/lib to classpath: /home/jenkins/workspace/Lucene-Solr-6.x-Linux/solr/build/solr-core/test/J2/temp/solr.cloud.LeaderFailoverAfterPartitionTest_CBC62745B607978D-001/shard-1-001/lib
   [junit4]   2> 119427 INFO  (TEST-LeaderFailoverAfterPartitionTest.test-seed#[CBC62745B607978D]) [    ] o.a.s.h.c.HttpShardHandlerFactory created with socketTimeout : 90000,urlScheme : ,connTimeout : 15000,maxConnectionsPerHost : 20,maxConnections : 10000,corePoolSize : 0,maximumPoolSize : 2147483647,maxThreadIdleTime : 5,sizeOfQueue : -1,fairnessPolicy : false,useRetries : false,connectionsEvictorSleepDelay : 5000,maxConnectionIdleTime : 40000,
   [junit4]   2> 119428 INFO  (TEST-LeaderFailoverAfterPartitionTest.test-seed#[CBC62745B607978D]) [    ] o.a.s.u.UpdateShardHandler Creating UpdateShardHandler HTTP client with params: socketTimeout=340000&connTimeout=45000&retry=true
   [junit4]   2> 119428 INFO  (TEST-LeaderFailoverAfterPartitionTest.test-seed#[CBC62745B607978D]) [    ] o.a.s.l.LogWatcher SLF4J impl is org.slf4j.impl.Log4jLoggerFactory
   [junit4]   2> 119428 INFO  (TEST-LeaderFailoverAfterPartitionTest.test-seed#[CBC62745B607978D]) [    ] o.a.s.l.LogWatcher Registering Log Listener [Log4j (org.slf4j.impl.Log4jLoggerFactory)]
   [junit4]   2> 119428 INFO  (TEST-LeaderFailoverAfterPartitionTest.test-seed#[CBC62745B607978D]) [    ] o.a.s.c.ZkContainer Zookeeper client=127.0.0.1:44245/solr
   [junit4]   2> 119428 INFO  (TEST-LeaderFailoverAfterPartitionTest.test-seed#[CBC62745B607978D]) [    ] o.a.s.c.ZkController zkHost includes chroot
   [junit4]   2> 119428 INFO  (TEST-LeaderFailoverAfterPartitionTest.test-seed#[CBC62745B607978D]) [    ] o.a.s.c.c.SolrZkClient Using default ZkCredentialsProvider
   [junit4]   2> 119428 INFO  (TEST-LeaderFailoverAfterPartitionTest.test-seed#[CBC62745B607978D]) [    ] o.a.s.c.c.ConnectionManager Waiting for client to connect to ZooKeeper
   [junit4]   2> 119429 INFO  (zkCallback-17781-thread-1) [    ] o.a.s.c.c.ConnectionManager Watcher org.apache.solr.common.cloud.ConnectionManager@13ea91cb name:ZooKeeperConnection Watcher:127.0.0.1:44245 got event WatchedEvent state:SyncConnected type:None path:null path:null type:None
   [junit4]   2> 119429 INFO  (TEST-LeaderFailoverAfterPartitionTest.test-seed#[CBC62745B607978D]) [    ] o.a.s.c.c.ConnectionManager Client is connected to ZooKeeper
   [junit4]   2> 119430 INFO  (TEST-LeaderFailoverAfterPartitionTest.test-seed#[CBC62745B607978D]) [    ] o.a.s.c.c.SolrZkClient Using default ZkACLProvider
   [junit4]   2> 119430 INFO  (TEST-LeaderFailoverAfterPartitionTest.test-seed#[CBC62745B607978D]) [    ] o.a.s.c.ZkController Added new OnReconnect listener org.apache.solr.cloud.ZkController$$Lambda$150/1448856410@522c7efc
   [junit4]   2> 119430 INFO  (TEST-LeaderFailoverAfterPartitionTest.test-seed#[CBC62745B607978D]) [    ] o.a.s.c.c.ConnectionManager Waiting for client to connect to ZooKeeper
   [junit4]   2> 119431 INFO  (zkCallback-17782-thread-1) [    ] o.a.s.c.c.ConnectionManager Watcher org.apache.solr.common.cloud.ConnectionManager@7393a5c name:ZooKeeperConnection Watcher:127.0.0.1:44245/solr got event WatchedEvent state:SyncConnected type:None path:null path:null type:None
   [junit4]   2> 119431 INFO  (TEST-LeaderFailoverAfterPartitionTest.test-seed#[CBC62745B607978D]) [    ] o.a.s.c.c.ConnectionManager Client is connected to ZooKeeper
   [junit4]   2> 119435 INFO  (TEST-LeaderFailoverAfterPartitionTest.test-seed#[CBC62745B607978D]) [    ] o.a.s.c.c.ZkStateReader Updating cluster state from ZooKeeper... 
   [junit4]   2> 119435 INFO  (TEST-LeaderFailoverAfterPartitionTest.test-seed#[CBC62745B607978D]) [    ] o.a.s.c.c.ZkStateReader Loaded empty cluster properties
   [junit4]   2> 119435 INFO  (TEST-LeaderFailoverAfterPartitionTest.test-seed#[CBC62745B607978D]) [    ] o.a.s.c.c.ZkStateReader Updated live nodes from ZooKeeper... (0) -> (1)
   [junit4]   2> 119436 INFO  (TEST-LeaderFailoverAfterPartitionTest.test-seed#[CBC62745B607978D]) [    ] o.a.s.c.Overseer Overseer (id=null) closing
   [junit4]   2> 119436 INFO  (TEST-LeaderFailoverAfterPartitionTest.test-seed#[CBC62745B607978D]) [    ] o.a.s.c.LeaderElector Joined leadership election with path: /overseer_elect/election/96265162533896201-127.0.0.1:37467_-n_0000000001
   [junit4]   2> 119437 INFO  (TEST-LeaderFailoverAfterPartitionTest.test-seed#[CBC62745B607978D]) [    ] o.a.s.c.LeaderElector Watching path /overseer_elect/election/96265162533896196-127.0.0.1:45929_-n_0000000000 to know if I could be the leader
   [junit4]   2> 119437 INFO  (TEST-LeaderFailoverAfterPartitionTest.test-seed#[CBC62745B607978D]) [    ] o.a.s.c.ZkController Publish node=127.0.0.1:37467_ as DOWN
   [junit4]   2> 119438 INFO  (TEST-LeaderFailoverAfterPartitionTest.test-seed#[CBC62745B607978D]) [    ] o.a.s.c.ZkController Register node as live in ZooKeeper:/live_nodes/127.0.0.1:37467_
   [junit4]   2> 119438 INFO  (TEST-LeaderFailoverAfterPartitionTest.test-seed#[CBC62745B607978D]) [    ] o.a.s.c.c.SolrZkClient makePath: /live_nodes/127.0.0.1:37467_
   [junit4]   2> 119438 INFO  (OverseerStateUpdate-96265162533896196-127.0.0.1:45929_-n_0000000000) [    ] o.a.s.c.Overseer processMessage: queueSize: 1, message = {
   [junit4]   2>   "operation":"downnode",
   [junit4]   2>   "node_name":"127.0.0.1:37467_"} current state version: 3
   [junit4]   2> 119438 INFO  (OverseerStateUpdate-96265162533896196-127.0.0.1:45929_-n_0000000000) [    ] o.a.s.c.o.NodeMutator DownNode state invoked for node: 127.0.0.1:37467_
   [junit4]   2> 119438 INFO  (zkCallback-17772-thread-2) [    ] o.a.s.c.c.ZkStateReader A live node change: [WatchedEvent state:SyncConnected type:NodeChildrenChanged path:/live_nodes], has occurred - updating... (live nodes size: [1])
   [junit4]   2> 119438 INFO  (OverseerStateUpdate-96265162533896196-127.0.0.1:45929_-n_0000000000) [    ] o.a.s.c.o.ZkStateWriter going to create_collection /collections/collection1/state.json
   [junit4]   2> 119439 INFO  (zkCallback-17776-thread-1) [    ] o.a.s.c.c.ZkStateReader A live node change: [WatchedEvent state:SyncConnected type:NodeChildrenChanged path:/live_nodes], has occurred - updating... (live nodes size: [1])
   [junit4]   2> 119439 INFO  (zkCallback-17782-thread-1) [    ] o.a.s.c.c.ZkStateReader A live node change: [WatchedEvent state:SyncConnected type:NodeChildrenChanged path:/live_nodes], has occurred - updating... (live nodes size: [1])
   [junit4]   2> 119439 INFO  (zkCallback-17772-thread-2) [    ] o.a.s.c.c.ZkStateReader Updated live nodes from ZooKeeper... (1) -> (2)
   [junit4]   2> 119439 INFO  (zkCallback-17776-thread-1) [    ] o.a.s.c.c.ZkStateReader Updated live nodes from ZooKeeper... (1) -> (2)
   [junit4]   2> 119439 INFO  (zkCallback-17782-thread-1) [    ] o.a.s.c.c.ZkStateReader Updated live nodes from ZooKeeper... (1) -> (2)
   [junit4]   2> 119440 INFO  (zkCallback-17772-thread-2) [    ] o.a.s.c.c.ZkStateReader A cluster state change: [WatchedEvent state:SyncConnected type:NodeDataChanged path:/clusterstate.json], has occurred - updating... (live nodes size: [2])
   [junit4]   2> 119440 INFO  (zkCallback-17776-thread-1) [    ] o.a.s.c.c.ZkStateReader A cluster state change: [WatchedEvent state:SyncConnected type:NodeDataChanged path:/clusterstate.json], has occurred - updating... (live nodes size: [2])
   [junit4]   2> 119441 INFO  (zkCallback-17782-thread-1) [    ] o.a.s.c.c.ZkStateReader A cluster state change: [WatchedEvent state:SyncConnected type:NodeDataChanged path:/clusterstate.json], has occurred - updating... (live nodes size: [2])
   [junit4]   2> 119444 INFO  (TEST-LeaderFailoverAfterPartitionTest.test-seed#[CBC62745B607978D]) [    ] o.a.s.c.CoreContainer Security conf doesn't exist. Skipping setup for authorization module.
   [junit4]   2> 119444 INFO  (TEST-LeaderFailoverAfterPartitionTest.test-seed#[CBC62745B607978D]) [    ] o.a.s.c.CoreContainer No authentication plugin used.
   [junit4]   2> 119444 INFO  (TEST-LeaderFailoverAfterPartitionTest.test-seed#[CBC62745B607978D]) [    ] o.a.s.c.CorePropertiesLocator Looking for core definitions underneath /home/jenkins/workspace/Lucene-Solr-6.x-Linux/solr/build/solr-core/test/J2/temp/solr.cloud.LeaderFailoverAfterPartitionTest_CBC62745B607978D-001/shard-1-001/cores
   [junit4]   2> 119445 INFO  (TEST-LeaderFailoverAfterPartitionTest.test-seed#[CBC62745B607978D]) [    ] o.a.s.c.CoreDescriptor Created CoreDescriptor: {schema=schema.xml, dataDir=data/, collection=collection1, loadOnStartup=true, coreNodeName=, transient=false, name=collection1, shard=, config=solrconfig.xml, configSetProperties=configsetprops.json}
   [junit4]   2> 119446 INFO  (TEST-LeaderFailoverAfterPartitionTest.test-seed#[CBC62745B607978D]) [    ] o.a.s.c.CorePropertiesLocator Found core collection1 in /home/jenkins/workspace/Lucene-Solr-6.x-Linux/solr/build/solr-core/test/J2/temp/solr.cloud.LeaderFailoverAfterPartitionTest_CBC62745B607978D-001/shard-1-001/cores/collection1
   [junit4]   2> 119446 INFO  (TEST-LeaderFailoverAfterPartitionTest.test-seed#[CBC62745B607978D]) [    ] o.a.s.c.CorePropertiesLocator Found 1 core definitions
   [junit4]   2> 119453 INFO  (TEST-LeaderFailoverAfterPartitionTest.test-seed#[CBC62745B607978D]) [    ] o.a.s.s.SolrDispatchFilter user.dir=/home/jenkins/workspace/Lucene-Solr-6.x-Linux/solr/build/solr-core/test/J2
   [junit4]   2> 119453 INFO  (TEST-LeaderFailoverAfterPartitionTest.test-seed#[CBC62745B607978D]) [    ] o.a.s.s.SolrDispatchFilter SolrDispatchFilter.init() done
   [junit4]   2> 119453 INFO  (coreLoadExecutor-3465-thread-1) [    ] o.a.s.c.ZkController publishing state=down
   [junit4]   2> 119453 INFO  (coreLoadExecutor-3465-thread-1) [    ] o.a.s.c.ZkController numShards not found on descriptor - reading it from system property
   [junit4]   2> 119456 INFO  (coreLoadExecutor-3465-thread-1) [    ] o.a.s.c.ZkController Registering watch for collection collection1
   [junit4]   2> 119458 INFO  (OverseerStateUpdate-96265162533896196-127.0.0.1:45929_-n_0000000000) [    ] o.a.s.c.Overseer processMessage: queueSize: 1, message = {
   [junit4]   2>   "core":"collection1",
   [junit4]   2>   "roles":null,
   [junit4]   2>   "base_url":"http://127.0.0.1:37467",
   [junit4]   2>   "node_name":"127.0.0.1:37467_",
   [junit4]   2>   "numShards":"2",
   [junit4]   2>   "state":"down",
   [junit4]   2>   "shard":null,
   [junit4]   2>   "collection":"collection1",
   [junit4]   2>   "operation":"state"} current state version: 4
   [junit4]   2> 119458 INFO  (OverseerStateUpdate-96265162533896196-127.0.0.1:45929_-n_0000000000) [    ] o.a.s.c.o.ReplicaMutator Update state numShards=2 message={
   [junit4]   2>   "core":"collection1",
   [junit4]   2>   "roles":null,
   [junit4]   2>   "base_url":"http://127.0.0.1:37467",
   [junit4]   2>   "node_name":"127.0.0.1:37467_",
   [junit4]   2>   "numShards":"2",
   [junit4]   2>   "state":"down",
   [junit4]   2>   "shard":null,
   [junit4]   2>   "collection":"collection1",
   [junit4]   2>   "operation":"state"}
   [junit4]   2> 119458 INFO  (OverseerStateUpdate-96265162533896196-127.0.0.1:45929_-n_0000000000) [    ] o.a.s.c.o.ReplicaMutator Collection already exists with numShards=2
   [junit4]   2> 119458 INFO  (OverseerStateUpdate-96265162533896196-127.0.0.1:45929_-n_0000000000) [    ] o.a.s.c.o.ReplicaMutator Assigning new node to shard shard=shard2
   [junit4]   2> 119460 INFO  (coreLoadExecutor-3465-thread-1) [    ] o.a.s.c.c.ZkStateReader Add data for [collection1] ver [0]
   [junit4]   2> 119460 INFO  (coreLoadExecutor-3465-thread-1) [    ] o.a.s.c.ZkController look for our core node name
   [junit4]   2> 119562 INFO  (OverseerStateUpdate-96265162533896196-127.0.0.1:45929_-n_0000000000) [    ] o.a.s.c.o.ZkStateWriter going to update_collection /collections/collection1/state.json version: 2147483647
   [junit4]   2> 119564 WARN  (OverseerStateUpdate-96265162533896196-127.0.0.1:45929_-n_0000000000) [    ] o.a.s.c.Overseer Bad version writing to ZK using compare-and-set, will force refresh cluster state
   [junit4]   2> org.apache.zookeeper.KeeperException$BadVersionException: KeeperErrorCode = BadVersion for /collections/collection1/state.json
   [junit4]   2> 	at org.apache.zookeeper.KeeperException.create(KeeperException.java:115)
   [junit4]   2> 	at org.apache.zookeeper.KeeperException.create(KeeperException.java:51)
   [junit4]   2> 	at org.apache.zookeeper.ZooKeeper.setData(ZooKeeper.java:1270)
   [junit4]   2> 	at org.apache.solr.common.cloud.SolrZkClient$8.execute(SolrZkClient.java:365)
   [junit4]   2> 	at org.apache.solr.common.cloud.SolrZkClient$8.execute(SolrZkClient.java:362)
   [junit4]   2> 	at org.apache.solr.common.cloud.ZkCmdExecutor.retryOperation(ZkCmdExecutor.java:60)
   [junit4]   2> 	at org.apache.solr.common.cloud.SolrZkClient.setData(SolrZkClient.java:362)
   [junit4]   2> 	at org.apache.solr.cloud.overseer.ZkStateWriter.writePendingUpdates(ZkStateWriter.java:230)
   [junit4]   2> 	at org.apache.solr.cloud.Overseer$ClusterStateUpdater.run(Overseer.java:240)
   [junit4]   2> 	at java.lang.Thread.run(java.base@9-ea/Thread.java:843)
   [junit4]   2> 119565 INFO  (OverseerStateUpdate-96265162533896196-127.0.0.1:45929_-n_0000000000) [    ] o.a.s.c.c.ZkStateReader Updated live nodes from ZooKeeper... (2) -> (2)
   [junit4]   2> 119566 INFO  (OverseerStateUpdate-96265162533896196-127.0.0.1:45929_-n_0000000000) [    ] o.a.s.c.Overseer processMessage: workQueueSize: 2, message = {
   [junit4]   2>   "operation":"downnode",
   [junit4]   2>   "node_name":"127.0.0.1:37467_"}
   [junit4]   2> 119566 INFO  (OverseerStateUpdate-96265162533896196-127.0.0.1:45929_-n_0000000000) [    ] o.a.s.c.o.NodeMutator DownNode state invoked for node: 127.0.0.1:37467_
   [junit4]   2> 119573 INFO  (zkCallback-17776-thread-1) [    ] o.a.s.c.c.ZkStateReader A cluster state change: [WatchedEvent state:SyncConnected type:NodeDataChanged path:/clusterstate.json], has occurred - updating... (live nodes size: [2])
   [junit4]   2> 119574 INFO  (zkCallback-17782-thread-1) [    ] o.a.s.c.c.ZkStateReader A cluster state change: [WatchedEvent state:SyncConnected type:NodeDataChanged path:/clusterstate.json], has occurred - updating... (live nodes size: [2])
   [junit4]   2> 119574 INFO  (zkCallback-17772-thread-2) [    ] o.a.s.c.c.ZkStateReader A cluster state change: [WatchedEvent state:SyncConnected type:NodeDataChanged path:/clusterstate.json], has occurred - updating... (live nodes size: [2])
   [junit4]   2> 119575 INFO  (OverseerStateUpdate-96265162533896196-127.0.0.1:45929_-n_0000000000) [    ] o.a.s.c.o.ZkStateWriter going to update_collection /collections/collection1/state.json version: 0
   [junit4]   2> 119575 INFO  (zkCallback-17782-thread-1) [    ] o.a.s.c.c.ZkStateReader A cluster state change: [WatchedEvent state:SyncConnected type:NodeDataChanged path:/collections/collection1/state.json] for collection [collection1] has occurred - updating... (live nodes size: [2])
   [junit4]   2> 119575 INFO  (zkCallback-17782-thread-1) [    ] o.a.s.c.c.ZkStateReader Updating data for [collection1] from [0] to [1]
   [junit4]   2> 119576 INFO  (OverseerStateUpdate-96265162533896196-127.0.0.1:45929_-n_0000000000) [    ] o.a.s.c.Overseer processMessage: workQueueSize: 1, message = {
   [junit4]   2>   "core":"collection1",
   [junit4]   2>   "roles":null,
   [junit4]   2>   "base_url":"http://127.0.0.1:37467",
   [junit4]   2>   "node_name":"127.0.0.1:37467_",
   [junit4]   2>   "numShards":"2",
   [junit4]   2>   "state":"down",
   [junit4]   2>   "shard":null,
   [junit4]   2>   "collection":"collection1",
   [junit4]   2>   "operation":"state"}
   [junit4]   2> 119577 INFO  (OverseerStateUpdate-96265162533896196-127.0.0.1:45929_-n_0000000000) [    ] o.a.s.c.o.ReplicaMutator Update state numShards=2 message={
   [junit4]   2>   "core":"collection1",
   [junit4]   2>   "roles":null,
   [junit4]   2>   "base_url":"http://127.0.0.1:37467",
   [junit4]   2>   "node_name":"127.0.0.1:37467_",
   [junit4]   2>   "numShards":"2",
   [junit4]   2>   "state":"down",
   [junit4]   2>   "shard":null,
   [junit4]   2>   "collection":"collection1",
   [junit4]   2>   "operation":"state"}
   [junit4]   2> 119577 INFO  (OverseerStateUpdate-96265162533896196-127.0.0.1:45929_-n_0000000000) [    ] o.a.s.c.o.ReplicaMutator Collection already exists with numShards=2
   [junit4]   2> 119577 INFO  (OverseerStateUpdate-96265162533896196-127.0.0.1:45929_-n_0000000000) [    ] o.a.s.c.o.ReplicaMutator Assigning new node to shard shard=shard2
   [junit4]   2> 119578 INFO  (OverseerStateUpdate-96265162533896196-127.0.0.1:45929_-n_0000000000) [    ] o.a.s.c.o.ZkStateWriter going to update_collection /collections/collection1/state.json version: 1
   [junit4]   2> 119579 INFO  (zkCallback-17782-thread-1) [    ] o.a.s.c.c.ZkStateReader A cluster state change: [WatchedEvent state:SyncConnected type:NodeDataChanged path:/collections/collection1/state.json] for collection [collection1] has occurred - updating... (live nodes size: [2])
   [junit4]   2> 119579 INFO  (zkCallback-17782-thread-1) [    ] o.a.s.c.c.ZkStateReader Updating data for [collection1] from [1] to [2]
   [junit4]   2> 120460 INFO  (coreLoadExecutor-3465-thread-1) [    ] o.a.s.c.ZkController waiting to find shard id in clusterstate for collection1
   [junit4]   2> 120460 INFO  (coreLoadExecutor-3465-thread-1) [    ] o.a.s.c.ZkController Check for collection zkNode:collection1
   [junit4]   2> 120461 INFO  (coreLoadExecutor-3465-thread-1) [    ] o.a.s.c.ZkController Collection zkNode exists
   [junit4]   2> 120461 INFO  (coreLoadExecutor-3465-thread-1) [    ] o.a.s.c.c.ZkStateReader Load collection config from: [/collections/collection1]
   [junit4]   2> 120461 INFO  (coreLoadExecutor-3465-thread-1) [    ] o.a.s.c.c.ZkStateReader path=[/collections/collection1] [configName]=[conf1] specified config exists in ZooKeeper
   [junit4]   2> 120461 INFO  (coreLoadExecutor-3465-thread-1) [    ] o.a.s.c.SolrResourceLoader new SolrResourceLoader for directory: '/home/jenkins/workspace/Lucene-Solr-6.x-Linux/solr/build/solr-core/test/J2/temp/solr.cloud.LeaderFailoverAfterPartitionTest_CBC62745B607978D-001/shard-1-001/cores/collection1'
   [junit4]   2> 120461 INFO  (coreLoadExecutor-3465-thread-1) [    ] o.a.s.c.SolrResourceLoader JNDI not configured for solr (NoInitialContextEx)
   [junit4]   2> 120461 INFO  (coreLoadExecutor-3465-thread-1) [    ] o.a.s.c.SolrResourceLoader solr home defaulted to 'solr/' (could not find system property or JNDI)
   [junit4]   2> 120462 INFO  (coreLoadExecutor-3465-thread-1) [    ] o.a.s.c.Config loaded config solrconfig.xml with version 0 
   [junit4]   2> 120466 INFO  (coreLoadExecutor-3465-thread-1) [    ] o.a.s.c.SolrConfig current version of requestparams : -1
   [junit4]   2> 120468 WARN  (coreLoadExecutor-3465-thread-1) [    ] o.a.s.c.Config Beginning with Solr 5.5, <mergePolicy> is deprecated, use <mergePolicyFactory> instead.
   [junit4]   2> 120469 INFO  (coreLoadExecutor-3465-thread-1) [    ] o.a.s.c.SolrConfig Using Lucene MatchVersion: 6.2.0
   [junit4]   2> 120476 INFO  (coreLoadExecutor-3465-thread-1) [    ] o.a.s.c.SolrConfig Loaded SolrConfig: solrconfig.xml
   [junit4]   2> 120480 INFO  (coreLoadExecutor-3465-thread-1) [    ] o.a.s.s.IndexSchema [collection1] Schema name=test
   [junit4]   2> 120554 INFO  (coreLoadExecutor-3465-thread-1) [    ] o.a.s.s.OpenExchangeRatesOrgProvider Initialized with rates=open-exchange-rates.json, refreshInterval=1440.
   [junit4]   2> 120558 INFO  (coreLoadExecutor-3465-thread-1) [    ] o.a.s.s.IndexSchema default search field in schema is text
   [junit4]   2> 120559 INFO  (coreLoadExecutor-3465-thread-1) [    ] o.a.s.s.IndexSchema unique key field: id
   [junit4]   2> 120564 INFO  (coreLoadExecutor-3465-thread-1) [    ] o.a.s.s.FileExchangeRateProvider Reloading exchange rates from file currency.xml
   [junit4]   2> 120566 INFO  (coreLoadExecutor-3465-thread-1) [    ] o.a.s.s.FileExchangeRateProvider Reloading exchange rates from file currency.xml
   [junit4]   2> 120567 INFO  (coreLoadExecutor-3465-thread-1) [    ] o.a.s.s.OpenExchangeRatesOrgProvider Reloading exchange rates from open-exchange-rates.json
   [junit4]   2> 120567 INFO  (coreLoadExecutor-3465-thread-1) [    ] o.a.s.s.OpenExchangeRatesOrgProvider Reloading exchange rates from open-exchange-rates.json
   [junit4]   2> 120568 INFO  (coreLoadExecutor-3465-thread-1) [    ] o.a.s.c.ConfigSetProperties Did not find ConfigSet properties, assuming default properties: Can't find resource 'configsetprops.json' in classpath or '/configs/conf1', cwd=/home/jenkins/workspace/Lucene-Solr-6.x-Linux/solr/build/solr-core/test/J2
   [junit4]   2> 120568 INFO  (coreLoadExecutor-3465-thread-1) [    ] o.a.s.c.CoreContainer Creating SolrCore 'collection1' using configuration from collection collection1
   [junit4]   2> 120568 INFO  (coreLoadExecutor-3465-thread-1) [    ] o.a.s.c.SolrCore org.apache.solr.core.MockDirectoryFactory
   [junit4]   2> 120568 INFO  (coreLoadExecutor-3465-thread-1) [    ] o.a.s.c.SolrCore [[collection1] ] Opening new SolrCore at [/home/jenkins/workspace/Lucene-Solr-6.x-Linux/solr/build/solr-core/test/J2/temp/solr.cloud.LeaderFailoverAfterPartitionTest_CBC62745B607978D-001/shard-1-001/cores/collection1], dataDir=[/home/jenkins/workspace/Lucene-Solr-6.x-Linux/solr/build/solr-core/test/J2/temp/solr.cloud.LeaderFailoverAfterPartitionTest_CBC62745B607978D-001/shard-1-001/cores/collection1/data/]
   [junit4]   2> 120568 INFO  (coreLoadExecutor-3465-thread-1) [    ] o.a.s.c.JmxMonitoredMap JMX monitoring is enabled. Adding Solr mbeans to JMX Server: com.sun.jmx.mbeanserver.JmxMBeanServer@61aadad9
   [junit4]   2> 120569 INFO  (coreLoadExecutor-3465-thread-1) [    ] o.a.s.c.CachingDirectoryFactory return new directory for /home/jenkins/workspace/Lucene-Solr-6.x-Linux/solr/build/solr-core/test/J2/temp/solr.cloud.LeaderFailoverAfterPartitionTest_CBC62745B607978D-001/shard-1-001/cores/collection1/data
   [junit4]   2> 120569 INFO  (coreLoadExecutor-3465-thread-1) [    ] o.a.s.c.SolrCore New index directory detected: old=null new=/home/jenkins/workspace/Lucene-Solr-6.x-Linux/solr/build/solr-core/test/J2/temp/solr.cloud.LeaderFailoverAfterPartitionTest_CBC62745B607978D-001/shard-1-001/cores/collection1/data/index/
   [junit4]   2> 120569 WARN  (coreLoadExecutor-3465-thread-1) [    ] o.a.s.c.SolrCore [collection1] Solr index directory '/home/jenkins/workspace/Lucene-Solr-6.x-Linux/solr/build/solr-core/test/J2/temp/solr.cloud.LeaderFailoverAfterPartitionTest_CBC62745B607978D-001/shard-1-001/cores/collection1/data/index' doesn't exist. Creating new index...
   [junit4]   2> 120569 INFO  (coreLoadExecutor-3465-thread-1) [    ] o.a.s.c.CachingDirectoryFactory return new directory for /home/jenkins/workspace/Lucene-Solr-6.x-Linux/solr/build/solr-core/test/J2/temp/solr.cloud.LeaderFailoverAfterPartitionTest_CBC62745B607978D-001/shard-1-001/cores/collection1/data/index
   [junit4]   2> 120570 INFO  (coreLoadExecutor-3465-thread-1) [    ] o.a.s.u.RandomMergePolicy RandomMergePolicy wrapping class org.apache.lucene.index.TieredMergePolicy: [TieredMergePolicy: maxMergeAtOnce=21, maxMergeAtOnceExplicit=13, maxMergedSegmentMB=69.8095703125, floorSegmentMB=1.4951171875, forceMergeDeletesPctAllowed=1.3107217234842783, segmentsPerTier=23.0, maxCFSSegmentSizeMB=8.796093022207999E12, noCFSRatio=0.41114469618162264
   [junit4]   2> 120570 INFO  (coreLoadExecutor-3465-thread-1) [    ] o.a.s.c.SolrDeletionPolicy SolrDeletionPolicy.onCommit: commits: num=1
   [junit4]   2> 	commit{dir=MockDirectoryWrapper(NRTCachingDirectory(RAMDirectory@721e6695 lockFactory=org.apache.lucene.store.SingleInstanceLockFactory@379130a1; maxCacheMB=0.8466796875 maxMergeSizeMB=0.9423828125)),segFN=segments_1,generation=1}
   [junit4]   2> 120570 INFO  (coreLoadExecutor-3465-thread-1) [    ] o.a.s.c.SolrDeletionPolicy newest commit generation = 1
   [junit4]   2> 120570 INFO  (OldIndexDirectoryCleanupThreadForCore-collection1) [    ] o.a.s.c.SolrCore Looking for old index directories to cleanup for core collection1 in /home/jenkins/workspace/Lucene-Solr-6.x-Linux/solr/build/solr-core/test/J2/temp/solr.cloud.LeaderFailoverAfterPartitionTest_CBC62745B607978D-001/shard-1-001/cores/collection1/data/
   [junit4]   2> 120571 WARN  (OldIndexDirectoryCleanupThreadForCore-collection1) [    ] o.a.s.c.DirectoryFactory /home/jenkins/workspace/Lucene-Solr-6.x-Linux/solr/build/solr-core/test/J2/temp/solr.cloud.LeaderFailoverAfterPartitionTest_CBC62745B607978D-001/shard-1-001/cores/collection1/data/ does not point to a valid data directory; skipping clean-up of old index directories.
   [junit4]   2> 120574 INFO  (coreLoadExecutor-3465-thread-1) [    ] o.a.s.u.p.UpdateRequestProcessorChain creating updateRequestProcessorChain "nodistrib"
   [junit4]   2> 120574 INFO  (coreLoadExecutor-3465-thread-1) [    ] o.a.s.u.p.UpdateRequestProcessorChain creating updateRequestProcessorChain "dedupe"
   [junit4]   2> 120574 INFO  (coreLoadExecutor-3465-thread-1) [    ] o.a.s.u.p.UpdateRequestProcessorChain inserting DistributedUpdateProcessorFactory into updateRequestProcessorChain "dedupe"
   [junit4]   2> 120574 INFO  (coreLoadExecutor-3465-thread-1) [    ] o.a.s.u.p.UpdateRequestProcessorChain creating updateRequestProcessorChain "stored_sig"
   [junit4]   2> 120574 INFO  (coreLoadExecutor-3465-thread-1) [    ] o.a.s.u.p.UpdateRequestProcessorChain inserting DistributedUpdateProcessorFactory into updateRequestProcessorChain "stored_sig"
   [junit4]   2> 1

[...truncated too long message...]

erPartitionTest.test-seed#[CBC62745B607978D]) [    ] o.e.j.s.h.ContextHandler Stopped o.e.j.s.ServletContextHandler@28e660d{/,null,UNAVAILABLE}
   [junit4]   2> 178310 INFO  (TEST-LeaderFailoverAfterPartitionTest.test-seed#[CBC62745B607978D]) [    ] o.a.s.c.ZkTestServer connecting to 127.0.0.1:44245 44245
   [junit4]   2> 178340 INFO  (Thread-199) [    ] o.a.s.c.ZkTestServer connecting to 127.0.0.1:44245 44245
   [junit4]   2> 178341 WARN  (Thread-199) [    ] o.a.s.c.ZkTestServer Watch limit violations: 
   [junit4]   2> Maximum concurrent create/delete watches above limit:
   [junit4]   2> 
   [junit4]   2> 	5	/solr/aliases.json
   [junit4]   2> 	5	/solr/clusterprops.json
   [junit4]   2> 	4	/solr/security.json
   [junit4]   2> 	4	/solr/configs/conf1
   [junit4]   2> 
   [junit4]   2> Maximum concurrent data watches above limit:
   [junit4]   2> 
   [junit4]   2> 	5	/solr/clusterstate.json
   [junit4]   2> 	3	/solr/collections/c8n_1x3_lf/state.json
   [junit4]   2> 	3	/solr/collections/collection1/state.json
   [junit4]   2> 	2	/solr/overseer_elect/election/96265162533896201-127.0.0.1:37467_-n_0000000001
   [junit4]   2> 
   [junit4]   2> Maximum concurrent children watches above limit:
   [junit4]   2> 
   [junit4]   2> 	55	/solr/overseer/collection-queue-work
   [junit4]   2> 	37	/solr/overseer/queue
   [junit4]   2> 	20	/solr/overseer/queue-work
   [junit4]   2> 	5	/solr/live_nodes
   [junit4]   2> 	5	/solr/collections
   [junit4]   2> 
   [junit4]   2> 178342 WARN  (TEST-LeaderFailoverAfterPartitionTest.test-seed#[CBC62745B607978D]) [    ] o.a.s.c.SocketProxy Closing 5 connections to: http://127.0.0.1:37467/, target: http://127.0.0.1:46839/
   [junit4]   2> 178342 WARN  (TEST-LeaderFailoverAfterPartitionTest.test-seed#[CBC62745B607978D]) [    ] o.a.s.c.SocketProxy Closing 0 connections to: http://127.0.0.1:38421/, target: http://127.0.0.1:41479/
   [junit4]   2> 178342 WARN  (TEST-LeaderFailoverAfterPartitionTest.test-seed#[CBC62745B607978D]) [    ] o.a.s.c.SocketProxy Closing 0 connections to: http://127.0.0.1:38869/, target: http://127.0.0.1:41991/
   [junit4]   2> 178342 WARN  (TEST-LeaderFailoverAfterPartitionTest.test-seed#[CBC62745B607978D]) [    ] o.a.s.c.SocketProxy Closing 5 connections to: http://127.0.0.1:45929/, target: http://127.0.0.1:42675/
   [junit4]   2> NOTE: reproduce with: ant test  -Dtestcase=LeaderFailoverAfterPartitionTest -Dtests.method=test -Dtests.seed=CBC62745B607978D -Dtests.multiplier=3 -Dtests.slow=true -Dtests.locale=bn-BD -Dtests.timezone=Canada/Newfoundland -Dtests.asserts=true -Dtests.file.encoding=US-ASCII
   [junit4] ERROR   60.7s J2 | LeaderFailoverAfterPartitionTest.test <<<
   [junit4]    > Throwable #1: org.apache.solr.client.solrj.impl.CloudSolrClient$RouteException: No live SolrServers available to handle this request:[http://127.0.0.1:38421/c8n_1x3_lf_shard1_replica2]
   [junit4]    > 	at __randomizedtesting.SeedInfo.seed([CBC62745B607978D:4392189F18FBFA75]:0)
   [junit4]    > 	at org.apache.solr.client.solrj.impl.CloudSolrClient.directUpdate(CloudSolrClient.java:739)
   [junit4]    > 	at org.apache.solr.client.solrj.impl.CloudSolrClient.sendRequest(CloudSolrClient.java:1151)
   [junit4]    > 	at org.apache.solr.client.solrj.impl.CloudSolrClient.requestWithRetryOnStaleState(CloudSolrClient.java:1040)
   [junit4]    > 	at org.apache.solr.client.solrj.impl.CloudSolrClient.request(CloudSolrClient.java:976)
   [junit4]    > 	at org.apache.solr.client.solrj.SolrClient.request(SolrClient.java:1219)
   [junit4]    > 	at org.apache.solr.cloud.HttpPartitionTest.sendDoc(HttpPartitionTest.java:592)
   [junit4]    > 	at org.apache.solr.cloud.HttpPartitionTest.sendDoc(HttpPartitionTest.java:578)
   [junit4]    > 	at org.apache.solr.cloud.LeaderFailoverAfterPartitionTest.testRf3WithLeaderFailover(LeaderFailoverAfterPartitionTest.java:174)
   [junit4]    > 	at org.apache.solr.cloud.LeaderFailoverAfterPartitionTest.test(LeaderFailoverAfterPartitionTest.java:55)
   [junit4]    > 	at jdk.internal.reflect.NativeMethodAccessorImpl.invoke0(java.base@9-ea/Native Method)
   [junit4]    > 	at jdk.internal.reflect.NativeMethodAccessorImpl.invoke(java.base@9-ea/NativeMethodAccessorImpl.java:62)
   [junit4]    > 	at jdk.internal.reflect.DelegatingMethodAccessorImpl.invoke(java.base@9-ea/DelegatingMethodAccessorImpl.java:43)
   [junit4]    > 	at org.apache.solr.BaseDistributedSearchTestCase$ShardsRepeatRule$ShardsFixedStatement.callStatement(BaseDistributedSearchTestCase.java:992)
   [junit4]    > 	at org.apache.solr.BaseDistributedSearchTestCase$ShardsRepeatRule$ShardsStatement.evaluate(BaseDistributedSearchTestCase.java:967)
   [junit4]    > 	at java.lang.Thread.run(java.base@9-ea/Thread.java:843)
   [junit4]    > Caused by: org.apache.solr.client.solrj.SolrServerException: No live SolrServers available to handle this request:[http://127.0.0.1:38421/c8n_1x3_lf_shard1_replica2]
   [junit4]    > 	at org.apache.solr.client.solrj.impl.LBHttpSolrClient.request(LBHttpSolrClient.java:383)
   [junit4]    > 	at org.apache.solr.client.solrj.impl.CloudSolrClient.lambda$directUpdate$0(CloudSolrClient.java:714)
   [junit4]    > 	at java.util.concurrent.FutureTask.run(java.base@9-ea/FutureTask.java:266)
   [junit4]    > 	at org.apache.solr.common.util.ExecutorUtil$MDCAwareThreadPoolExecutor.lambda$execute$0(ExecutorUtil.java:229)
   [junit4]    > 	at java.util.concurrent.ThreadPoolExecutor.runWorker(java.base@9-ea/ThreadPoolExecutor.java:1158)
   [junit4]    > 	at java.util.concurrent.ThreadPoolExecutor$Worker.run(java.base@9-ea/ThreadPoolExecutor.java:632)
   [junit4]    > 	... 1 more
   [junit4]    > Caused by: org.apache.solr.client.solrj.SolrServerException: Server refused connection at: http://127.0.0.1:38421/c8n_1x3_lf_shard1_replica2
   [junit4]    > 	at org.apache.solr.client.solrj.impl.HttpSolrClient.executeMethod(HttpSolrClient.java:597)
   [junit4]    > 	at org.apache.solr.client.solrj.impl.HttpSolrClient.request(HttpSolrClient.java:259)
   [junit4]    > 	at org.apache.solr.client.solrj.impl.HttpSolrClient.request(HttpSolrClient.java:248)
   [junit4]    > 	at org.apache.solr.client.solrj.impl.LBHttpSolrClient.doRequest(LBHttpSolrClient.java:403)
   [junit4]    > 	at org.apache.solr.client.solrj.impl.LBHttpSolrClient.request(LBHttpSolrClient.java:356)
   [junit4]    > 	... 6 more
   [junit4]    > Caused by: java.net.ConnectException: Connection refused
   [junit4]    > 	at java.net.PlainSocketImpl.socketConnect(java.base@9-ea/Native Method)
   [junit4]    > 	at java.net.AbstractPlainSocketImpl.doConnect(java.base@9-ea/AbstractPlainSocketImpl.java:400)
   [junit4]    > 	at java.net.AbstractPlainSocketImpl.connectToAddress(java.base@9-ea/AbstractPlainSocketImpl.java:243)
   [junit4]    > 	at java.net.AbstractPlainSocketImpl.connect(java.base@9-ea/AbstractPlainSocketImpl.java:225)
   [junit4]    > 	at java.net.SocksSocketImpl.connect(java.base@9-ea/SocksSocketImpl.java:402)
   [junit4]    > 	at java.net.Socket.connect(java.base@9-ea/Socket.java:591)
   [junit4]    > 	at org.apache.http.conn.scheme.PlainSocketFactory.connectSocket(PlainSocketFactory.java:117)
   [junit4]    > 	at org.apache.http.impl.conn.DefaultClientConnectionOperator.openConnection(DefaultClientConnectionOperator.java:177)
   [junit4]    > 	at org.apache.http.impl.conn.ManagedClientConnectionImpl.open(ManagedClientConnectionImpl.java:304)
   [junit4]    > 	at org.apache.http.impl.client.DefaultRequestDirector.tryConnect(DefaultRequestDirector.java:611)
   [junit4]    > 	at org.apache.http.impl.client.DefaultRequestDirector.execute(DefaultRequestDirector.java:446)
   [junit4]    > 	at org.apache.http.impl.client.AbstractHttpClient.doExecute(AbstractHttpClient.java:882)
   [junit4]    > 	at org.apache.http.impl.client.CloseableHttpClient.execute(CloseableHttpClient.java:82)
   [junit4]    > 	at org.apache.http.impl.client.CloseableHttpClient.execute(CloseableHttpClient.java:107)
   [junit4]    > 	at org.apache.http.impl.client.CloseableHttpClient.execute(CloseableHttpClient.java:55)
   [junit4]    > 	at org.apache.solr.client.solrj.impl.HttpSolrClient.executeMethod(HttpSolrClient.java:495)
   [junit4]    > 	... 10 more
   [junit4]   2> 178344 INFO  (SUITE-LeaderFailoverAfterPartitionTest-seed#[CBC62745B607978D]-worker) [    ] o.a.s.SolrTestCaseJ4 ###deleteCore
   [junit4]   2> NOTE: leaving temporary files on disk at: /home/jenkins/workspace/Lucene-Solr-6.x-Linux/solr/build/solr-core/test/J2/temp/solr.cloud.LeaderFailoverAfterPartitionTest_CBC62745B607978D-001
   [junit4]   2> Jul 19, 2016 12:57:49 AM com.carrotsearch.randomizedtesting.ThreadLeakControl checkThreadLeaks
   [junit4]   2> WARNING: Will linger awaiting termination of 1 leaked thread(s).
   [junit4]   2> NOTE: test params are: codec=Asserting(Lucene62): {range_facet_l_dv=Lucene50(blocksize=128), _version_=PostingsFormat(name=LuceneVarGapFixedInterval), multiDefault=PostingsFormat(name=Direct), a_t=PostingsFormat(name=Direct), intDefault=PostingsFormat(name=LuceneVarGapFixedInterval), id=Lucene50(blocksize=128), range_facet_i_dv=PostingsFormat(name=Direct), text=FSTOrd50, range_facet_l=PostingsFormat(name=Direct), timestamp=PostingsFormat(name=Direct)}, docValues:{range_facet_l_dv=DocValuesFormat(name=Lucene54), range_facet_i_dv=DocValuesFormat(name=Lucene54), timestamp=DocValuesFormat(name=Lucene54)}, maxPointsInLeafNode=1191, maxMBSortInHeap=7.414634395019499, sim=RandomSimilarity(queryNorm=false,coord=crazy): {}, locale=bn-BD, timezone=Canada/Newfoundland
   [junit4]   2> NOTE: Linux 4.4.0-31-generic amd64/Oracle Corporation 9-ea (64-bit)/cpus=12,threads=1,free=148076960,total=526385152
   [junit4]   2> NOTE: All tests run in this JVM: [TestSQLHandler, TestReplicationHandlerBackup, TestCloudDeleteByQuery, SuggesterWFSTTest, TestStressLiveNodes, TestSolr4Spatial2, HLLSerializationTest, TestOnReconnectListenerSupport, LeaderFailoverAfterPartitionTest]
   [junit4] Completed [29/623 (1!)] on J2 in 60.99s, 1 test, 1 error <<< FAILURES!

[...truncated 51583 lines...]


Mime
View raw message