lucene-dev mailing list archives

Site index · List index
Message view « Date » · « Thread »
Top « Date » · « Thread »
From Policeman Jenkins Server <jenk...@thetaphi.de>
Subject [JENKINS] Lucene-Solr-6.x-Linux (32bit/jdk1.8.0_92) - Build # 1287 - Unstable!
Date Wed, 27 Jul 2016 12:10:56 GMT
Build: http://jenkins.thetaphi.de/job/Lucene-Solr-6.x-Linux/1287/
Java: 32bit/jdk1.8.0_92 -server -XX:+UseSerialGC

1 tests failed.
FAILED:  org.apache.solr.cloud.ForceLeaderTest.testReplicasInLIRNoLeader

Error Message:
org.apache.solr.client.solrj.SolrServerException: No live SolrServers available to handle this request:[http://127.0.0.1:33550/aqa/x/forceleader_test_collection_shard1_replica1]

Stack Trace:
org.apache.solr.client.solrj.SolrServerException: org.apache.solr.client.solrj.SolrServerException: No live SolrServers available to handle this request:[http://127.0.0.1:33550/aqa/x/forceleader_test_collection_shard1_replica1]
	at __randomizedtesting.SeedInfo.seed([F083F3B8492D27DE:1614C77870AFDEBF]:0)
	at org.apache.solr.client.solrj.impl.CloudSolrClient.directUpdate(CloudSolrClient.java:774)
	at org.apache.solr.client.solrj.impl.CloudSolrClient.sendRequest(CloudSolrClient.java:1172)
	at org.apache.solr.client.solrj.impl.CloudSolrClient.requestWithRetryOnStaleState(CloudSolrClient.java:1061)
	at org.apache.solr.client.solrj.impl.CloudSolrClient.request(CloudSolrClient.java:997)
	at org.apache.solr.cloud.AbstractFullDistribZkTestBase.sendDocsWithRetry(AbstractFullDistribZkTestBase.java:753)
	at org.apache.solr.cloud.AbstractFullDistribZkTestBase.sendDocsWithRetry(AbstractFullDistribZkTestBase.java:741)
	at org.apache.solr.cloud.ForceLeaderTest.sendDoc(ForceLeaderTest.java:424)
	at org.apache.solr.cloud.ForceLeaderTest.assertSendDocFails(ForceLeaderTest.java:315)
	at org.apache.solr.cloud.ForceLeaderTest.testReplicasInLIRNoLeader(ForceLeaderTest.java:110)
	at sun.reflect.NativeMethodAccessorImpl.invoke0(Native Method)
	at sun.reflect.NativeMethodAccessorImpl.invoke(NativeMethodAccessorImpl.java:62)
	at sun.reflect.DelegatingMethodAccessorImpl.invoke(DelegatingMethodAccessorImpl.java:43)
	at java.lang.reflect.Method.invoke(Method.java:498)
	at com.carrotsearch.randomizedtesting.RandomizedRunner.invoke(RandomizedRunner.java:1764)
	at com.carrotsearch.randomizedtesting.RandomizedRunner$8.evaluate(RandomizedRunner.java:871)
	at com.carrotsearch.randomizedtesting.RandomizedRunner$9.evaluate(RandomizedRunner.java:907)
	at com.carrotsearch.randomizedtesting.RandomizedRunner$10.evaluate(RandomizedRunner.java:921)
	at org.apache.solr.BaseDistributedSearchTestCase$ShardsRepeatRule$ShardsFixedStatement.callStatement(BaseDistributedSearchTestCase.java:992)
	at org.apache.solr.BaseDistributedSearchTestCase$ShardsRepeatRule$ShardsStatement.evaluate(BaseDistributedSearchTestCase.java:967)
	at com.carrotsearch.randomizedtesting.rules.SystemPropertiesRestoreRule$1.evaluate(SystemPropertiesRestoreRule.java:57)
	at org.apache.lucene.util.TestRuleSetupTeardownChained$1.evaluate(TestRuleSetupTeardownChained.java:49)
	at org.apache.lucene.util.AbstractBeforeAfterRule$1.evaluate(AbstractBeforeAfterRule.java:45)
	at org.apache.lucene.util.TestRuleThreadAndTestName$1.evaluate(TestRuleThreadAndTestName.java:48)
	at org.apache.lucene.util.TestRuleIgnoreAfterMaxFailures$1.evaluate(TestRuleIgnoreAfterMaxFailures.java:64)
	at org.apache.lucene.util.TestRuleMarkFailure$1.evaluate(TestRuleMarkFailure.java:47)
	at com.carrotsearch.randomizedtesting.rules.StatementAdapter.evaluate(StatementAdapter.java:36)
	at com.carrotsearch.randomizedtesting.ThreadLeakControl$StatementRunner.run(ThreadLeakControl.java:367)
	at com.carrotsearch.randomizedtesting.ThreadLeakControl.forkTimeoutingTask(ThreadLeakControl.java:809)
	at com.carrotsearch.randomizedtesting.ThreadLeakControl$3.evaluate(ThreadLeakControl.java:460)
	at com.carrotsearch.randomizedtesting.RandomizedRunner.runSingleTest(RandomizedRunner.java:880)
	at com.carrotsearch.randomizedtesting.RandomizedRunner$5.evaluate(RandomizedRunner.java:781)
	at com.carrotsearch.randomizedtesting.RandomizedRunner$6.evaluate(RandomizedRunner.java:816)
	at com.carrotsearch.randomizedtesting.RandomizedRunner$7.evaluate(RandomizedRunner.java:827)
	at com.carrotsearch.randomizedtesting.rules.StatementAdapter.evaluate(StatementAdapter.java:36)
	at com.carrotsearch.randomizedtesting.rules.SystemPropertiesRestoreRule$1.evaluate(SystemPropertiesRestoreRule.java:57)
	at org.apache.lucene.util.AbstractBeforeAfterRule$1.evaluate(AbstractBeforeAfterRule.java:45)
	at com.carrotsearch.randomizedtesting.rules.StatementAdapter.evaluate(StatementAdapter.java:36)
	at org.apache.lucene.util.TestRuleStoreClassName$1.evaluate(TestRuleStoreClassName.java:41)
	at com.carrotsearch.randomizedtesting.rules.NoShadowingOrOverridesOnMethodsRule$1.evaluate(NoShadowingOrOverridesOnMethodsRule.java:40)
	at com.carrotsearch.randomizedtesting.rules.NoShadowingOrOverridesOnMethodsRule$1.evaluate(NoShadowingOrOverridesOnMethodsRule.java:40)
	at com.carrotsearch.randomizedtesting.rules.StatementAdapter.evaluate(StatementAdapter.java:36)
	at com.carrotsearch.randomizedtesting.rules.StatementAdapter.evaluate(StatementAdapter.java:36)
	at com.carrotsearch.randomizedtesting.rules.StatementAdapter.evaluate(StatementAdapter.java:36)
	at org.apache.lucene.util.TestRuleAssertionsRequired$1.evaluate(TestRuleAssertionsRequired.java:53)
	at org.apache.lucene.util.TestRuleMarkFailure$1.evaluate(TestRuleMarkFailure.java:47)
	at org.apache.lucene.util.TestRuleIgnoreAfterMaxFailures$1.evaluate(TestRuleIgnoreAfterMaxFailures.java:64)
	at org.apache.lucene.util.TestRuleIgnoreTestSuites$1.evaluate(TestRuleIgnoreTestSuites.java:54)
	at com.carrotsearch.randomizedtesting.rules.StatementAdapter.evaluate(StatementAdapter.java:36)
	at com.carrotsearch.randomizedtesting.ThreadLeakControl$StatementRunner.run(ThreadLeakControl.java:367)
	at java.lang.Thread.run(Thread.java:745)
Caused by: org.apache.solr.client.solrj.SolrServerException: No live SolrServers available to handle this request:[http://127.0.0.1:33550/aqa/x/forceleader_test_collection_shard1_replica1]
	at org.apache.solr.client.solrj.impl.LBHttpSolrClient.request(LBHttpSolrClient.java:383)
	at org.apache.solr.client.solrj.impl.CloudSolrClient.directUpdate(CloudSolrClient.java:768)
	... 49 more
Caused by: org.apache.solr.client.solrj.SolrServerException: Server refused connection at: http://127.0.0.1:33550/aqa/x/forceleader_test_collection_shard1_replica1
	at org.apache.solr.client.solrj.impl.HttpSolrClient.executeMethod(HttpSolrClient.java:597)
	at org.apache.solr.client.solrj.impl.HttpSolrClient.request(HttpSolrClient.java:259)
	at org.apache.solr.client.solrj.impl.HttpSolrClient.request(HttpSolrClient.java:248)
	at org.apache.solr.client.solrj.impl.LBHttpSolrClient.doRequest(LBHttpSolrClient.java:403)
	at org.apache.solr.client.solrj.impl.LBHttpSolrClient.request(LBHttpSolrClient.java:372)
	... 50 more
Caused by: java.net.ConnectException: Connection refused
	at java.net.PlainSocketImpl.socketConnect(Native Method)
	at java.net.AbstractPlainSocketImpl.doConnect(AbstractPlainSocketImpl.java:350)
	at java.net.AbstractPlainSocketImpl.connectToAddress(AbstractPlainSocketImpl.java:206)
	at java.net.AbstractPlainSocketImpl.connect(AbstractPlainSocketImpl.java:188)
	at java.net.SocksSocketImpl.connect(SocksSocketImpl.java:392)
	at java.net.Socket.connect(Socket.java:589)
	at org.apache.http.conn.scheme.PlainSocketFactory.connectSocket(PlainSocketFactory.java:117)
	at org.apache.http.impl.conn.DefaultClientConnectionOperator.openConnection(DefaultClientConnectionOperator.java:177)
	at org.apache.http.impl.conn.ManagedClientConnectionImpl.open(ManagedClientConnectionImpl.java:304)
	at org.apache.http.impl.client.DefaultRequestDirector.tryConnect(DefaultRequestDirector.java:611)
	at org.apache.http.impl.client.DefaultRequestDirector.execute(DefaultRequestDirector.java:446)
	at org.apache.http.impl.client.AbstractHttpClient.doExecute(AbstractHttpClient.java:882)
	at org.apache.http.impl.client.CloseableHttpClient.execute(CloseableHttpClient.java:82)
	at org.apache.http.impl.client.CloseableHttpClient.execute(CloseableHttpClient.java:107)
	at org.apache.http.impl.client.CloseableHttpClient.execute(CloseableHttpClient.java:55)
	at org.apache.solr.client.solrj.impl.HttpSolrClient.executeMethod(HttpSolrClient.java:495)
	... 54 more




Build Log:
[...truncated 12102 lines...]
   [junit4] Suite: org.apache.solr.cloud.ForceLeaderTest
   [junit4]   2> Creating dataDir: /home/jenkins/workspace/Lucene-Solr-6.x-Linux/solr/build/solr-core/test/J1/temp/solr.cloud.ForceLeaderTest_F083F3B8492D27DE-001/init-core-data-001
   [junit4]   2> 1459020 INFO  (SUITE-ForceLeaderTest-seed#[F083F3B8492D27DE]-worker) [    ] o.a.s.SolrTestCaseJ4 Randomized ssl (false) and clientAuth (false) via: @org.apache.solr.SolrTestCaseJ4$SuppressSSL(bugUrl=https://issues.apache.org/jira/browse/SOLR-5776)
   [junit4]   2> 1459020 INFO  (SUITE-ForceLeaderTest-seed#[F083F3B8492D27DE]-worker) [    ] o.a.s.BaseDistributedSearchTestCase Setting hostContext system property: /aqa/x
   [junit4]   2> 1459021 INFO  (TEST-ForceLeaderTest.testLastPublishedStateIsActive-seed#[F083F3B8492D27DE]) [    ] o.a.s.c.ZkTestServer STARTING ZK TEST SERVER
   [junit4]   2> 1459021 INFO  (Thread-2563) [    ] o.a.s.c.ZkTestServer client port:0.0.0.0/0.0.0.0:0
   [junit4]   2> 1459021 INFO  (Thread-2563) [    ] o.a.s.c.ZkTestServer Starting server
   [junit4]   2> 1459121 INFO  (TEST-ForceLeaderTest.testLastPublishedStateIsActive-seed#[F083F3B8492D27DE]) [    ] o.a.s.c.ZkTestServer start zk server on port:41566
   [junit4]   2> 1459121 INFO  (TEST-ForceLeaderTest.testLastPublishedStateIsActive-seed#[F083F3B8492D27DE]) [    ] o.a.s.c.c.SolrZkClient Using default ZkCredentialsProvider
   [junit4]   2> 1459122 INFO  (TEST-ForceLeaderTest.testLastPublishedStateIsActive-seed#[F083F3B8492D27DE]) [    ] o.a.s.c.c.ConnectionManager Waiting for client to connect to ZooKeeper
   [junit4]   2> 1459122 INFO  (zkCallback-1827-thread-1) [    ] o.a.s.c.c.ConnectionManager Watcher org.apache.solr.common.cloud.ConnectionManager@12f9946 name:ZooKeeperConnection Watcher:127.0.0.1:41566 got event WatchedEvent state:SyncConnected type:None path:null path:null type:None
   [junit4]   2> 1459123 INFO  (TEST-ForceLeaderTest.testLastPublishedStateIsActive-seed#[F083F3B8492D27DE]) [    ] o.a.s.c.c.ConnectionManager Client is connected to ZooKeeper
   [junit4]   2> 1459123 INFO  (TEST-ForceLeaderTest.testLastPublishedStateIsActive-seed#[F083F3B8492D27DE]) [    ] o.a.s.c.c.SolrZkClient Using default ZkACLProvider
   [junit4]   2> 1459123 INFO  (TEST-ForceLeaderTest.testLastPublishedStateIsActive-seed#[F083F3B8492D27DE]) [    ] o.a.s.c.c.SolrZkClient makePath: /solr
   [junit4]   2> 1459124 INFO  (TEST-ForceLeaderTest.testLastPublishedStateIsActive-seed#[F083F3B8492D27DE]) [    ] o.a.s.c.c.SolrZkClient Using default ZkCredentialsProvider
   [junit4]   2> 1459124 INFO  (TEST-ForceLeaderTest.testLastPublishedStateIsActive-seed#[F083F3B8492D27DE]) [    ] o.a.s.c.c.ConnectionManager Waiting for client to connect to ZooKeeper
   [junit4]   2> 1459124 INFO  (zkCallback-1828-thread-1) [    ] o.a.s.c.c.ConnectionManager Watcher org.apache.solr.common.cloud.ConnectionManager@a845fc name:ZooKeeperConnection Watcher:127.0.0.1:41566/solr got event WatchedEvent state:SyncConnected type:None path:null path:null type:None
   [junit4]   2> 1459124 INFO  (TEST-ForceLeaderTest.testLastPublishedStateIsActive-seed#[F083F3B8492D27DE]) [    ] o.a.s.c.c.ConnectionManager Client is connected to ZooKeeper
   [junit4]   2> 1459125 INFO  (TEST-ForceLeaderTest.testLastPublishedStateIsActive-seed#[F083F3B8492D27DE]) [    ] o.a.s.c.c.SolrZkClient Using default ZkACLProvider
   [junit4]   2> 1459125 INFO  (TEST-ForceLeaderTest.testLastPublishedStateIsActive-seed#[F083F3B8492D27DE]) [    ] o.a.s.c.c.SolrZkClient makePath: /collections/collection1
   [junit4]   2> 1459125 INFO  (TEST-ForceLeaderTest.testLastPublishedStateIsActive-seed#[F083F3B8492D27DE]) [    ] o.a.s.c.c.SolrZkClient makePath: /collections/collection1/shards
   [junit4]   2> 1459125 INFO  (TEST-ForceLeaderTest.testLastPublishedStateIsActive-seed#[F083F3B8492D27DE]) [    ] o.a.s.c.c.SolrZkClient makePath: /collections/control_collection
   [junit4]   2> 1459126 INFO  (TEST-ForceLeaderTest.testLastPublishedStateIsActive-seed#[F083F3B8492D27DE]) [    ] o.a.s.c.c.SolrZkClient makePath: /collections/control_collection/shards
   [junit4]   2> 1459127 INFO  (TEST-ForceLeaderTest.testLastPublishedStateIsActive-seed#[F083F3B8492D27DE]) [    ] o.a.s.c.AbstractZkTestCase put /home/jenkins/workspace/Lucene-Solr-6.x-Linux/solr/core/src/test-files/solr/collection1/conf/solrconfig-tlog.xml to /configs/conf1/solrconfig.xml
   [junit4]   2> 1459127 INFO  (TEST-ForceLeaderTest.testLastPublishedStateIsActive-seed#[F083F3B8492D27DE]) [    ] o.a.s.c.c.SolrZkClient makePath: /configs/conf1/solrconfig.xml
   [junit4]   2> 1459127 INFO  (TEST-ForceLeaderTest.testLastPublishedStateIsActive-seed#[F083F3B8492D27DE]) [    ] o.a.s.c.AbstractZkTestCase put /home/jenkins/workspace/Lucene-Solr-6.x-Linux/solr/core/src/test-files/solr/collection1/conf/schema.xml to /configs/conf1/schema.xml
   [junit4]   2> 1459128 INFO  (TEST-ForceLeaderTest.testLastPublishedStateIsActive-seed#[F083F3B8492D27DE]) [    ] o.a.s.c.c.SolrZkClient makePath: /configs/conf1/schema.xml
   [junit4]   2> 1459128 INFO  (TEST-ForceLeaderTest.testLastPublishedStateIsActive-seed#[F083F3B8492D27DE]) [    ] o.a.s.c.AbstractZkTestCase put /home/jenkins/workspace/Lucene-Solr-6.x-Linux/solr/core/src/test-files/solr/collection1/conf/solrconfig.snippet.randomindexconfig.xml to /configs/conf1/solrconfig.snippet.randomindexconfig.xml
   [junit4]   2> 1459128 INFO  (TEST-ForceLeaderTest.testLastPublishedStateIsActive-seed#[F083F3B8492D27DE]) [    ] o.a.s.c.c.SolrZkClient makePath: /configs/conf1/solrconfig.snippet.randomindexconfig.xml
   [junit4]   2> 1459129 INFO  (TEST-ForceLeaderTest.testLastPublishedStateIsActive-seed#[F083F3B8492D27DE]) [    ] o.a.s.c.AbstractZkTestCase put /home/jenkins/workspace/Lucene-Solr-6.x-Linux/solr/core/src/test-files/solr/collection1/conf/stopwords.txt to /configs/conf1/stopwords.txt
   [junit4]   2> 1459129 INFO  (TEST-ForceLeaderTest.testLastPublishedStateIsActive-seed#[F083F3B8492D27DE]) [    ] o.a.s.c.c.SolrZkClient makePath: /configs/conf1/stopwords.txt
   [junit4]   2> 1459129 INFO  (TEST-ForceLeaderTest.testLastPublishedStateIsActive-seed#[F083F3B8492D27DE]) [    ] o.a.s.c.AbstractZkTestCase put /home/jenkins/workspace/Lucene-Solr-6.x-Linux/solr/core/src/test-files/solr/collection1/conf/protwords.txt to /configs/conf1/protwords.txt
   [junit4]   2> 1459129 INFO  (TEST-ForceLeaderTest.testLastPublishedStateIsActive-seed#[F083F3B8492D27DE]) [    ] o.a.s.c.c.SolrZkClient makePath: /configs/conf1/protwords.txt
   [junit4]   2> 1459130 INFO  (TEST-ForceLeaderTest.testLastPublishedStateIsActive-seed#[F083F3B8492D27DE]) [    ] o.a.s.c.AbstractZkTestCase put /home/jenkins/workspace/Lucene-Solr-6.x-Linux/solr/core/src/test-files/solr/collection1/conf/currency.xml to /configs/conf1/currency.xml
   [junit4]   2> 1459130 INFO  (TEST-ForceLeaderTest.testLastPublishedStateIsActive-seed#[F083F3B8492D27DE]) [    ] o.a.s.c.c.SolrZkClient makePath: /configs/conf1/currency.xml
   [junit4]   2> 1459130 INFO  (TEST-ForceLeaderTest.testLastPublishedStateIsActive-seed#[F083F3B8492D27DE]) [    ] o.a.s.c.AbstractZkTestCase put /home/jenkins/workspace/Lucene-Solr-6.x-Linux/solr/core/src/test-files/solr/collection1/conf/enumsConfig.xml to /configs/conf1/enumsConfig.xml
   [junit4]   2> 1459130 INFO  (TEST-ForceLeaderTest.testLastPublishedStateIsActive-seed#[F083F3B8492D27DE]) [    ] o.a.s.c.c.SolrZkClient makePath: /configs/conf1/enumsConfig.xml
   [junit4]   2> 1459131 INFO  (TEST-ForceLeaderTest.testLastPublishedStateIsActive-seed#[F083F3B8492D27DE]) [    ] o.a.s.c.AbstractZkTestCase put /home/jenkins/workspace/Lucene-Solr-6.x-Linux/solr/core/src/test-files/solr/collection1/conf/open-exchange-rates.json to /configs/conf1/open-exchange-rates.json
   [junit4]   2> 1459131 INFO  (TEST-ForceLeaderTest.testLastPublishedStateIsActive-seed#[F083F3B8492D27DE]) [    ] o.a.s.c.c.SolrZkClient makePath: /configs/conf1/open-exchange-rates.json
   [junit4]   2> 1459131 INFO  (TEST-ForceLeaderTest.testLastPublishedStateIsActive-seed#[F083F3B8492D27DE]) [    ] o.a.s.c.AbstractZkTestCase put /home/jenkins/workspace/Lucene-Solr-6.x-Linux/solr/core/src/test-files/solr/collection1/conf/mapping-ISOLatin1Accent.txt to /configs/conf1/mapping-ISOLatin1Accent.txt
   [junit4]   2> 1459131 INFO  (TEST-ForceLeaderTest.testLastPublishedStateIsActive-seed#[F083F3B8492D27DE]) [    ] o.a.s.c.c.SolrZkClient makePath: /configs/conf1/mapping-ISOLatin1Accent.txt
   [junit4]   2> 1459132 INFO  (TEST-ForceLeaderTest.testLastPublishedStateIsActive-seed#[F083F3B8492D27DE]) [    ] o.a.s.c.AbstractZkTestCase put /home/jenkins/workspace/Lucene-Solr-6.x-Linux/solr/core/src/test-files/solr/collection1/conf/old_synonyms.txt to /configs/conf1/old_synonyms.txt
   [junit4]   2> 1459132 INFO  (TEST-ForceLeaderTest.testLastPublishedStateIsActive-seed#[F083F3B8492D27DE]) [    ] o.a.s.c.c.SolrZkClient makePath: /configs/conf1/old_synonyms.txt
   [junit4]   2> 1459132 INFO  (TEST-ForceLeaderTest.testLastPublishedStateIsActive-seed#[F083F3B8492D27DE]) [    ] o.a.s.c.AbstractZkTestCase put /home/jenkins/workspace/Lucene-Solr-6.x-Linux/solr/core/src/test-files/solr/collection1/conf/synonyms.txt to /configs/conf1/synonyms.txt
   [junit4]   2> 1459132 INFO  (TEST-ForceLeaderTest.testLastPublishedStateIsActive-seed#[F083F3B8492D27DE]) [    ] o.a.s.c.c.SolrZkClient makePath: /configs/conf1/synonyms.txt
   [junit4]   2> 1459189 INFO  (TEST-ForceLeaderTest.testLastPublishedStateIsActive-seed#[F083F3B8492D27DE]) [    ] o.a.s.SolrTestCaseJ4 Writing core.properties file to /home/jenkins/workspace/Lucene-Solr-6.x-Linux/solr/build/solr-core/test/J1/temp/solr.cloud.ForceLeaderTest_F083F3B8492D27DE-001/control-001/cores/collection1
   [junit4]   2> 1459191 INFO  (TEST-ForceLeaderTest.testLastPublishedStateIsActive-seed#[F083F3B8492D27DE]) [    ] o.e.j.s.Server jetty-9.3.8.v20160314
   [junit4]   2> 1459194 INFO  (TEST-ForceLeaderTest.testLastPublishedStateIsActive-seed#[F083F3B8492D27DE]) [    ] o.e.j.s.h.ContextHandler Started o.e.j.s.ServletContextHandler@1f14beb{/aqa/x,null,AVAILABLE}
   [junit4]   2> 1459195 INFO  (TEST-ForceLeaderTest.testLastPublishedStateIsActive-seed#[F083F3B8492D27DE]) [    ] o.e.j.s.ServerConnector Started ServerConnector@4f420d{HTTP/1.1,[http/1.1]}{127.0.0.1:46540}
   [junit4]   2> 1459195 INFO  (TEST-ForceLeaderTest.testLastPublishedStateIsActive-seed#[F083F3B8492D27DE]) [    ] o.e.j.s.Server Started @1460727ms
   [junit4]   2> 1459195 INFO  (TEST-ForceLeaderTest.testLastPublishedStateIsActive-seed#[F083F3B8492D27DE]) [    ] o.a.s.c.s.e.JettySolrRunner Jetty properties: {solr.data.dir=/home/jenkins/workspace/Lucene-Solr-6.x-Linux/solr/build/solr-core/test/J1/temp/solr.cloud.ForceLeaderTest_F083F3B8492D27DE-001/tempDir-001/control/data, hostContext=/aqa/x, hostPort=33924, coreRootDirectory=/home/jenkins/workspace/Lucene-Solr-6.x-Linux/solr/build/solr-core/test/J1/temp/solr.cloud.ForceLeaderTest_F083F3B8492D27DE-001/control-001/cores}
   [junit4]   2> 1459195 INFO  (TEST-ForceLeaderTest.testLastPublishedStateIsActive-seed#[F083F3B8492D27DE]) [    ] o.a.s.s.SolrDispatchFilter SolrDispatchFilter.init(): sun.misc.Launcher$AppClassLoader@1d16e93
   [junit4]   2> 1459195 INFO  (TEST-ForceLeaderTest.testLastPublishedStateIsActive-seed#[F083F3B8492D27DE]) [    ] o.a.s.c.SolrResourceLoader new SolrResourceLoader for directory: '/home/jenkins/workspace/Lucene-Solr-6.x-Linux/solr/build/solr-core/test/J1/temp/solr.cloud.ForceLeaderTest_F083F3B8492D27DE-001/control-001'
   [junit4]   2> 1459195 INFO  (TEST-ForceLeaderTest.testLastPublishedStateIsActive-seed#[F083F3B8492D27DE]) [    ] o.a.s.c.SolrResourceLoader JNDI not configured for solr (NoInitialContextEx)
   [junit4]   2> 1459195 INFO  (TEST-ForceLeaderTest.testLastPublishedStateIsActive-seed#[F083F3B8492D27DE]) [    ] o.a.s.c.SolrResourceLoader solr home defaulted to 'solr/' (could not find system property or JNDI)
   [junit4]   2> 1459195 INFO  (TEST-ForceLeaderTest.testLastPublishedStateIsActive-seed#[F083F3B8492D27DE]) [    ] o.a.s.c.c.SolrZkClient Using default ZkCredentialsProvider
   [junit4]   2> 1459196 INFO  (TEST-ForceLeaderTest.testLastPublishedStateIsActive-seed#[F083F3B8492D27DE]) [    ] o.a.s.c.c.ConnectionManager Waiting for client to connect to ZooKeeper
   [junit4]   2> 1459196 INFO  (zkCallback-1829-thread-1) [    ] o.a.s.c.c.ConnectionManager Watcher org.apache.solr.common.cloud.ConnectionManager@1bd0e47 name:ZooKeeperConnection Watcher:127.0.0.1:41566/solr got event WatchedEvent state:SyncConnected type:None path:null path:null type:None
   [junit4]   2> 1459196 INFO  (TEST-ForceLeaderTest.testLastPublishedStateIsActive-seed#[F083F3B8492D27DE]) [    ] o.a.s.c.c.ConnectionManager Client is connected to ZooKeeper
   [junit4]   2> 1459197 INFO  (TEST-ForceLeaderTest.testLastPublishedStateIsActive-seed#[F083F3B8492D27DE]) [    ] o.a.s.c.c.SolrZkClient Using default ZkACLProvider
   [junit4]   2> 1459197 INFO  (TEST-ForceLeaderTest.testLastPublishedStateIsActive-seed#[F083F3B8492D27DE]) [    ] o.a.s.s.SolrDispatchFilter Loading solr.xml from SolrHome (not found in ZooKeeper)
   [junit4]   2> 1459197 INFO  (TEST-ForceLeaderTest.testLastPublishedStateIsActive-seed#[F083F3B8492D27DE]) [    ] o.a.s.c.SolrXmlConfig Loading container configuration from /home/jenkins/workspace/Lucene-Solr-6.x-Linux/solr/build/solr-core/test/J1/temp/solr.cloud.ForceLeaderTest_F083F3B8492D27DE-001/control-001/solr.xml
   [junit4]   2> 1459201 INFO  (TEST-ForceLeaderTest.testLastPublishedStateIsActive-seed#[F083F3B8492D27DE]) [    ] o.a.s.c.CorePropertiesLocator Config-defined core root directory: /home/jenkins/workspace/Lucene-Solr-6.x-Linux/solr/build/solr-core/test/J1/temp/solr.cloud.ForceLeaderTest_F083F3B8492D27DE-001/control-001/cores
   [junit4]   2> 1459201 INFO  (TEST-ForceLeaderTest.testLastPublishedStateIsActive-seed#[F083F3B8492D27DE]) [    ] o.a.s.c.CoreContainer New CoreContainer 28654713
   [junit4]   2> 1459201 INFO  (TEST-ForceLeaderTest.testLastPublishedStateIsActive-seed#[F083F3B8492D27DE]) [    ] o.a.s.c.CoreContainer Loading cores into CoreContainer [instanceDir=/home/jenkins/workspace/Lucene-Solr-6.x-Linux/solr/build/solr-core/test/J1/temp/solr.cloud.ForceLeaderTest_F083F3B8492D27DE-001/control-001]
   [junit4]   2> 1459201 WARN  (TEST-ForceLeaderTest.testLastPublishedStateIsActive-seed#[F083F3B8492D27DE]) [    ] o.a.s.c.CoreContainer Couldn't add files from /home/jenkins/workspace/Lucene-Solr-6.x-Linux/solr/build/solr-core/test/J1/temp/solr.cloud.ForceLeaderTest_F083F3B8492D27DE-001/control-001/lib to classpath: /home/jenkins/workspace/Lucene-Solr-6.x-Linux/solr/build/solr-core/test/J1/temp/solr.cloud.ForceLeaderTest_F083F3B8492D27DE-001/control-001/lib
   [junit4]   2> 1459201 INFO  (TEST-ForceLeaderTest.testLastPublishedStateIsActive-seed#[F083F3B8492D27DE]) [    ] o.a.s.h.c.HttpShardHandlerFactory created with socketTimeout : 90000,urlScheme : ,connTimeout : 15000,maxConnectionsPerHost : 20,maxConnections : 10000,corePoolSize : 0,maximumPoolSize : 2147483647,maxThreadIdleTime : 5,sizeOfQueue : -1,fairnessPolicy : false,useRetries : false,connectionsEvictorSleepDelay : 5000,maxConnectionIdleTime : 40000,
   [junit4]   2> 1459202 INFO  (TEST-ForceLeaderTest.testLastPublishedStateIsActive-seed#[F083F3B8492D27DE]) [    ] o.a.s.u.UpdateShardHandler Creating UpdateShardHandler HTTP client with params: socketTimeout=340000&connTimeout=45000&retry=true
   [junit4]   2> 1459203 INFO  (TEST-ForceLeaderTest.testLastPublishedStateIsActive-seed#[F083F3B8492D27DE]) [    ] o.a.s.l.LogWatcher SLF4J impl is org.slf4j.impl.Log4jLoggerFactory
   [junit4]   2> 1459203 INFO  (TEST-ForceLeaderTest.testLastPublishedStateIsActive-seed#[F083F3B8492D27DE]) [    ] o.a.s.l.LogWatcher Registering Log Listener [Log4j (org.slf4j.impl.Log4jLoggerFactory)]
   [junit4]   2> 1459203 INFO  (TEST-ForceLeaderTest.testLastPublishedStateIsActive-seed#[F083F3B8492D27DE]) [    ] o.a.s.c.ZkContainer Zookeeper client=127.0.0.1:41566/solr
   [junit4]   2> 1459203 INFO  (TEST-ForceLeaderTest.testLastPublishedStateIsActive-seed#[F083F3B8492D27DE]) [    ] o.a.s.c.ZkController zkHost includes chroot
   [junit4]   2> 1459203 INFO  (TEST-ForceLeaderTest.testLastPublishedStateIsActive-seed#[F083F3B8492D27DE]) [    ] o.a.s.c.c.SolrZkClient Using default ZkCredentialsProvider
   [junit4]   2> 1459203 INFO  (TEST-ForceLeaderTest.testLastPublishedStateIsActive-seed#[F083F3B8492D27DE]) [    ] o.a.s.c.c.ConnectionManager Waiting for client to connect to ZooKeeper
   [junit4]   2> 1459203 INFO  (zkCallback-1832-thread-1) [    ] o.a.s.c.c.ConnectionManager Watcher org.apache.solr.common.cloud.ConnectionManager@121aba3 name:ZooKeeperConnection Watcher:127.0.0.1:41566 got event WatchedEvent state:SyncConnected type:None path:null path:null type:None
   [junit4]   2> 1459204 INFO  (TEST-ForceLeaderTest.testLastPublishedStateIsActive-seed#[F083F3B8492D27DE]) [    ] o.a.s.c.c.ConnectionManager Client is connected to ZooKeeper
   [junit4]   2> 1459204 INFO  (TEST-ForceLeaderTest.testLastPublishedStateIsActive-seed#[F083F3B8492D27DE]) [    ] o.a.s.c.c.SolrZkClient Using default ZkACLProvider
   [junit4]   2> 1459205 INFO  (TEST-ForceLeaderTest.testLastPublishedStateIsActive-seed#[F083F3B8492D27DE]) [n:127.0.0.1:33924_aqa%2Fx    ] o.a.s.c.ZkController Added new OnReconnect listener org.apache.solr.cloud.ZkController$$Lambda$64/30421038@3b8d73
   [junit4]   2> 1459205 INFO  (TEST-ForceLeaderTest.testLastPublishedStateIsActive-seed#[F083F3B8492D27DE]) [n:127.0.0.1:33924_aqa%2Fx    ] o.a.s.c.c.ConnectionManager Waiting for client to connect to ZooKeeper
   [junit4]   2> 1459205 INFO  (zkCallback-1833-thread-1-processing-n:127.0.0.1:33924_aqa%2Fx) [n:127.0.0.1:33924_aqa%2Fx    ] o.a.s.c.c.ConnectionManager Watcher org.apache.solr.common.cloud.ConnectionManager@150fe48 name:ZooKeeperConnection Watcher:127.0.0.1:41566/solr got event WatchedEvent state:SyncConnected type:None path:null path:null type:None
   [junit4]   2> 1459205 INFO  (TEST-ForceLeaderTest.testLastPublishedStateIsActive-seed#[F083F3B8492D27DE]) [n:127.0.0.1:33924_aqa%2Fx    ] o.a.s.c.c.ConnectionManager Client is connected to ZooKeeper
   [junit4]   2> 1459206 INFO  (TEST-ForceLeaderTest.testLastPublishedStateIsActive-seed#[F083F3B8492D27DE]) [n:127.0.0.1:33924_aqa%2Fx    ] o.a.s.c.c.SolrZkClient makePath: /overseer/queue
   [junit4]   2> 1459206 INFO  (TEST-ForceLeaderTest.testLastPublishedStateIsActive-seed#[F083F3B8492D27DE]) [n:127.0.0.1:33924_aqa%2Fx    ] o.a.s.c.c.SolrZkClient makePath: /overseer/collection-queue-work
   [junit4]   2> 1459207 INFO  (TEST-ForceLeaderTest.testLastPublishedStateIsActive-seed#[F083F3B8492D27DE]) [n:127.0.0.1:33924_aqa%2Fx    ] o.a.s.c.c.SolrZkClient makePath: /overseer/collection-map-running
   [junit4]   2> 1459208 INFO  (TEST-ForceLeaderTest.testLastPublishedStateIsActive-seed#[F083F3B8492D27DE]) [n:127.0.0.1:33924_aqa%2Fx    ] o.a.s.c.c.SolrZkClient makePath: /overseer/collection-map-completed
   [junit4]   2> 1459208 INFO  (TEST-ForceLeaderTest.testLastPublishedStateIsActive-seed#[F083F3B8492D27DE]) [n:127.0.0.1:33924_aqa%2Fx    ] o.a.s.c.c.SolrZkClient makePath: /overseer/collection-map-failure
   [junit4]   2> 1459209 INFO  (TEST-ForceLeaderTest.testLastPublishedStateIsActive-seed#[F083F3B8492D27DE]) [n:127.0.0.1:33924_aqa%2Fx    ] o.a.s.c.c.SolrZkClient makePath: /live_nodes
   [junit4]   2> 1459209 INFO  (TEST-ForceLeaderTest.testLastPublishedStateIsActive-seed#[F083F3B8492D27DE]) [n:127.0.0.1:33924_aqa%2Fx    ] o.a.s.c.c.SolrZkClient makePath: /aliases.json
   [junit4]   2> 1459209 INFO  (TEST-ForceLeaderTest.testLastPublishedStateIsActive-seed#[F083F3B8492D27DE]) [n:127.0.0.1:33924_aqa%2Fx    ] o.a.s.c.c.SolrZkClient makePath: /clusterstate.json
   [junit4]   2> 1459211 INFO  (TEST-ForceLeaderTest.testLastPublishedStateIsActive-seed#[F083F3B8492D27DE]) [n:127.0.0.1:33924_aqa%2Fx    ] o.a.s.c.c.SolrZkClient makePath: /security.json
   [junit4]   2> 1459211 INFO  (TEST-ForceLeaderTest.testLastPublishedStateIsActive-seed#[F083F3B8492D27DE]) [n:127.0.0.1:33924_aqa%2Fx    ] o.a.s.c.c.ZkStateReader Updating cluster state from ZooKeeper... 
   [junit4]   2> 1459211 INFO  (TEST-ForceLeaderTest.testLastPublishedStateIsActive-seed#[F083F3B8492D27DE]) [n:127.0.0.1:33924_aqa%2Fx    ] o.a.s.c.c.ZkStateReader Loaded empty cluster properties
   [junit4]   2> 1459211 INFO  (TEST-ForceLeaderTest.testLastPublishedStateIsActive-seed#[F083F3B8492D27DE]) [n:127.0.0.1:33924_aqa%2Fx    ] o.a.s.c.c.ZkStateReader Updated live nodes from ZooKeeper... (0) -> (0)
   [junit4]   2> 1459212 INFO  (TEST-ForceLeaderTest.testLastPublishedStateIsActive-seed#[F083F3B8492D27DE]) [n:127.0.0.1:33924_aqa%2Fx    ] o.a.s.c.c.SolrZkClient makePath: /overseer_elect
   [junit4]   2> 1459212 INFO  (TEST-ForceLeaderTest.testLastPublishedStateIsActive-seed#[F083F3B8492D27DE]) [n:127.0.0.1:33924_aqa%2Fx    ] o.a.s.c.c.SolrZkClient makePath: /overseer_elect/election
   [junit4]   2> 1459213 INFO  (TEST-ForceLeaderTest.testLastPublishedStateIsActive-seed#[F083F3B8492D27DE]) [n:127.0.0.1:33924_aqa%2Fx    ] o.a.s.c.Overseer Overseer (id=null) closing
   [junit4]   2> 1459213 INFO  (TEST-ForceLeaderTest.testLastPublishedStateIsActive-seed#[F083F3B8492D27DE]) [n:127.0.0.1:33924_aqa%2Fx    ] o.a.s.c.LeaderElector Joined leadership election with path: /overseer_elect/election/96313011887407108-127.0.0.1:33924_aqa%2Fx-n_0000000000
   [junit4]   2> 1459213 INFO  (TEST-ForceLeaderTest.testLastPublishedStateIsActive-seed#[F083F3B8492D27DE]) [n:127.0.0.1:33924_aqa%2Fx    ] o.a.s.c.OverseerElectionContext I am going to be the leader 127.0.0.1:33924_aqa%2Fx
   [junit4]   2> 1459213 INFO  (TEST-ForceLeaderTest.testLastPublishedStateIsActive-seed#[F083F3B8492D27DE]) [n:127.0.0.1:33924_aqa%2Fx    ] o.a.s.c.c.SolrZkClient makePath: /overseer_elect/leader
   [junit4]   2> 1459213 INFO  (TEST-ForceLeaderTest.testLastPublishedStateIsActive-seed#[F083F3B8492D27DE]) [n:127.0.0.1:33924_aqa%2Fx    ] o.a.s.c.Overseer Overseer (id=96313011887407108-127.0.0.1:33924_aqa%2Fx-n_0000000000) starting
   [junit4]   2> 1459214 INFO  (TEST-ForceLeaderTest.testLastPublishedStateIsActive-seed#[F083F3B8492D27DE]) [n:127.0.0.1:33924_aqa%2Fx    ] o.a.s.c.c.SolrZkClient makePath: /overseer/queue-work
   [junit4]   2> 1459215 INFO  (TEST-ForceLeaderTest.testLastPublishedStateIsActive-seed#[F083F3B8492D27DE]) [n:127.0.0.1:33924_aqa%2Fx    ] o.a.s.c.OverseerAutoReplicaFailoverThread Starting OverseerAutoReplicaFailoverThread autoReplicaFailoverWorkLoopDelay=10000 autoReplicaFailoverWaitAfterExpiration=10000 autoReplicaFailoverBadNodeExpiration=60000
   [junit4]   2> 1459215 INFO  (OverseerCollectionConfigSetProcessor-96313011887407108-127.0.0.1:33924_aqa%2Fx-n_0000000000) [n:127.0.0.1:33924_aqa%2Fx    ] o.a.s.c.OverseerTaskProcessor Process current queue of overseer operations
   [junit4]   2> 1459216 INFO  (OverseerStateUpdate-96313011887407108-127.0.0.1:33924_aqa%2Fx-n_0000000000) [n:127.0.0.1:33924_aqa%2Fx    ] o.a.s.c.Overseer Starting to work on the main queue
   [junit4]   2> 1459216 INFO  (TEST-ForceLeaderTest.testLastPublishedStateIsActive-seed#[F083F3B8492D27DE]) [n:127.0.0.1:33924_aqa%2Fx    ] o.a.s.c.ZkController Register node as live in ZooKeeper:/live_nodes/127.0.0.1:33924_aqa%2Fx
   [junit4]   2> 1459216 INFO  (TEST-ForceLeaderTest.testLastPublishedStateIsActive-seed#[F083F3B8492D27DE]) [n:127.0.0.1:33924_aqa%2Fx    ] o.a.s.c.c.SolrZkClient makePath: /live_nodes/127.0.0.1:33924_aqa%2Fx
   [junit4]   2> 1459216 INFO  (OverseerStateUpdate-96313011887407108-127.0.0.1:33924_aqa%2Fx-n_0000000000) [n:127.0.0.1:33924_aqa%2Fx    ] o.a.s.c.c.ZkStateReader Updated live nodes from ZooKeeper... (0) -> (0)
   [junit4]   2> 1459216 INFO  (zkCallback-1833-thread-1-processing-n:127.0.0.1:33924_aqa%2Fx) [n:127.0.0.1:33924_aqa%2Fx    ] o.a.s.c.c.ZkStateReader A live node change: [WatchedEvent state:SyncConnected type:NodeChildrenChanged path:/live_nodes], has occurred - updating... (live nodes size: [0])
   [junit4]   2> 1459216 INFO  (zkCallback-1833-thread-1-processing-n:127.0.0.1:33924_aqa%2Fx) [n:127.0.0.1:33924_aqa%2Fx    ] o.a.s.c.c.ZkStateReader Updated live nodes from ZooKeeper... (0) -> (1)
   [junit4]   2> 1459237 INFO  (TEST-ForceLeaderTest.testLastPublishedStateIsActive-seed#[F083F3B8492D27DE]) [n:127.0.0.1:33924_aqa%2Fx    ] o.a.s.c.CoreContainer Security conf doesn't exist. Skipping setup for authorization module.
   [junit4]   2> 1459237 INFO  (TEST-ForceLeaderTest.testLastPublishedStateIsActive-seed#[F083F3B8492D27DE]) [n:127.0.0.1:33924_aqa%2Fx    ] o.a.s.c.CoreContainer No authentication plugin used.
   [junit4]   2> 1459238 INFO  (TEST-ForceLeaderTest.testLastPublishedStateIsActive-seed#[F083F3B8492D27DE]) [n:127.0.0.1:33924_aqa%2Fx    ] o.a.s.c.CorePropertiesLocator Looking for core definitions underneath /home/jenkins/workspace/Lucene-Solr-6.x-Linux/solr/build/solr-core/test/J1/temp/solr.cloud.ForceLeaderTest_F083F3B8492D27DE-001/control-001/cores
   [junit4]   2> 1459238 INFO  (TEST-ForceLeaderTest.testLastPublishedStateIsActive-seed#[F083F3B8492D27DE]) [n:127.0.0.1:33924_aqa%2Fx    ] o.a.s.c.CoreDescriptor Created CoreDescriptor: {name=collection1, config=solrconfig.xml, transient=false, schema=schema.xml, loadOnStartup=true, configSetProperties=configsetprops.json, collection=control_collection, coreNodeName=, dataDir=data/, shard=}
   [junit4]   2> 1459239 INFO  (TEST-ForceLeaderTest.testLastPublishedStateIsActive-seed#[F083F3B8492D27DE]) [n:127.0.0.1:33924_aqa%2Fx    ] o.a.s.c.CorePropertiesLocator Found core collection1 in /home/jenkins/workspace/Lucene-Solr-6.x-Linux/solr/build/solr-core/test/J1/temp/solr.cloud.ForceLeaderTest_F083F3B8492D27DE-001/control-001/cores/collection1
   [junit4]   2> 1459239 INFO  (TEST-ForceLeaderTest.testLastPublishedStateIsActive-seed#[F083F3B8492D27DE]) [n:127.0.0.1:33924_aqa%2Fx    ] o.a.s.c.CorePropertiesLocator Found 1 core definitions
   [junit4]   2> 1459239 INFO  (coreLoadExecutor-5125-thread-1-processing-n:127.0.0.1:33924_aqa%2Fx) [n:127.0.0.1:33924_aqa%2Fx c:control_collection   x:collection1] o.a.s.c.ZkController publishing state=down
   [junit4]   2> 1459239 INFO  (TEST-ForceLeaderTest.testLastPublishedStateIsActive-seed#[F083F3B8492D27DE]) [n:127.0.0.1:33924_aqa%2Fx    ] o.a.s.s.SolrDispatchFilter user.dir=/home/jenkins/workspace/Lucene-Solr-6.x-Linux/solr/build/solr-core/test/J1
   [junit4]   2> 1459239 INFO  (TEST-ForceLeaderTest.testLastPublishedStateIsActive-seed#[F083F3B8492D27DE]) [n:127.0.0.1:33924_aqa%2Fx    ] o.a.s.s.SolrDispatchFilter SolrDispatchFilter.init() done
   [junit4]   2> 1459239 INFO  (coreLoadExecutor-5125-thread-1-processing-n:127.0.0.1:33924_aqa%2Fx) [n:127.0.0.1:33924_aqa%2Fx c:control_collection   x:collection1] o.a.s.c.ZkController numShards not found on descriptor - reading it from system property
   [junit4]   2> 1459240 INFO  (coreLoadExecutor-5125-thread-1-processing-n:127.0.0.1:33924_aqa%2Fx) [n:127.0.0.1:33924_aqa%2Fx c:control_collection   x:collection1] o.a.s.c.ZkController Collection control_collection not visible yet, but flagging it so a watch is registered when it becomes visible
   [junit4]   2> 1459240 INFO  (OverseerStateUpdate-96313011887407108-127.0.0.1:33924_aqa%2Fx-n_0000000000) [n:127.0.0.1:33924_aqa%2Fx    ] o.a.s.c.Overseer processMessage: queueSize: 1, message = {
   [junit4]   2>   "core":"collection1",
   [junit4]   2>   "roles":null,
   [junit4]   2>   "base_url":"http://127.0.0.1:33924/aqa/x",
   [junit4]   2>   "node_name":"127.0.0.1:33924_aqa%2Fx",
   [junit4]   2>   "numShards":"1",
   [junit4]   2>   "state":"down",
   [junit4]   2>   "shard":null,
   [junit4]   2>   "collection":"control_collection",
   [junit4]   2>   "operation":"state"} current state version: 0
   [junit4]   2> 1459240 INFO  (OverseerStateUpdate-96313011887407108-127.0.0.1:33924_aqa%2Fx-n_0000000000) [n:127.0.0.1:33924_aqa%2Fx    ] o.a.s.c.o.ReplicaMutator Update state numShards=1 message={
   [junit4]   2>   "core":"collection1",
   [junit4]   2>   "roles":null,
   [junit4]   2>   "base_url":"http://127.0.0.1:33924/aqa/x",
   [junit4]   2>   "node_name":"127.0.0.1:33924_aqa%2Fx",
   [junit4]   2>   "numShards":"1",
   [junit4]   2>   "state":"down",
   [junit4]   2>   "shard":null,
   [junit4]   2>   "collection":"control_collection",
   [junit4]   2>   "operation":"state"}
   [junit4]   2> 1459240 INFO  (coreLoadExecutor-5125-thread-1-processing-n:127.0.0.1:33924_aqa%2Fx) [n:127.0.0.1:33924_aqa%2Fx c:control_collection   x:collection1] o.a.s.c.c.ZkStateReader Deleting data for [control_collection]
   [junit4]   2> 1459240 INFO  (OverseerStateUpdate-96313011887407108-127.0.0.1:33924_aqa%2Fx-n_0000000000) [n:127.0.0.1:33924_aqa%2Fx    ] o.a.s.c.o.ClusterStateMutator building a new cName: control_collection
   [junit4]   2> 1459240 INFO  (OverseerStateUpdate-96313011887407108-127.0.0.1:33924_aqa%2Fx-n_0000000000) [n:127.0.0.1:33924_aqa%2Fx    ] o.a.s.c.o.ReplicaMutator Assigning new node to shard shard=shard1
   [junit4]   2> 1459240 INFO  (coreLoadExecutor-5125-thread-1-processing-n:127.0.0.1:33924_aqa%2Fx) [n:127.0.0.1:33924_aqa%2Fx c:control_collection   x:collection1] o.a.s.c.ZkController look for our core node name
   [junit4]   2> 1459240 INFO  (zkCallback-1833-thread-1-processing-n:127.0.0.1:33924_aqa%2Fx) [n:127.0.0.1:33924_aqa%2Fx    ] o.a.s.c.c.ZkStateReader A cluster state change: [WatchedEvent state:SyncConnected type:NodeDataChanged path:/clusterstate.json], has occurred - updating... (live nodes size: [1])
   [junit4]   2> 1460240 INFO  (coreLoadExecutor-5125-thread-1-processing-n:127.0.0.1:33924_aqa%2Fx) [n:127.0.0.1:33924_aqa%2Fx c:control_collection   x:collection1] o.a.s.c.ZkController waiting to find shard id in clusterstate for collection1
   [junit4]   2> 1460240 INFO  (coreLoadExecutor-5125-thread-1-processing-n:127.0.0.1:33924_aqa%2Fx) [n:127.0.0.1:33924_aqa%2Fx c:control_collection   x:collection1] o.a.s.c.ZkController Check for collection zkNode:control_collection
   [junit4]   2> 1460241 INFO  (coreLoadExecutor-5125-thread-1-processing-n:127.0.0.1:33924_aqa%2Fx) [n:127.0.0.1:33924_aqa%2Fx c:control_collection   x:collection1] o.a.s.c.ZkController Collection zkNode exists
   [junit4]   2> 1460241 INFO  (coreLoadExecutor-5125-thread-1-processing-n:127.0.0.1:33924_aqa%2Fx) [n:127.0.0.1:33924_aqa%2Fx c:control_collection   x:collection1] o.a.s.c.c.ZkStateReader Load collection config from: [/collections/control_collection]
   [junit4]   2> 1460241 INFO  (coreLoadExecutor-5125-thread-1-processing-n:127.0.0.1:33924_aqa%2Fx) [n:127.0.0.1:33924_aqa%2Fx c:control_collection   x:collection1] o.a.s.c.c.ZkStateReader path=[/collections/control_collection] [configName]=[conf1] specified config exists in ZooKeeper
   [junit4]   2> 1460241 INFO  (coreLoadExecutor-5125-thread-1-processing-n:127.0.0.1:33924_aqa%2Fx) [n:127.0.0.1:33924_aqa%2Fx c:control_collection   x:collection1] o.a.s.c.SolrResourceLoader new SolrResourceLoader for directory: '/home/jenkins/workspace/Lucene-Solr-6.x-Linux/solr/build/solr-core/test/J1/temp/solr.cloud.ForceLeaderTest_F083F3B8492D27DE-001/control-001/cores/collection1'
   [junit4]   2> 1460241 INFO  (coreLoadExecutor-5125-thread-1-processing-n:127.0.0.1:33924_aqa%2Fx) [n:127.0.0.1:33924_aqa%2Fx c:control_collection   x:collection1] o.a.s.c.SolrResourceLoader JNDI not configured for solr (NoInitialContextEx)
   [junit4]   2> 1460241 INFO  (coreLoadExecutor-5125-thread-1-processing-n:127.0.0.1:33924_aqa%2Fx) [n:127.0.0.1:33924_aqa%2Fx c:control_collection   x:collection1] o.a.s.c.SolrResourceLoader solr home defaulted to 'solr/' (could not find system property or JNDI)
   [junit4]   2> 1460242 INFO  (coreLoadExecutor-5125-thread-1-processing-n:127.0.0.1:33924_aqa%2Fx) [n:127.0.0.1:33924_aqa%2Fx c:control_collection   x:collection1] o.a.s.c.Config loaded config solrconfig.xml with version 0 
   [junit4]   2> 1460244 INFO  (coreLoadExecutor-5125-thread-1-processing-n:127.0.0.1:33924_aqa%2Fx) [n:127.0.0.1:33924_aqa%2Fx c:control_collection   x:collection1] o.a.s.c.SolrConfig current version of requestparams : -1
   [junit4]   2> 1460248 INFO  (coreLoadExecutor-5125-thread-1-processing-n:127.0.0.1:33924_aqa%2Fx) [n:127.0.0.1:33924_aqa%2Fx c:control_collection   x:collection1] o.a.s.c.SolrConfig Using Lucene MatchVersion: 6.2.0
   [junit4]   2> 1460267 INFO  (coreLoadExecutor-5125-thread-1-processing-n:127.0.0.1:33924_aqa%2Fx) [n:127.0.0.1:33924_aqa%2Fx c:control_collection   x:collection1] o.a.s.c.SolrConfig Loaded SolrConfig: solrconfig.xml
   [junit4]   2> 1460271 INFO  (coreLoadExecutor-5125-thread-1-processing-n:127.0.0.1:33924_aqa%2Fx) [n:127.0.0.1:33924_aqa%2Fx c:control_collection   x:collection1] o.a.s.s.IndexSchema [collection1] Schema name=test
   [junit4]   2> 1460336 INFO  (coreLoadExecutor-5125-thread-1-processing-n:127.0.0.1:33924_aqa%2Fx) [n:127.0.0.1:33924_aqa%2Fx c:control_collection   x:collection1] o.a.s.s.OpenExchangeRatesOrgProvider Initialized with rates=open-exchange-rates.json, refreshInterval=1440.
   [junit4]   2> 1460340 INFO  (coreLoadExecutor-5125-thread-1-processing-n:127.0.0.1:33924_aqa%2Fx) [n:127.0.0.1:33924_aqa%2Fx c:control_collection   x:collection1] o.a.s.s.IndexSchema default search field in schema is text
   [junit4]   2> 1460341 INFO  (coreLoadExecutor-5125-thread-1-processing-n:127.0.0.1:33924_aqa%2Fx) [n:127.0.0.1:33924_aqa%2Fx c:control_collection   x:collection1] o.a.s.s.IndexSchema unique key field: id
   [junit4]   2> 1460344 INFO  (coreLoadExecutor-5125-thread-1-processing-n:127.0.0.1:33924_aqa%2Fx) [n:127.0.0.1:33924_aqa%2Fx c:control_collection   x:collection1] o.a.s.s.FileExchangeRateProvider Reloading exchange rates from file currency.xml
   [junit4]   2> 1460345 INFO  (coreLoadExecutor-5125-thread-1-processing-n:127.0.0.1:33924_aqa%2Fx) [n:127.0.0.1:33924_aqa%2Fx c:control_collection   x:collection1] o.a.s.s.FileExchangeRateProvider Reloading exchange rates from file currency.xml
   [junit4]   2> 1460345 INFO  (coreLoadExecutor-5125-thread-1-processing-n:127.0.0.1:33924_aqa%2Fx) [n:127.0.0.1:33924_aqa%2Fx c:control_collection   x:collection1] o.a.s.s.OpenExchangeRatesOrgProvider Reloading exchange rates from open-exchange-rates.json
   [junit4]   2> 1460346 INFO  (coreLoadExecutor-5125-thread-1-processing-n:127.0.0.1:33924_aqa%2Fx) [n:127.0.0.1:33924_aqa%2Fx c:control_collection   x:collection1] o.a.s.s.OpenExchangeRatesOrgProvider Reloading exchange rates from open-exchange-rates.json
   [junit4]   2> 1460347 INFO  (coreLoadExecutor-5125-thread-1-processing-n:127.0.0.1:33924_aqa%2Fx) [n:127.0.0.1:33924_aqa%2Fx c:control_collection   x:collection1] o.a.s.c.ConfigSetProperties Did not find ConfigSet properties, assuming default properties: Can't find resource 'configsetprops.json' in classpath or '/configs/conf1', cwd=/home/jenkins/workspace/Lucene-Solr-6.x-Linux/solr/build/solr-core/test/J1
   [junit4]   2> 1460347 INFO  (coreLoadExecutor-5125-thread-1-processing-n:127.0.0.1:33924_aqa%2Fx) [n:127.0.0.1:33924_aqa%2Fx c:control_collection   x:collection1] o.a.s.c.CoreContainer Creating SolrCore 'collection1' using configuration from collection control_collection
   [junit4]   2> 1460347 INFO  (coreLoadExecutor-5125-thread-1-processing-n:127.0.0.1:33924_aqa%2Fx) [n:127.0.0.1:33924_aqa%2Fx c:control_collection s:shard1 r:core_node1 x:collection1] o.a.s.c.SolrCore org.apache.solr.core.MockDirectoryFactory
   [junit4]   2> 1460347 INFO  (coreLoadExecutor-5125-thread-1-processing-n:127.0.0.1:33924_aqa%2Fx) [n:127.0.0.1:33924_aqa%2Fx c:control_collection s:shard1 r:core_node1 x:collection1] o.a.s.c.SolrCore [[collection1] ] Opening new SolrCore at [/home/jenkins/workspace/Lucene-Solr-6.x-Linux/solr/build/solr-core/test/J1/temp/solr.cloud.ForceLeaderTest_F083F3B8492D27DE-001/control-001/cores/collection1], dataDir=[/home/jenkins/workspace/Lucene-Solr-6.x-Linux/solr/build/solr-core/test/J1/temp/solr.cloud.ForceLeaderTest_F083F3B8492D27DE-001/control-001/cores/collection1/data/]
   [junit4]   2> 1460347 INFO  (coreLoadExecutor-5125-thread-1-processing-n:127.0.0.1:33924_aqa%2Fx) [n:127.0.0.1:33924_aqa%2Fx c:control_collection s:shard1 r:core_node1 x:collection1] o.a.s.c.JmxMonitoredMap JMX monitoring is enabled. Adding Solr mbeans to JMX Server: com.sun.jmx.mbeanserver.JmxMBeanServer@1130ead
   [junit4]   2> 1460347 INFO  (coreLoadExecutor-5125-thread-1-processing-n:127.0.0.1:33924_aqa%2Fx) [n:127.0.0.1:33924_aqa%2Fx c:control_collection s:shard1 r:core_node1 x:collection1] o.a.s.c.CachingDirectoryFactory return new directory for /home/jenkins/workspace/Lucene-Solr-6.x-Linux/solr/build/solr-core/test/J1/temp/solr.cloud.ForceLeaderTest_F083F3B8492D27DE-001/control-001/cores/collection1/data
   [junit4]   2> 1460348 INFO  (coreLoadExecutor-5125-thread-1-processing-n:127.0.0.1:33924_aqa%2Fx) [n:127.0.0.1:33924_aqa%2Fx c:control_collection s:shard1 r:core_node1 x:collection1] o.a.s.c.SolrCore New index directory detected: old=null new=/home/jenkins/workspace/Lucene-Solr-6.x-Linux/solr/build/solr-core/test/J1/temp/solr.cloud.ForceLeaderTest_F083F3B8492D27DE-001/control-001/cores/collection1/data/index/
   [junit4]   2> 1460348 WARN  (coreLoadExecutor-5125-thread-1-processing-n:127.0.0.1:33924_aqa%2Fx) [n:127.0.0.1:33924_aqa%2Fx c:control_collection s:shard1 r:core_node1 x:collection1] o.a.s.c.SolrCore [collection1] Solr index directory '/home/jenkins/workspace/Lucene-Solr-6.x-Linux/solr/build/solr-core/test/J1/temp/solr.cloud.ForceLeaderTest_F083F3B8492D27DE-001/control-001/cores/collection1/data/index' doesn't exist. Creating new index...
   [junit4]   2> 1460348 INFO  (coreLoadExecutor-5125-thread-1-processing-n:127.0.0.1:33924_aqa%2Fx) [n:127.0.0.1:33924_aqa%2Fx c:control_collection s:shard1 r:core_node1 x:collection1] o.a.s.c.CachingDirectoryFactory return new directory for /home/jenkins/workspace/Lucene-Solr-6.x-Linux/solr/build/solr-core/test/J1/temp/solr.cloud.ForceLeaderTest_F083F3B8492D27DE-001/control-001/cores/collection1/data/index
   [junit4]   2> 1460348 INFO  (coreLoadExecutor-5125-thread-1-processing-n:127.0.0.1:33924_aqa%2Fx) [n:127.0.0.1:33924_aqa%2Fx c:control_collection s:shard1 r:core_node1 x:collection1] o.a.s.u.RandomMergePolicy RandomMergePolicy wrapping class org.apache.lucene.index.AlcoholicMergePolicy: [AlcoholicMergePolicy: minMergeSize=0, mergeFactor=10, maxMergeSize=610680006, maxMergeSizeForForcedMerge=9223372036854775807, calibrateSizeByDeletes=true, maxMergeDocs=2147483647, maxCFSSegmentSizeMB=8.796093022207999E12, noCFSRatio=0.1]
   [junit4]   2> 1460348 INFO  (coreLoadExecutor-5125-thread-1-processing-n:127.0.0.1:33924_aqa%2Fx) [n:127.0.0.1:33924_aqa%2Fx c:control_collection s:shard1 r:core_node1 x:collection1] o.a.s.c.SolrDeletionPolicy SolrDeletionPolicy.onCommit: commits: num=1
   [junit4]   2> 	commit{dir=MockDirectoryWrapper(RAMDirectory@1b20298 lockFactory=org.apache.lucene.store.SingleInstanceLockFactory@19559ca),segFN=segments_1,generation=1}
   [junit4]   2> 1460348 INFO  (coreLoadExecutor-5125-thread-1-processing-n:127.0.0.1:33924_aqa%2Fx) [n:127.0.0.1:33924_aqa%2Fx c:control_collection s:shard1 r:core_node1 x:collection1] o.a.s.c.SolrDeletionPolicy newest commit generation = 1
   [junit4]   2> 1460349 INFO  (OldIndexDirectoryCleanupThreadForCore-collection1) [n:127.0.0.1:33924_aqa%2Fx c:control_collection s:shard1 r:core_node1 x:collection1] o.a.s.c.SolrCore Looking for old index directories to cleanup for core collection1 in /home/jenkins/workspace/Lucene-Solr-6.x-Linux/solr/build/solr-core/test/J1/temp/solr.cloud.ForceLeaderTest_F083F3B8492D27DE-001/control-001/cores/collection1/data/
   [junit4]   2> 1460349 WARN  (OldIndexDirectoryCleanupThreadForCore-collection1) [n:127.0.0.1:33924_aqa%2Fx c:control_collection s:shard1 r:core_node1 x:collection1] o.a.s.c.DirectoryFactory /home/jenkins/workspace/Lucene-Solr-6.x-Linux/solr/build/solr-core/test/J1/temp/solr.cloud.ForceLeaderTest_F083F3B8492D27DE-001/control-001/cores/collection1/data/ does not point to a valid data directory; skipping clean-up of old index directories.
   [junit4]   2> 1460350 INFO  (coreLoadExecutor-5125-thread-1-processing-n:127.0.0.1:33924_aqa%2Fx) [n:127.0.0.1:33924_aqa%2Fx c:control_collection s:shard1 r:core_node1 x:collection1] o.a.s.u.p.UpdateRequestProcessorChain creating updateRequestProcessorChain "nodistrib"
   [junit4]   2> 1460351 INFO  (coreLoadExecutor-5125-thread-1-processing-n:127.0.0.1:33924_aqa%2Fx) [n:127.0.0.1:33924_aqa%2Fx c:control_collection s:shard1 r:core_node1 x:collection1] o.a.s.u.p.UpdateRequestProcessorChain creating updateRequestProcessorChain "dedupe"
   [junit4]   2> 1460351 INFO  (coreLoadExecutor-5125-thread-1-processing-n:127.0.0.1:33924_aqa%2Fx) [n:127.0.0.1:33924_aqa%2Fx c:control_collection s:shard1 r:core_node1 x:collection1] o.a.s.u.p.UpdateRequestProcessorChain inserting DistributedUpdateProcessorFactory into updateRequestProcessorChain "dedupe"
   [junit4]   2> 1460351 INFO  (coreLoadExecutor-5125-thread-1-processing-n:127.0.0.1:33924_aqa%2Fx) [n:127.0.0.1:33924_aqa%2Fx c:control_collection s:shard1 r:core_node1 x:collection1] o.a.s.u.p.UpdateRequestProcessorChain creating updateRequestProcessorChain "stored_sig"
   [junit4]   2> 1460351 INFO  (coreLoadExecutor-5125-thread-1-processing-n:127.0.0.1:33924_aqa%2Fx) [n:127.0.0.1:33924_aqa%2Fx c:control_collection s:shard1 r:core_node1 x:collection1] o.a.s.u.p.UpdateRequestProcessorChain inserting DistributedUpdateProcessorFactory into updateRequestProcessorChain "stored_sig"
   [junit4]   2> 1460351 INFO  (coreLoadExecutor-5125-thread-1-processing-n:127.0.0.1:33924_aqa%2Fx) [n:127.0.0.1:33924_aqa%2Fx c:control_collection s:shard1 r:core_node1 x:collection1] o.a.s.u.p.UpdateRequestProcessorChain creating updateRequestProcessorChain "distrib-dup-test-chain-explicit"
   [junit4]   2> 1460351 INFO  (coreLoadExecutor-5125-thread-1-processing-n:127.0.0.1:33924_aqa%2Fx) [n:127.0.0.1:33924_aqa%2Fx c:control_collection s:shard1 r:core_node1 x:collection1] o.a.s.u.p.UpdateRequestProcessorChain creating updateRequestProcessorChain "distrib-dup-test-chain-implicit"
   [junit4]   2> 1460351 INFO  (coreLoadExecutor-5125-thread-1-processing-n:127.0.0.1:33924_aqa%2Fx) [n:127.0.0.1:33924_aqa%2Fx c:control_collection s:shard1 r:core_node1 x:collection1] o.a.s.u.p.UpdateRequestProcessorChain inserting DistributedUpdateProcessorFactory into updateRequestProcessorChain "distrib-dup-test-chain-implicit"
   [junit4]   2> 1460351 INFO  (coreLoadExecutor-5125-thread-1-processing-n:127.0.0.1:33924_aqa%2Fx) [n:127.0.0.1:33924_aqa%2Fx c:control_collection s:shard1 r:core_node1 x:collection1] o.a.s.c.SolrCore no updateRequestProcessorChain defined as default, creating implicit default
   [junit4]   2> 1460351 WARN  (coreLoadExecutor-5125-thread-1-processing-n:127.0.0.1:33924_aqa%2Fx) [n:127.0.0.1:33924_aqa%2Fx c:control_collection s:shard1 r:core_node1 x:collection1] o.a.s.c.RequestHandlers INVALID paramSet a in requestHandler {type = requestHandler,name = /dump,class = DumpRequestHandler,args = {defaults={a=A,b=B}}}
   [junit4]   2> 1460352 INFO  (coreLoadExecutor-5125-thread-1-processing-n:127.0.0.1:33924_aqa%2Fx) [n:127.0.0.1:33924_aqa%2Fx c:control_collection s:shard1 r:core_node1 x:collection1] o.a.s.h.l.XMLLoader xsltCacheLifetimeSeconds=60
   [junit4]   2> 1460352 INFO  (coreLoadExecutor-5125-thread-1-processing-n:127.0.0.1:33924_aqa%2Fx) [n:127.0.0.1:33924_aqa%2Fx c:control_collection s:shard1 r:core_node1 x:collection1] o.a.s.h.l.XMLLoader xsltCacheLifetimeSeconds=60
   [junit4]   2> 1460353 INFO  (coreLoadExecutor-5125-thread-1-processing-n:127.0.0.1:33924_aqa%2Fx) [n:127.0.0.1:33924_aqa%2Fx c:control_collection s:shard1 r:core_node1 x:collection1] o.a.s.h.l.XMLLoader xsltCacheLifetimeSeconds=60
   [junit4]   2> 1460353 INFO  (coreLoadExecutor-5125-thread-1-processing-n:127.0.0.1:33924_aqa%2Fx) [n:127.0.0.1:33924_aqa%2Fx c:control_collection s:shard1 r:core_node1 x:collection1] o.a.s.h.l.XMLLoader xsltCacheLifetimeSeconds=60
   [junit4]   2> 1460355 INFO  (coreLoadExecutor-5125-thread-1-processing-n:127.0.0.1:33924_aqa%2Fx) [n:127.0.0.1:33924_aqa%2Fx c:control_collection s:shard1 r:core_node1 x:collection1] o.a.s.c.RequestHandlers Registered paths: /admin/mbeans,standard,/update/json/docs,/admin/luke,/export,/get,/admin/properties,/update/json,/admin/threads,/dump,/update/csv,/sql,/graph,/admin/segments,/admin/system,/replication,/config,/stream,/schema,/admin/plugins,/admin/logging,/admin/ping,/update,/admin/file,/terms
   [junit4]   2> 1460355 INFO  (coreLoadExecutor-5125-thread-1-processing-n:127.0.0.1:33924_aqa%2Fx) [n:127.0.0.1:33924_aqa%2Fx c:control_collection s:shard1 r:core_node1 x:collection1] o.a.s.c.SolrCore Using default statsCache cache: org.apache.solr.search.stats.LocalStatsCache
   [junit4]   2> 1460356 INFO  (coreLoadExecutor-5125-thread-1-processing-n:127.0.0.1:33924_aqa%2Fx) [n:127.0.0.1:33924_aqa%2Fx c:control_collection s:shard1 r:core_node1 x:collection1] o.a.s.u.UpdateHandler Using UpdateLog implementation: org.apache.solr.update.UpdateLog
   [junit4]   2> 1460356 INFO  (coreLoadExecutor-5125-thread-1-processing-n:127.0.0.1:33924_aqa%2Fx) [n:127.0.0.1:33924_aqa%2Fx c:control_collection s:shard1 r:core_node1 x:collection1] o.a.s.u.UpdateLog Initializing UpdateLog: dataDir= defaultSyncLevel=FLUSH numRecordsToKeep=100 maxNumLogsToKeep=10 numVersionBuckets=65536
   [junit4]   2> 1460356 INFO  (coreLoadExecutor-5125-thread-1-processing-n:127.0.0.1:33924_aqa%2Fx) [n:127.0.0.1:33924_aqa%2Fx c:control_collection s:shard1 r:core_node1 x:collection1] o.a.s.u.CommitTracker Hard AutoCommit: disabled
   [junit4]   2> 1460356 INFO  (coreLoadExecutor-5125-thread-1-processing-n:127.0.0.1:33924_aqa%2Fx) [n:127.0.0.1:33924_aqa%2Fx c:control_collection s:shard1 r:core_node1 x:collection1] o.a.s.u.CommitTracker Soft AutoCommit: disabled
   [junit4]   2> 1460356 INFO  (coreLoadExecutor-5125-thread-1-processing-n:127.0.0.1:33924_aqa%2Fx) [n:127.0.0.1:33924_aqa%2Fx c:control_collection s:shard1 r:core_node1 x:collection1] o.a.s.u.RandomMergePolicy RandomMergePolicy wrapping class org.apache.lucene.index.LogDocMergePolicy: [LogDocMergePolicy: minMergeSize=1000, mergeFactor=27, maxMergeSize=9223372036854775807, maxMergeSizeForForcedMerge=9223372036854775807, calibrateSizeByDeletes=true, maxMergeDocs=2147483647, maxCFSSegmentSizeMB=8.796093022207999E12, noCFSRatio=0.0]
   [junit4]   2> 1460356 INFO  (coreLoadExecutor-5125-thread-1-processing-n:127.0.0.1:33924_aqa%2Fx) [n:127.0.0.1:33924_aqa%2Fx c:control_collection s:shard1 r:core_node1 x:collection1] o.a.s.c.SolrDeletionPolicy SolrDeletionPolicy.onInit: commits: num=1
   [junit4]   2> 	commit{dir=MockDirectoryWrapper(RAMDirectory@1b20298 lockFactory=org.apache.lucene.store.SingleInstanceLockFactory@19559ca),segFN=segments_1,generation=1}
   [junit4]   2> 1460357 INFO  (coreLoadExecutor-5125-thread-1-processing-n:127.0.0.1:33924_aqa%2Fx) [n:127.0.0.1:33924_aqa%2Fx c:control_collection s:shard1 r:core_node1 x:collection1] o.a.s.c.SolrDeletionPolicy newest commit generation = 1
   [junit4]   2> 1460357 INFO  (coreLoadExecutor-5125-thread-1-processing-n:127.0.0.1:33924_aqa%2Fx) [n:127.0.0.1:33924_aqa%2Fx c:control_collection s:shard1 r:core_node1 x:collection1] o.a.s.s.SolrIndexSearcher Opening [Searcher@1abfed[collection1] main]
   [junit4]   2> 1460357 INFO  (coreLoadExecutor-5125-thread-1-processing-n:127.0.0.1:33924_aqa%2Fx) [n:127.0.0.1:33924_aqa%2Fx c:control_collection s:shard1 r:core_node1 x:collection1] o.a.s.c.c.ZkStateReader Load collection config from: [/collections/control_collection]
   [junit4]   2> 1460357 INFO  (coreLoadExecutor-5125-thread-1-processing-n:127.0.0.1:33924_aqa%2Fx) [n:127.0.0.1:33924_aqa%2Fx c:control_collection s:shard1 r:core_node1 x:collection1] o.a.s.c.c.ZkStateReader path=[/collections/control_collection] [configName]=[conf1] specified config exists in ZooKeeper
   [junit4]   2> 1460357 INFO  (coreLoadExecutor-5125-thread-1-processing-n:127.0.0.1:33924_aqa%2Fx) [n:127.0.0.1:33924_aqa%2Fx c:control_collection s:shard1 r:core_node1 x:collection1] o.a.s.r.ManagedResourceStorage Setting up ZooKeeper-based storage for the RestManager with znodeBase: /configs/conf1
   [junit4]   2> 1460357 INFO  (coreLoadExecutor-5125-thread-1-processing-n:127.0.0.1:33924_aqa%2Fx) [n:127.0.0.1:33924_aqa%2Fx c:control_collection s:shard1 r:core_node1 x:collection1] o.a.s.r.ManagedResourceStorage Configured ZooKeeperStorageIO with znodeBase: /configs/conf1
   [junit4]   2> 1460357 INFO  (coreLoadExecutor-5125-thread-1-processing-n:127.0.0.1:33924_aqa%2Fx) [n:127.0.0.1:33924_aqa%2Fx c:control_collection s:shard1 r:core_node1 x:collection1] o.a.s.r.RestManager Initializing RestManager with initArgs: {}
   [junit4]   2> 1460357 INFO  (coreLoadExecutor-5125-thread-1-processing-n:127.0.0.1:33924_aqa%2Fx) [n:127.0.0.1:33924_aqa%2Fx c:control_collection s:shard1 r:core_node1 x:collection1] o.a.s.r.ManagedResourceStorage Reading _rest_managed.json using ZooKeeperStorageIO:path=/configs/conf1
   [junit4]   2> 1460357 INFO  (coreLoadExecutor-5125-thread-1-processing-n:127.0.0.1:33924_aqa%2Fx) [n:127.0.0.1:33924_aqa%2Fx c:control_collection s:shard1 r:core_node1 x:collection1] o.a.s.r.ManagedResourceStorage No data found for znode /configs/conf1/_rest_managed.json
   [junit4]   2> 1460357 INFO  (coreLoadExecutor-5125-thread-1-processing-n:127.0.0.1:33924_aqa%2Fx) [n:127.0.0.1:33924_aqa%2Fx c:control_collection s:shard1 r:core_node1 x:collection1] o.a.s.r.ManagedResourceStorage Loaded null at path _rest_managed.json using ZooKeeperStorageIO:path=/configs/conf1
   [junit4]   2> 1460357 INFO  (coreLoadExecutor-5125-thread-1-processing-n:127.0.0.1:33924_aqa%2Fx) [n:127.0.0.1:33924_aqa%2Fx c:control_collection s:shard1 r:core_node1 x:collection1] o.a.s.r.RestManager Initializing 0 registered ManagedResources
   [junit4]   2> 1460358 INFO  (coreLoadExecutor-5125-thread-1-processing-n:127.0.0.1:33924_aqa%2Fx) [n:127.0.0.1:33924_aqa%2Fx c:control_collection s:shard1 r:core_node1 x:collection1] o.a.s.h.ReplicationHandler Commits will be reserved for  10000
   [junit4]   2> 1460358 INFO  (searcherExecutor-5126-thread-1-processing-n:127.0.0.1:33924_aqa%2Fx x:collection1 s:shard1 c:control_collection r:core_node1) [n:127.0.0.1:33924_aqa%2Fx c:control_collection s:shard1 r:core_node1 x:collection1] o.a.s.c.SolrCore [collection1] Registered new searcher Searcher@1abfed[collection1] main{ExitableDirectoryReader(UninvertingDirectoryReader())}
   [junit4]   2> 1460358 INFO  (coreLoadExecutor-5125-thread-1-processing-n:127.0.0.1:33924_aqa%2Fx) [n:127.0.0.1:33924_aqa%2Fx c:control_collection s:shard1 r:core_node1 x:collection1] o.a.s.u.UpdateLog Looking up max value of version field to seed version buckets
   [junit4]   2> 1460358 INFO  (coreLoadExecutor-5125-thread-1-processing-n:127.0.0.1:33924_aqa%2Fx) [n:127.0.0.1:33924_aqa%2Fx c:control_collection s:shard1 r:core_node1 x:collection1] o.a.s.u.VersionInfo Refreshing highest value of _version_ for 65536 version buckets from index
   [junit4]   2> 1460358 INFO  (coreLoadExecutor-5125-thread-1-processing-n:127.0.0.1:33924_aqa%2Fx) [n:127.0.0.1:33924_aqa%2Fx c:control_collection s:shard1 r:core_node1 x:collection1] o.a.s.u.VersionInfo No terms found for _version_, cannot seed version bucket highest value from index
   [junit4]   2> 1460358 INFO  (coreLoadExecutor-5125-thread-1-processing-n:127.0.0.1:33924_aqa%2Fx) [n:127.0.0.1:33924_aqa%2Fx c:control_collection s:shard1 r:core_node1 x:collection1] o.a.s.u.UpdateLog Could not find max version in index or recent updates, using new clock 1541008191599411200
   [junit4]   2> 1460360 INFO  (coreLoadExecutor-5125-thread-1-processing-n:127.0.0.1:33924_aqa%2Fx) [n:127.0.0.1:33924_aqa%2Fx c:control_collection s:shard1 r:core_node1 x:collection1] o.a.s.u.UpdateLog Took 1.0ms to seed version buckets with highest version 1541008191599411200
   [junit4]   2> 1460360 INFO  (coreLoadExecutor-5125-thread-1-processing-n:127.0.0.1:33924_aqa%2Fx) [n:127.0.0.1:33924_aqa%2Fx c:control_collection s:shard1 r:core_node1 x:collection1] o.a.s.c.ZkController watch zkdir /configs/conf1
   [junit4]   2> 1460360 INFO  (coreLoadExecutor-5125-thread-1-processing-n:127.0.0.1:33924_aqa%2Fx) [n:127.0.0.1:33924_aqa%2Fx c:control_collection s:shard1 r:core_node1 x:collection1] o.a.s.c.CoreContainer registering core: collection1
   [junit4]   2> 1460360 INFO  (coreZkRegister-5119-thread-1-processing-n:127.0.0.1:33924_aqa%2Fx x:collection1 s:shard1 c:control_collection r:core_node1) [n:127.0.0.1:33924_aqa%2Fx c:control_collection s:shard1 r:core_node1 x:collection1] o.a.s.c.ZkController Register replica - core:collection1 address:http://127.0.0.1:33924/aqa/x collection:control_collection shard:shard1
   [junit4]   2> 1460361 INFO  (coreZkRegister-5119-thread-1-processing-n:127.0.0.1:33924_aqa%2Fx x:collection1 s:shard1 c:control_collection r:core_node1) [n:127.0.0.1:33924_aqa%2Fx c:control_collection s:shard1 r:core_node1 x:collection1] o.a.s.c.c.SolrZkClient makePath: /collections/control_collection/leader_elect/shard1/election
   [junit4]   2> 1460361 INFO  (coreZkRegister-5119-thread-1-processing-n:127.0.0.1:33924_aqa%2Fx x:collection1 s:shard1 c:control_collection r:core_node1) [n:127.0.0.1:33924_aqa%2Fx c:control_collection s:shard1 r:core_node1 x:collection1] o.a.s.c.LeaderElector Joined leadership election with path: /collections/control_collection/leader_elect/shard1/election/96313011887407108-core_node1-n_0000000000
   [junit4]   2> 1460362 INFO  (coreZkRegister-5119-thread-1-processing-n:127.0.0.1:33924_aqa%2Fx x:collection1 s:shard1 c:control_collection r:core_node1) [n:127.0.0.1:33924_aqa%2Fx c:control_collection s:shard1 r:core_node1 x:collection1] o.a.s.c.ShardLeaderElectionContext Running the leader process for shard=shard1 and weAreReplacement=false and leaderVoteWait=10000
   [junit4]   2> 1460362 INFO  (coreZkRegister-5119-thread-1-processing-n:127.0.0.1:33924_aqa%2Fx x:collection1 s:shard1 c:control_collection r:core_node1) [n:127.0.0.1:33924_aqa%2Fx c:control_collection s:shard1 r:core_node1 x:collection1] o.a.s.c.ShardLeaderElectionContext Enough replicas found to continue.
   [junit4]   2> 1460363 INFO  (coreZkRegister-5119-thread-1-processing-n:127.0.0.1:33924_aqa%2Fx x:collection1 s:shard1 c:control_collection r:core_node1) [n:127.0.0.1:33924_aqa%2Fx c:control_collection s:shard1 r:core_node1 x:collection1] o.a.s.c.ShardLeaderElectionContext I may be the new leader - try and sync
   [junit4]   2> 1460363 INFO  (coreZkRegister-5119-thread-1-processing-n:127.0.0.1:33924_aqa%2Fx x:collection1 s:shard1 c:control_collection r:core_node1) [n:127.0.0.1:33924_aqa%2Fx c:control_collection s:shard1 r:core_node1 x:collection1] o.a.s.c.SyncStrategy Sync replicas to http://127.0.0.1:33924/aqa/x/collection1/
   [junit4]   2> 1460363 INFO  (OverseerStateUpdate-96313011887407108-127.0.0.1:33924_aqa%2Fx-n_0000000000) [n:127.0.0.1:33924_aqa%2Fx    ] o.a.s.c.Overseer processMessage: queueSize: 1, message = {
   [junit4]   2>   "operation":"leader",
   [junit4]   2>   "shard":"shard1",
   [junit4]   2>   "collection":"control_collection"} current state version: 1
   [junit4]   2> 1460363 INFO  (coreZkRegister-5119-thread-1-processing-n:127.0.0.1:33924_aqa%2Fx x:collection1 s:shard1 c:control_collection r:core_node1) [n:127.0.0.1:33924_aqa%2Fx c:control_collection s:shard1 r:core_node1 x:collection1] o.a.s.c.SyncStrategy Sync Success - now sync replicas to me
   [junit4]   2> 1460363 INFO  (coreZkRegister-5119-thread-1-processing-n:127.0.0.1:33924_aqa%2Fx x:collection1 s:shard1 c:control_collection r:core_node1) [n:127.0.0.1:33924_aqa%2Fx c:control_collection s:shard1 r:core_node1 x:collection1] o.a.s.c.SyncStrategy http://127.0.0.1:33924/aqa/x/collection1/ has no replicas
   [junit4]   2> 1460363 INFO  (coreZkRegister-5119-thread-1-processing-n:127.0.0.1:33924_aqa%2Fx x:collection1 s:shard1 c:control_collection r:core_node1) [n:127.0.0.1:33924_aqa%2Fx c:control_collection s:shard1 r:core_node1 x:collection1] o.a.s.c.c.SolrZkClient makePath: /collections/control_collection/leaders/shard1
   [junit4]   2> 1460364 INFO  (coreZkRegister-5119-thread-1-processing-n:127.0.0.1:33924_aqa%2Fx x:collection1 s:shard1 c:control_collection r:core_node1) [n:127.0.0.1:33924_aqa%2Fx c:control_collection s:shard1 r:core_node1 x:collection1] o.a.s.c.ShardLeaderElectionContextBase Creating leader registration node /collections/control_collection/leaders/shard1/leader after winning as /collections/control_collection/leader_elect/shard1/election/96313011887407108-core_node1-n_0000000000
   [junit4]   2> 1460364 INFO  (coreZkRegister-5119-thread-1-processing-n:127.0.0.1:33924_aqa%2Fx x:collection1 s:shard1 c:control_collection r:core_node1) [n:127.0.0.1:33924_aqa%2Fx c:control_collection s:shard1 r:core_node1 x:collection1] o.a.s.c.ShardLeaderElectionContext I am the new leader: http://127.0.0.1:33924/aqa/x/collection1/ shard1
   [junit4]   2> 1460364 INFO  (OverseerStateUpdate-96313011887407108-127.0.0.1:33924_aqa%2Fx-n_0000000000) [n:127.0.0.1:33924_aqa%2Fx    ] o.a.s.c.Overseer processMessage: queueSize: 1, message = {
   [junit4]   2>   "operation":"leader",
   [junit4]   2>   "shard":"shard1",
   [junit4]   2>   "collection":"control_collection",
   [junit4]   2>   "base_url":"http://127.0.0.1:33924/aqa/x",
   [junit4]   2>   "core":"collection1",
   [junit4]   2>   "state":"active"} current state version: 1
   [junit4]   2> 1460465 INFO  (zkCallback-1833-thread-2-processing-n:127.0.0.1:33924_aqa%2Fx) [n:127.0.0.1:33924_aqa%2Fx    ] o.a.s.c.c.ZkStateReader A cluster state change: [WatchedEvent state:SyncConnected type:NodeDataChanged path:/clusterstate.json], has occurred - updating... (live nodes size: [1])
   [junit4]   2> 1460515 INFO  (coreZkRegister-5119-thread-1-processing-n:127.0.0.1:33924_aqa%2Fx x:collection1 s:shard1 c:control_collection r:core_node1) [n:127.0.0.1:33924_aqa%2Fx c:control_collection s:shard1 r:core_node1 x:collection1] o.a.s.c.ZkController We are http://127.0.0.1:33924/aqa/x/collection1/ and leader is http://127.0.0.1:33924/aqa/x/collection1/
   [junit4]   2> 1460515 INFO  (coreZkRegister-5119-thread-1-processing-n:127.0.0.1:33924_aqa%2Fx x:collection1 s:shard1 c:control_collection r:core_node1) [n:127.0.0.1:33924_aqa%2Fx c:control_collection s:shard1 r:core_node1 x:collection1] o.a.s.c.ZkController No LogReplay needed for core=collection1 baseURL=http://127.0.0.1:33924/aqa/x
   [junit4]   2> 1460515 INFO  (coreZkRegister-5119-thread-1-processing-n:127.0.0.1:33924_aqa%2Fx x:collection1 s:shard1 c:control_collection r:core_node1) [n:127.0.0.1:33924_aqa%2Fx c:control_collection s:shard1 r:core_node1 x:collection1] o.a.s.c.ZkController I am the leader, no recovery necessary
   [junit4]   2> 1460515 INFO  (coreZkRegister-5119-thread-1-processing-n:127.0.0.1:33924_aqa%2Fx x:collection1 s:shard1 c:control_collection r:core_node1) [n:127.0.0.1:33924_aqa%2Fx c:control_collection s:shard1 r:core_node1 x:collection1] o.a.s.c.ZkController publishing state=active
   [junit4]   2> 1460515 INFO  (coreZkRegister-5119-thread-1-processing-n:127.0.0.1:33924_aqa%2Fx x:collection1 s:shard1 c:control_collection r:core_node1) [n:127.0.0.1:33924_aqa%2Fx c:control_collection s:shard1 r:core_node1 x:collection1] o.a.s.c.ZkController numShards not found on descriptor - reading it from system property
   [junit4]   2> 1460516 INFO  (coreZkRegister-5119-thread-1-processing-n:127.0.0.1:33924_aqa%2Fx x:collection1 s:shard1 c:control_collection r:core_node1) [n:127.0.0.1:33924_aqa%2Fx c:control_collection s:shard1 r:core_node1 x:collection1] o.a.s.c.c.ZkStateReader Checking legacy cluster state for collection control_collection
   [junit4]   2> 1460516 INFO  (OverseerStateUpdate-96313011887407108-127.0.0.1:33924_aqa%2Fx-n_0000000000) [n:127.0.0.1:33924_aqa%2Fx    ] o.a.s.c.Overseer processMessage: queueSize: 1, message = {
   [junit4]   2>   "core":"collection1",
   [junit4]   2>   "core_node_name":"core_node1",
   [junit4]   2>   "roles":null,
   [junit4]   2>   "base_url":"http://127.0.0.1:33924/aqa/x",
   [junit4]   2>   "node_name":"127.0.0.1:33924_aqa%2Fx",
   [junit4]   2>   "numShards":"1",
   [junit4]   2>   "state":"active",
   [junit4]   2>   "shard":"shard1",
   [junit4]   2>   "collection":"control_collection",
   [junit4]   2>   "operation":"state"} current state version: 2
   [junit4]   2> 1460516 INFO  (OverseerStateUpdate-96313011887407108-127.0.0.1:33924_aqa%2Fx-n_0000000000) [n:127.0.0.1:33924_aqa%2Fx    ] o.a.s.c.o.ReplicaMutator Update state numShards=1 message={
   [junit4]   2>   "core":"collection1",
   [junit4]   2>   "core_node_name":"core_node1",
   [junit4]   2>   "roles":null,
   [junit4]   2>   "base_url":"http://127.0.0.1:33924/aqa/x",
   [junit4]   2>   "node_name":"127.0.0.1:33924_aqa%2Fx",
   [junit4]   2>   "numShards":"1",
   [junit4]   2>   "state":"active",
   [junit4]   2>   "shard":"shard1",
   [junit4]   2>   "collection":"control_collection",
   [junit4]   2>   "operation":"state"}
   [junit4]   2> 1460617 INFO  (zkCallback-1833-thread-2-processing-n:127.0.0.1:33924_aqa%2Fx) [n:127.0.0.1:33924_aqa%2Fx    ] o.a.s.c.c.ZkStateReader A cluster state change: [WatchedEvent state:SyncConnected type:NodeDataChanged path:/clusterstate.json], has occurred - updating... (live nodes size: [1])
   [junit4]   2> 1460741 INFO  (TEST-ForceLeaderTest.testLastPublishedStateIsActive-seed#[F083F3B8492D27DE]) [    ] o.a.s.c.c.SolrZkClient Using default ZkCredentialsProvider
   [junit4]   2> 1460741 INFO  (TEST-ForceLeaderTest.testLastPublishedStateIsActive-seed#[F083F3B8492D27DE]) [    ] o.a.s.c.c.ConnectionManager Waiting for client to connect to ZooKeeper
   [junit4]   2> 1460742 INFO  (zkCallback-1837-thread-1) [    ] o.a.s.c.c.ConnectionManager Watcher org.apache.solr.common.cloud.ConnectionManager@1e57172 name:ZooKeeperConnection Watcher:127.0.0.1:41566/solr got event WatchedEvent state:SyncConnected type:None path:null path:null type:None
   [junit4]   2> 1460742 INFO  (TEST-ForceLeaderTest.testLastPublishedStateIsActive-seed#[F083F3B8492D27DE]) [    ] o.a.s.c.c.ConnectionManager Client is connected to ZooKeeper
   [junit4]   2> 1460742 INFO  (TEST-ForceLeaderTest.testLastPublishedStateIsActive-seed#[F083F3B8492D27DE]) [    ] o.a.s.c.c.SolrZkClient Using default ZkACLProvider
   [junit4]   2> 1460742 INFO  (TEST-ForceLeaderTest.testLastPublishedStateIsActive-seed#[F083F3B8492D27DE]) [    ] o.a.s.c.c.ZkStateReader Updating cluster state from ZooKeeper... 
   [junit4]   2> 1460742 INFO  (TEST-ForceLeaderTest.testLastPublishedStateIsActive-seed#[F083F3B8492D27DE]) [    ] o.a.s.c.c.ZkStateReader Loaded empty cluster properties
   [junit4]   2> 1460743 INFO  (TEST-ForceLeaderTest.testLastPublishedStateIsActive-seed#[F083F3B8492D27DE]) [    ] o.a.s.c.c.ZkStateReader Updated live nodes from ZooKeeper... (0) -> (1)
   [junit4]   2> 1460743 INFO  (TEST-ForceLeaderTest.testLastPublishedStateIsActive-seed#[F083F3B8492D27DE]) [    ] o.a.s.c.ChaosMonkey monkey: init - expire sessions:false cause connection loss:false
   [junit4]   2> 1460800 INFO  (TEST-ForceLeaderTest.testLastPublishedStateIsActive-seed#[F083F3B8492D27DE]) [    ] o.a.s.SolrTestCaseJ4 Writing core.properties file to /home/jenkins/workspace/Lucene-Solr-6.x-Linux/solr/build/solr-core/test/J1/temp/solr.cloud.ForceLeaderTest_F083F3B8492D27DE-001/shard-1-001/cores/collection1
   [junit4]   2> 1460801 INFO  (TEST-ForceLeaderTest.testLastPublishedStateIsActive-seed#[F083F3B8492D27DE]) [    ] o.a.s.c.AbstractFullDistribZkTestBase create jetty 1 in directory /home/jenkins/workspace/Lucene-Solr-6.x-Linux/solr/build/solr-core/test/J1/temp/solr.cloud.ForceLeaderTest_F083F3B8492D27DE-001/shard-1-001
   [junit4]   2> 1460801 INFO  (TEST-ForceLeaderTest.testLastPublishedStateIsActive-seed#[F083F3B8492D27DE]) [    ] o.e.j.s.Server jetty-9.3.8.v20160314
   [junit4]   2> 1460802 INFO  (TEST-ForceLeaderTest.testLastPublishedStateIsActive-seed#[F083F3B8492D27DE]) [    ] o.e.j.s.h.ContextHandler Started o.e.j.s.ServletContextHandler@af3b1d{/aqa/x,null,AVAILABLE}
   [junit4]   2> 1460802 INFO  (TEST-ForceLeaderTest.testLastPublishedStateIsActive-seed#[F083F3B8492D27DE]) [    ] o.e.j.s.ServerConnector Started ServerConnector@265ce6{HTTP/1.1,[http/1.1]}{127.0.0.1:43072}
   [junit4]   2> 1460802 INFO  (TEST-ForceLeaderTest.testLastPublishedStateIsActive-seed#[F083F3B8492D27DE]) [    ] o.e.j.s.Server Started @1462335ms
   [junit4]   2> 1460802 INFO  (TEST-ForceLeaderTest.testLastPublishedStateIsActive-seed#[F083F3B8492D27DE]) [    ] o.a.s.c.s.e.JettySolrRunner Jetty properties: {solr.data.dir=/home/jenkins/workspace/Lucene-Solr-6.x-Linux/solr/build/solr-core/test/J1/temp/solr.cloud.ForceLeaderTest_F083F3B8492D27DE-001/tempDir-001/jetty1, solrconfig=solrconfig.xml, hostContext=/aqa/x, hostPort=41218, coreRootDirectory=/home/jenkins/workspace/Lucene-Solr-6.x-Linux/solr/build/solr-core/test/J1/temp/solr.cloud.ForceLeaderTest_F083F3B8492D27DE-001/shard-1-001/cores}
   [junit4]   2> 1460802 INFO  (TEST-ForceLeaderTest.testLastPublishedStateIsActive-seed#[F083F3B8492D27DE]) [    ] o.a.s.s.SolrDispatchFilter SolrDispatchFilter.init(): sun.misc.Launcher$AppClassLoader@1d16e93
   [junit4]   2> 1460803 INFO  (TEST-ForceLeaderTest.testLastPublishedStateIsActive-seed#[F083F3B8492D27DE]) [    ] o.a.s.c.SolrResourceLoader new SolrResourceLoader for directory: '/home/jenkins/workspace/Lucene-Solr-6.x-Linux/solr/build/solr-core/test/J1/temp/solr.cloud.ForceLeaderTest_F083F3B8492D27DE-001/shard-1-001'
   [junit4]   2> 1460803 INFO  (TEST-ForceLeaderTest.testLastPublishedStateIsActive-seed#[F083F3B8492D27DE]) [    ] o.a.s.c.SolrResourceLoader JNDI not configured for solr (NoInitialContextEx)
   [junit4]   2> 1460803 INFO  (TEST-ForceLeaderTest.testLastPublishedStateIsActive-seed#[F083F3B8492D27DE]) [    ] o.a.s.c.SolrResourceLoader solr home defaulted to 'solr/' (could not find system property or JNDI)
   [junit4]   2> 1460803 INFO  (TEST-ForceLeaderTest.testLastPublishedStateIsActive-seed#[F083F3B8492D27DE]) [    ] o.a.s.c.c.SolrZkClient Using default ZkCredentialsProvider
   [junit4]   2> 1460803 INFO  (TEST-ForceLeaderTest.testLastPublishedStateIsActive-seed#[F083F3B8492D27DE]) [    ] o.a.s.c.c.ConnectionManager Waiting for client to connect to ZooKeeper
   [junit4]   2> 1460804 INFO  (zkCallback-1838-thread-1) [    ] o.a.s.c.c.ConnectionManager Watcher org.apache.solr.common.cloud.ConnectionManager@9a0429 name:ZooKeeperConnection Watcher:127.0.0.1:41566/solr got event WatchedEvent state:SyncConnected type:None path:null path:null type:None
   [junit4]   2> 1460804 INFO  (TEST-ForceLeaderTest.testLastPublishedStateIsActive-seed#[F083F3B8492D27DE]) [    ] o.a.s.c.c.ConnectionManager Client is connected to ZooKeeper
   [junit4]   2> 1460804 INFO  (TEST-ForceLeaderTest.testLastPublishedStateIsActive-seed#[F083F3B8492D27DE]) [    ] o.a.s.c.c.SolrZkClient Using default ZkACLProvider
   [junit4]   2> 1460804 INFO  (TEST-ForceLeaderTest.testLastPublishedStateIsActive-seed#[F083F3B8492D27DE]) [    ] o.a.s.s.SolrDispatchFilter Loading solr.xml from SolrHome (not found in ZooKeeper)
   [junit4]   2> 1460804 INFO  (TEST-ForceLeaderTest.testLastPublishedStateIsActive-seed#[F083F3B8492D27DE]) [    ] o.a.s.c.SolrXmlConfig Loading container configuration from /home/jenkins/workspace/Lucene-Solr-6.x-Linux/solr/build/solr-core/test/J1/temp/solr.cloud.ForceLeaderTest_F083F3B8492D27DE-001/shard-1-001/solr.xml
   [junit4]   2> 1460808 INFO  (TEST-ForceLeaderTest.testLastPublishedStateIsActive-seed#[F083F3B8492D27DE]) [    ] o.a.s.c.CorePropertiesLocator Config-defined core root directory: /home/jenkins/workspace/Lucene-Solr-6.x-Linux/solr/build/solr-core/test/J1/temp/solr.cloud.ForceLeaderTest_F083F3B8492D27DE-001/shard-1-001/cores
   [junit4]   2> 1460808 INFO  (TEST-ForceLeaderTest.testLastPublishedStateIsActive-seed#[F083F3B8492D27DE]) [    ] o.a.s.c.CoreContainer New CoreContainer 25512977
   [junit4]   2> 1460808 INFO  (TEST-ForceLeaderTest.testLastPublishedStateIsActive-seed#[F083F3B8492D27DE]) [    ] o.a.s.c.CoreContainer Loading cores into CoreContainer [instanceDir=/home/jenkins/workspace/Lucene-Solr-6.x-Linux/solr/build/solr-core/test/J1/temp/solr.cloud.ForceLeaderTest_F083F3B8492D27DE-001/shard-1-001]
   [junit4]   2> 1460808 WARN  (TEST-ForceLeaderTest.testLastPublishedStateIsActive-seed#[F083F3B8492D27DE]) [    ] o.a.s.c.CoreContainer Couldn't add files from /home/jenkins/workspace/Lucene-Solr-6.x-Linux/solr/build/solr-core/test/J1/temp/solr.cloud.ForceLeaderTest_F083F3B8492D27DE-001/shard-1-001/lib to classpath: /home/jenkins/workspace/Lucene-Solr-6.x-Linux/solr/build/solr-core/test/J1/temp/solr.cloud.ForceLeaderTest_F083F3B8492D27DE-001/shard-1-001/lib
   [junit4]   2> 1460808 INFO  (TEST-ForceLeaderTest.testLastPublishedStateIsActive-seed#[F083F3B8492D27DE]) [    ] o.a.s.h.c.HttpShardHandlerFactory created with socketTimeout : 90000,urlScheme : ,connTimeout : 15000,maxConnectionsPerHost : 20,maxConnections : 10000,corePoolSize : 0,maximumPoolSize : 2147483647,maxThreadIdleTime : 5,sizeOfQueue : -1,fairnessPolicy : false,useRetries : false,connectionsEvictorSleepDelay : 5000,maxConnectionIdleTime : 40000,
   [junit4]   2> 1460809 INFO  (TEST-ForceLeaderTest.testLastPublishedStateIsActive-seed#[F083F3B8492D27DE]) [    ] o.a.s.u.UpdateShardHandler Creating UpdateShardHandler HTTP client with params: socketTimeout=340000&connTimeout=45000&retry=true
   [junit4]   2> 1460809 INFO  (TEST-ForceLeaderTest.testLastPublishedStateIsActive-seed#[F083F3B8492D27DE]) [    ] o.a.s.l.LogWatcher SLF4J impl is org.slf4j.impl.Log4jLoggerFactory
   [junit4]   2> 1460809 INFO  (TEST-ForceLeaderTest.testLastPublishedStateIsActive-seed#[F083F3B8492D27DE]) [    ] o.a.s.l.LogWatcher Registering Log Listener [Log4j (org.slf4j.impl.Log4jLoggerFactory)]
   [junit4]   2> 1460809 INFO  (TEST-ForceLeaderTest.testLastPublishedStateIsActive-seed#[F083F3B8492D27DE]) [    ] o.a.s.c.ZkContainer Zookeeper client=127.0.0.1:41566/solr
   [junit4]   2> 1460809 INFO  (TEST-ForceLeaderTest.testLastPublishedStateIsActive-seed#[F083F3B8492D27DE]) [    ] o.a.s.c.ZkController zkHost includes chroot
   [junit4]   2> 1460809 INFO  (TEST-ForceLeaderTest.testLastPublishedStateIsActive-seed#[F083F3B8492D27DE]) [    ] o.a.s.c.c.SolrZkClient Using default ZkCredentialsProvider
   [junit4]   2> 1460810 INFO  (TEST-ForceLeaderTest.testLastPublishedStateIsActive-seed#[F083F3B8492D27DE]) [    ] o.a.s.c.c.ConnectionManager Waiting for client to connect to ZooKeeper
   [junit4]   2> 1460810 INFO  (zkCallback-1841-thread-1) [    ] o.a.s.c.c.ConnectionManager Watcher org.apache.solr.common.cloud.ConnectionManager@1bd884c name:ZooKeeperConnection Watcher:127.0.0.1:41566 got event WatchedEvent state:SyncConnected type:None path:null path:null type:None
   [junit4]   2> 1460810 INFO  (TEST-ForceLeaderTest.testLastPublishedStateIsActive-seed#[F083F3B8492D27DE]) [    ] o.a.s.c.c.ConnectionManager Client is connected to ZooKeeper
   [junit4]   2> 1460811 INFO  (TEST-ForceLeaderTest.testLastPublishedStateIsActive-seed#[F083F3B8492D27DE]) [    ] o.a.s.c.c.SolrZkClient Using default ZkACLProvider
   [junit4]   2> 1460811 INFO  (TEST-ForceLeaderTest.testLastPublishedStateIsActive-seed#[F083F3B8492D27DE]) [n:127.0.0.1:41218_aqa%2Fx    ] o.a.s.c.ZkController Added new OnReconnect listener org.apache.solr.cloud.ZkController$$Lambda$64/30421038@1678eda
   [junit4]   2> 1460811 INFO  (TEST-ForceLeaderTest.testLastPublishedStateIsActive-seed#[F083F3B8492D27DE]) [n:127.0.0.1:41218_aqa%2Fx    ] o.a.s.c.c.ConnectionManager Waiting for client to connect to ZooKeeper
   [junit4]   2> 1460812 INFO  (zkCallback-1842-thread-1-processing-n:127.0.0.1:41218_aqa%2Fx) [n:127.0.0.1:41218_aqa%2Fx    ] o.a.s.c.c.ConnectionManager Watcher org.apache.solr.common.cloud.ConnectionManager@1b4d4a1 name:ZooKeeperConnection Watcher:127.0.0.1:41566/solr got event WatchedEvent state:SyncConnected type:None path:null path:null type:None
   [junit4]   2> 1460812 INFO  (TEST-ForceLeaderTest.testLastPublishedStateIsActive-seed#[F083F3B8492D27DE]) [n:127.0.0.1:41218_aqa%2Fx    ] o.a.s.c.c.ConnectionManager Client is connected to ZooKeeper
   [junit4]   2> 1460814 INFO  (TEST-ForceLeaderTest.testLastPublishedStateIsActive-seed#[F083F3B8492D27DE]) [n:127.0.0.1:41218_aqa%2Fx    ] o.a.s.c.c.ZkStateReader Updating cluster state from ZooKeeper... 
   [junit4]   2> 1460814 INFO  (TEST-ForceLeaderTest.testLastPublishedStateIsActive-seed#[F083F3B8492D27DE]) [n:127.0.0.1:41218_aqa%2Fx    ] o.a.s.c.c.ZkStateReader Loaded empty cluster properties
   [junit4]   2> 1460814 INFO  (TEST-ForceLeaderTest.testLastPublishedStateIsActive-seed#[F083F3B8492D27DE]) [n:127.0.0.1:41218_aqa%2Fx    ] o.a.s.c.c.ZkStateReader Updated live nodes from ZooKeeper... (0) -> (1)
   [junit4]   2> 1460815 INFO  (TEST-ForceLeaderTest.testLastPublishedStateIsActive-seed#[F083F3B8492D27DE]) [n:127.0.0.1:41218_aqa%2Fx    ] o.a.s.c.Overseer Overseer (id=null) closing
   [junit4]   2> 1460815 INFO  (TEST-ForceLeaderTest.testLastPublishedStateIsActive-seed#[F083F3B8492D27DE]) [n:127.0.0.1:41218_aqa%2Fx    ] o.a.s.c.LeaderElector Joined leadership election with path: /overseer_elect/election/96313011887407112-127.0.0.1:41218_aqa%2Fx-n_0000000001
   [junit4]   2> 1460815 INFO  (TEST-ForceLeaderTest.testLastPublishedStateIsActive-seed#[F083F3B8492D27DE]) [n:127.0.0.1:41218_aqa%2Fx    ] o.a.s.c.LeaderElector Watching path /overseer_elect/election/96313011887407108-127.0.0.1:33924_aqa%2Fx-n_0000000000 to know if I could be the leader
   [junit4]   2> 1460815 INFO  (TEST-ForceLeaderTest.testLastPublishedStateIsActive-seed#[F083F3B8492D27DE]) [n:127.0.0.1:41218_aqa%2Fx    ] o.a.s.c.ZkController Publish node=127.0.0.1:41218_aqa%2Fx as DOWN
   [junit4]   2> 1460816 INFO  (TEST-ForceLeaderTest.testLastPublishedStateIsActive-seed#[F083F3B8492D27DE]) [n:127.0.0.1:41218_aqa%2Fx    ] o.a.s.c.ZkController Register node as live in ZooKeeper:/live_nodes/127.0.0.1:41218_aqa%2Fx
   [junit4]   2> 1460816 INFO  (TEST-ForceLeaderTest.testLastPublishedStateIsActive-seed#[F083F3B8492D27DE]) [n:127.0.0.1:41218_aqa%2Fx    ] o.a.s.c.c.SolrZkClient makePath: /live_nodes/127.0.0.1:41218_aqa%2Fx
   [junit4]   2> 1460816 INFO  (OverseerStateUpdate-96313011887407108-127.0.0.1:33924_aqa%2Fx-n_0000000000) [n:127.0.0.1:33924_aqa%2Fx    ] o.a.s.c.Overseer processMessage: queueSize: 1, message = {
   [junit4]   2>   "operation":"downnode",
   [junit4]   2>   "node_name":"127.0.0.1:41218_aqa%2Fx"} current state version: 3
   [junit4]   2> 1460816 INFO  (OverseerStateUpdate-96313011887407108-127.0.0.1:33924_aqa%2Fx-n_0000000000) [n:127.0.0.1:33924_aqa%2Fx    ] o.a.s.c.o.NodeMutator DownNode state invoked for node: 127.0.0.1:41218_aqa%2Fx
   [junit4]   2> 1460816 INFO  (zkCallback-1833-thread-2-processing-n:127.0.0.1:33924_aqa%2Fx) [n:127.0.0.1:33924_aqa%2Fx    ] o.a.s.c.c.ZkStateReader A live node change: [WatchedEvent state:SyncConnected type:NodeChildrenChanged path:/live_nodes], has occurred - updating... (live nodes size: [1])
   [junit4]   2> 1460816 INFO  (zkCallback-1842-thread-1-processing-n:127.0.0.1:41218_aqa%2Fx) [n:127.0.0.1:41218_aqa%2Fx    ] o.a.s.c.c.ZkStateReader A live node change: [WatchedEvent state:SyncConnected type:NodeChildrenChanged path:/live_nodes], has occurred - updating... (live nodes size: [1])
   [junit4]   2> 1460816 INFO  (zkCallback-1837-thread-1) [    ] o.a.s.c.c.ZkStateReader A live node change: [WatchedEvent state:SyncConnected type:NodeChildrenChanged path:/live_nodes], has occurred - updating... (live nodes size: [1])
   [junit4]   2> 1460816 INFO  (zkCallback-1833-thread-2-processing-n:127.0.0.1:33924_aqa%2Fx) [n:127.0.0.1:33924_aqa%2Fx    ] o.a.s.c.c.ZkStateReader Updated live nodes from ZooKeeper... (1) -> (2)
   [junit4]   2> 1460816 INFO  (zkCallback-1842-thread-1-processing-n:127.0.0.1:41218_aqa%2Fx) [n:127.0.0.1:41218_aqa%2Fx    ] o.a.s.c.c.ZkStateReader Updated live nodes from ZooKeeper... (1) -> (2)
   [junit4]   2> 1460817 INFO  (zkCallback-1837-thread-1) [    ] o.a.s.c.c.ZkStateReader Updated live nodes from ZooKeeper... (1) -> (2)
   [junit4]   2> 1460835 INFO  (TEST-ForceLeaderTest.testLastPublishedStateIsActive-seed#[F083F3B8492D27DE]) [n:127.0.0.1:41218_aqa%2Fx    ] o.a.s.c.CoreContainer Security conf doesn't exist. Skipping setup for authorization module.
   [junit4]   2> 1460835 INFO  (TEST-ForceLeaderTest.testLastPublishedStateIsActive-seed#[F083F3B8492D27DE]) [n:127.0.0.1:41218_aqa%2Fx    ] o.a.s.c.CoreContainer No authentication plugin used.
   [junit4]   2> 1460835 INFO  (TEST-ForceLeaderTest.testLastPublishedStateIsActive-seed#[F083F3B8492D27DE]) [n:127.0.0.1:41218_aqa%2Fx    ] o.a.s.c.CorePropertiesLocator Looking for core definitions underneath /home/jenkins/workspace/Lucene-Solr-6.x-Linux/solr/build/solr-core/test/J1/temp/solr.cloud.ForceLeaderTest_F083F3B8492D27DE-001/shard-1-001/cores
   [junit4]   2> 1460836 INFO  (TEST-ForceLeaderTest.testLastPublishedStateIsActive-seed#[F083F3B8492D27DE]) [n:127.0.0.1:41218_aqa%2Fx    ] o.a.s.c.CoreDescriptor Created CoreDescriptor: {name=collection1, config=solrconfig.xml, transient=false, schema=schema.xml, loadOnStartup=true, configSetProperties=configsetprops.json, collection=collection1, coreNodeName=, dataDir=data/, shard=}
   [junit4]   2> 1460836 INFO  (TEST-ForceLeaderTest.testLastPublishedStateIsActive-seed#[F083F3B8492D27DE]) [n:127.0.0.1:41218_aqa%2Fx    ] o.a.s.c.CorePropertiesLocator Found core collection1 in /home/jenkins/workspace/Lucene-Solr-6.x-Linux/solr/build/solr-core/test/J1/temp/solr.cloud.ForceLeaderTest_F083F3B8492D27DE-001/shard-1-001/cores/collection1
   [junit4]   2> 1460836 INFO  (TEST-ForceLeaderTest.testLastPublishedStateIsActive-seed#[F083F3B8492D27DE]) [n:127.0.0.1:41218_aqa%2Fx    ] o.a.s.c.CorePropertiesLocator Found 1 core definitions
   [junit4]   2> 1460836 INFO  (coreLoadExecutor-5136-thread-1-processing-n:127.0.0.1:41218_aqa%2Fx) [n:127.0.0.1:41218_aqa%2Fx c:collection1   x:collection1] o.a.s.c.ZkController publishing state=down
   [junit4]   2> 1460836 INFO  (TEST-ForceLeaderTest.testLastPublishedStateIsActive-seed#[F083F3B8492D27DE]) [n:127.0.0.1:41218_aqa%2Fx    ] o.a.s.s.SolrDispatchFilter user.dir=/home/jenkins/workspace/Lucene-Solr-6.x-Linux/solr/build/solr-core/test/J1
   [junit4]   2> 1460836 INFO  (TEST-ForceLeaderTest.testLastPublishedStateIsActive-seed#[F083F3B8492D27DE]) [n:127.0.0.1:41218_aqa%2Fx    ] o.a.s.s.SolrDispatchFilter SolrDispatchFilter.init() done
   [junit4]   2> 1460836 INFO  (coreLoadExecutor-5136-thread-1-processing-n:127.0.0.1:41218_aqa%2Fx) [n:127.0.0.1:41218_aqa%2Fx c:collection1   x:collection1] o.a.s.c.ZkController numShards not found on descriptor - reading it from system property
   [junit4]   2> 1460837 INFO  (coreLoadExecutor-5136-thread-1-processing-n:127.0.0.1:41218_aqa%2Fx) [n:127.0.0.1:41218_aqa%2Fx c:collection1   x:collection1] o.a.s.c.ZkController Collection collection1 not visible yet, but flagging it so a watch is registered when it becomes visible
   [junit4]   2> 1460837 INFO  (OverseerStateUpdate-96313011887407108-127.0.0.1:33924_aqa%2Fx-n_0000000000) [n:127.0.0.1:33924_aqa%2Fx    ] o.a.s.c.Overseer processMessage: queueSize: 1, message = {
   [junit4]   2>   "core":"collection1",
   [junit4]   2>   "roles":null,
   [junit4]   2>   "base_url":"http://127.0.0.1:41218/aqa/x",
   [junit4]   2>   "node_name":"127.0.0.1:41218_aqa%2Fx",
   [junit4]   2>   "numShards":"2",
   [junit4]   2>   "state":"down",
   [junit4]   2>   "shard":null,
   [junit4]   2>   "collection":"collection1",
   [junit4]   2>   "operation":"state"} current state version: 3
   [junit4]   2> 1460837 INFO  (OverseerStateUpdate-96313011887407108-127.0.0.1:33924_aqa%2Fx-n_0000000000) [n:127.0.0.1:33924_aqa%2Fx    ] o.a.s.c.o.ReplicaMutator Update state numShards=2 message={
   [junit4]   2>   "core":"collection1",
   [junit4]   2>   "roles":null,
   [junit4]   2>   "base_url":"http://127.0.0.1:41218/aqa/x",
   [junit4]   2>   "node_name":"127.0.0.1:41218_aqa%2Fx",
   [junit4]   2>   "numShards":"2",
   [junit4]   2>   "state":"down",
   [junit4]   2>   "shard":null,
   [junit4]   2>   "collection":"collection1",
   [junit4]   2>   "operation":"state"}
   [junit4]   2> 1460837 INFO  (coreLoadExecutor-5136-thread-1-processing-n:127.0.0.1:41218_aqa%2Fx) [n:127.0.0.1:41218_aqa%2Fx c:collection1   x:collection1] o.a.s.c.c.ZkStateReader Deleting data for [collection1]
   [junit4]   2> 1460837 INFO  (OverseerStateUpdate-96313011887407108-127.0.0.1:33924_aqa%2Fx-n_0000000000) [n:127.0.0.1:33924_aqa%2Fx    ] o.a.s.c.o.ClusterStateMutator building a new cName: collection1
   [junit4]   2> 1460837 INFO  (OverseerStateUpdate-96313011887407108-127.0.0.1:33924_aqa%2Fx-n_0000000000) [n:127.0.0.1:33924_aqa%2Fx    ] o.a.s.c.o.ReplicaMutator Assigning new node to shard shard=shard2
   [junit4]   2> 1460837 INFO  (coreLoadExecutor-5136-thread-1-processing-n:127.0.0.1:41218_aqa%2Fx) [n:127.0.0.1:41218_aqa%2Fx c:collection1   x:collection1] o.a.s.c.ZkController look for our core node name
   [junit4]   2> 1460938 INFO  (zkCallback-1833-thread-2-processing-n:127.0.0.1:33924_aqa%2Fx) [n:127.0.0.1:33924_aqa%2Fx    ] o.a.s.c.c.ZkStateReader A cluster state change: [WatchedEvent state:SyncConnected type:NodeDataChanged path:/clusterstate.json], has occurred - updating... (live nodes size: [2])
   [junit4]   2> 1460938 INFO  (zkCallback-1842-thread-1-processing-n:127.0.0.1:41218_aqa%2Fx) [n:127.0.0.1:41218_aqa%2Fx    ] o.a.s.c.c.ZkStateReader A cluster state change: [WatchedEvent state:SyncConnected type:NodeDataChanged path:/clusterstate.json], has occurred - updating... (live nodes size: [2])
   [junit4]   2> 1460938 INFO  (zkCallback-1837-thread-1) [    ] o.a.s.c.c.ZkStateReader A cluster state change: [WatchedEvent state:SyncConnected type:NodeDataChanged path:/clusterstate.json], has occurred - updating... (live nodes size: [2])
   [junit4]   2> 1461837 INFO  (coreLoadExecutor-5136-thread-1-processing-n

[...truncated too long message...]

, target: http://127.0.0.1:37879/aqa/x
   [junit4]   2> 1561771 WARN  (TEST-ForceLeaderTest.testReplicasInLIRNoLeader-seed#[F083F3B8492D27DE]) [    ] o.a.s.c.SocketProxy Closing 1 connections to: http://127.0.0.1:33527/aqa/x, target: http://127.0.0.1:33585/aqa/x
   [junit4]   2> 1561772 WARN  (TEST-ForceLeaderTest.testReplicasInLIRNoLeader-seed#[F083F3B8492D27DE]) [    ] o.a.s.c.SocketProxy Closing 1 connections to: http://127.0.0.1:46704/aqa/x, target: http://127.0.0.1:34898/aqa/x
   [junit4]   2> 1561772 WARN  (TEST-ForceLeaderTest.testReplicasInLIRNoLeader-seed#[F083F3B8492D27DE]) [    ] o.a.s.c.SocketProxy Closing 0 connections to: http://127.0.0.1:33550/aqa/x, target: http://127.0.0.1:42597/aqa/x
   [junit4]   2> NOTE: reproduce with: ant test  -Dtestcase=ForceLeaderTest -Dtests.method=testReplicasInLIRNoLeader -Dtests.seed=F083F3B8492D27DE -Dtests.multiplier=3 -Dtests.slow=true -Dtests.locale=en-IN -Dtests.timezone=PRC -Dtests.asserts=true -Dtests.file.encoding=UTF-8
   [junit4] ERROR   28.5s J1 | ForceLeaderTest.testReplicasInLIRNoLeader <<<
   [junit4]    > Throwable #1: org.apache.solr.client.solrj.SolrServerException: org.apache.solr.client.solrj.SolrServerException: No live SolrServers available to handle this request:[http://127.0.0.1:33550/aqa/x/forceleader_test_collection_shard1_replica1]
   [junit4]    > 	at __randomizedtesting.SeedInfo.seed([F083F3B8492D27DE:1614C77870AFDEBF]:0)
   [junit4]    > 	at org.apache.solr.client.solrj.impl.CloudSolrClient.directUpdate(CloudSolrClient.java:774)
   [junit4]    > 	at org.apache.solr.client.solrj.impl.CloudSolrClient.sendRequest(CloudSolrClient.java:1172)
   [junit4]    > 	at org.apache.solr.client.solrj.impl.CloudSolrClient.requestWithRetryOnStaleState(CloudSolrClient.java:1061)
   [junit4]    > 	at org.apache.solr.client.solrj.impl.CloudSolrClient.request(CloudSolrClient.java:997)
   [junit4]    > 	at org.apache.solr.cloud.AbstractFullDistribZkTestBase.sendDocsWithRetry(AbstractFullDistribZkTestBase.java:753)
   [junit4]    > 	at org.apache.solr.cloud.AbstractFullDistribZkTestBase.sendDocsWithRetry(AbstractFullDistribZkTestBase.java:741)
   [junit4]    > 	at org.apache.solr.cloud.ForceLeaderTest.sendDoc(ForceLeaderTest.java:424)
   [junit4]    > 	at org.apache.solr.cloud.ForceLeaderTest.assertSendDocFails(ForceLeaderTest.java:315)
   [junit4]    > 	at org.apache.solr.cloud.ForceLeaderTest.testReplicasInLIRNoLeader(ForceLeaderTest.java:110)
   [junit4]    > 	at org.apache.solr.BaseDistributedSearchTestCase$ShardsRepeatRule$ShardsFixedStatement.callStatement(BaseDistributedSearchTestCase.java:992)
   [junit4]    > 	at org.apache.solr.BaseDistributedSearchTestCase$ShardsRepeatRule$ShardsStatement.evaluate(BaseDistributedSearchTestCase.java:967)
   [junit4]    > 	at java.lang.Thread.run(Thread.java:745)
   [junit4]    > Caused by: org.apache.solr.client.solrj.SolrServerException: No live SolrServers available to handle this request:[http://127.0.0.1:33550/aqa/x/forceleader_test_collection_shard1_replica1]
   [junit4]    > 	at org.apache.solr.client.solrj.impl.LBHttpSolrClient.request(LBHttpSolrClient.java:383)
   [junit4]    > 	at org.apache.solr.client.solrj.impl.CloudSolrClient.directUpdate(CloudSolrClient.java:768)
   [junit4]    > 	... 49 more
   [junit4]    > Caused by: org.apache.solr.client.solrj.SolrServerException: Server refused connection at: http://127.0.0.1:33550/aqa/x/forceleader_test_collection_shard1_replica1
   [junit4]    > 	at org.apache.solr.client.solrj.impl.HttpSolrClient.executeMethod(HttpSolrClient.java:597)
   [junit4]    > 	at org.apache.solr.client.solrj.impl.HttpSolrClient.request(HttpSolrClient.java:259)
   [junit4]    > 	at org.apache.solr.client.solrj.impl.HttpSolrClient.request(HttpSolrClient.java:248)
   [junit4]    > 	at org.apache.solr.client.solrj.impl.LBHttpSolrClient.doRequest(LBHttpSolrClient.java:403)
   [junit4]    > 	at org.apache.solr.client.solrj.impl.LBHttpSolrClient.request(LBHttpSolrClient.java:372)
   [junit4]    > 	... 50 more
   [junit4]    > Caused by: java.net.ConnectException: Connection refused
   [junit4]    > 	at java.net.PlainSocketImpl.socketConnect(Native Method)
   [junit4]    > 	at java.net.AbstractPlainSocketImpl.doConnect(AbstractPlainSocketImpl.java:350)
   [junit4]    > 	at java.net.AbstractPlainSocketImpl.connectToAddress(AbstractPlainSocketImpl.java:206)
   [junit4]    > 	at java.net.AbstractPlainSocketImpl.connect(AbstractPlainSocketImpl.java:188)
   [junit4]    > 	at java.net.SocksSocketImpl.connect(SocksSocketImpl.java:392)
   [junit4]    > 	at java.net.Socket.connect(Socket.java:589)
   [junit4]    > 	at org.apache.http.conn.scheme.PlainSocketFactory.connectSocket(PlainSocketFactory.java:117)
   [junit4]    > 	at org.apache.http.impl.conn.DefaultClientConnectionOperator.openConnection(DefaultClientConnectionOperator.java:177)
   [junit4]    > 	at org.apache.http.impl.conn.ManagedClientConnectionImpl.open(ManagedClientConnectionImpl.java:304)
   [junit4]    > 	at org.apache.http.impl.client.DefaultRequestDirector.tryConnect(DefaultRequestDirector.java:611)
   [junit4]    > 	at org.apache.http.impl.client.DefaultRequestDirector.execute(DefaultRequestDirector.java:446)
   [junit4]    > 	at org.apache.http.impl.client.AbstractHttpClient.doExecute(AbstractHttpClient.java:882)
   [junit4]    > 	at org.apache.http.impl.client.CloseableHttpClient.execute(CloseableHttpClient.java:82)
   [junit4]    > 	at org.apache.http.impl.client.CloseableHttpClient.execute(CloseableHttpClient.java:107)
   [junit4]    > 	at org.apache.http.impl.client.CloseableHttpClient.execute(CloseableHttpClient.java:55)
   [junit4]    > 	at org.apache.solr.client.solrj.impl.HttpSolrClient.executeMethod(HttpSolrClient.java:495)
   [junit4]    > 	... 54 more
   [junit4]   2> 1561776 INFO  (SUITE-ForceLeaderTest-seed#[F083F3B8492D27DE]-worker) [    ] o.a.s.SolrTestCaseJ4 ###deleteCore
   [junit4]   2> NOTE: leaving temporary files on disk at: /home/jenkins/workspace/Lucene-Solr-6.x-Linux/solr/build/solr-core/test/J1/temp/solr.cloud.ForceLeaderTest_F083F3B8492D27DE-001
   [junit4]   2> NOTE: test params are: codec=CheapBastard, sim=ClassicSimilarity, locale=en-IN, timezone=PRC
   [junit4]   2> NOTE: Linux 4.4.0-31-generic i386/Oracle Corporation 1.8.0_92 (32-bit)/cpus=12,threads=1,free=202489304,total=398278656
   [junit4]   2> NOTE: All tests run in this JVM: [TestImplicitCoreProperties, SolrPluginUtilsTest, TestScoreJoinQPScore, CoreMergeIndexesAdminHandlerTest, TestFastLRUCache, TestSubQueryTransformerDistrib, TestSystemIdResolver, TestSchemaResource, TestStandardQParsers, TestDocTermOrds, TestLFUCache, TestIntervalFaceting, TestWordDelimiterFilterFactory, TestAuthenticationFramework, UniqFieldsUpdateProcessorFactoryTest, ZkStateWriterTest, ConvertedLegacyTest, CollectionsAPIAsyncDistributedZkTest, DistributedFacetPivotLargeTest, BigEndianAscendingWordDeserializerTest, TestExclusionRuleCollectionAccess, TestDFRSimilarityFactory, DistributedQueryComponentOptimizationTest, TestHdfsBackupRestoreCore, SimplePostToolTest, SolrCLIZkUtilsTest, HdfsRestartWhileUpdatingTest, AddBlockUpdateTest, CollectionsAPIDistributedZkTest, DistributedIntervalFacetingTest, TestQuerySenderListener, TestRestoreCore, HdfsChaosMonkeyNothingIsSafeTest, SpatialRPTFieldTypeTest, TestLMJelinekMercerSimilarityFactory, TestCursorMarkWithoutUniqueKey, ChaosMonkeyNothingIsSafeTest, TestOverriddenPrefixQueryForCustomFieldType, TestGraphTermsQParserPlugin, NotRequiredUniqueKeyTest, TestCopyFieldCollectionResource, TestEmbeddedSolrServerConstructors, AliasIntegrationTest, TestLeaderInitiatedRecoveryThread, TestSerializedLuceneMatchVersion, TestTolerantUpdateProcessorRandomCloud, DistribCursorPagingTest, TestHighFrequencyDictionaryFactory, IndexBasedSpellCheckerTest, BJQParserTest, TestFiltering, TestRequestForwarding, DeleteReplicaTest, HLLUtilTest, DistributedMLTComponentTest, BufferStoreTest, OpenExchangeRatesOrgProviderTest, PreAnalyzedUpdateProcessorTest, TestQueryUtils, TestSolrCoreProperties, TestChildDocTransformer, SegmentsInfoRequestHandlerTest, CSVRequestHandlerTest, TestSolrConfigHandler, RankQueryTest, TermVectorComponentTest, SolrIndexConfigTest, TermsComponentTest, HdfsNNFailoverTest, SSLMigrationTest, CustomCollectionTest, TestPartialUpdateDeduplication, TestMiniSolrCloudCluster, TestPKIAuthenticationPlugin, CdcrReplicationHandlerTest, TestHashPartitioner, SpellCheckCollatorTest, RulesTest, SpellCheckComponentTest, TestReloadDeadlock, MBeansHandlerTest, TestUseDocValuesAsStored, FileUtilsTest, TestTrackingShardHandlerFactory, OverseerModifyCollectionTest, TestFieldCacheSanityChecker, TestCloudPivotFacet, TestShortCircuitedRequests, TestFieldTypeCollectionResource, DateRangeFieldTest, TestCodecSupport, CollectionReloadTest, ConfigSetsAPITest, DirectSolrSpellCheckerTest, CachingDirectoryFactoryTest, LeaderInitiatedRecoveryOnShardRestartTest, DOMUtilTest, ChaosMonkeySafeLeaderTest, TestSolrDeletionPolicy2, TestFaceting, ZkControllerTest, TestStressReorder, TestReload, TestStressVersions, DistributedTermsComponentTest, StatsComponentTest, SolrCmdDistributorTest, TestSort, DirectUpdateHandlerTest, TestBadConfig, SoftAutoCommitTest, SuggesterTSTTest, SuggesterTest, TestTrie, SpatialFilterTest, SuggesterWFSTTest, TestCSVLoader, PolyFieldTest, WordBreakSolrSpellCheckerTest, TestPseudoReturnFields, DirectUpdateHandlerOptimizeTest, StatelessScriptUpdateProcessorFactoryTest, SolrInfoMBeanTest, TestQueryTypes, XmlUpdateRequestHandlerTest, DocumentBuilderTest, FastVectorHighlighterTest, TestJmxIntegration, JsonLoaderTest, SOLR749Test, AlternateDirectoryTest, TestSolrIndexConfig, CopyFieldTest, TestStressRecovery, TimeZoneUtilsTest, PluginInfoTest, PrimUtilsTest, TestSolrJ, TestUtils, SliceStateTest, TestHighlightDedupGrouping, TestJettySolrRunner, ActionThrottleTest, CollectionStateFormat2Test, DistributedQueueTest, ForceLeaderTest]
   [junit4] Completed [466/624 (1!)] on J1 in 102.77s, 3 tests, 1 error, 1 skipped <<< FAILURES!

[...truncated 52970 lines...]


Mime
View raw message