lucene-dev mailing list archives

Site index · List index
Message view « Date » · « Thread »
Top « Date » · « Thread »
From Policeman Jenkins Server <jenk...@thetaphi.de>
Subject [JENKINS] Lucene-Solr-6.x-Windows (64bit/jdk1.8.0_92) - Build # 300 - Still Failing!
Date Wed, 06 Jul 2016 23:37:12 GMT
Build: http://jenkins.thetaphi.de/job/Lucene-Solr-6.x-Windows/300/
Java: 64bit/jdk1.8.0_92 -XX:-UseCompressedOops -XX:+UseSerialGC

3 tests failed.
FAILED:  org.apache.solr.cloud.overseer.ZkStateReaderTest.testStateFormatUpdateWithExplicitRefreshLazy

Error Message:
Could not find collection : c1

Stack Trace:
org.apache.solr.common.SolrException: Could not find collection : c1
	at __randomizedtesting.SeedInfo.seed([A43467B507B06DCD:CF7BC7C87EBFB0F7]:0)
	at org.apache.solr.common.cloud.ClusterState.getCollection(ClusterState.java:192)
	at org.apache.solr.cloud.overseer.ZkStateReaderTest.testStateFormatUpdate(ZkStateReaderTest.java:129)
	at org.apache.solr.cloud.overseer.ZkStateReaderTest.testStateFormatUpdateWithExplicitRefreshLazy(ZkStateReaderTest.java:48)
	at sun.reflect.NativeMethodAccessorImpl.invoke0(Native Method)
	at sun.reflect.NativeMethodAccessorImpl.invoke(NativeMethodAccessorImpl.java:62)
	at sun.reflect.DelegatingMethodAccessorImpl.invoke(DelegatingMethodAccessorImpl.java:43)
	at java.lang.reflect.Method.invoke(Method.java:498)
	at com.carrotsearch.randomizedtesting.RandomizedRunner.invoke(RandomizedRunner.java:1764)
	at com.carrotsearch.randomizedtesting.RandomizedRunner$8.evaluate(RandomizedRunner.java:871)
	at com.carrotsearch.randomizedtesting.RandomizedRunner$9.evaluate(RandomizedRunner.java:907)
	at com.carrotsearch.randomizedtesting.RandomizedRunner$10.evaluate(RandomizedRunner.java:921)
	at com.carrotsearch.randomizedtesting.rules.SystemPropertiesRestoreRule$1.evaluate(SystemPropertiesRestoreRule.java:57)
	at org.apache.lucene.util.TestRuleSetupTeardownChained$1.evaluate(TestRuleSetupTeardownChained.java:49)
	at org.apache.lucene.util.AbstractBeforeAfterRule$1.evaluate(AbstractBeforeAfterRule.java:45)
	at org.apache.lucene.util.TestRuleThreadAndTestName$1.evaluate(TestRuleThreadAndTestName.java:48)
	at org.apache.lucene.util.TestRuleIgnoreAfterMaxFailures$1.evaluate(TestRuleIgnoreAfterMaxFailures.java:64)
	at org.apache.lucene.util.TestRuleMarkFailure$1.evaluate(TestRuleMarkFailure.java:47)
	at com.carrotsearch.randomizedtesting.rules.StatementAdapter.evaluate(StatementAdapter.java:36)
	at com.carrotsearch.randomizedtesting.ThreadLeakControl$StatementRunner.run(ThreadLeakControl.java:367)
	at com.carrotsearch.randomizedtesting.ThreadLeakControl.forkTimeoutingTask(ThreadLeakControl.java:809)
	at com.carrotsearch.randomizedtesting.ThreadLeakControl$3.evaluate(ThreadLeakControl.java:460)
	at com.carrotsearch.randomizedtesting.RandomizedRunner.runSingleTest(RandomizedRunner.java:880)
	at com.carrotsearch.randomizedtesting.RandomizedRunner$5.evaluate(RandomizedRunner.java:781)
	at com.carrotsearch.randomizedtesting.RandomizedRunner$6.evaluate(RandomizedRunner.java:816)
	at com.carrotsearch.randomizedtesting.RandomizedRunner$7.evaluate(RandomizedRunner.java:827)
	at com.carrotsearch.randomizedtesting.rules.StatementAdapter.evaluate(StatementAdapter.java:36)
	at com.carrotsearch.randomizedtesting.rules.SystemPropertiesRestoreRule$1.evaluate(SystemPropertiesRestoreRule.java:57)
	at org.apache.lucene.util.AbstractBeforeAfterRule$1.evaluate(AbstractBeforeAfterRule.java:45)
	at com.carrotsearch.randomizedtesting.rules.StatementAdapter.evaluate(StatementAdapter.java:36)
	at org.apache.lucene.util.TestRuleStoreClassName$1.evaluate(TestRuleStoreClassName.java:41)
	at com.carrotsearch.randomizedtesting.rules.NoShadowingOrOverridesOnMethodsRule$1.evaluate(NoShadowingOrOverridesOnMethodsRule.java:40)
	at com.carrotsearch.randomizedtesting.rules.NoShadowingOrOverridesOnMethodsRule$1.evaluate(NoShadowingOrOverridesOnMethodsRule.java:40)
	at com.carrotsearch.randomizedtesting.rules.StatementAdapter.evaluate(StatementAdapter.java:36)
	at com.carrotsearch.randomizedtesting.rules.StatementAdapter.evaluate(StatementAdapter.java:36)
	at com.carrotsearch.randomizedtesting.rules.StatementAdapter.evaluate(StatementAdapter.java:36)
	at org.apache.lucene.util.TestRuleAssertionsRequired$1.evaluate(TestRuleAssertionsRequired.java:53)
	at org.apache.lucene.util.TestRuleMarkFailure$1.evaluate(TestRuleMarkFailure.java:47)
	at org.apache.lucene.util.TestRuleIgnoreAfterMaxFailures$1.evaluate(TestRuleIgnoreAfterMaxFailures.java:64)
	at org.apache.lucene.util.TestRuleIgnoreTestSuites$1.evaluate(TestRuleIgnoreTestSuites.java:54)
	at com.carrotsearch.randomizedtesting.rules.StatementAdapter.evaluate(StatementAdapter.java:36)
	at com.carrotsearch.randomizedtesting.ThreadLeakControl$StatementRunner.run(ThreadLeakControl.java:367)
	at java.lang.Thread.run(Thread.java:745)


FAILED:  junit.framework.TestSuite.org.apache.solr.handler.TestReplicationHandler

Error Message:
ObjectTracker found 1 object(s) that were not released!!! [NRTCachingDirectory]

Stack Trace:
java.lang.AssertionError: ObjectTracker found 1 object(s) that were not released!!! [NRTCachingDirectory]
	at __randomizedtesting.SeedInfo.seed([A43467B507B06DCD]:0)
	at org.junit.Assert.fail(Assert.java:93)
	at org.junit.Assert.assertTrue(Assert.java:43)
	at org.junit.Assert.assertNull(Assert.java:551)
	at org.apache.solr.SolrTestCaseJ4.teardownTestCases(SolrTestCaseJ4.java:258)
	at sun.reflect.GeneratedMethodAccessor21.invoke(Unknown Source)
	at sun.reflect.DelegatingMethodAccessorImpl.invoke(DelegatingMethodAccessorImpl.java:43)
	at java.lang.reflect.Method.invoke(Method.java:498)
	at com.carrotsearch.randomizedtesting.RandomizedRunner.invoke(RandomizedRunner.java:1764)
	at com.carrotsearch.randomizedtesting.RandomizedRunner$7.evaluate(RandomizedRunner.java:834)
	at com.carrotsearch.randomizedtesting.rules.StatementAdapter.evaluate(StatementAdapter.java:36)
	at com.carrotsearch.randomizedtesting.rules.SystemPropertiesRestoreRule$1.evaluate(SystemPropertiesRestoreRule.java:57)
	at org.apache.lucene.util.AbstractBeforeAfterRule$1.evaluate(AbstractBeforeAfterRule.java:45)
	at com.carrotsearch.randomizedtesting.rules.StatementAdapter.evaluate(StatementAdapter.java:36)
	at org.apache.lucene.util.TestRuleStoreClassName$1.evaluate(TestRuleStoreClassName.java:41)
	at com.carrotsearch.randomizedtesting.rules.NoShadowingOrOverridesOnMethodsRule$1.evaluate(NoShadowingOrOverridesOnMethodsRule.java:40)
	at com.carrotsearch.randomizedtesting.rules.NoShadowingOrOverridesOnMethodsRule$1.evaluate(NoShadowingOrOverridesOnMethodsRule.java:40)
	at com.carrotsearch.randomizedtesting.rules.StatementAdapter.evaluate(StatementAdapter.java:36)
	at com.carrotsearch.randomizedtesting.rules.StatementAdapter.evaluate(StatementAdapter.java:36)
	at com.carrotsearch.randomizedtesting.rules.StatementAdapter.evaluate(StatementAdapter.java:36)
	at org.apache.lucene.util.TestRuleAssertionsRequired$1.evaluate(TestRuleAssertionsRequired.java:53)
	at org.apache.lucene.util.TestRuleMarkFailure$1.evaluate(TestRuleMarkFailure.java:47)
	at org.apache.lucene.util.TestRuleIgnoreAfterMaxFailures$1.evaluate(TestRuleIgnoreAfterMaxFailures.java:64)
	at org.apache.lucene.util.TestRuleIgnoreTestSuites$1.evaluate(TestRuleIgnoreTestSuites.java:54)
	at com.carrotsearch.randomizedtesting.rules.StatementAdapter.evaluate(StatementAdapter.java:36)
	at com.carrotsearch.randomizedtesting.ThreadLeakControl$StatementRunner.run(ThreadLeakControl.java:367)
	at java.lang.Thread.run(Thread.java:745)


FAILED:  org.apache.solr.cloud.TestLocalFSCloudBackupRestore.test

Error Message:
Error from server at http://127.0.0.1:65312/solr: The backup directory already exists: file:///C:/Users/jenkins/workspace/Lucene-Solr-6.x-Windows/solr/build/solr-core/test/J1/temp/solr.cloud.TestLocalFSCloudBackupRestore_A43467B507B06DCD-001/tempDir-002/mytestbackup/

Stack Trace:
org.apache.solr.client.solrj.impl.HttpSolrClient$RemoteSolrException: Error from server at http://127.0.0.1:65312/solr: The backup directory already exists: file:///C:/Users/jenkins/workspace/Lucene-Solr-6.x-Windows/solr/build/solr-core/test/J1/temp/solr.cloud.TestLocalFSCloudBackupRestore_A43467B507B06DCD-001/tempDir-002/mytestbackup/
	at __randomizedtesting.SeedInfo.seed([A43467B507B06DCD:2C60586FA94C0035]:0)
	at org.apache.solr.client.solrj.impl.HttpSolrClient.executeMethod(HttpSolrClient.java:590)
	at org.apache.solr.client.solrj.impl.HttpSolrClient.request(HttpSolrClient.java:259)
	at org.apache.solr.client.solrj.impl.HttpSolrClient.request(HttpSolrClient.java:248)
	at org.apache.solr.client.solrj.impl.LBHttpSolrClient.doRequest(LBHttpSolrClient.java:403)
	at org.apache.solr.client.solrj.impl.LBHttpSolrClient.request(LBHttpSolrClient.java:356)
	at org.apache.solr.client.solrj.impl.CloudSolrClient.sendRequest(CloudSolrClient.java:1228)
	at org.apache.solr.client.solrj.impl.CloudSolrClient.requestWithRetryOnStaleState(CloudSolrClient.java:998)
	at org.apache.solr.client.solrj.impl.CloudSolrClient.request(CloudSolrClient.java:934)
	at org.apache.solr.client.solrj.SolrRequest.process(SolrRequest.java:149)
	at org.apache.solr.client.solrj.SolrRequest.process(SolrRequest.java:166)
	at org.apache.solr.cloud.AbstractCloudBackupRestoreTestCase.testBackupAndRestore(AbstractCloudBackupRestoreTestCase.java:207)
	at org.apache.solr.cloud.AbstractCloudBackupRestoreTestCase.test(AbstractCloudBackupRestoreTestCase.java:127)
	at sun.reflect.NativeMethodAccessorImpl.invoke0(Native Method)
	at sun.reflect.NativeMethodAccessorImpl.invoke(NativeMethodAccessorImpl.java:62)
	at sun.reflect.DelegatingMethodAccessorImpl.invoke(DelegatingMethodAccessorImpl.java:43)
	at java.lang.reflect.Method.invoke(Method.java:498)
	at com.carrotsearch.randomizedtesting.RandomizedRunner.invoke(RandomizedRunner.java:1764)
	at com.carrotsearch.randomizedtesting.RandomizedRunner$8.evaluate(RandomizedRunner.java:871)
	at com.carrotsearch.randomizedtesting.RandomizedRunner$9.evaluate(RandomizedRunner.java:907)
	at com.carrotsearch.randomizedtesting.RandomizedRunner$10.evaluate(RandomizedRunner.java:921)
	at com.carrotsearch.randomizedtesting.rules.SystemPropertiesRestoreRule$1.evaluate(SystemPropertiesRestoreRule.java:57)
	at org.apache.lucene.util.TestRuleSetupTeardownChained$1.evaluate(TestRuleSetupTeardownChained.java:49)
	at org.apache.lucene.util.AbstractBeforeAfterRule$1.evaluate(AbstractBeforeAfterRule.java:45)
	at org.apache.lucene.util.TestRuleThreadAndTestName$1.evaluate(TestRuleThreadAndTestName.java:48)
	at org.apache.lucene.util.TestRuleIgnoreAfterMaxFailures$1.evaluate(TestRuleIgnoreAfterMaxFailures.java:64)
	at org.apache.lucene.util.TestRuleMarkFailure$1.evaluate(TestRuleMarkFailure.java:47)
	at com.carrotsearch.randomizedtesting.rules.StatementAdapter.evaluate(StatementAdapter.java:36)
	at com.carrotsearch.randomizedtesting.ThreadLeakControl$StatementRunner.run(ThreadLeakControl.java:367)
	at com.carrotsearch.randomizedtesting.ThreadLeakControl.forkTimeoutingTask(ThreadLeakControl.java:809)
	at com.carrotsearch.randomizedtesting.ThreadLeakControl$3.evaluate(ThreadLeakControl.java:460)
	at com.carrotsearch.randomizedtesting.RandomizedRunner.runSingleTest(RandomizedRunner.java:880)
	at com.carrotsearch.randomizedtesting.RandomizedRunner$5.evaluate(RandomizedRunner.java:781)
	at com.carrotsearch.randomizedtesting.RandomizedRunner$6.evaluate(RandomizedRunner.java:816)
	at com.carrotsearch.randomizedtesting.RandomizedRunner$7.evaluate(RandomizedRunner.java:827)
	at com.carrotsearch.randomizedtesting.rules.StatementAdapter.evaluate(StatementAdapter.java:36)
	at com.carrotsearch.randomizedtesting.rules.SystemPropertiesRestoreRule$1.evaluate(SystemPropertiesRestoreRule.java:57)
	at org.apache.lucene.util.AbstractBeforeAfterRule$1.evaluate(AbstractBeforeAfterRule.java:45)
	at com.carrotsearch.randomizedtesting.rules.StatementAdapter.evaluate(StatementAdapter.java:36)
	at org.apache.lucene.util.TestRuleStoreClassName$1.evaluate(TestRuleStoreClassName.java:41)
	at com.carrotsearch.randomizedtesting.rules.NoShadowingOrOverridesOnMethodsRule$1.evaluate(NoShadowingOrOverridesOnMethodsRule.java:40)
	at com.carrotsearch.randomizedtesting.rules.NoShadowingOrOverridesOnMethodsRule$1.evaluate(NoShadowingOrOverridesOnMethodsRule.java:40)
	at com.carrotsearch.randomizedtesting.rules.StatementAdapter.evaluate(StatementAdapter.java:36)
	at com.carrotsearch.randomizedtesting.rules.StatementAdapter.evaluate(StatementAdapter.java:36)
	at com.carrotsearch.randomizedtesting.rules.StatementAdapter.evaluate(StatementAdapter.java:36)
	at org.apache.lucene.util.TestRuleAssertionsRequired$1.evaluate(TestRuleAssertionsRequired.java:53)
	at org.apache.lucene.util.TestRuleMarkFailure$1.evaluate(TestRuleMarkFailure.java:47)
	at org.apache.lucene.util.TestRuleIgnoreAfterMaxFailures$1.evaluate(TestRuleIgnoreAfterMaxFailures.java:64)
	at org.apache.lucene.util.TestRuleIgnoreTestSuites$1.evaluate(TestRuleIgnoreTestSuites.java:54)
	at com.carrotsearch.randomizedtesting.rules.StatementAdapter.evaluate(StatementAdapter.java:36)
	at com.carrotsearch.randomizedtesting.ThreadLeakControl$StatementRunner.run(ThreadLeakControl.java:367)
	at java.lang.Thread.run(Thread.java:745)




Build Log:
[...truncated 10746 lines...]
   [junit4] Suite: org.apache.solr.cloud.TestLocalFSCloudBackupRestore
   [junit4]   2> Creating dataDir: C:\Users\jenkins\workspace\Lucene-Solr-6.x-Windows\solr\build\solr-core\test\J1\temp\solr.cloud.TestLocalFSCloudBackupRestore_A43467B507B06DCD-001\init-core-data-001
   [junit4]   2> 189029 INFO  (SUITE-TestLocalFSCloudBackupRestore-seed#[A43467B507B06DCD]-worker) [    ] o.a.s.SolrTestCaseJ4 Randomized ssl (false) and clientAuth (false) via: @org.apache.solr.util.RandomizeSSL(reason=, value=NaN, ssl=NaN, clientAuth=NaN)
   [junit4]   2> 189032 INFO  (SUITE-TestLocalFSCloudBackupRestore-seed#[A43467B507B06DCD]-worker) [    ] o.a.s.c.ZkTestServer STARTING ZK TEST SERVER
   [junit4]   2> 189032 INFO  (Thread-328) [    ] o.a.s.c.ZkTestServer client port:0.0.0.0/0.0.0.0:0
   [junit4]   2> 189032 INFO  (Thread-328) [    ] o.a.s.c.ZkTestServer Starting server
   [junit4]   2> 189132 INFO  (SUITE-TestLocalFSCloudBackupRestore-seed#[A43467B507B06DCD]-worker) [    ] o.a.s.c.ZkTestServer start zk server on port:65302
   [junit4]   2> 189132 INFO  (SUITE-TestLocalFSCloudBackupRestore-seed#[A43467B507B06DCD]-worker) [    ] o.a.s.c.c.SolrZkClient Using default ZkCredentialsProvider
   [junit4]   2> 189133 INFO  (SUITE-TestLocalFSCloudBackupRestore-seed#[A43467B507B06DCD]-worker) [    ] o.a.s.c.c.ConnectionManager Waiting for client to connect to ZooKeeper
   [junit4]   2> 189142 INFO  (zkCallback-233-thread-1) [    ] o.a.s.c.c.ConnectionManager Watcher org.apache.solr.common.cloud.ConnectionManager@2cb8e00e name:ZooKeeperConnection Watcher:127.0.0.1:65302 got event WatchedEvent state:SyncConnected type:None path:null path:null type:None
   [junit4]   2> 189142 INFO  (SUITE-TestLocalFSCloudBackupRestore-seed#[A43467B507B06DCD]-worker) [    ] o.a.s.c.c.ConnectionManager Client is connected to ZooKeeper
   [junit4]   2> 189143 INFO  (SUITE-TestLocalFSCloudBackupRestore-seed#[A43467B507B06DCD]-worker) [    ] o.a.s.c.c.SolrZkClient Using default ZkACLProvider
   [junit4]   2> 189143 INFO  (SUITE-TestLocalFSCloudBackupRestore-seed#[A43467B507B06DCD]-worker) [    ] o.a.s.c.c.SolrZkClient makePath: /solr/solr.xml
   [junit4]   2> 189154 INFO  (jetty-launcher-232-thread-1) [    ] o.e.j.s.Server jetty-9.3.8.v20160314
   [junit4]   2> 189155 INFO  (jetty-launcher-232-thread-2) [    ] o.e.j.s.Server jetty-9.3.8.v20160314
   [junit4]   2> 189156 INFO  (jetty-launcher-232-thread-2) [    ] o.e.j.s.h.ContextHandler Started o.e.j.s.ServletContextHandler@2469d66a{/solr,null,AVAILABLE}
   [junit4]   2> 189157 INFO  (jetty-launcher-232-thread-1) [    ] o.e.j.s.h.ContextHandler Started o.e.j.s.ServletContextHandler@5f95c5c5{/solr,null,AVAILABLE}
   [junit4]   2> 189157 INFO  (jetty-launcher-232-thread-2) [    ] o.e.j.s.ServerConnector Started ServerConnector@fdd7690{HTTP/1.1,[http/1.1]}{127.0.0.1:65308}
   [junit4]   2> 189157 INFO  (jetty-launcher-232-thread-2) [    ] o.e.j.s.Server Started @194930ms
   [junit4]   2> 189157 INFO  (jetty-launcher-232-thread-2) [    ] o.a.s.c.s.e.JettySolrRunner Jetty properties: {hostContext=/solr, hostPort=65308}
   [junit4]   2> 189157 INFO  (jetty-launcher-232-thread-2) [    ] o.a.s.s.SolrDispatchFilter SolrDispatchFilter.init(): sun.misc.Launcher$AppClassLoader@73d16e93
   [junit4]   2> 189157 INFO  (jetty-launcher-232-thread-1) [    ] o.e.j.s.ServerConnector Started ServerConnector@5698651e{HTTP/1.1,[http/1.1]}{127.0.0.1:65312}
   [junit4]   2> 189157 INFO  (jetty-launcher-232-thread-2) [    ] o.a.s.c.SolrResourceLoader new SolrResourceLoader for directory: 'C:\Users\jenkins\workspace\Lucene-Solr-6.x-Windows\solr\build\solr-core\test\J1\temp\solr.cloud.TestLocalFSCloudBackupRestore_A43467B507B06DCD-001\tempDir-001\node2'
   [junit4]   2> 189158 INFO  (jetty-launcher-232-thread-2) [    ] o.a.s.c.SolrResourceLoader JNDI not configured for solr (NoInitialContextEx)
   [junit4]   2> 189158 INFO  (jetty-launcher-232-thread-2) [    ] o.a.s.c.SolrResourceLoader solr home defaulted to 'solr/' (could not find system property or JNDI)
   [junit4]   2> 189158 INFO  (jetty-launcher-232-thread-1) [    ] o.e.j.s.Server Started @194931ms
   [junit4]   2> 189158 INFO  (jetty-launcher-232-thread-1) [    ] o.a.s.c.s.e.JettySolrRunner Jetty properties: {hostContext=/solr, hostPort=65312}
   [junit4]   2> 189160 INFO  (jetty-launcher-232-thread-1) [    ] o.a.s.s.SolrDispatchFilter SolrDispatchFilter.init(): sun.misc.Launcher$AppClassLoader@73d16e93
   [junit4]   2> 189160 INFO  (jetty-launcher-232-thread-1) [    ] o.a.s.c.SolrResourceLoader new SolrResourceLoader for directory: 'C:\Users\jenkins\workspace\Lucene-Solr-6.x-Windows\solr\build\solr-core\test\J1\temp\solr.cloud.TestLocalFSCloudBackupRestore_A43467B507B06DCD-001\tempDir-001\node1'
   [junit4]   2> 189160 INFO  (jetty-launcher-232-thread-1) [    ] o.a.s.c.SolrResourceLoader JNDI not configured for solr (NoInitialContextEx)
   [junit4]   2> 189160 INFO  (jetty-launcher-232-thread-2) [    ] o.a.s.c.c.SolrZkClient Using default ZkCredentialsProvider
   [junit4]   2> 189160 INFO  (jetty-launcher-232-thread-1) [    ] o.a.s.c.SolrResourceLoader solr home defaulted to 'solr/' (could not find system property or JNDI)
   [junit4]   2> 189160 INFO  (jetty-launcher-232-thread-2) [    ] o.a.s.c.c.ConnectionManager Waiting for client to connect to ZooKeeper
   [junit4]   2> 189164 INFO  (jetty-launcher-232-thread-1) [    ] o.a.s.c.c.SolrZkClient Using default ZkCredentialsProvider
   [junit4]   2> 189167 INFO  (jetty-launcher-232-thread-1) [    ] o.a.s.c.c.ConnectionManager Waiting for client to connect to ZooKeeper
   [junit4]   2> 189173 INFO  (zkCallback-234-thread-1) [    ] o.a.s.c.c.ConnectionManager Watcher org.apache.solr.common.cloud.ConnectionManager@13ee7fc5 name:ZooKeeperConnection Watcher:127.0.0.1:65302/solr got event WatchedEvent state:SyncConnected type:None path:null path:null type:None
   [junit4]   2> 189173 INFO  (jetty-launcher-232-thread-2) [    ] o.a.s.c.c.ConnectionManager Client is connected to ZooKeeper
   [junit4]   2> 189173 INFO  (jetty-launcher-232-thread-2) [    ] o.a.s.c.c.SolrZkClient Using default ZkACLProvider
   [junit4]   2> 189174 INFO  (jetty-launcher-232-thread-2) [    ] o.a.s.s.SolrDispatchFilter solr.xml found in ZooKeeper. Loading...
   [junit4]   2> 189174 INFO  (zkCallback-235-thread-1) [    ] o.a.s.c.c.ConnectionManager Watcher org.apache.solr.common.cloud.ConnectionManager@e572cad name:ZooKeeperConnection Watcher:127.0.0.1:65302/solr got event WatchedEvent state:SyncConnected type:None path:null path:null type:None
   [junit4]   2> 189175 INFO  (jetty-launcher-232-thread-1) [    ] o.a.s.c.c.ConnectionManager Client is connected to ZooKeeper
   [junit4]   2> 189175 INFO  (jetty-launcher-232-thread-1) [    ] o.a.s.c.c.SolrZkClient Using default ZkACLProvider
   [junit4]   2> 189176 INFO  (jetty-launcher-232-thread-1) [    ] o.a.s.s.SolrDispatchFilter solr.xml found in ZooKeeper. Loading...
   [junit4]   2> 189202 INFO  (jetty-launcher-232-thread-1) [    ] o.a.s.c.CorePropertiesLocator Config-defined core root directory: C:\Users\jenkins\workspace\Lucene-Solr-6.x-Windows\solr\build\solr-core\test\J1\temp\solr.cloud.TestLocalFSCloudBackupRestore_A43467B507B06DCD-001\tempDir-001\node1\.
   [junit4]   2> 189204 INFO  (jetty-launcher-232-thread-1) [    ] o.a.s.c.CoreContainer New CoreContainer 1780363661
   [junit4]   2> 189204 INFO  (jetty-launcher-232-thread-2) [    ] o.a.s.c.CorePropertiesLocator Config-defined core root directory: C:\Users\jenkins\workspace\Lucene-Solr-6.x-Windows\solr\build\solr-core\test\J1\temp\solr.cloud.TestLocalFSCloudBackupRestore_A43467B507B06DCD-001\tempDir-001\node2\.
   [junit4]   2> 189204 INFO  (jetty-launcher-232-thread-1) [    ] o.a.s.c.CoreContainer Loading cores into CoreContainer [instanceDir=C:\Users\jenkins\workspace\Lucene-Solr-6.x-Windows\solr\build\solr-core\test\J1\temp\solr.cloud.TestLocalFSCloudBackupRestore_A43467B507B06DCD-001\tempDir-001\node1]
   [junit4]   2> 189204 INFO  (jetty-launcher-232-thread-2) [    ] o.a.s.c.CoreContainer New CoreContainer 853125540
   [junit4]   2> 189204 INFO  (jetty-launcher-232-thread-2) [    ] o.a.s.c.CoreContainer Loading cores into CoreContainer [instanceDir=C:\Users\jenkins\workspace\Lucene-Solr-6.x-Windows\solr\build\solr-core\test\J1\temp\solr.cloud.TestLocalFSCloudBackupRestore_A43467B507B06DCD-001\tempDir-001\node2]
   [junit4]   2> 189204 WARN  (jetty-launcher-232-thread-1) [    ] o.a.s.c.CoreContainer Couldn't add files from C:\Users\jenkins\workspace\Lucene-Solr-6.x-Windows\solr\build\solr-core\test\J1\temp\solr.cloud.TestLocalFSCloudBackupRestore_A43467B507B06DCD-001\tempDir-001\node1\lib to classpath: C:\Users\jenkins\workspace\Lucene-Solr-6.x-Windows\solr\build\solr-core\test\J1\temp\solr.cloud.TestLocalFSCloudBackupRestore_A43467B507B06DCD-001\tempDir-001\node1\lib
   [junit4]   2> 189204 WARN  (jetty-launcher-232-thread-2) [    ] o.a.s.c.CoreContainer Couldn't add files from C:\Users\jenkins\workspace\Lucene-Solr-6.x-Windows\solr\build\solr-core\test\J1\temp\solr.cloud.TestLocalFSCloudBackupRestore_A43467B507B06DCD-001\tempDir-001\node2\lib to classpath: C:\Users\jenkins\workspace\Lucene-Solr-6.x-Windows\solr\build\solr-core\test\J1\temp\solr.cloud.TestLocalFSCloudBackupRestore_A43467B507B06DCD-001\tempDir-001\node2\lib
   [junit4]   2> 189204 INFO  (jetty-launcher-232-thread-1) [    ] o.a.s.h.c.HttpShardHandlerFactory created with socketTimeout : 90000,urlScheme : ,connTimeout : 15000,maxConnectionsPerHost : 20,maxConnections : 10000,corePoolSize : 0,maximumPoolSize : 2147483647,maxThreadIdleTime : 5,sizeOfQueue : -1,fairnessPolicy : false,useRetries : false,
   [junit4]   2> 189204 INFO  (jetty-launcher-232-thread-2) [    ] o.a.s.h.c.HttpShardHandlerFactory created with socketTimeout : 90000,urlScheme : ,connTimeout : 15000,maxConnectionsPerHost : 20,maxConnections : 10000,corePoolSize : 0,maximumPoolSize : 2147483647,maxThreadIdleTime : 5,sizeOfQueue : -1,fairnessPolicy : false,useRetries : false,
   [junit4]   2> 189209 INFO  (jetty-launcher-232-thread-2) [    ] o.a.s.u.UpdateShardHandler Creating UpdateShardHandler HTTP client with params: socketTimeout=340000&connTimeout=45000&retry=true
   [junit4]   2> 189209 INFO  (jetty-launcher-232-thread-1) [    ] o.a.s.u.UpdateShardHandler Creating UpdateShardHandler HTTP client with params: socketTimeout=340000&connTimeout=45000&retry=true
   [junit4]   2> 189210 INFO  (jetty-launcher-232-thread-2) [    ] o.a.s.l.LogWatcher SLF4J impl is org.slf4j.impl.Log4jLoggerFactory
   [junit4]   2> 189210 INFO  (jetty-launcher-232-thread-2) [    ] o.a.s.l.LogWatcher Registering Log Listener [Log4j (org.slf4j.impl.Log4jLoggerFactory)]
   [junit4]   2> 189210 INFO  (jetty-launcher-232-thread-2) [    ] o.a.s.c.ZkContainer Zookeeper client=127.0.0.1:65302/solr
   [junit4]   2> 189210 INFO  (jetty-launcher-232-thread-2) [    ] o.a.s.c.ZkController zkHost includes chroot
   [junit4]   2> 189210 INFO  (jetty-launcher-232-thread-2) [    ] o.a.s.c.c.SolrZkClient Using default ZkCredentialsProvider
   [junit4]   2> 189211 INFO  (jetty-launcher-232-thread-1) [    ] o.a.s.l.LogWatcher SLF4J impl is org.slf4j.impl.Log4jLoggerFactory
   [junit4]   2> 189212 INFO  (jetty-launcher-232-thread-1) [    ] o.a.s.l.LogWatcher Registering Log Listener [Log4j (org.slf4j.impl.Log4jLoggerFactory)]
   [junit4]   2> 189212 INFO  (jetty-launcher-232-thread-1) [    ] o.a.s.c.ZkContainer Zookeeper client=127.0.0.1:65302/solr
   [junit4]   2> 189212 INFO  (jetty-launcher-232-thread-1) [    ] o.a.s.c.ZkController zkHost includes chroot
   [junit4]   2> 189212 INFO  (jetty-launcher-232-thread-1) [    ] o.a.s.c.c.SolrZkClient Using default ZkCredentialsProvider
   [junit4]   2> 189213 INFO  (jetty-launcher-232-thread-2) [    ] o.a.s.c.c.ConnectionManager Waiting for client to connect to ZooKeeper
   [junit4]   2> 189214 INFO  (jetty-launcher-232-thread-1) [    ] o.a.s.c.c.ConnectionManager Waiting for client to connect to ZooKeeper
   [junit4]   2> 189217 INFO  (zkCallback-240-thread-1) [    ] o.a.s.c.c.ConnectionManager Watcher org.apache.solr.common.cloud.ConnectionManager@61908fc7 name:ZooKeeperConnection Watcher:127.0.0.1:65302 got event WatchedEvent state:SyncConnected type:None path:null path:null type:None
   [junit4]   2> 189217 INFO  (jetty-launcher-232-thread-2) [    ] o.a.s.c.c.ConnectionManager Client is connected to ZooKeeper
   [junit4]   2> 189217 INFO  (zkCallback-241-thread-1) [    ] o.a.s.c.c.ConnectionManager Watcher org.apache.solr.common.cloud.ConnectionManager@76dbabed name:ZooKeeperConnection Watcher:127.0.0.1:65302 got event WatchedEvent state:SyncConnected type:None path:null path:null type:None
   [junit4]   2> 189217 INFO  (jetty-launcher-232-thread-1) [    ] o.a.s.c.c.ConnectionManager Client is connected to ZooKeeper
   [junit4]   2> 189217 INFO  (jetty-launcher-232-thread-1) [    ] o.a.s.c.c.SolrZkClient Using default ZkACLProvider
   [junit4]   2> 189217 INFO  (jetty-launcher-232-thread-2) [    ] o.a.s.c.c.SolrZkClient Using default ZkACLProvider
   [junit4]   2> 189220 WARN  (NIOServerCxn.Factory:0.0.0.0/0.0.0.0:0) [    ] o.a.z.s.NIOServerCnxn caught end of stream exception
   [junit4]   2> EndOfStreamException: Unable to read additional data from client sessionid 0x155c268ce5f0004, likely client has closed socket
   [junit4]   2> 	at org.apache.zookeeper.server.NIOServerCnxn.doIO(NIOServerCnxn.java:228)
   [junit4]   2> 	at org.apache.zookeeper.server.NIOServerCnxnFactory.run(NIOServerCnxnFactory.java:208)
   [junit4]   2> 	at java.lang.Thread.run(Thread.java:745)
   [junit4]   2> 189220 INFO  (jetty-launcher-232-thread-1) [n:127.0.0.1:65312_solr    ] o.a.s.c.ZkController Added new OnReconnect listener org.apache.solr.cloud.ZkController$$Lambda$10/1607077479@6b351c18
   [junit4]   2> 189222 INFO  (jetty-launcher-232-thread-2) [n:127.0.0.1:65308_solr    ] o.a.s.c.ZkController Added new OnReconnect listener org.apache.solr.cloud.ZkController$$Lambda$10/1607077479@3c2ded4d
   [junit4]   2> 189223 INFO  (jetty-launcher-232-thread-2) [n:127.0.0.1:65308_solr    ] o.a.s.c.c.ConnectionManager Waiting for client to connect to ZooKeeper
   [junit4]   2> 189223 INFO  (jetty-launcher-232-thread-1) [n:127.0.0.1:65312_solr    ] o.a.s.c.c.ConnectionManager Waiting for client to connect to ZooKeeper
   [junit4]   2> 189226 INFO  (zkCallback-242-thread-1-processing-n:127.0.0.1:65312_solr) [n:127.0.0.1:65312_solr    ] o.a.s.c.c.ConnectionManager Watcher org.apache.solr.common.cloud.ConnectionManager@69690524 name:ZooKeeperConnection Watcher:127.0.0.1:65302/solr got event WatchedEvent state:SyncConnected type:None path:null path:null type:None
   [junit4]   2> 189226 INFO  (jetty-launcher-232-thread-1) [n:127.0.0.1:65312_solr    ] o.a.s.c.c.ConnectionManager Client is connected to ZooKeeper
   [junit4]   2> 189226 INFO  (zkCallback-243-thread-1-processing-n:127.0.0.1:65308_solr) [n:127.0.0.1:65308_solr    ] o.a.s.c.c.ConnectionManager Watcher org.apache.solr.common.cloud.ConnectionManager@7b56f3ca name:ZooKeeperConnection Watcher:127.0.0.1:65302/solr got event WatchedEvent state:SyncConnected type:None path:null path:null type:None
   [junit4]   2> 189226 INFO  (jetty-launcher-232-thread-2) [n:127.0.0.1:65308_solr    ] o.a.s.c.c.ConnectionManager Client is connected to ZooKeeper
   [junit4]   2> 189229 INFO  (jetty-launcher-232-thread-2) [n:127.0.0.1:65308_solr    ] o.a.s.c.c.SolrZkClient makePath: /overseer/queue
   [junit4]   2> 189229 INFO  (jetty-launcher-232-thread-1) [n:127.0.0.1:65312_solr    ] o.a.s.c.c.SolrZkClient makePath: /overseer/queue
   [junit4]   2> 189232 INFO  (jetty-launcher-232-thread-2) [n:127.0.0.1:65308_solr    ] o.a.s.c.c.SolrZkClient makePath: /overseer/collection-queue-work
   [junit4]   2> 189232 INFO  (jetty-launcher-232-thread-1) [n:127.0.0.1:65312_solr    ] o.a.s.c.c.SolrZkClient makePath: /overseer/collection-queue-work
   [junit4]   2> 189236 INFO  (jetty-launcher-232-thread-1) [n:127.0.0.1:65312_solr    ] o.a.s.c.c.SolrZkClient makePath: /overseer/collection-map-running
   [junit4]   2> 189236 INFO  (jetty-launcher-232-thread-2) [n:127.0.0.1:65308_solr    ] o.a.s.c.c.SolrZkClient makePath: /overseer/collection-map-running
   [junit4]   2> 189238 INFO  (jetty-launcher-232-thread-1) [n:127.0.0.1:65312_solr    ] o.a.s.c.c.SolrZkClient makePath: /overseer/collection-map-completed
   [junit4]   2> 189239 INFO  (jetty-launcher-232-thread-2) [n:127.0.0.1:65308_solr    ] o.a.s.c.c.SolrZkClient makePath: /overseer/collection-map-completed
   [junit4]   2> 189242 INFO  (jetty-launcher-232-thread-2) [n:127.0.0.1:65308_solr    ] o.a.s.c.c.SolrZkClient makePath: /overseer/collection-map-failure
   [junit4]   2> 189242 INFO  (jetty-launcher-232-thread-1) [n:127.0.0.1:65312_solr    ] o.a.s.c.c.SolrZkClient makePath: /overseer/collection-map-failure
   [junit4]   2> 189244 INFO  (jetty-launcher-232-thread-1) [n:127.0.0.1:65312_solr    ] o.a.s.c.c.SolrZkClient makePath: /live_nodes
   [junit4]   2> 189244 INFO  (jetty-launcher-232-thread-2) [n:127.0.0.1:65308_solr    ] o.a.s.c.c.SolrZkClient makePath: /live_nodes
   [junit4]   2> 189246 INFO  (jetty-launcher-232-thread-1) [n:127.0.0.1:65312_solr    ] o.a.s.c.c.SolrZkClient makePath: /collections
   [junit4]   2> 189246 INFO  (jetty-launcher-232-thread-2) [n:127.0.0.1:65308_solr    ] o.a.s.c.c.SolrZkClient makePath: /collections
   [junit4]   2> 189247 INFO  (jetty-launcher-232-thread-1) [n:127.0.0.1:65312_solr    ] o.a.s.c.c.SolrZkClient makePath: /aliases.json
   [junit4]   2> 189247 INFO  (jetty-launcher-232-thread-2) [n:127.0.0.1:65308_solr    ] o.a.s.c.c.SolrZkClient makePath: /aliases.json
   [junit4]   2> 189249 INFO  (jetty-launcher-232-thread-2) [n:127.0.0.1:65308_solr    ] o.a.s.c.c.SolrZkClient makePath: /clusterstate.json
   [junit4]   2> 189249 INFO  (jetty-launcher-232-thread-1) [n:127.0.0.1:65312_solr    ] o.a.s.c.c.SolrZkClient makePath: /clusterstate.json
   [junit4]   2> 189251 INFO  (jetty-launcher-232-thread-2) [n:127.0.0.1:65308_solr    ] o.a.s.c.c.SolrZkClient makePath: /security.json
   [junit4]   2> 189251 INFO  (jetty-launcher-232-thread-1) [n:127.0.0.1:65312_solr    ] o.a.s.c.c.SolrZkClient makePath: /security.json
   [junit4]   2> 189252 INFO  (jetty-launcher-232-thread-2) [n:127.0.0.1:65308_solr    ] o.a.s.c.c.ZkStateReader Updating cluster state from ZooKeeper... 
   [junit4]   2> 189252 INFO  (jetty-launcher-232-thread-1) [n:127.0.0.1:65312_solr    ] o.a.s.c.c.ZkStateReader Updating cluster state from ZooKeeper... 
   [junit4]   2> 189253 INFO  (jetty-launcher-232-thread-2) [n:127.0.0.1:65308_solr    ] o.a.s.c.c.ZkStateReader Loaded empty cluster properties
   [junit4]   2> 189253 INFO  (jetty-launcher-232-thread-1) [n:127.0.0.1:65312_solr    ] o.a.s.c.c.ZkStateReader Loaded empty cluster properties
   [junit4]   2> 189254 INFO  (jetty-launcher-232-thread-2) [n:127.0.0.1:65308_solr    ] o.a.s.c.c.ZkStateReader Updated live nodes from ZooKeeper... (0) -> (0)
   [junit4]   2> 189254 INFO  (jetty-launcher-232-thread-1) [n:127.0.0.1:65312_solr    ] o.a.s.c.c.ZkStateReader Updated live nodes from ZooKeeper... (0) -> (0)
   [junit4]   2> 189259 INFO  (jetty-launcher-232-thread-2) [n:127.0.0.1:65308_solr    ] o.a.s.c.c.SolrZkClient makePath: /overseer_elect
   [junit4]   2> 189259 INFO  (jetty-launcher-232-thread-1) [n:127.0.0.1:65312_solr    ] o.a.s.c.c.SolrZkClient makePath: /overseer_elect
   [junit4]   2> 189261 INFO  (jetty-launcher-232-thread-1) [n:127.0.0.1:65312_solr    ] o.a.s.c.c.SolrZkClient makePath: /overseer_elect/election
   [junit4]   2> 189261 INFO  (jetty-launcher-232-thread-2) [n:127.0.0.1:65308_solr    ] o.a.s.c.c.SolrZkClient makePath: /overseer_elect/election
   [junit4]   2> 189263 INFO  (jetty-launcher-232-thread-1) [n:127.0.0.1:65312_solr    ] o.a.s.c.Overseer Overseer (id=null) closing
   [junit4]   2> 189263 INFO  (jetty-launcher-232-thread-2) [n:127.0.0.1:65308_solr    ] o.a.s.c.Overseer Overseer (id=null) closing
   [junit4]   2> 189264 INFO  (jetty-launcher-232-thread-1) [n:127.0.0.1:65312_solr    ] o.a.s.c.LeaderElector Joined leadership election with path: /overseer_elect/election/96196722453053445-127.0.0.1:65312_solr-n_0000000000
   [junit4]   2> 189264 INFO  (jetty-launcher-232-thread-2) [n:127.0.0.1:65308_solr    ] o.a.s.c.LeaderElector Joined leadership election with path: /overseer_elect/election/96196722453053446-127.0.0.1:65308_solr-n_0000000001
   [junit4]   2> 189264 INFO  (jetty-launcher-232-thread-1) [n:127.0.0.1:65312_solr    ] o.a.s.c.OverseerElectionContext I am going to be the leader 127.0.0.1:65312_solr
   [junit4]   2> 189264 INFO  (jetty-launcher-232-thread-1) [n:127.0.0.1:65312_solr    ] o.a.s.c.c.SolrZkClient makePath: /overseer_elect/leader
   [junit4]   2> 189265 INFO  (jetty-launcher-232-thread-2) [n:127.0.0.1:65308_solr    ] o.a.s.c.LeaderElector Watching path /overseer_elect/election/96196722453053445-127.0.0.1:65312_solr-n_0000000000 to know if I could be the leader
   [junit4]   2> 189265 INFO  (jetty-launcher-232-thread-2) [n:127.0.0.1:65308_solr    ] o.a.s.c.ZkController Register node as live in ZooKeeper:/live_nodes/127.0.0.1:65308_solr
   [junit4]   2> 189265 INFO  (jetty-launcher-232-thread-2) [n:127.0.0.1:65308_solr    ] o.a.s.c.c.SolrZkClient makePath: /live_nodes/127.0.0.1:65308_solr
   [junit4]   2> 189269 INFO  (jetty-launcher-232-thread-1) [n:127.0.0.1:65312_solr    ] o.a.s.c.Overseer Overseer (id=96196722453053445-127.0.0.1:65312_solr-n_0000000000) starting
   [junit4]   2> 189270 INFO  (zkCallback-243-thread-1-processing-n:127.0.0.1:65308_solr) [n:127.0.0.1:65308_solr    ] o.a.s.c.c.ZkStateReader A live node change: [WatchedEvent state:SyncConnected type:NodeChildrenChanged path:/live_nodes], has occurred - updating... (live nodes size: [0])
   [junit4]   2> 189270 INFO  (zkCallback-242-thread-1-processing-n:127.0.0.1:65312_solr) [n:127.0.0.1:65312_solr    ] o.a.s.c.c.ZkStateReader A live node change: [WatchedEvent state:SyncConnected type:NodeChildrenChanged path:/live_nodes], has occurred - updating... (live nodes size: [0])
   [junit4]   2> 189275 INFO  (zkCallback-242-thread-1-processing-n:127.0.0.1:65312_solr) [n:127.0.0.1:65312_solr    ] o.a.s.c.c.ZkStateReader Updated live nodes from ZooKeeper... (0) -> (1)
   [junit4]   2> 189275 INFO  (zkCallback-243-thread-1-processing-n:127.0.0.1:65308_solr) [n:127.0.0.1:65308_solr    ] o.a.s.c.c.ZkStateReader Updated live nodes from ZooKeeper... (0) -> (1)
   [junit4]   2> 189276 INFO  (jetty-launcher-232-thread-1) [n:127.0.0.1:65312_solr    ] o.a.s.c.c.SolrZkClient makePath: /overseer/queue-work
   [junit4]   2> 189286 INFO  (jetty-launcher-232-thread-1) [n:127.0.0.1:65312_solr    ] o.a.s.c.OverseerAutoReplicaFailoverThread Starting OverseerAutoReplicaFailoverThread autoReplicaFailoverWorkLoopDelay=10000 autoReplicaFailoverWaitAfterExpiration=30000 autoReplicaFailoverBadNodeExpiration=60000
   [junit4]   2> 189286 INFO  (jetty-launcher-232-thread-2) [n:127.0.0.1:65308_solr    ] o.a.s.c.CoreContainer Security conf doesn't exist. Skipping setup for authorization module.
   [junit4]   2> 189287 INFO  (jetty-launcher-232-thread-2) [n:127.0.0.1:65308_solr    ] o.a.s.c.CoreContainer No authentication plugin used.
   [junit4]   2> 189289 INFO  (jetty-launcher-232-thread-1) [n:127.0.0.1:65312_solr    ] o.a.s.c.ZkController Publish node=127.0.0.1:65312_solr as DOWN
   [junit4]   2> 189290 INFO  (jetty-launcher-232-thread-2) [n:127.0.0.1:65308_solr    ] o.a.s.c.CorePropertiesLocator Looking for core definitions underneath C:\Users\jenkins\workspace\Lucene-Solr-6.x-Windows\solr\build\solr-core\test\J1\temp\solr.cloud.TestLocalFSCloudBackupRestore_A43467B507B06DCD-001\tempDir-001\node2\.
   [junit4]   2> 189291 INFO  (jetty-launcher-232-thread-2) [n:127.0.0.1:65308_solr    ] o.a.s.c.CorePropertiesLocator Found 0 core definitions
   [junit4]   2> 189292 INFO  (jetty-launcher-232-thread-2) [n:127.0.0.1:65308_solr    ] o.a.s.s.SolrDispatchFilter user.dir=C:\Users\jenkins\workspace\Lucene-Solr-6.x-Windows\solr\build\solr-core\test\J1
   [junit4]   2> 189292 INFO  (jetty-launcher-232-thread-2) [n:127.0.0.1:65308_solr    ] o.a.s.s.SolrDispatchFilter SolrDispatchFilter.init() done
   [junit4]   2> 189294 INFO  (jetty-launcher-232-thread-1) [n:127.0.0.1:65312_solr    ] o.a.s.c.ZkController Register node as live in ZooKeeper:/live_nodes/127.0.0.1:65312_solr
   [junit4]   2> 189294 INFO  (jetty-launcher-232-thread-1) [n:127.0.0.1:65312_solr    ] o.a.s.c.c.SolrZkClient makePath: /live_nodes/127.0.0.1:65312_solr
   [junit4]   2> 189295 INFO  (OverseerCollectionConfigSetProcessor-96196722453053445-127.0.0.1:65312_solr-n_0000000000) [n:127.0.0.1:65312_solr    ] o.a.s.c.OverseerTaskProcessor Process current queue of overseer operations
   [junit4]   2> 189296 INFO  (zkCallback-242-thread-1-processing-n:127.0.0.1:65312_solr) [n:127.0.0.1:65312_solr    ] o.a.s.c.c.ZkStateReader A live node change: [WatchedEvent state:SyncConnected type:NodeChildrenChanged path:/live_nodes], has occurred - updating... (live nodes size: [1])
   [junit4]   2> 189297 INFO  (zkCallback-243-thread-1-processing-n:127.0.0.1:65308_solr) [n:127.0.0.1:65308_solr    ] o.a.s.c.c.ZkStateReader A live node change: [WatchedEvent state:SyncConnected type:NodeChildrenChanged path:/live_nodes], has occurred - updating... (live nodes size: [1])
   [junit4]   2> 189297 INFO  (OverseerStateUpdate-96196722453053445-127.0.0.1:65312_solr-n_0000000000) [n:127.0.0.1:65312_solr    ] o.a.s.c.Overseer Starting to work on the main queue
   [junit4]   2> 189299 INFO  (zkCallback-243-thread-1-processing-n:127.0.0.1:65308_solr) [n:127.0.0.1:65308_solr    ] o.a.s.c.c.ZkStateReader Updated live nodes from ZooKeeper... (1) -> (2)
   [junit4]   2> 189299 INFO  (zkCallback-242-thread-1-processing-n:127.0.0.1:65312_solr) [n:127.0.0.1:65312_solr    ] o.a.s.c.c.ZkStateReader Updated live nodes from ZooKeeper... (1) -> (2)
   [junit4]   2> 189305 INFO  (OverseerStateUpdate-96196722453053445-127.0.0.1:65312_solr-n_0000000000) [n:127.0.0.1:65312_solr    ] o.a.s.c.c.ZkStateReader Updated live nodes from ZooKeeper... (2) -> (2)
   [junit4]   2> 189308 INFO  (OverseerStateUpdate-96196722453053445-127.0.0.1:65312_solr-n_0000000000) [n:127.0.0.1:65312_solr    ] o.a.s.c.Overseer processMessage: queueSize: 1, message = {
   [junit4]   2>   "operation":"downnode",
   [junit4]   2>   "node_name":"127.0.0.1:65312_solr"} current state version: 0
   [junit4]   2> 189308 INFO  (OverseerStateUpdate-96196722453053445-127.0.0.1:65312_solr-n_0000000000) [n:127.0.0.1:65312_solr    ] o.a.s.c.o.NodeMutator DownNode state invoked for node: 127.0.0.1:65312_solr
   [junit4]   2> 189313 INFO  (jetty-launcher-232-thread-1) [n:127.0.0.1:65312_solr    ] o.a.s.c.CoreContainer Security conf doesn't exist. Skipping setup for authorization module.
   [junit4]   2> 189313 INFO  (jetty-launcher-232-thread-1) [n:127.0.0.1:65312_solr    ] o.a.s.c.CoreContainer No authentication plugin used.
   [junit4]   2> 189315 INFO  (jetty-launcher-232-thread-1) [n:127.0.0.1:65312_solr    ] o.a.s.c.CorePropertiesLocator Looking for core definitions underneath C:\Users\jenkins\workspace\Lucene-Solr-6.x-Windows\solr\build\solr-core\test\J1\temp\solr.cloud.TestLocalFSCloudBackupRestore_A43467B507B06DCD-001\tempDir-001\node1\.
   [junit4]   2> 189316 INFO  (jetty-launcher-232-thread-1) [n:127.0.0.1:65312_solr    ] o.a.s.c.CorePropertiesLocator Found 0 core definitions
   [junit4]   2> 189317 INFO  (jetty-launcher-232-thread-1) [n:127.0.0.1:65312_solr    ] o.a.s.s.SolrDispatchFilter user.dir=C:\Users\jenkins\workspace\Lucene-Solr-6.x-Windows\solr\build\solr-core\test\J1
   [junit4]   2> 189317 INFO  (jetty-launcher-232-thread-1) [n:127.0.0.1:65312_solr    ] o.a.s.s.SolrDispatchFilter SolrDispatchFilter.init() done
   [junit4]   2> 189317 INFO  (SUITE-TestLocalFSCloudBackupRestore-seed#[A43467B507B06DCD]-worker) [    ] o.a.s.c.c.SolrZkClient Using default ZkCredentialsProvider
   [junit4]   2> 189318 INFO  (SUITE-TestLocalFSCloudBackupRestore-seed#[A43467B507B06DCD]-worker) [    ] o.a.s.c.c.ConnectionManager Waiting for client to connect to ZooKeeper
   [junit4]   2> 189322 INFO  (zkCallback-246-thread-1) [    ] o.a.s.c.c.ConnectionManager Watcher org.apache.solr.common.cloud.ConnectionManager@22fb13fe name:ZooKeeperConnection Watcher:127.0.0.1:65302 got event WatchedEvent state:SyncConnected type:None path:null path:null type:None
   [junit4]   2> 189322 INFO  (SUITE-TestLocalFSCloudBackupRestore-seed#[A43467B507B06DCD]-worker) [    ] o.a.s.c.c.ConnectionManager Client is connected to ZooKeeper
   [junit4]   2> 189322 INFO  (SUITE-TestLocalFSCloudBackupRestore-seed#[A43467B507B06DCD]-worker) [    ] o.a.s.c.c.SolrZkClient Using default ZkACLProvider
   [junit4]   2> 189327 INFO  (SUITE-TestLocalFSCloudBackupRestore-seed#[A43467B507B06DCD]-worker) [    ] o.a.s.c.c.SolrZkClient Using default ZkCredentialsProvider
   [junit4]   2> 189328 WARN  (NIOServerCxn.Factory:0.0.0.0/0.0.0.0:0) [    ] o.a.z.s.NIOServerCnxn caught end of stream exception
   [junit4]   2> EndOfStreamException: Unable to read additional data from client sessionid 0x155c268ce5f0007, likely client has closed socket
   [junit4]   2> 	at org.apache.zookeeper.server.NIOServerCnxn.doIO(NIOServerCnxn.java:228)
   [junit4]   2> 	at org.apache.zookeeper.server.NIOServerCnxnFactory.run(NIOServerCnxnFactory.java:208)
   [junit4]   2> 	at java.lang.Thread.run(Thread.java:745)
   [junit4]   2> 189329 INFO  (SUITE-TestLocalFSCloudBackupRestore-seed#[A43467B507B06DCD]-worker) [    ] o.a.s.c.c.ConnectionManager Waiting for client to connect to ZooKeeper
   [junit4]   2> 189332 INFO  (zkCallback-249-thread-1) [    ] o.a.s.c.c.ConnectionManager Watcher org.apache.solr.common.cloud.ConnectionManager@308ccc60 name:ZooKeeperConnection Watcher:127.0.0.1:65302/solr got event WatchedEvent state:SyncConnected type:None path:null path:null type:None
   [junit4]   2> 189332 INFO  (SUITE-TestLocalFSCloudBackupRestore-seed#[A43467B507B06DCD]-worker) [    ] o.a.s.c.c.ConnectionManager Client is connected to ZooKeeper
   [junit4]   2> 189332 INFO  (SUITE-TestLocalFSCloudBackupRestore-seed#[A43467B507B06DCD]-worker) [    ] o.a.s.c.c.SolrZkClient Using default ZkACLProvider
   [junit4]   2> 189332 INFO  (SUITE-TestLocalFSCloudBackupRestore-seed#[A43467B507B06DCD]-worker) [    ] o.a.s.c.c.ZkStateReader Updating cluster state from ZooKeeper... 
   [junit4]   2> 189334 INFO  (SUITE-TestLocalFSCloudBackupRestore-seed#[A43467B507B06DCD]-worker) [    ] o.a.s.c.c.ZkStateReader Loaded empty cluster properties
   [junit4]   2> 189335 INFO  (SUITE-TestLocalFSCloudBackupRestore-seed#[A43467B507B06DCD]-worker) [    ] o.a.s.c.c.ZkStateReader Updated live nodes from ZooKeeper... (0) -> (2)
   [junit4]   2> 189342 INFO  (SUITE-TestLocalFSCloudBackupRestore-seed#[A43467B507B06DCD]-worker) [    ] o.a.s.c.c.SolrZkClient makePath: /configs/conf1/schema.xml
   [junit4]   2> 189347 INFO  (SUITE-TestLocalFSCloudBackupRestore-seed#[A43467B507B06DCD]-worker) [    ] o.a.s.c.c.SolrZkClient makePath: /configs/conf1/solrconfig.xml
   [junit4]   2> 189374 INFO  (TEST-TestLocalFSCloudBackupRestore.test-seed#[A43467B507B06DCD]) [    ] o.a.s.SolrTestCaseJ4 ###Starting test
   [junit4]   2> 189383 INFO  (qtp415745430-1117) [n:127.0.0.1:65308_solr    ] o.a.s.h.a.CollectionsHandler Invoked Collection Action :create with params shards=shard1,shard2&replicationFactor=1&property.customKey=customValue&collection.configName=conf1&router.field=shard_s&autoAddReplicas=true&name=backuprestore&router.name=implicit&action=CREATE&wt=javabin&version=2 and sendToOCPQueue=true
   [junit4]   2> 189386 INFO  (OverseerCollectionConfigSetProcessor-96196722453053445-127.0.0.1:65312_solr-n_0000000000) [n:127.0.0.1:65312_solr    ] o.a.s.c.OverseerTaskProcessor Overseer Collection Message Handler: Get the message id:/overseer/collection-queue-work/qn-0000000000 message:{
   [junit4]   2>   "name":"backuprestore",
   [junit4]   2>   "fromApi":"true",
   [junit4]   2>   "replicationFactor":"1",
   [junit4]   2>   "collection.configName":"conf1",
   [junit4]   2>   "shards":"shard1,shard2",
   [junit4]   2>   "autoAddReplicas":"true",
   [junit4]   2>   "stateFormat":"2",
   [junit4]   2>   "property.customKey":"customValue",
   [junit4]   2>   "router.field":"shard_s",
   [junit4]   2>   "router.name":"implicit",
   [junit4]   2>   "operation":"create"}
   [junit4]   2> 189387 INFO  (OverseerThreadFactory-759-thread-1-processing-n:127.0.0.1:65312_solr) [n:127.0.0.1:65312_solr    ] o.a.s.c.OverseerCollectionMessageHandler OverseerCollectionMessageHandler.processMessage : create , {
   [junit4]   2>   "name":"backuprestore",
   [junit4]   2>   "fromApi":"true",
   [junit4]   2>   "replicationFactor":"1",
   [junit4]   2>   "collection.configName":"conf1",
   [junit4]   2>   "shards":"shard1,shard2",
   [junit4]   2>   "autoAddReplicas":"true",
   [junit4]   2>   "stateFormat":"2",
   [junit4]   2>   "property.customKey":"customValue",
   [junit4]   2>   "router.field":"shard_s",
   [junit4]   2>   "router.name":"implicit",
   [junit4]   2>   "operation":"create"}
   [junit4]   2> 189387 INFO  (OverseerThreadFactory-759-thread-1-processing-n:127.0.0.1:65312_solr) [n:127.0.0.1:65312_solr    ] o.a.s.c.OverseerCollectionMessageHandler Create collection backuprestore
   [junit4]   2> 189387 INFO  (OverseerThreadFactory-759-thread-1-processing-n:127.0.0.1:65312_solr) [n:127.0.0.1:65312_solr    ] o.a.s.c.OverseerCollectionMessageHandler creating collections conf node /collections/backuprestore 
   [junit4]   2> 189388 INFO  (OverseerThreadFactory-759-thread-1-processing-n:127.0.0.1:65312_solr) [n:127.0.0.1:65312_solr    ] o.a.s.c.c.SolrZkClient makePath: /collections/backuprestore
   [junit4]   2> 189389 INFO  (zkCallback-249-thread-1) [    ] o.a.s.c.c.ZkStateReader A collections change: [WatchedEvent state:SyncConnected type:NodeChildrenChanged path:/collections], has occurred - updating...
   [junit4]   2> 189389 INFO  (zkCallback-243-thread-1-processing-n:127.0.0.1:65308_solr) [n:127.0.0.1:65308_solr    ] o.a.s.c.c.ZkStateReader A collections change: [WatchedEvent state:SyncConnected type:NodeChildrenChanged path:/collections], has occurred - updating...
   [junit4]   2> 189389 INFO  (zkCallback-242-thread-1-processing-n:127.0.0.1:65312_solr) [n:127.0.0.1:65312_solr    ] o.a.s.c.c.ZkStateReader A collections change: [WatchedEvent state:SyncConnected type:NodeChildrenChanged path:/collections], has occurred - updating...
   [junit4]   2> 189393 INFO  (OverseerStateUpdate-96196722453053445-127.0.0.1:65312_solr-n_0000000000) [n:127.0.0.1:65312_solr    ] o.a.s.c.Overseer processMessage: queueSize: 1, message = {
   [junit4]   2>   "name":"backuprestore",
   [junit4]   2>   "fromApi":"true",
   [junit4]   2>   "replicationFactor":"1",
   [junit4]   2>   "collection.configName":"conf1",
   [junit4]   2>   "shards":"shard1,shard2",
   [junit4]   2>   "autoAddReplicas":"true",
   [junit4]   2>   "stateFormat":"2",
   [junit4]   2>   "property.customKey":"customValue",
   [junit4]   2>   "router.field":"shard_s",
   [junit4]   2>   "router.name":"implicit",
   [junit4]   2>   "operation":"create"} current state version: 0
   [junit4]   2> 189393 INFO  (OverseerStateUpdate-96196722453053445-127.0.0.1:65312_solr-n_0000000000) [n:127.0.0.1:65312_solr    ] o.a.s.c.o.ClusterStateMutator building a new cName: backuprestore
   [junit4]   2> 189395 INFO  (OverseerStateUpdate-96196722453053445-127.0.0.1:65312_solr-n_0000000000) [n:127.0.0.1:65312_solr    ] o.a.s.c.o.ZkStateWriter going to create_collection /collections/backuprestore/state.json
   [junit4]   2> 189493 INFO  (OverseerThreadFactory-759-thread-1-processing-n:127.0.0.1:65312_solr) [n:127.0.0.1:65312_solr    ] o.a.s.c.OverseerCollectionMessageHandler Creating SolrCores for new collection backuprestore, shardNames [shard1, shard2] , replicationFactor : 1
   [junit4]   2> 189493 INFO  (OverseerThreadFactory-759-thread-1-processing-n:127.0.0.1:65312_solr) [n:127.0.0.1:65312_solr    ] o.a.s.c.OverseerCollectionMessageHandler Creating core backuprestore_shard2_replica1 as part of shard shard2 of collection backuprestore on 127.0.0.1:65308_solr
   [junit4]   2> 189494 INFO  (OverseerThreadFactory-759-thread-1-processing-n:127.0.0.1:65312_solr) [n:127.0.0.1:65312_solr    ] o.a.s.c.OverseerCollectionMessageHandler Creating core backuprestore_shard1_replica1 as part of shard shard1 of collection backuprestore on 127.0.0.1:65312_solr
   [junit4]   2> 189498 INFO  (qtp415745430-1115) [n:127.0.0.1:65308_solr    ] o.a.s.h.a.CoreAdminOperation core create command property.customKey=customValue&qt=/admin/cores&collection.configName=conf1&name=backuprestore_shard2_replica1&action=CREATE&numShards=2&collection=backuprestore&shard=shard2&wt=javabin&version=2
   [junit4]   2> 189498 INFO  (qtp2077420951-1124) [n:127.0.0.1:65312_solr    ] o.a.s.h.a.CoreAdminOperation core create command property.customKey=customValue&qt=/admin/cores&collection.configName=conf1&name=backuprestore_shard1_replica1&action=CREATE&numShards=2&collection=backuprestore&shard=shard1&wt=javabin&version=2
   [junit4]   2> 189501 INFO  (qtp2077420951-1124) [n:127.0.0.1:65312_solr    ] o.a.s.c.CoreDescriptor Created CoreDescriptor: {name=backuprestore_shard1_replica1, collection.configName=conf1, config=solrconfig.xml, transient=false, schema=schema.xml, loadOnStartup=true, configSetProperties=configsetprops.json, collection=backuprestore, customKey=customValue, numShards=2, dataDir=data\, shard=shard1}
   [junit4]   2> 189501 INFO  (qtp415745430-1115) [n:127.0.0.1:65308_solr    ] o.a.s.c.CoreDescriptor Created CoreDescriptor: {name=backuprestore_shard2_replica1, collection.configName=conf1, config=solrconfig.xml, transient=false, schema=schema.xml, loadOnStartup=true, configSetProperties=configsetprops.json, collection=backuprestore, customKey=customValue, numShards=2, dataDir=data\, shard=shard2}
   [junit4]   2> 189502 INFO  (qtp2077420951-1124) [n:127.0.0.1:65312_solr c:backuprestore s:shard1  x:backuprestore_shard1_replica1] o.a.s.c.ZkController publishing state=down
   [junit4]   2> 189502 INFO  (qtp415745430-1115) [n:127.0.0.1:65308_solr c:backuprestore s:shard2  x:backuprestore_shard2_replica1] o.a.s.c.ZkController publishing state=down
   [junit4]   2> 189504 INFO  (qtp2077420951-1124) [n:127.0.0.1:65312_solr c:backuprestore s:shard1  x:backuprestore_shard1_replica1] o.a.s.c.ZkController Registering watch for collection backuprestore
   [junit4]   2> 189504 INFO  (qtp415745430-1115) [n:127.0.0.1:65308_solr c:backuprestore s:shard2  x:backuprestore_shard2_replica1] o.a.s.c.ZkController Registering watch for collection backuprestore
   [junit4]   2> 189504 INFO  (qtp2077420951-1124) [n:127.0.0.1:65312_solr c:backuprestore s:shard1  x:backuprestore_shard1_replica1] o.a.s.c.c.ZkStateReader Add data for [backuprestore] ver [0]
   [junit4]   2> 189504 INFO  (qtp2077420951-1124) [n:127.0.0.1:65312_solr c:backuprestore s:shard1  x:backuprestore_shard1_replica1] o.a.s.c.ZkController look for our core node name
   [junit4]   2> 189504 INFO  (qtp415745430-1115) [n:127.0.0.1:65308_solr c:backuprestore s:shard2  x:backuprestore_shard2_replica1] o.a.s.c.c.ZkStateReader Add data for [backuprestore] ver [0]
   [junit4]   2> 189504 INFO  (qtp415745430-1115) [n:127.0.0.1:65308_solr c:backuprestore s:shard2  x:backuprestore_shard2_replica1] o.a.s.c.ZkController look for our core node name
   [junit4]   2> 189505 INFO  (OverseerStateUpdate-96196722453053445-127.0.0.1:65312_solr-n_0000000000) [n:127.0.0.1:65312_solr    ] o.a.s.c.Overseer processMessage: queueSize: 2, message = {
   [junit4]   2>   "core":"backuprestore_shard1_replica1",
   [junit4]   2>   "roles":null,
   [junit4]   2>   "base_url":"http://127.0.0.1:65312/solr",
   [junit4]   2>   "node_name":"127.0.0.1:65312_solr",
   [junit4]   2>   "numShards":"2",
   [junit4]   2>   "state":"down",
   [junit4]   2>   "shard":"shard1",
   [junit4]   2>   "collection":"backuprestore",
   [junit4]   2>   "operation":"state"} current state version: 0
   [junit4]   2> 189505 INFO  (OverseerStateUpdate-96196722453053445-127.0.0.1:65312_solr-n_0000000000) [n:127.0.0.1:65312_solr    ] o.a.s.c.o.ReplicaMutator Update state numShards=2 message={
   [junit4]   2>   "core":"backuprestore_shard1_replica1",
   [junit4]   2>   "roles":null,
   [junit4]   2>   "base_url":"http://127.0.0.1:65312/solr",
   [junit4]   2>   "node_name":"127.0.0.1:65312_solr",
   [junit4]   2>   "numShards":"2",
   [junit4]   2>   "state":"down",
   [junit4]   2>   "shard":"shard1",
   [junit4]   2>   "collection":"backuprestore",
   [junit4]   2>   "operation":"state"}
   [junit4]   2> 189507 INFO  (OverseerStateUpdate-96196722453053445-127.0.0.1:65312_solr-n_0000000000) [n:127.0.0.1:65312_solr    ] o.a.s.c.Overseer processMessage: queueSize: 2, message = {
   [junit4]   2>   "core":"backuprestore_shard2_replica1",
   [junit4]   2>   "roles":null,
   [junit4]   2>   "base_url":"http://127.0.0.1:65308/solr",
   [junit4]   2>   "node_name":"127.0.0.1:65308_solr",
   [junit4]   2>   "numShards":"2",
   [junit4]   2>   "state":"down",
   [junit4]   2>   "shard":"shard2",
   [junit4]   2>   "collection":"backuprestore",
   [junit4]   2>   "operation":"state"} current state version: 0
   [junit4]   2> 189507 INFO  (OverseerStateUpdate-96196722453053445-127.0.0.1:65312_solr-n_0000000000) [n:127.0.0.1:65312_solr    ] o.a.s.c.o.ReplicaMutator Update state numShards=2 message={
   [junit4]   2>   "core":"backuprestore_shard2_replica1",
   [junit4]   2>   "roles":null,
   [junit4]   2>   "base_url":"http://127.0.0.1:65308/solr",
   [junit4]   2>   "node_name":"127.0.0.1:65308_solr",
   [junit4]   2>   "numShards":"2",
   [junit4]   2>   "state":"down",
   [junit4]   2>   "shard":"shard2",
   [junit4]   2>   "collection":"backuprestore",
   [junit4]   2>   "operation":"state"}
   [junit4]   2> 189612 INFO  (OverseerStateUpdate-96196722453053445-127.0.0.1:65312_solr-n_0000000000) [n:127.0.0.1:65312_solr    ] o.a.s.c.o.ZkStateWriter going to update_collection /collections/backuprestore/state.json version: 0
   [junit4]   2> 189613 INFO  (zkCallback-243-thread-1-processing-n:127.0.0.1:65308_solr) [n:127.0.0.1:65308_solr    ] o.a.s.c.c.ZkStateReader A cluster state change: [WatchedEvent state:SyncConnected type:NodeDataChanged path:/collections/backuprestore/state.json] for collection [backuprestore] has occurred - updating... (live nodes size: [2])
   [junit4]   2> 189613 INFO  (zkCallback-242-thread-2-processing-n:127.0.0.1:65312_solr) [n:127.0.0.1:65312_solr    ] o.a.s.c.c.ZkStateReader A cluster state change: [WatchedEvent state:SyncConnected type:NodeDataChanged path:/collections/backuprestore/state.json] for collection [backuprestore] has occurred - updating... (live nodes size: [2])
   [junit4]   2> 189613 INFO  (zkCallback-243-thread-1-processing-n:127.0.0.1:65308_solr) [n:127.0.0.1:65308_solr    ] o.a.s.c.c.ZkStateReader Updating data for [backuprestore] from [0] to [1]
   [junit4]   2> 189614 INFO  (zkCallback-242-thread-2-processing-n:127.0.0.1:65312_solr) [n:127.0.0.1:65312_solr    ] o.a.s.c.c.ZkStateReader Updating data for [backuprestore] from [0] to [1]
   [junit4]   2> 190504 INFO  (qtp2077420951-1124) [n:127.0.0.1:65312_solr c:backuprestore s:shard1  x:backuprestore_shard1_replica1] o.a.s.c.ZkController waiting to find shard id in clusterstate for backuprestore_shard1_replica1
   [junit4]   2> 190504 INFO  (qtp2077420951-1124) [n:127.0.0.1:65312_solr c:backuprestore s:shard1  x:backuprestore_shard1_replica1] o.a.s.c.ZkController Check for collection zkNode:backuprestore
   [junit4]   2> 190505 INFO  (qtp415745430-1115) [n:127.0.0.1:65308_solr c:backuprestore s:shard2  x:backuprestore_shard2_replica1] o.a.s.c.ZkController waiting to find shard id in clusterstate for backuprestore_shard2_replica1
   [junit4]   2> 190505 INFO  (qtp415745430-1115) [n:127.0.0.1:65308_solr c:backuprestore s:shard2  x:backuprestore_shard2_replica1] o.a.s.c.ZkController Check for collection zkNode:backuprestore
   [junit4]   2> 190505 INFO  (qtp2077420951-1124) [n:127.0.0.1:65312_solr c:backuprestore s:shard1  x:backuprestore_shard1_replica1] o.a.s.c.ZkController Collection zkNode exists
   [junit4]   2> 190505 INFO  (qtp2077420951-1124) [n:127.0.0.1:65312_solr c:backuprestore s:shard1  x:backuprestore_shard1_replica1] o.a.s.c.c.ZkStateReader Load collection config from: [/collections/backuprestore]
   [junit4]   2> 190505 INFO  (qtp415745430-1115) [n:127.0.0.1:65308_solr c:backuprestore s:shard2  x:backuprestore_shard2_replica1] o.a.s.c.ZkController Collection zkNode exists
   [junit4]   2> 190505 INFO  (qtp415745430-1115) [n:127.0.0.1:65308_solr c:backuprestore s:shard2  x:backuprestore_shard2_replica1] o.a.s.c.c.ZkStateReader Load collection config from: [/collections/backuprestore]
   [junit4]   2> 190506 INFO  (qtp2077420951-1124) [n:127.0.0.1:65312_solr c:backuprestore s:shard1  x:backuprestore_shard1_replica1] o.a.s.c.c.ZkStateReader path=[/collections/backuprestore] [configName]=[conf1] specified config exists in ZooKeeper
   [junit4]   2> 190506 INFO  (qtp2077420951-1124) [n:127.0.0.1:65312_solr c:backuprestore s:shard1  x:backuprestore_shard1_replica1] o.a.s.c.SolrResourceLoader new SolrResourceLoader for directory: 'C:\Users\jenkins\workspace\Lucene-Solr-6.x-Windows\solr\build\solr-core\test\J1\temp\solr.cloud.TestLocalFSCloudBackupRestore_A43467B507B06DCD-001\tempDir-001\node1\backuprestore_shard1_replica1'
   [junit4]   2> 190506 INFO  (qtp2077420951-1124) [n:127.0.0.1:65312_solr c:backuprestore s:shard1  x:backuprestore_shard1_replica1] o.a.s.c.SolrResourceLoader JNDI not configured for solr (NoInitialContextEx)
   [junit4]   2> 190506 INFO  (qtp2077420951-1124) [n:127.0.0.1:65312_solr c:backuprestore s:shard1  x:backuprestore_shard1_replica1] o.a.s.c.SolrResourceLoader solr home defaulted to 'solr/' (could not find system property or JNDI)
   [junit4]   2> 190507 INFO  (qtp415745430-1115) [n:127.0.0.1:65308_solr c:backuprestore s:shard2  x:backuprestore_shard2_replica1] o.a.s.c.c.ZkStateReader path=[/collections/backuprestore] [configName]=[conf1] specified config exists in ZooKeeper
   [junit4]   2> 190507 INFO  (qtp415745430-1115) [n:127.0.0.1:65308_solr c:backuprestore s:shard2  x:backuprestore_shard2_replica1] o.a.s.c.SolrResourceLoader new SolrResourceLoader for directory: 'C:\Users\jenkins\workspace\Lucene-Solr-6.x-Windows\solr\build\solr-core\test\J1\temp\solr.cloud.TestLocalFSCloudBackupRestore_A43467B507B06DCD-001\tempDir-001\node2\backuprestore_shard2_replica1'
   [junit4]   2> 190508 INFO  (qtp415745430-1115) [n:127.0.0.1:65308_solr c:backuprestore s:shard2  x:backuprestore_shard2_replica1] o.a.s.c.SolrResourceLoader JNDI not configured for solr (NoInitialContextEx)
   [junit4]   2> 190508 INFO  (qtp415745430-1115) [n:127.0.0.1:65308_solr c:backuprestore s:shard2  x:backuprestore_shard2_replica1] o.a.s.c.SolrResourceLoader solr home defaulted to 'solr/' (could not find system property or JNDI)
   [junit4]   2> 190512 INFO  (qtp2077420951-1124) [n:127.0.0.1:65312_solr c:backuprestore s:shard1  x:backuprestore_shard1_replica1] o.a.s.c.Config loaded config solrconfig.xml with version 0 
   [junit4]   2> 190512 INFO  (qtp415745430-1115) [n:127.0.0.1:65308_solr c:backuprestore s:shard2  x:backuprestore_shard2_replica1] o.a.s.c.Config loaded config solrconfig.xml with version 0 
   [junit4]   2> 190531 INFO  (qtp2077420951-1124) [n:127.0.0.1:65312_solr c:backuprestore s:shard1  x:backuprestore_shard1_replica1] o.a.s.c.SolrConfig current version of requestparams : -1
   [junit4]   2> 190534 INFO  (qtp2077420951-1124) [n:127.0.0.1:65312_solr c:backuprestore s:shard1  x:backuprestore_shard1_replica1] o.a.s.c.SolrConfig Using Lucene MatchVersion: 6.2.0
   [junit4]   2> 190553 INFO  (qtp415745430-1115) [n:127.0.0.1:65308_solr c:backuprestore s:shard2  x:backuprestore_shard2_replica1] o.a.s.c.SolrConfig current version of requestparams : -1
   [junit4]   2> 190556 INFO  (qtp2077420951-1124) [n:127.0.0.1:65312_solr c:backuprestore s:shard1  x:backuprestore_shard1_replica1] o.a.s.c.SolrConfig Loaded SolrConfig: solrconfig.xml
   [junit4]   2> 190558 INFO  (qtp415745430-1115) [n:127.0.0.1:65308_solr c:backuprestore s:shard2  x:backuprestore_shard2_replica1] o.a.s.c.SolrConfig Using Lucene MatchVersion: 6.2.0
   [junit4]   2> 190575 INFO  (qtp415745430-1115) [n:127.0.0.1:65308_solr c:backuprestore s:shard2  x:backuprestore_shard2_replica1] o.a.s.c.SolrConfig Loaded SolrConfig: solrconfig.xml
   [junit4]   2> 190578 INFO  (qtp2077420951-1124) [n:127.0.0.1:65312_solr c:backuprestore s:shard1  x:backuprestore_shard1_replica1] o.a.s.s.IndexSchema [backuprestore_shard1_replica1] Schema name=minimal
   [junit4]   2> 190582 INFO  (qtp415745430-1115) [n:127.0.0.1:65308_solr c:backuprestore s:shard2  x:backuprestore_shard2_replica1] o.a.s.s.IndexSchema [backuprestore_shard2_replica1] Schema name=minimal
   [junit4]   2> 190586 INFO  (qtp2077420951-1124) [n:127.0.0.1:65312_solr c:backuprestore s:shard1  x:backuprestore_shard1_replica1] o.a.s.s.IndexSchema unique key field: id
   [junit4]   2> 190586 INFO  (qtp415745430-1115) [n:127.0.0.1:65308_solr c:backuprestore s:shard2  x:backuprestore_shard2_replica1] o.a.s.s.IndexSchema unique key field: id
   [junit4]   2> 190592 INFO  (qtp2077420951-1124) [n:127.0.0.1:65312_solr c:backuprestore s:shard1  x:backuprestore_shard1_replica1] o.a.s.c.ConfigSetProperties Did not find ConfigSet properties, assuming default properties: Can't find resource 'configsetprops.json' in classpath or '/configs/conf1', cwd=C:\Users\jenkins\workspace\Lucene-Solr-6.x-Windows\solr\build\solr-core\test\J1
   [junit4]   2> 190592 INFO  (qtp2077420951-1124) [n:127.0.0.1:65312_solr c:backuprestore s:shard1  x:backuprestore_shard1_replica1] o.a.s.c.CoreContainer Creating SolrCore 'backuprestore_shard1_replica1' using configuration from collection backuprestore
   [junit4]   2> 190592 INFO  (qtp415745430-1115) [n:127.0.0.1:65308_solr c:backuprestore s:shard2  x:backuprestore_shard2_replica1] o.a.s.c.ConfigSetProperties Did not find ConfigSet properties, assuming default properties: Can't find resource 'configsetprops.json' in classpath or '/configs/conf1', cwd=C:\Users\jenkins\workspace\Lucene-Solr-6.x-Windows\solr\build\solr-core\test\J1
   [junit4]   2> 190592 INFO  (qtp415745430-1115) [n:127.0.0.1:65308_solr c:backuprestore s:shard2  x:backuprestore_shard2_replica1] o.a.s.c.CoreContainer Creating SolrCore 'backuprestore_shard2_replica1' using configuration from collection backuprestore
   [junit4]   2> 190592 INFO  (qtp415745430-1115) [n:127.0.0.1:65308_solr c:backuprestore s:shard2 r:core_node2 x:backuprestore_shard2_replica1] o.a.s.c.SolrCore org.apache.solr.core.MockDirectoryFactory
   [junit4]   2> 190593 INFO  (qtp2077420951-1124) [n:127.0.0.1:65312_solr c:backuprestore s:shard1 r:core_node1 x:backuprestore_shard1_replica1] o.a.s.c.SolrCore org.apache.solr.core.MockDirectoryFactory
   [junit4]   2> 190593 INFO  (qtp415745430-1115) [n:127.0.0.1:65308_solr c:backuprestore s:shard2 r:core_node2 x:backuprestore_shard2_replica1] o.a.s.c.SolrCore [[backuprestore_shard2_replica1] ] Opening new SolrCore at [C:\Users\jenkins\workspace\Lucene-Solr-6.x-Windows\solr\build\solr-core\test\J1\temp\solr.cloud.TestLocalFSCloudBackupRestore_A43467B507B06DCD-001\tempDir-001\node2\backuprestore_shard2_replica1], dataDir=[C:\Users\jenkins\workspace\Lucene-Solr-6.x-Windows\solr\build\solr-core\test\J1\temp\solr.cloud.TestLocalFSCloudBackupRestore_A43467B507B06DCD-001\tempDir-001\node2\.\backuprestore_shard2_replica1\data\]
   [junit4]   2> 190593 INFO  (qtp2077420951-1124) [n:127.0.0.1:65312_solr c:backuprestore s:shard1 r:core_node1 x:backuprestore_shard1_replica1] o.a.s.c.SolrCore [[backuprestore_shard1_replica1] ] Opening new SolrCore at [C:\Users\jenkins\workspace\Lucene-Solr-6.x-Windows\solr\build\solr-core\test\J1\temp\solr.cloud.TestLocalFSCloudBackupRestore_A43467B507B06DCD-001\tempDir-001\node1\backuprestore_shard1_replica1], dataDir=[C:\Users\jenkins\workspace\Lucene-Solr-6.x-Windows\solr\build\solr-core\test\J1\temp\solr.cloud.TestLocalFSCloudBackupRestore_A43467B507B06DCD-001\tempDir-001\node1\.\backuprestore_shard1_replica1\data\]
   [junit4]   2> 190593 INFO  (qtp415745430-1115) [n:127.0.0.1:65308_solr c:backuprestore s:shard2 r:core_node2 x:backuprestore_shard2_replica1] o.a.s.c.SolrCore JMX monitoring not detected for core: backuprestore_shard2_replica1
   [junit4]   2> 190593 INFO  (qtp2077420951-1124) [n:127.0.0.1:65312_solr c:backuprestore s:shard1 r:core_node1 x:backuprestore_shard1_replica1] o.a.s.c.SolrCore JMX monitoring not detected for core: backuprestore_shard1_replica1
   [junit4]   2> 190593 INFO  (qtp415745430-1115) [n:127.0.0.1:65308_solr c:backuprestore s:shard2 r:core_node2 x:backuprestore_shard2_replica1] o.a.s.c.CachingDirectoryFactory return new directory for C:\Users\jenkins\workspace\Lucene-Solr-6.x-Windows\solr\build\solr-core\test\J1\temp\solr.cloud.TestLocalFSCloudBackupRestore_A43467B507B06DCD-001\tempDir-001\node2\.\backuprestore_shard2_replica1\data\
   [junit4]   2> 190595 INFO  (qtp415745430-1115) [n:127.0.0.1:65308_solr c:backuprestore s:shard2 r:core_node2 x:backuprestore_shard2_replica1] o.a.s.c.SolrCore New index directory detected: old=null new=C:\Users\jenkins\workspace\Lucene-Solr-6.x-Windows\solr\build\solr-core\test\J1\temp\solr.cloud.TestLocalFSCloudBackupRestore_A43467B507B06DCD-001\tempDir-001\node2\.\backuprestore_shard2_replica1\data\index/
   [junit4]   2> 190595 WARN  (qtp415745430-1115) [n:127.0.0.1:65308_solr c:backuprestore s:shard2 r:core_node2 x:backuprestore_shard2_replica1] o.a.s.c.SolrCore [backuprestore_shard2_replica1] Solr index directory 'C:\Users\jenkins\workspace\Lucene-Solr-6.x-Windows\solr\build\solr-core\test\J1\temp\solr.cloud.TestLocalFSCloudBackupRestore_A43467B507B06DCD-001\tempDir-001\node2\.\backuprestore_shard2_replica1\data\index' doesn't exist. Creating new index...
   [junit4]   2> 190595 INFO  (qtp2077420951-1124) [n:127.0.0.1:65312_solr c:backuprestore s:shard1 r:core_node1 x:backuprestore_shard1_replica1] o.a.s.c.CachingDirectoryFactory return new directory for C:\Users\jenkins\workspace\Lucene-Solr-6.x-Windows\solr\build\solr-core\test\J1\temp\solr.cloud.TestLocalFSCloudBackupRestore_A43467B507B06DCD-001\tempDir-001\node1\.\backuprestore_shard1_replica1\data\
   [junit4]   2> 190596 INFO  (qtp2077420951-1124) [n:127.0.0.1:65312_solr c:backuprestore s:shard1 r:core_node1 x:backuprestore_shard1_replica1] o.a.s.c.SolrCore New index directory detected: old=null new=C:\Users\jenkins\workspace\Lucene-Solr-6.x-Windows\solr\build\solr-core\test\J1\temp\solr.cloud.TestLocalFSCloudBackupRestore_A43467B507B06DCD-001\tempDir-001\node1\.\backuprestore_shard1_replica1\data\index/
   [junit4]   2> 190596 WARN  (qtp2077420951-1124) [n:127.0.0.1:65312_solr c:backuprestore s:shard1 r:core_node1 x:backuprestore_shard1_replica1] o.a.s.c.SolrCore [backuprestore_shard1_replica1] Solr index directory 'C:\Users\jenkins\workspace\Lucene-Solr-6.x-Windows\solr\build\solr-core\test\J1\temp\solr.cloud.TestLocalFSCloudBackupRestore_A43467B507B06DCD-001\tempDir-001\node1\.\backuprestore_shard1_replica1\data\index' doesn't exist. Creating new index...
   [junit4]   2> 190596 INFO  (qtp415745430-1115) [n:127.0.0.1:65308_solr c:backuprestore s:shard2 r:core_node2 x:backuprestore_shard2_replica1] o.a.s.c.CachingDirectoryFactory return new directory for C:\Users\jenkins\workspace\Lucene-Solr-6.x-Windows\solr\build\solr-core\test\J1\temp\solr.cloud.TestLocalFSCloudBackupRestore_A43467B507B06DCD-001\tempDir-001\node2\.\backuprestore_shard2_replica1\data\index
   [junit4]   2> 190597 INFO  (qtp2077420951-1124) [n:127.0.0.1:65312_solr c:backuprestore s:shard1 r:core_node1 x:backuprestore_shard1_replica1] o.a.s.c.CachingDirectoryFactory return new directory for C:\Users\jenkins\workspace\Lucene-Solr-6.x-Windows\solr\build\solr-core\test\J1\temp\solr.cloud.TestLocalFSCloudBackupRestore_A43467B507B06DCD-001\tempDir-001\node1\.\backuprestore_shard1_replica1\data\index
   [junit4]   2> 190598 INFO  (qtp415745430-1115) [n:127.0.0.1:65308_solr c:backuprestore s:shard2 r:core_node2 x:backuprestore_shard2_replica1] o.a.s.c.SolrDeletionPolicy SolrDeletionPolicy.onCommit: commits: num=1
   [junit4]   2> 	commit{dir=MockDirectoryWrapper(RAMDirectory@2ccb9608 lockFactory=org.apache.lucene.store.SingleInstanceLockFactory@7e47086c),segFN=segments_1,generation=1}
   [junit4]   2> 190598 INFO  (qtp415745430-1115) [n:127.0.0.1:65308_solr c:backuprestore s:shard2 r:core_node2 x:backuprestore_shard2_replica1] o.a.s.c.SolrDeletionPolicy newest commit generation = 1
   [junit4]   2> 190600 INFO  (qtp2077420951-1124) [n:127.0.0.1:65312_solr c:backuprestore s:shard1 r:core_node1 x:backuprestore_shard1_replica1] o.a.s.c.SolrDeletionPolicy SolrDeletionPolicy.onCommit: commits: num=1
   [junit4]   2> 	commit{dir=MockDirectoryWrapper(RAMDirectory@588adfd3 lockFactory=org.apache.lucene.store.SingleInstanceLockFactory@f7d6f66),segFN=segments_1,generation=1}
   [junit4]   2> 190600 INFO  (qtp2077420951-1124) [n:127.0.0.1:65312_solr c:backuprestore s:shard1 r:core_node1 x:backuprestore_shard1_replica1] o.a.s.c.SolrDeletionPolicy newest commit generation = 1
   [junit4]   2> 190600 INFO  (OldIndexDirectoryCleanupThreadForCore-backuprestore_shard2_replica1) [n:127.0.0.1:65308_solr c:backuprestore s:shard2 r:core_node2 x:backuprestore_shard2_replica1] o.a.s.c.SolrCore Looking for old index directories to cleanup for core backuprestore_shard2_replica1 in C:\Users\jenkins\workspace\Lucene-Solr-6.x-Windows\solr\build\solr-core\test\J1\temp\solr.cloud.TestLocalFSCloudBackupRestore_A43467B507B06DCD-001\tempDir-001\node2\.\backuprestore_shard2_replica1\data\
   [junit4]   2> 190601 INFO  (qtp2077420951-1124) [n:127.0.0.1:65312_solr c:backuprestore s:shard1 r:core_node1 x:backuprestore_shard1_replica1] o.a.s.c.SolrCore no updateRequestProcessorChain defined as default, creating implicit default
   [junit4]   2> 190601 INFO  (qtp415745430-1115) [n:127.0.0.1:65308_solr c:backuprestore s:shard2 r:core_node2 x:backuprestore_shard2_replica1] o.a.s.c.SolrCore no updateRequestProcessorChain defined as default, creating implicit default
   [junit4]   2> 190601 INFO  (OldIndexDirectoryCleanupThreadForCore-backuprestore_shard1_replica1) [n:127.0.0.1:65312_solr c:backuprestore s:shard1 r:core_node1 x:backuprestore_shard1_replica1] o.a.s.c.SolrCore Looking for old index directories to cleanup for core backuprestore_shard1_replica1 in C:\Users\jenkins\workspace\Lucene-Solr-6.x-Windows\solr\build\solr-core\test\J1\temp\solr.cloud.TestLocalFSCloudBackupRestore_A43467B507B06DCD-001\tempDir-001\node1\.\backuprestore_shard1_replica1\data\
   [junit4]   2> 190602 WARN  (OldIndexDirectoryCleanupThreadForCore-backuprestore_shard2_replica1) [n:127.0.0.1:65308_solr c:backuprestore s:shard2 r:core_node2 x:backuprestore_shard2_replica1] o.a.s.c.DirectoryFactory C:\Users\jenkins\workspace\Lucene-Solr-6.x-Windows\solr\build\solr-core\test\J1\temp\solr.cloud.TestLocalFSCloudBackupRestore_A43467B507B06DCD-001\tempDir-001\node2\.\backuprestore_shard2_replica1\data\ does not point to a valid data directory; skipping clean-up of old index directories.
   [junit4]   2> 190607 WARN  (OldIndexDirectoryCleanupThreadForCore-backuprestore_shard1_replica1) [n:127.0.0.1:65312_solr c:backuprestore s:shard1 r:core_node1 x:backuprestore_shard1_replica1] o.a.s.c.DirectoryFactory C:\Users\jenkins\workspace\Lucene-Solr-6.x-Windows\solr\build\solr-core\test\J1\temp\solr.cloud.TestLocalFSCloudBackupRestore_A43467B507B06DCD-001\tempDir-001\node1\.\backuprestore_shard1_replica1\data\ does not point to a valid data directory; skipping clean-up of old index directories.
   [junit4]   2> 190613 INFO  (qtp415745430-1115) [n:127.0.0.1:65308_solr c:backuprestore s:shard2 r:core_node2 x:backuprestore_shard2_replica1] o.a.s.h.l.XMLLoader xsltCacheLifetimeSeconds=60
   [junit4]   2> 190614 INFO  (qtp2077420951-1124) [n:127.0.0.1:65312_solr c:backuprestore s:shard1 r:core_node1 x:backuprestore_shard1_replica1] o.a.s.h.l.XMLLoader xsltCacheLifetimeSeconds=60
   [junit4]   2> 190615 INFO  (qtp415745430-1115) [n:127.0.0.1:65308_solr c:backuprestore s:shard2 r:core_node2 x:backuprestore_shard2_replica1] o.a.s.h.l.XMLLoader xsltCacheLifetimeSeconds=60
   [junit4]   2> 190616 INFO  (qtp2077420951-1124) [n:127.0.0.1:65312_solr c:backuprestore s:shard1 r:core_node1 x:backuprestore_shard1_replica1] o.a.s.h.l.XMLLoader xsltCacheLifetimeSeconds=60
   [junit4]   2> 190617 INFO  (qtp415745430-1115) [n:127.0.0.1:65308_solr c:backuprestore s:shard2 r:core_node2 x:backuprestore_shard2_replica1] o.a.s.h.l.XMLLoader xsltCacheLifetimeSeconds=60
   [junit4]   2> 190619 INFO  (qtp415745430-1115) [n:127.0.0.1:65308_solr c:backuprestore s:shard2 r:core_node2 x:backuprestore_shard2_replica1] o.a.s.h.l.XMLLoader xsltCacheLifetimeSeconds=60
   [junit4]   2> 190622 INFO  (qtp415745430-1115) [n:127.0.0.1:65308_solr c:backuprestore s:shard2 r:core_node2 x:backuprestore_shard2_replica1] o.a.s.c.RequestHandlers Registered paths: /admin/mbeans,/update/json/docs,/admin/luke,/export,/get,/admin/properties,/update/json,/admin/threads,/update/csv,/sql,/graph,/select,/admin/segments,/admin/system,/replication,/config,/stream,/schema,/admin/plugins,/admin/logging,/admin/ping,/update,/admin/file,/terms
   [junit4]   2> 190622 INFO  (qtp415745430-1115) [n:127.0.0.1:65308_solr c:backuprestore s:shard2 r:core_node2 x:backuprestore_shard2_replica1] o.a.s.c.SolrCore Using default statsCache cache: org.apache.solr.search.stats.LocalStatsCache
   [junit4]   2> 190624 INFO  (qtp415745430-1115) [n:127.0.0.1:65308_solr c:backuprestore s:shard2 r:core_node2 x:backuprestore_shard2_replica1] o.a.s.u.UpdateHandler Using UpdateLog implementation: org.apache.solr.update.UpdateLog
   [junit4]   2> 190624 INFO  (qtp415745430-1115) [n:127.0.0.1:65308_solr c:backuprestore s:shard2 r:core_node2 x:backuprestore_shard2_replica1] o.a.s.u.UpdateLog Initializing UpdateLog: dataDir=null defaultSyncLevel=FLUSH numRecordsToKeep=100 maxNumLogsToKeep=10 numVersionBuckets=65536
   [junit4]   2> 190627 INFO  (qtp415745430-1115) [n:127.0.0.1:65308_solr c:backuprestore s:shard2 r:core_node2 x:backuprestore_shard2_replica1] o.a.s.u.CommitTracker Hard AutoCommit: disabled
   [junit4]   2> 190627 INFO  (qtp415745430-1115) [n:127.0.0.1:65308_solr c:backuprestore s:shard2 r:core_node2 x:backuprestore_shard2_replica1] o.a.s.u.CommitTracker Soft AutoCommit: disabled
   [junit4]   2> 190628 INFO  (qtp2077420951-1124) [n:127.0.0.1:65312_solr c:backuprestore s:shard1 r:core_node1 x:backuprestore_shard1_replica1] o.a.s.h.l.XMLLoader xsltCacheLifetimeSeconds=60
   [junit4]   2> 190629 INFO  (qtp415745430-1115) [n:127.0.0.1:65308_solr c:backuprestore s:shard2 r:core_node2 x:backuprestore_shard2_replica1] o.a.s.c.SolrDeletionPolicy SolrDeletionPolicy.onInit: commits: num=1
   [junit4]   2> 	commit{dir=MockDirectoryWrapper(RAMDirectory@2ccb9608 lockFactory=org.apache.lucene.store.SingleInstanceLockFactory@7e47086c),segFN=segments_1,generation=1}
   [junit4]   2> 190629 INFO  (qtp415745430-1115) [n:127.0.0.1:65308_solr c:backuprestore s:shard2 r:core_node2 x:backuprestore_shard2_replica1] o.a.s.c.SolrDeletionPolicy newest commit generation = 1
   [junit4]   2> 190629 INFO  (qtp415745430-1115) [n:127.0.0.1:65308_solr c:backuprestore s:shard2 r:core_node2 x:backuprestore_shard2_replica1] o.a.s.s.SolrIndexSearcher Opening [Searcher@3fc625b6[backuprestore_shard2_replica1] main]
   [junit4]   2> 190629 INFO  (qtp415745430-1115) [n:127.0.0.1:65308_solr c:backuprestore s:shard2 r:core_node2 x:backuprestore_shard2_replica1] o.a.s.c.c.ZkStateReader Load collection config from: [/collections/backuprestore]
   [junit4]   2> 190630 INFO  (qtp2077420951-1124) [n:127.0.0.1:65312_solr c:backuprestore s:shard1 r:core_node1 x:backuprestore_shard1_replica1] o.a.s.h.l.XMLLoader xsltCacheLifetimeSeconds=60
   [junit4]   2> 190631 INFO  (qtp2077420951-1124) [n:127.0.0.1:65312_solr c:backuprestore s:shard1 r:core_node1 x:backuprestore_shard1_replica1] o.a.s.c.RequestHandlers Registered paths: /admin/mbeans,/update/json/docs,/admin/luke,/export,/get,/admin/properties,/update/json,/admin/threads,/update/csv,/sql,/graph,/select,/admin/segments,/admin/system,/replication,/config,/stream,/schema,/admin/plugins,/admin/logging,/admin/ping,/update,/admin/file,/terms
   [junit4]   2> 190631 INFO  (qtp2077420951-1124) [n:127.0.0.1:65312_solr c:backuprestore s:shard1 r:core_node1 x:backuprestore_shard1_replica1] o.a.s.c.SolrCore Using default statsCache cache: org.apache.solr.search.stats.LocalStatsCache
   [junit4]   2> 190632 INFO  (qtp415745430-1115) [n:127.0.0.1:65308_solr c:backuprestore s:shard2 r:core_node2 x:backuprestore_shard2_replica1] o.a.s.c.c.ZkStateReader path=[/collections/backuprestore] [configName]=[conf1] specified config exists in ZooKeeper
   [junit4]   2> 190632 INFO  (qtp415745430-1115) [n:127.0.0.1:65308_solr c:backuprestore s:shard2 r:core_node2 x:backuprestore_shard2_replica1] o.a.s.r.ManagedResourceStorage Setting up ZooKeeper-based storage for the RestManager with znodeBase: /configs/conf1
   [junit4]   2> 190632 INFO  (qtp415745430-1115) [n:127.0.0.1:65308_solr c:backuprestore s:shard2 r:core_node2 x:backuprestore_shard2_replica1] o.a.s.r.ManagedResourceStorage Configured ZooKeeperStorageIO with znodeBase: /configs/conf1
   [junit4]   2> 190632 INFO  (qtp415745430-1115) [n:127.0.0.1:65308_solr c:backuprestore s:shard2 r:core_node2 x:backuprestore_shard2_replica1] o.a.s.r.RestManager Initializing RestManager with initArgs: {}
   [junit4]   2> 190632 INFO  (qtp415745430-1115) [n:127.0.0.1:65308_solr c:backuprestore s:shard2 r:core_node2 x:backuprestore_shard2_replica1] o.a.s.r.ManagedResourceStorage Reading _rest_managed.json using ZooKeeperStorageIO:path=/configs/conf1
   [junit4]   2> 190633 INFO  (qtp2077420951-1124) [n:127.0.0.1:65312_solr c:backuprestore s:shard1 r:core_node1 x:backuprestore_shard1_replica1] o.a.s.u.UpdateHandler Using UpdateLog implementation: org.apache.solr.update.UpdateLog
   [junit4]   2> 190633 INFO  (qtp2077420951-1124) [n:127.0.0.1:65312_solr c:backuprestore s:shard1 r:core_node1 x:backuprestore_shard1_replica1] o.a.s.u.UpdateLog Initializing UpdateLog: dataDir=null defaultSyncLevel=FLUSH numRecordsToKeep=100 maxNumLogsToKeep=10 numVersionBuckets=65536
   [junit4]   2> 190633 INFO  (qtp415745430-1115) [n:127.0.0.1:65308_solr c:backuprestore s:shard2 r:core_node2 x:backuprestore_shard2_replica1] o.a.s.r.ManagedResourceStorage No data found for znode /configs/conf1/_rest_managed.json
   [junit4]   2> 190633 INFO  (qtp415745430-1115) [n:127.0.0.1:65308_solr c:backuprestore s:shard2 r:core_node2 x:backuprestore_shard2_replica1] o.a.s.r.ManagedResourceStorage Loaded null at path _rest_managed.json using ZooKeeperStorageIO:path=/configs/conf1
   [junit4]   2> 190634 INFO  (qtp415745430-1115) [n:127.0.0.1:65308_solr c:backuprestore s:shard2 r:core_node2 x:backuprestore_shard2_replica1] o.a.s.r.RestManager Initializing 0 registered ManagedResources
   [junit4]   2> 190634 INFO  (qtp415745430-1115) [n:127.0.0.1:65308_solr c:backuprestore s:shard2 r:core_node2 x:backuprestore_shard2_replica1] o.a.s.h.ReplicationHandler Commits will be reserved for  10000
   [junit4]   2> 190634 INFO  (qtp415745430-1115) [n:127.0.0.1:65308_solr c:backuprestore s:shard2 r:core_node2 x:backuprestore_shard2_replica1] o.a.s.u.UpdateLog Looking up max value of version field to seed version buckets
   [junit4]   2> 190634 INFO  (qtp415745430-1115) [n:127.0.0.1:65308_solr c:backuprestore s:shard2 r:core_node2 x:backuprestore_shard2_replica1] o.a.s.u.VersionInfo Refreshing highest value of _version_ for 65536 version buckets from index
   [junit4]   2> 190634 INFO  (qtp415745430-1115) [n:127.0.0.1:65308_solr c:backuprestore s:shard2 r:core_node2 x:backuprestore_shard2_replica1] o.a.s.u.VersionInfo No terms found for _version_, cannot seed version bucket highest value from index
   [junit4]   2> 190634 INFO  (qtp415745430-1115) [n:127.0.0.1:65308_solr c:backuprestore s:shard2 r:core_node2 x:backuprestore_shard2_replica1] o.a.s.u.UpdateLog Could not find max version in index or recent updates, using new clock 1539147560921333760
   [junit4]   2> 190635 INFO  (qtp2077420951-1124) [n:127.0.0.1:65312_solr c:backuprestore s:shard1 r:core_node1 x:backuprestore_shard1_replica1] o.a.s.u.CommitTracker Hard AutoCommit: disabled
   [junit4]   2> 190635 INFO  (qtp2077420951-1124) [n:127.0.0.1:65312_solr c:backuprestore s:shard1 r:core_node1 x:backuprestore_shard1_replica1] o.a.s.u.CommitTracker Soft AutoCommit: disabled
   [junit4]   2> 190635 INFO  (qtp415745430-1115) [n:127.0.0.1:65308_solr c:backuprestore s:shard2 r:core_node2 x:backuprestore_shard2_replica1] o.a.s.u.UpdateLog Took 1.0ms to seed version buckets with highest version 1539147560921333760
   [junit4]   2> 190635 INFO  (searcherExecutor-763-thread-1-processing-n:127.0.0.1:65308_solr x:backuprestore_shard2_replica1 s:shard2 c:backuprestore r:core_node2) [n:127.0.0.1:65308_solr c:backuprestore s:shard2 r:core_node2 x:backuprestore_shard2_replica1] o.a.s.c.SolrCore [backuprestore_shard2_replica1] Registered new searcher Searcher@3fc625b6[backuprestore_shard2_replica1] main{ExitableDirectoryReader(UninvertingDirectoryReader())}
   [junit4]   2> 190635 INFO  (qtp415745430-1115) [n:127.0.0.1:65308_solr c:backuprestore s:shard2 r:core_node2 x:backuprestore_shard2_replica1] o.a.s.c.ZkController watch zkdir /configs/conf1
   [junit4]   2> 190653 INFO  (qtp415745430-1115) [n:127.0.0.1:65308_solr c:backuprestore s:shard2 r:core_node2 x:backuprestore_shard2_replica1] o.a.s.c.CoreContainer registering core: backuprestore_shard2_replica1
   [junit4]   2> 190653 INFO  (qtp415745430-1115) [n:127.0.0.1:65308_solr c:backuprestore s:shard2 r:core_node2 x:backuprestore_shard2_replica1] o.a.s.c.ZkController Register replica - core:backuprestore_shard2_replica1 address:http://127.0.0.1:65308/solr collection:backuprestore shard:shard2
   [junit4]   2> 190655 INFO  (qtp415745430-1115) [n:127.0.0.1:65308_solr c:backuprestore s:shard2 r:core_node2 x:backuprestore_shard2_replica1] o.a.s.c.c.SolrZkClient makePath: /collections/backuprestore/leader_elect/shard2/election
   [junit4]   2> 190657 INFO  (qtp2077420951-1124) [n:127.0.0.1:65312_solr c:backuprestore s:shard1 r:core_node1 x:backuprestore_shard1_replica1] o.a.s.c.SolrDeletionPolicy SolrDeletionPolicy.onInit: commits: num=1
   [junit4]   2> 	commit{dir=MockDirectoryWrapper(RAMDirectory@588adfd3 lockFactory=org.apache.lucene.store.SingleInstanceLockFactory@f7d6f66),segFN=segments_1,generation=1}
   [junit4]   2> 190657 INFO  (qtp2077420951-1124) [n:127.0.0.1:65312_solr c:backuprestore s:shard1 r:core_node1 x:backuprestore_shard1_replica1] o.a.s.c.SolrDeletionPolicy newest commit generation = 1
   [junit4]   2> 190657 INFO  (qtp2077420951-1124) [n:127.0.0.1:65312_solr c:backuprestore s:shard1 r:core_node1 x:backuprestore_shard1_replica1] o.a.s.s.SolrIndexSearcher Opening [Searcher@71cfa5c7[backuprestore_shard1_replica1] main]
   [junit4]   2> 190658 INFO  (qtp2077420951-1124) [n:127.0.0.1:65312_solr c:backuprestore s:shard1 r:core_node1 x:backuprestore_shard1_replica1] o.a.s.c.c.ZkStateReader Load collection config from: [/collections/backuprestore]
   [junit4]   2> 190661 INFO  (qtp2077420951-1124) [n:127.0.0.1:65312_solr c:backuprestore s:shard1 r:core_node1 x:backuprestore_shard1_replica1] o.a.s.c.c.ZkStateReader path=[/collections/backuprestore] [configName]=[conf1] specified config exists in ZooKeeper
   [junit4]   2> 190661 INFO  (qtp2077420951-1124) [n:127.0.0.1:65312_solr c:backuprestore s:shard1 r:core_node1 x:backuprestore_shard1_replica1] o.a.s.r.ManagedResourceStorage Setting up ZooKeeper-based storage for the RestManager with znodeBase: /configs/conf1
   [junit4]   2> 190661 INFO  (qtp2077420951-1124) [n:127.0.0.1:65312_solr c:backuprestore s:shard1 r:core_node1 x:backuprestore_shard1_replica1] o.a.s.r.ManagedResourceStorage Configured ZooKeeperStorageIO with znodeBase: /configs/conf1
   [junit4]   2> 190661 INFO  (qtp2077420951-1124) [n:127.0.0.1:65312_solr c:backuprestore s:shard1 r:core_node1 x:backuprestore_shard1_replica1] o.a.s.r.RestManager Initializing RestManager with initArgs: {}
   [junit4]   2> 190661 INFO  (qtp2077420951-1124) [n:127.0.0.1:65312_solr c:backuprestore s:shard1 r:core_node1 x:backuprestore_shard1_replica1] o.a.s.r.ManagedResourceStorage Reading _rest_managed.json using ZooKeeperStorageIO:path=/configs/conf1
   [junit4]   2> 190662 INFO  (qtp415745430-1115) [n:127.0.0.1:65308_solr c:backuprestore s:shard2 r:core_node2 x:backuprestore_shard2_replica1] o.a.s.c.LeaderElector Joined leadership election with path: /collections/backuprestore/leader_elect/shard2/election/96196722453053446-core_node2-n_0000000000
   [junit4]   2> 190662 INFO  (qtp2077420951-1124) [n:127.0.0.1:65312_solr c:backuprestore s:shard1 r:core_node1 x:backuprestore_shard1_replica1] o.a.s.r.ManagedResourceStorage No data found for znode /configs/conf1/_rest_managed.json
   [junit4]   2> 190662 INFO  (qtp2077420951-1124) [n:127.0.0.1:65312_solr c:backuprestore s:shard1 r:core_node1 x:backuprestore_shard1_replica1] o.a.s.r.ManagedResourceStorage Loaded null at path _rest_managed.json using ZooKeeperStorageIO:path=/configs/conf1
   [junit4]   2> 190662 INFO  (qtp2077420951-1124) [n:127.0.0.1:65312_solr c:backuprestore s:shard1 r:core_node1 x:backuprestore_shard1_replica1] o.a.s.r.RestManager Initializing 0 registered ManagedResources
   [junit4]   2> 190662 INFO  (qtp2077420951-1124) [n:127.0.0.1:65312_solr c:backuprestore s:shard1 r:core_node1 x:backuprestore_shard1_replica1] o.a.s.h.ReplicationHandler Commits will be reserved for  10000
   [junit4]   2> 190662 INFO  (qtp2077420951-1124) [n:127.0.0.1:65312_solr c:backuprestore s:shard1 r:core_node1 x:backuprestore_shard1_replica1] o.a.s.u.UpdateLog Looking up max value of version field to seed version buckets
   [junit4]   2> 190662 INFO  (qtp2077420951-1124) [n:127.0.0.1:65312_solr c:backuprestore s:shard1 r:core_node1 x:backuprestore_shard1_replica1] o.a.s.u.VersionInfo Refreshing highest value of _version_ for 65536 version buckets from index
   [junit4]   2> 190662 INFO  (qtp2077420951-1124) [n:127.0.0.1:65312_solr c:backuprestore s:shard1 r:core_node1 x:backuprestore_shard1_replica1] o.a.s.u.VersionInfo No terms found for _version_, cannot seed version bucket highest value from index
   [junit4]   2> 190662 INFO  (qtp2077420951-1124) [n:127.0.0.1:65312_solr c:backuprestore s:shard1 r:core_node1 x:backuprestore_shard1_replica1] o.a.s.u.UpdateLog Could not find max version in index or recent updates, using new clock 1539147560950693888
   [junit4]   2> 190663 INFO  (qtp415745430-1115) [n:127.0.0.1:65308_solr c:backuprestore s:shard2 r:core_node2 x:backuprestore_shard2_replica1] o.a.s.c.ShardLeaderElectionContext Running the leader process for shard=shard2 and weAreReplacement=false and leaderVoteWait=10000
   [junit4]   2> 190663 INFO  (searcherExecutor-762-thread-1-processing-n:127.0.0.1:65312_solr x:backuprestore_shard1_replica1 s:shard1 c:backuprestore r:core_node1) [n:127.0.0.1:65312_solr c:backuprestore s:shard1 r:core_node1 x:backuprestore_shard1_replica1] o.a.s.c.SolrCore [backuprestore_shard1_replica1] Registered new searcher Searcher@71cfa5c7[backuprestore_shard1_replica1] main{ExitableDirectoryReader(UninvertingDirectoryReader())}
   [junit4]   2> 190664 INFO  (qtp2077420951-1124) [n:127.0.0.1:65312_solr c:backuprestore s:shard1 r:core_node1 x:backuprestore_shard1_replica1] o.a.s.u.UpdateLog Took 1.0ms to seed version buckets with highest version 1539147560950693888
   [junit4]   2> 190664 INFO  (qtp2077420951-1124) [n:127.0.0.1:65312_solr c:backuprestore s:shard1 r:core_node1 x:backuprestore_shard1_replica1] o.a.s.c.ZkController watch zkdir /configs/conf1
   [junit4]   2> 190665 INFO  (qtp2077420951-1124) [n:127.0.0.1:65312_solr c:backuprestore s:shard1 r:core_node1 x:backuprestore_shard1_replica1] o.a.s.c.CoreContainer registering core: backuprestore_shard1_replica1
   [junit4]   2> 190665 INFO  (qtp2077420951-1124) [n:127.0.0.1:65312_solr c:backuprestore s:shard1 r:core_node1 x:backuprestore_shard1_replica1] o.a.s.c.ZkController Register replica - core:backuprestore_shard1_replica1 address:http://127.0.0.1:65312/solr collection:backuprestore shard:shard1
   [junit4]   2> 190669 INFO  (qtp415745430-1115) [n:127.0.0.1:65308_solr c:backuprestore s:shard2 r:core_node2 x:backuprestore_shard2_replica1] o.a.s.c.ShardLeaderElectionContext Enough replicas found to continue.
   [junit4]   2> 190669 INFO  (qtp415745430-1115) [n:127.0.0.1:65308_solr c:backuprestore s:shard2 r

[...truncated too long message...]

ateReaderTest.testExternalCollectionWatchedNotWatched-seed#[A43467B507B06DCD]) [    ] o.a.s.c.c.SolrZkClient makePath: /collections/c1
   [junit4]   2> 2566617 INFO  (zkCallback-3226-thread-1) [    ] o.a.s.c.c.ZkStateReader A collections change: [WatchedEvent state:SyncConnected type:NodeChildrenChanged path:/collections], has occurred - updating...
   [junit4]   2> 2566618 INFO  (TEST-ZkStateReaderTest.testExternalCollectionWatchedNotWatched-seed#[A43467B507B06DCD]) [    ] o.a.s.c.o.ZkStateWriter going to create_collection /collections/c1/state.json
   [junit4]   2> 2566619 INFO  (TEST-ZkStateReaderTest.testExternalCollectionWatchedNotWatched-seed#[A43467B507B06DCD]) [    ] o.a.s.c.c.ZkStateReader Add data for [c1] ver [0]
   [junit4]   2> 2566619 WARN  (NIOServerCxn.Factory:0.0.0.0/0.0.0.0:0) [    ] o.a.z.s.NIOServerCnxn caught end of stream exception
   [junit4]   2> EndOfStreamException: Unable to read additional data from client sessionid 0x155c28d15500002, likely client has closed socket
   [junit4]   2> 	at org.apache.zookeeper.server.NIOServerCnxn.doIO(NIOServerCnxn.java:228)
   [junit4]   2> 	at org.apache.zookeeper.server.NIOServerCnxnFactory.run(NIOServerCnxnFactory.java:208)
   [junit4]   2> 	at java.lang.Thread.run(Thread.java:745)
   [junit4]   2> 2566621 INFO  (TEST-ZkStateReaderTest.testExternalCollectionWatchedNotWatched-seed#[A43467B507B06DCD]) [    ] o.a.s.c.ZkTestServer connecting to 127.0.0.1:63451 63451
   [junit4]   2> 2566623 INFO  (Thread-6766) [    ] o.a.s.c.ZkTestServer connecting to 127.0.0.1:63451 63451
   [junit4]   2> 2566624 INFO  (TEST-ZkStateReaderTest.testExternalCollectionWatchedNotWatched-seed#[A43467B507B06DCD]) [    ] o.a.s.SolrTestCaseJ4 ###Ending testExternalCollectionWatchedNotWatched
   [junit4]   2> 2566636 INFO  (SUITE-ZkStateReaderTest-seed#[A43467B507B06DCD]-worker) [    ] o.a.s.SolrTestCaseJ4 ###deleteCore
   [junit4]   2> NOTE: leaving temporary files on disk at: C:\Users\jenkins\workspace\Lucene-Solr-6.x-Windows\solr\build\solr-core\test\J1\temp\solr.cloud.overseer.ZkStateReaderTest_A43467B507B06DCD-001
   [junit4]   2> Jul 06, 2016 11:31:14 PM com.carrotsearch.randomizedtesting.ThreadLeakControl checkThreadLeaks
   [junit4]   2> WARNING: Will linger awaiting termination of 3 leaked thread(s).
   [junit4]   2> NOTE: test params are: codec=Asserting(Lucene62): {}, docValues:{}, maxPointsInLeafNode=1899, maxMBSortInHeap=5.950710074190799, sim=ClassicSimilarity, locale=zh-HK, timezone=Etc/GMT+3
   [junit4]   2> NOTE: Windows 10 10.0 amd64/Oracle Corporation 1.8.0_92 (64-bit)/cpus=3,threads=1,free=280982624,total=517492736
   [junit4]   2> NOTE: All tests run in this JVM: [BaseCdcrDistributedZkTest, RollingRestartTest, TolerantUpdateProcessorTest, ConjunctionSolrSpellCheckerTest, TestRangeQuery, TestShardHandlerFactory, SpellPossibilityIteratorTest, TestSystemIdResolver, HdfsChaosMonkeySafeLeaderTest, LeaderElectionIntegrationTest, TestRTGBase, TestUtils, ConnectionReuseTest, HdfsTlogReplayBufferedWhileIndexingTest, TestManagedSchema, FacetPivotSmallTest, CollectionReloadTest, TestFieldCacheSanityChecker, TestLocalFSCloudBackupRestore, CollectionTooManyReplicasTest, TestClusterStateMutator, UniqFieldsUpdateProcessorFactoryTest, DistributedFacetPivotLargeTest, TestCSVResponseWriter, SaslZkACLProviderTest, SortByFunctionTest, CSVRequestHandlerTest, TestSlowCompositeReaderWrapper, OutputWriterTest, CachingDirectoryFactoryTest, TestAtomicUpdateErrorCases, TestJsonFacets, TestBlendedInfixSuggestions, HLLSerializationTest, TestPivotHelperCode, TestZkChroot, TestSolrCoreProperties, TestOnReconnectListenerSupport, TestFuzzyAnalyzedSuggestions, TestSubQueryTransformerDistrib, TestSolrJ, MinimalSchemaTest, CdcrVersionReplicationTest, TestLMJelinekMercerSimilarityFactory, TestFreeTextSuggestions, NumericFieldsTest, TestSolrQueryParserResource, ZkSolrClientTest, DateMathParserTest, TestExceedMaxTermLength, TestReversedWildcardFilterFactory, SpellingQueryConverterTest, ResourceLoaderTest, CloneFieldUpdateProcessorFactoryTest, TestSimpleQParserPlugin, TestReload, TestFastWriter, TestInfoStreamLogging, OpenCloseCoreStressTest, TestPerFieldSimilarityWithDefaultOverride, TestFieldCache, TestJettySolrRunner, TestFieldSortValues, EchoParamsTest, RequestHandlersTest, TestTolerantUpdateProcessorCloud, TestNumericTerms32, TestConfigOverlay, SpatialRPTFieldTypeTest, TlogReplayBufferedWhileIndexingTest, TestRTimerTree, LeaderFailoverAfterPartitionTest, ExitableDirectoryReaderTest, BJQParserTest, MergeStrategyTest, ZkNodePropsTest, StatsComponentTest, TestSSLRandomization, TestExclusionRuleCollectionAccess, ZkStateWriterTest, TestClassicSimilarityFactory, DateFieldTest, TestIntervalFaceting, TestRawTransformer, CopyFieldTest, TestUninvertingReader, DistanceFunctionTest, OverriddenZkACLAndCredentialsProvidersTest, VMParamsZkACLAndCredentialsProvidersTest, TestGraphMLResponseWriter, SynonymTokenizerTest, BadCopyFieldTest, DistributedIntervalFacetingTest, SortSpecParsingTest, BlobRepositoryCloudTest, TestConfigSetProperties, TestUseDocValuesAsStored2, AliasIntegrationTest, RecoveryAfterSoftCommitTest, HdfsLockFactoryTest, TestCopyFieldCollectionResource, TestStandardQParsers, CreateCollectionCleanupTest, BlockCacheTest, SolrPluginUtilsTest, GraphQueryTest, TestSuggestSpellingConverter, SecurityConfHandlerTest, TestSolrQueryParser, TestCrossCoreJoin, TestPerFieldSimilarity, TestCloudManagedSchema, TestLeaderElectionZkExpiry, VersionInfoTest, TestValueSourceCache, AnalysisErrorHandlingTest, HdfsRecoveryZkTest, CurrencyFieldOpenExchangeTest, TestAuthenticationFramework, TestDistribDocBasedVersion, ExplicitHLLTest, QueryParsingTest, FileBasedSpellCheckerTest, DeleteStatusTest, BasicZkTest, DocValuesMissingTest, PKIAuthenticationIntegrationTest, TestFiltering, SparseHLLTest, TermVectorComponentTest, TestComplexPhraseQParserPlugin, TestRestoreCore, CollectionsAPISolrJTest, TestFastOutputStream, TestStressCloudBlindAtomicUpdates, DistributedFacetPivotWhiteBoxTest, CoreAdminCreateDiscoverTest, TestReloadDeadlock, DistributedTermsComponentTest, TestSolrIndexConfig, TestSortingResponseWriter, TestWriterPerf, TestSha256AuthenticationProvider, TestIndexSearcher, RuleEngineTest, TestCollationField, LoggingHandlerTest, SuggestComponentContextFilterQueryTest, MultiThreadedOCPTest, CleanupOldIndexTest, PluginInfoTest, TestPHPSerializedResponseWriter, ChaosMonkeySafeLeaderTest, BasicDistributedZk2Test, CollectionsAPIDistributedZkTest, SyncSliceTest, OverseerTest, ShardRoutingTest, RecoveryZkTest, FullSolrCloudDistribCmdsTest, TestReplicationHandler, ClusterStateUpdateTest, TestRandomFaceting, ShardRoutingCustomTest, TestDistributedGrouping, TestHashPartitioner, TermVectorComponentDistributedTest, TestStressReorder, TestJoin, TestSolr4Spatial, SpellCheckComponentTest, PeerSyncTest, ConvertedLegacyTest, TestLazyCores, SoftAutoCommitTest, CurrencyFieldXmlFileTest, TestCoreDiscovery, SignatureUpdateProcessorFactoryTest, SpellCheckCollatorTest, CoreAdminHandlerTest, SuggesterTSTTest, SuggesterTest, TestTrie, SuggesterWFSTTest, TestCSVLoader, PolyFieldTest, NoCacheHeaderTest, WordBreakSolrSpellCheckerTest, SolrCoreCheckLockOnStartupTest, TestPseudoReturnFields, FieldMutatingUpdateProcessorTest, QueryEqualityTest, DirectUpdateHandlerOptimizeTest, DefaultValueUpdateProcessorTest, DocValuesMultiTest, DebugComponentTest, CacheHeaderTest, LukeRequestHandlerTest, TestQueryTypes, TermsComponentTest, PathHierarchyTokenizerFactoryTest, FieldAnalysisRequestHandlerTest, IndexSchemaRuntimeFieldTest, TestJmxIntegration, UpdateRequestProcessorFactoryTest, JsonLoaderTest, SearchHandlerTest, UpdateParamsTest, TestStressRecovery, TestSolrDeletionPolicy2, MultiTermTest, TestElisionMultitermQuery, DirectSolrConnectionTest, TestLuceneMatchVersion, TestCodecSupport, TimeZoneUtilsTest, TestFastLRUCache, PreAnalyzedFieldTest, PrimUtilsTest, RAMDirectoryFactoryTest, TestLRUCache, SliceStateTest, SystemInfoHandlerTest, FileUtilsTest, DistributedMLTComponentTest, TestDistributedMissingSort, TestHighlightDedupGrouping, TestSimpleTrackingShardHandler, TestTolerantSearch, ActionThrottleTest, AsyncCallRequestStatusResponseTest, AsyncMigrateRouteKeyTest, DeleteInactiveReplicaTest, DeleteShardTest, DistributedQueueTest, ForceLeaderTest, OverseerRolesTest, SolrCloudExampleTest, TestMiniSolrCloudCluster, TestRebalanceLeaders, TestSizeLimitedDistributedMap, HdfsBasicDistributedZkTest, HdfsCollectionsAPIDistributedZkTest, HdfsNNFailoverTest, HdfsSyncSliceTest, HdfsThreadLeakTest, HdfsUnloadDistributedZkTest, HdfsWriteToMultipleCollectionsTest, ZkStateReaderTest]
   [junit4] Completed [499/621 (3!)] on J1 in 1.12s, 6 tests, 1 error <<< FAILURES!

[...truncated 373 lines...]
BUILD FAILED
C:\Users\jenkins\workspace\Lucene-Solr-6.x-Windows\build.xml:740: The following error occurred while executing this line:
C:\Users\jenkins\workspace\Lucene-Solr-6.x-Windows\build.xml:684: The following error occurred while executing this line:
C:\Users\jenkins\workspace\Lucene-Solr-6.x-Windows\build.xml:59: The following error occurred while executing this line:
C:\Users\jenkins\workspace\Lucene-Solr-6.x-Windows\solr\build.xml:233: The following error occurred while executing this line:
C:\Users\jenkins\workspace\Lucene-Solr-6.x-Windows\solr\common-build.xml:530: The following error occurred while executing this line:
C:\Users\jenkins\workspace\Lucene-Solr-6.x-Windows\lucene\common-build.xml:1427: The following error occurred while executing this line:
C:\Users\jenkins\workspace\Lucene-Solr-6.x-Windows\lucene\common-build.xml:984: There were test failures: 621 suites (10 ignored), 2642 tests, 1 suite-level error, 2 errors, 144 ignored (98 assumptions) [seed: A43467B507B06DCD]

Total time: 71 minutes 41 seconds
Build step 'Invoke Ant' marked build as failure
Archiving artifacts
[WARNINGS] Skipping publisher since build result is FAILURE
Recording test results
Email was triggered for: Failure - Any
Sending email for trigger: Failure - Any



Mime
View raw message