lucene-dev mailing list archives

Site index · List index
Message view « Date » · « Thread »
Top « Date » · « Thread »
From Apache Jenkins Server <jenk...@builds.apache.org>
Subject [JENKINS] Lucene-Solr-Tests-master - Build # 1263 - Still Failing
Date Thu, 07 Jul 2016 11:08:43 GMT
Build: https://builds.apache.org/job/Lucene-Solr-Tests-master/1263/

1 tests failed.
FAILED:  org.apache.solr.cloud.overseer.ZkStateReaderTest.testStateFormatUpdateWithExplicitRefreshLazy

Error Message:
Could not find collection : c1

Stack Trace:
org.apache.solr.common.SolrException: Could not find collection : c1
	at __randomizedtesting.SeedInfo.seed([C8DC0E1270FE2FF6:A393AE6F09F1F2CC]:0)
	at org.apache.solr.common.cloud.ClusterState.getCollection(ClusterState.java:192)
	at org.apache.solr.cloud.overseer.ZkStateReaderTest.testStateFormatUpdate(ZkStateReaderTest.java:129)
	at org.apache.solr.cloud.overseer.ZkStateReaderTest.testStateFormatUpdateWithExplicitRefreshLazy(ZkStateReaderTest.java:48)
	at sun.reflect.NativeMethodAccessorImpl.invoke0(Native Method)
	at sun.reflect.NativeMethodAccessorImpl.invoke(NativeMethodAccessorImpl.java:62)
	at sun.reflect.DelegatingMethodAccessorImpl.invoke(DelegatingMethodAccessorImpl.java:43)
	at java.lang.reflect.Method.invoke(Method.java:498)
	at com.carrotsearch.randomizedtesting.RandomizedRunner.invoke(RandomizedRunner.java:1764)
	at com.carrotsearch.randomizedtesting.RandomizedRunner$8.evaluate(RandomizedRunner.java:871)
	at com.carrotsearch.randomizedtesting.RandomizedRunner$9.evaluate(RandomizedRunner.java:907)
	at com.carrotsearch.randomizedtesting.RandomizedRunner$10.evaluate(RandomizedRunner.java:921)
	at com.carrotsearch.randomizedtesting.rules.SystemPropertiesRestoreRule$1.evaluate(SystemPropertiesRestoreRule.java:57)
	at org.apache.lucene.util.TestRuleSetupTeardownChained$1.evaluate(TestRuleSetupTeardownChained.java:49)
	at org.apache.lucene.util.AbstractBeforeAfterRule$1.evaluate(AbstractBeforeAfterRule.java:45)
	at org.apache.lucene.util.TestRuleThreadAndTestName$1.evaluate(TestRuleThreadAndTestName.java:48)
	at org.apache.lucene.util.TestRuleIgnoreAfterMaxFailures$1.evaluate(TestRuleIgnoreAfterMaxFailures.java:64)
	at org.apache.lucene.util.TestRuleMarkFailure$1.evaluate(TestRuleMarkFailure.java:47)
	at com.carrotsearch.randomizedtesting.rules.StatementAdapter.evaluate(StatementAdapter.java:36)
	at com.carrotsearch.randomizedtesting.ThreadLeakControl$StatementRunner.run(ThreadLeakControl.java:367)
	at com.carrotsearch.randomizedtesting.ThreadLeakControl.forkTimeoutingTask(ThreadLeakControl.java:809)
	at com.carrotsearch.randomizedtesting.ThreadLeakControl$3.evaluate(ThreadLeakControl.java:460)
	at com.carrotsearch.randomizedtesting.RandomizedRunner.runSingleTest(RandomizedRunner.java:880)
	at com.carrotsearch.randomizedtesting.RandomizedRunner$5.evaluate(RandomizedRunner.java:781)
	at com.carrotsearch.randomizedtesting.RandomizedRunner$6.evaluate(RandomizedRunner.java:816)
	at com.carrotsearch.randomizedtesting.RandomizedRunner$7.evaluate(RandomizedRunner.java:827)
	at com.carrotsearch.randomizedtesting.rules.StatementAdapter.evaluate(StatementAdapter.java:36)
	at com.carrotsearch.randomizedtesting.rules.SystemPropertiesRestoreRule$1.evaluate(SystemPropertiesRestoreRule.java:57)
	at org.apache.lucene.util.AbstractBeforeAfterRule$1.evaluate(AbstractBeforeAfterRule.java:45)
	at com.carrotsearch.randomizedtesting.rules.StatementAdapter.evaluate(StatementAdapter.java:36)
	at org.apache.lucene.util.TestRuleStoreClassName$1.evaluate(TestRuleStoreClassName.java:41)
	at com.carrotsearch.randomizedtesting.rules.NoShadowingOrOverridesOnMethodsRule$1.evaluate(NoShadowingOrOverridesOnMethodsRule.java:40)
	at com.carrotsearch.randomizedtesting.rules.NoShadowingOrOverridesOnMethodsRule$1.evaluate(NoShadowingOrOverridesOnMethodsRule.java:40)
	at com.carrotsearch.randomizedtesting.rules.StatementAdapter.evaluate(StatementAdapter.java:36)
	at com.carrotsearch.randomizedtesting.rules.StatementAdapter.evaluate(StatementAdapter.java:36)
	at com.carrotsearch.randomizedtesting.rules.StatementAdapter.evaluate(StatementAdapter.java:36)
	at org.apache.lucene.util.TestRuleAssertionsRequired$1.evaluate(TestRuleAssertionsRequired.java:53)
	at org.apache.lucene.util.TestRuleMarkFailure$1.evaluate(TestRuleMarkFailure.java:47)
	at org.apache.lucene.util.TestRuleIgnoreAfterMaxFailures$1.evaluate(TestRuleIgnoreAfterMaxFailures.java:64)
	at org.apache.lucene.util.TestRuleIgnoreTestSuites$1.evaluate(TestRuleIgnoreTestSuites.java:54)
	at com.carrotsearch.randomizedtesting.rules.StatementAdapter.evaluate(StatementAdapter.java:36)
	at com.carrotsearch.randomizedtesting.ThreadLeakControl$StatementRunner.run(ThreadLeakControl.java:367)
	at java.lang.Thread.run(Thread.java:745)




Build Log:
[...truncated 12210 lines...]
   [junit4] Suite: org.apache.solr.cloud.overseer.ZkStateReaderTest
   [junit4]   2> Creating dataDir: /x1/jenkins/jenkins-slave/workspace/Lucene-Solr-Tests-master/solr/build/solr-core/test/J1/temp/solr.cloud.overseer.ZkStateReaderTest_C8DC0E1270FE2FF6-001/init-core-data-001
   [junit4]   2> 1935860 INFO  (SUITE-ZkStateReaderTest-seed#[C8DC0E1270FE2FF6]-worker) [    ] o.a.s.SolrTestCaseJ4 Randomized ssl (false) and clientAuth (true) via: @org.apache.solr.util.RandomizeSSL(reason=, ssl=NaN, value=NaN, clientAuth=NaN)
   [junit4]   2> 1935862 INFO  (TEST-ZkStateReaderTest.testStateFormatUpdateWithExplicitRefreshLazy-seed#[C8DC0E1270FE2FF6]) [    ] o.a.s.SolrTestCaseJ4 ###Starting testStateFormatUpdateWithExplicitRefreshLazy
   [junit4]   2> 1935862 INFO  (TEST-ZkStateReaderTest.testStateFormatUpdateWithExplicitRefreshLazy-seed#[C8DC0E1270FE2FF6]) [    ] o.a.s.c.ZkTestServer STARTING ZK TEST SERVER
   [junit4]   2> 1935862 INFO  (Thread-5828) [    ] o.a.s.c.ZkTestServer client port:0.0.0.0/0.0.0.0:0
   [junit4]   2> 1935862 INFO  (Thread-5828) [    ] o.a.s.c.ZkTestServer Starting server
   [junit4]   2> 1935962 INFO  (TEST-ZkStateReaderTest.testStateFormatUpdateWithExplicitRefreshLazy-seed#[C8DC0E1270FE2FF6]) [    ] o.a.s.c.ZkTestServer start zk server on port:48926
   [junit4]   2> 1935963 INFO  (TEST-ZkStateReaderTest.testStateFormatUpdateWithExplicitRefreshLazy-seed#[C8DC0E1270FE2FF6]) [    ] o.a.s.c.c.SolrZkClient Using default ZkCredentialsProvider
   [junit4]   2> 1935963 INFO  (TEST-ZkStateReaderTest.testStateFormatUpdateWithExplicitRefreshLazy-seed#[C8DC0E1270FE2FF6]) [    ] o.a.s.c.c.ConnectionManager Waiting for client to connect to ZooKeeper
   [junit4]   2> 1935965 INFO  (zkCallback-15091-thread-1) [    ] o.a.s.c.c.ConnectionManager Watcher org.apache.solr.common.cloud.ConnectionManager@7d3a5edf name:ZooKeeperConnection Watcher:127.0.0.1:48926 got event WatchedEvent state:SyncConnected type:None path:null path:null type:None
   [junit4]   2> 1935965 INFO  (TEST-ZkStateReaderTest.testStateFormatUpdateWithExplicitRefreshLazy-seed#[C8DC0E1270FE2FF6]) [    ] o.a.s.c.c.ConnectionManager Client is connected to ZooKeeper
   [junit4]   2> 1935966 INFO  (TEST-ZkStateReaderTest.testStateFormatUpdateWithExplicitRefreshLazy-seed#[C8DC0E1270FE2FF6]) [    ] o.a.s.c.c.SolrZkClient Using default ZkACLProvider
   [junit4]   2> 1935967 INFO  (TEST-ZkStateReaderTest.testStateFormatUpdateWithExplicitRefreshLazy-seed#[C8DC0E1270FE2FF6]) [    ] o.a.s.c.c.SolrZkClient Using default ZkCredentialsProvider
   [junit4]   2> 1935967 INFO  (TEST-ZkStateReaderTest.testStateFormatUpdateWithExplicitRefreshLazy-seed#[C8DC0E1270FE2FF6]) [    ] o.a.s.c.c.ConnectionManager Waiting for client to connect to ZooKeeper
   [junit4]   2> 1935968 INFO  (zkCallback-15092-thread-1) [    ] o.a.s.c.c.ConnectionManager Watcher org.apache.solr.common.cloud.ConnectionManager@2a5c944c name:ZooKeeperConnection Watcher:127.0.0.1:48926 got event WatchedEvent state:SyncConnected type:None path:null path:null type:None
   [junit4]   2> 1935968 INFO  (TEST-ZkStateReaderTest.testStateFormatUpdateWithExplicitRefreshLazy-seed#[C8DC0E1270FE2FF6]) [    ] o.a.s.c.c.ConnectionManager Client is connected to ZooKeeper
   [junit4]   2> 1935968 INFO  (TEST-ZkStateReaderTest.testStateFormatUpdateWithExplicitRefreshLazy-seed#[C8DC0E1270FE2FF6]) [    ] o.a.s.c.c.SolrZkClient Using default ZkACLProvider
   [junit4]   2> 1935968 INFO  (TEST-ZkStateReaderTest.testStateFormatUpdateWithExplicitRefreshLazy-seed#[C8DC0E1270FE2FF6]) [    ] o.a.s.c.c.SolrZkClient makePath: /solr
   [junit4]   2> 1935972 INFO  (TEST-ZkStateReaderTest.testStateFormatUpdateWithExplicitRefreshLazy-seed#[C8DC0E1270FE2FF6]) [    ] o.a.s.c.c.SolrZkClient Using default ZkCredentialsProvider
   [junit4]   2> 1935972 INFO  (TEST-ZkStateReaderTest.testStateFormatUpdateWithExplicitRefreshLazy-seed#[C8DC0E1270FE2FF6]) [    ] o.a.s.c.c.ConnectionManager Waiting for client to connect to ZooKeeper
   [junit4]   2> 1935973 INFO  (zkCallback-15093-thread-1) [    ] o.a.s.c.c.ConnectionManager Watcher org.apache.solr.common.cloud.ConnectionManager@50784588 name:ZooKeeperConnection Watcher:127.0.0.1:48926/solr got event WatchedEvent state:SyncConnected type:None path:null path:null type:None
   [junit4]   2> 1935973 INFO  (TEST-ZkStateReaderTest.testStateFormatUpdateWithExplicitRefreshLazy-seed#[C8DC0E1270FE2FF6]) [    ] o.a.s.c.c.ConnectionManager Client is connected to ZooKeeper
   [junit4]   2> 1935973 INFO  (TEST-ZkStateReaderTest.testStateFormatUpdateWithExplicitRefreshLazy-seed#[C8DC0E1270FE2FF6]) [    ] o.a.s.c.c.SolrZkClient Using default ZkACLProvider
   [junit4]   2> 1935974 INFO  (TEST-ZkStateReaderTest.testStateFormatUpdateWithExplicitRefreshLazy-seed#[C8DC0E1270FE2FF6]) [    ] o.a.s.c.c.SolrZkClient makePath: /live_nodes
   [junit4]   2> 1935975 INFO  (TEST-ZkStateReaderTest.testStateFormatUpdateWithExplicitRefreshLazy-seed#[C8DC0E1270FE2FF6]) [    ] o.a.s.c.c.SolrZkClient makePath: /collections
   [junit4]   2> 1935976 INFO  (TEST-ZkStateReaderTest.testStateFormatUpdateWithExplicitRefreshLazy-seed#[C8DC0E1270FE2FF6]) [    ] o.a.s.c.c.SolrZkClient makePath: /aliases.json
   [junit4]   2> 1935977 INFO  (TEST-ZkStateReaderTest.testStateFormatUpdateWithExplicitRefreshLazy-seed#[C8DC0E1270FE2FF6]) [    ] o.a.s.c.c.SolrZkClient makePath: /clusterstate.json
   [junit4]   2> 1935978 INFO  (TEST-ZkStateReaderTest.testStateFormatUpdateWithExplicitRefreshLazy-seed#[C8DC0E1270FE2FF6]) [    ] o.a.s.c.c.SolrZkClient makePath: /security.json
   [junit4]   2> 1935979 INFO  (TEST-ZkStateReaderTest.testStateFormatUpdateWithExplicitRefreshLazy-seed#[C8DC0E1270FE2FF6]) [    ] o.a.s.c.c.ZkStateReader Updating cluster state from ZooKeeper... 
   [junit4]   2> 1935979 INFO  (TEST-ZkStateReaderTest.testStateFormatUpdateWithExplicitRefreshLazy-seed#[C8DC0E1270FE2FF6]) [    ] o.a.s.c.c.ZkStateReader Loaded empty cluster properties
   [junit4]   2> 1935982 INFO  (TEST-ZkStateReaderTest.testStateFormatUpdateWithExplicitRefreshLazy-seed#[C8DC0E1270FE2FF6]) [    ] o.a.s.c.c.ZkStateReader Updated live nodes from ZooKeeper... (0) -> (0)
   [junit4]   2> 1935983 INFO  (TEST-ZkStateReaderTest.testStateFormatUpdateWithExplicitRefreshLazy-seed#[C8DC0E1270FE2FF6]) [    ] o.a.s.c.c.SolrZkClient makePath: /collections/c1
   [junit4]   2> 1935985 INFO  (TEST-ZkStateReaderTest.testStateFormatUpdateWithExplicitRefreshLazy-seed#[C8DC0E1270FE2FF6]) [    ] o.a.s.c.c.ZkStateReader Checking legacy cluster state for collection c1
   [junit4]   2> 1935986 INFO  (TEST-ZkStateReaderTest.testStateFormatUpdateWithExplicitRefreshLazy-seed#[C8DC0E1270FE2FF6]) [    ] o.a.s.c.o.ZkStateWriter going to create_collection /collections/c1/state.json
   [junit4]   2> 1935987 INFO  (TEST-ZkStateReaderTest.testStateFormatUpdateWithExplicitRefreshLazy-seed#[C8DC0E1270FE2FF6]) [    ] o.a.s.c.c.ZkStateReader Checking legacy cluster state for collection c1
   [junit4]   2> 1935988 INFO  (TEST-ZkStateReaderTest.testStateFormatUpdateWithExplicitRefreshLazy-seed#[C8DC0E1270FE2FF6]) [    ] o.a.s.c.ZkTestServer connecting to 127.0.0.1:48926 48926
   [junit4]   2> 1935989 ERROR (TEST-ZkStateReaderTest.testStateFormatUpdateWithExplicitRefreshLazy-seed#[C8DC0E1270FE2FF6]-EventThread) [    ] o.a.z.ClientCnxn Error while calling watcher 
   [junit4]   2> java.util.concurrent.RejectedExecutionException: Task org.apache.solr.common.util.ExecutorUtil$MDCAwareThreadPoolExecutor$$Lambda$43/948588793@526603ff rejected from org.apache.solr.common.util.ExecutorUtil$MDCAwareThreadPoolExecutor@56598d6b[Terminated, pool size = 0, active threads = 0, queued tasks = 0, completed tasks = 1]
   [junit4]   2> 	at java.util.concurrent.ThreadPoolExecutor$AbortPolicy.rejectedExecution(ThreadPoolExecutor.java:2047)
   [junit4]   2> 	at java.util.concurrent.ThreadPoolExecutor.reject(ThreadPoolExecutor.java:823)
   [junit4]   2> 	at java.util.concurrent.ThreadPoolExecutor.execute(ThreadPoolExecutor.java:1369)
   [junit4]   2> 	at org.apache.solr.common.util.ExecutorUtil$MDCAwareThreadPoolExecutor.execute(ExecutorUtil.java:214)
   [junit4]   2> 	at java.util.concurrent.AbstractExecutorService.submit(AbstractExecutorService.java:112)
   [junit4]   2> 	at org.apache.solr.common.cloud.SolrZkClient$3.process(SolrZkClient.java:266)
   [junit4]   2> 	at org.apache.zookeeper.ClientCnxn$EventThread.processEvent(ClientCnxn.java:522)
   [junit4]   2> 	at org.apache.zookeeper.ClientCnxn$EventThread.run(ClientCnxn.java:498)
   [junit4]   2> 1935990 ERROR (TEST-ZkStateReaderTest.testStateFormatUpdateWithExplicitRefreshLazy-seed#[C8DC0E1270FE2FF6]-EventThread) [    ] o.a.z.ClientCnxn Error while calling watcher 
   [junit4]   2> java.util.concurrent.RejectedExecutionException: Task org.apache.solr.common.util.ExecutorUtil$MDCAwareThreadPoolExecutor$$Lambda$43/948588793@4019a48a rejected from org.apache.solr.common.util.ExecutorUtil$MDCAwareThreadPoolExecutor@56598d6b[Terminated, pool size = 0, active threads = 0, queued tasks = 0, completed tasks = 1]
   [junit4]   2> 	at java.util.concurrent.ThreadPoolExecutor$AbortPolicy.rejectedExecution(ThreadPoolExecutor.java:2047)
   [junit4]   2> 	at java.util.concurrent.ThreadPoolExecutor.reject(ThreadPoolExecutor.java:823)
   [junit4]   2> 	at java.util.concurrent.ThreadPoolExecutor.execute(ThreadPoolExecutor.java:1369)
   [junit4]   2> 	at org.apache.solr.common.util.ExecutorUtil$MDCAwareThreadPoolExecutor.execute(ExecutorUtil.java:214)
   [junit4]   2> 	at java.util.concurrent.AbstractExecutorService.submit(AbstractExecutorService.java:112)
   [junit4]   2> 	at org.apache.solr.common.cloud.SolrZkClient$3.process(SolrZkClient.java:266)
   [junit4]   2> 	at org.apache.zookeeper.ClientCnxn$EventThread.processEvent(ClientCnxn.java:522)
   [junit4]   2> 	at org.apache.zookeeper.ClientCnxn$EventThread.run(ClientCnxn.java:498)
   [junit4]   2> 1936112 INFO  (Thread-5828) [    ] o.a.s.c.ZkTestServer connecting to 127.0.0.1:48926 48926
   [junit4]   2> 1936118 INFO  (TEST-ZkStateReaderTest.testStateFormatUpdateWithExplicitRefreshLazy-seed#[C8DC0E1270FE2FF6]) [    ] o.a.s.SolrTestCaseJ4 ###Ending testStateFormatUpdateWithExplicitRefreshLazy
   [junit4]   2> NOTE: reproduce with: ant test  -Dtestcase=ZkStateReaderTest -Dtests.method=testStateFormatUpdateWithExplicitRefreshLazy -Dtests.seed=C8DC0E1270FE2FF6 -Dtests.multiplier=2 -Dtests.slow=true -Dtests.locale=en-MT -Dtests.timezone=Europe/Monaco -Dtests.asserts=true -Dtests.file.encoding=UTF-8
   [junit4] ERROR   0.26s J1 | ZkStateReaderTest.testStateFormatUpdateWithExplicitRefreshLazy <<<
   [junit4]    > Throwable #1: org.apache.solr.common.SolrException: Could not find collection : c1
   [junit4]    > 	at __randomizedtesting.SeedInfo.seed([C8DC0E1270FE2FF6:A393AE6F09F1F2CC]:0)
   [junit4]    > 	at org.apache.solr.common.cloud.ClusterState.getCollection(ClusterState.java:192)
   [junit4]    > 	at org.apache.solr.cloud.overseer.ZkStateReaderTest.testStateFormatUpdate(ZkStateReaderTest.java:129)
   [junit4]    > 	at org.apache.solr.cloud.overseer.ZkStateReaderTest.testStateFormatUpdateWithExplicitRefreshLazy(ZkStateReaderTest.java:48)
   [junit4]    > 	at java.lang.Thread.run(Thread.java:745)
   [junit4]   2> 1936124 INFO  (TEST-ZkStateReaderTest.testStateFormatUpdateWithExplicitRefresh-seed#[C8DC0E1270FE2FF6]) [    ] o.a.s.SolrTestCaseJ4 ###Starting testStateFormatUpdateWithExplicitRefresh
   [junit4]   2> 1936128 INFO  (TEST-ZkStateReaderTest.testStateFormatUpdateWithExplicitRefresh-seed#[C8DC0E1270FE2FF6]) [    ] o.a.s.c.ZkTestServer STARTING ZK TEST SERVER
   [junit4]   2> 1936128 INFO  (Thread-5829) [    ] o.a.s.c.ZkTestServer client port:0.0.0.0/0.0.0.0:0
   [junit4]   2> 1936129 INFO  (Thread-5829) [    ] o.a.s.c.ZkTestServer Starting server
   [junit4]   2> 1936229 INFO  (TEST-ZkStateReaderTest.testStateFormatUpdateWithExplicitRefresh-seed#[C8DC0E1270FE2FF6]) [    ] o.a.s.c.ZkTestServer start zk server on port:60885
   [junit4]   2> 1936229 INFO  (TEST-ZkStateReaderTest.testStateFormatUpdateWithExplicitRefresh-seed#[C8DC0E1270FE2FF6]) [    ] o.a.s.c.c.SolrZkClient Using default ZkCredentialsProvider
   [junit4]   2> 1936230 INFO  (TEST-ZkStateReaderTest.testStateFormatUpdateWithExplicitRefresh-seed#[C8DC0E1270FE2FF6]) [    ] o.a.s.c.c.ConnectionManager Waiting for client to connect to ZooKeeper
   [junit4]   2> 1936231 INFO  (zkCallback-15095-thread-1) [    ] o.a.s.c.c.ConnectionManager Watcher org.apache.solr.common.cloud.ConnectionManager@12ff5577 name:ZooKeeperConnection Watcher:127.0.0.1:60885 got event WatchedEvent state:SyncConnected type:None path:null path:null type:None
   [junit4]   2> 1936232 INFO  (TEST-ZkStateReaderTest.testStateFormatUpdateWithExplicitRefresh-seed#[C8DC0E1270FE2FF6]) [    ] o.a.s.c.c.ConnectionManager Client is connected to ZooKeeper
   [junit4]   2> 1936232 INFO  (TEST-ZkStateReaderTest.testStateFormatUpdateWithExplicitRefresh-seed#[C8DC0E1270FE2FF6]) [    ] o.a.s.c.c.SolrZkClient Using default ZkACLProvider
   [junit4]   2> 1936233 INFO  (TEST-ZkStateReaderTest.testStateFormatUpdateWithExplicitRefresh-seed#[C8DC0E1270FE2FF6]) [    ] o.a.s.c.c.SolrZkClient Using default ZkCredentialsProvider
   [junit4]   2> 1936234 INFO  (TEST-ZkStateReaderTest.testStateFormatUpdateWithExplicitRefresh-seed#[C8DC0E1270FE2FF6]) [    ] o.a.s.c.c.ConnectionManager Waiting for client to connect to ZooKeeper
   [junit4]   2> 1936234 INFO  (zkCallback-15096-thread-1) [    ] o.a.s.c.c.ConnectionManager Watcher org.apache.solr.common.cloud.ConnectionManager@17fe198e name:ZooKeeperConnection Watcher:127.0.0.1:60885 got event WatchedEvent state:SyncConnected type:None path:null path:null type:None
   [junit4]   2> 1936234 INFO  (TEST-ZkStateReaderTest.testStateFormatUpdateWithExplicitRefresh-seed#[C8DC0E1270FE2FF6]) [    ] o.a.s.c.c.ConnectionManager Client is connected to ZooKeeper
   [junit4]   2> 1936234 INFO  (TEST-ZkStateReaderTest.testStateFormatUpdateWithExplicitRefresh-seed#[C8DC0E1270FE2FF6]) [    ] o.a.s.c.c.SolrZkClient Using default ZkACLProvider
   [junit4]   2> 1936234 INFO  (TEST-ZkStateReaderTest.testStateFormatUpdateWithExplicitRefresh-seed#[C8DC0E1270FE2FF6]) [    ] o.a.s.c.c.SolrZkClient makePath: /solr
   [junit4]   2> 1936236 INFO  (TEST-ZkStateReaderTest.testStateFormatUpdateWithExplicitRefresh-seed#[C8DC0E1270FE2FF6]) [    ] o.a.s.c.c.SolrZkClient Using default ZkCredentialsProvider
   [junit4]   2> 1936245 INFO  (TEST-ZkStateReaderTest.testStateFormatUpdateWithExplicitRefresh-seed#[C8DC0E1270FE2FF6]) [    ] o.a.s.c.c.ConnectionManager Waiting for client to connect to ZooKeeper
   [junit4]   2> 1936245 INFO  (zkCallback-15097-thread-1) [    ] o.a.s.c.c.ConnectionManager Watcher org.apache.solr.common.cloud.ConnectionManager@1f6abbeb name:ZooKeeperConnection Watcher:127.0.0.1:60885/solr got event WatchedEvent state:SyncConnected type:None path:null path:null type:None
   [junit4]   2> 1936245 INFO  (TEST-ZkStateReaderTest.testStateFormatUpdateWithExplicitRefresh-seed#[C8DC0E1270FE2FF6]) [    ] o.a.s.c.c.ConnectionManager Client is connected to ZooKeeper
   [junit4]   2> 1936246 INFO  (TEST-ZkStateReaderTest.testStateFormatUpdateWithExplicitRefresh-seed#[C8DC0E1270FE2FF6]) [    ] o.a.s.c.c.SolrZkClient Using default ZkACLProvider
   [junit4]   2> 1936246 INFO  (TEST-ZkStateReaderTest.testStateFormatUpdateWithExplicitRefresh-seed#[C8DC0E1270FE2FF6]) [    ] o.a.s.c.c.SolrZkClient makePath: /live_nodes
   [junit4]   2> 1936248 INFO  (TEST-ZkStateReaderTest.testStateFormatUpdateWithExplicitRefresh-seed#[C8DC0E1270FE2FF6]) [    ] o.a.s.c.c.SolrZkClient makePath: /collections
   [junit4]   2> 1936249 INFO  (TEST-ZkStateReaderTest.testStateFormatUpdateWithExplicitRefresh-seed#[C8DC0E1270FE2FF6]) [    ] o.a.s.c.c.SolrZkClient makePath: /aliases.json
   [junit4]   2> 1936250 INFO  (TEST-ZkStateReaderTest.testStateFormatUpdateWithExplicitRefresh-seed#[C8DC0E1270FE2FF6]) [    ] o.a.s.c.c.SolrZkClient makePath: /clusterstate.json
   [junit4]   2> 1936258 INFO  (TEST-ZkStateReaderTest.testStateFormatUpdateWithExplicitRefresh-seed#[C8DC0E1270FE2FF6]) [    ] o.a.s.c.c.SolrZkClient makePath: /security.json
   [junit4]   2> 1936259 INFO  (TEST-ZkStateReaderTest.testStateFormatUpdateWithExplicitRefresh-seed#[C8DC0E1270FE2FF6]) [    ] o.a.s.c.c.ZkStateReader Updating cluster state from ZooKeeper... 
   [junit4]   2> 1936259 INFO  (TEST-ZkStateReaderTest.testStateFormatUpdateWithExplicitRefresh-seed#[C8DC0E1270FE2FF6]) [    ] o.a.s.c.c.ZkStateReader Loaded empty cluster properties
   [junit4]   2> 1936260 INFO  (TEST-ZkStateReaderTest.testStateFormatUpdateWithExplicitRefresh-seed#[C8DC0E1270FE2FF6]) [    ] o.a.s.c.c.ZkStateReader Updated live nodes from ZooKeeper... (0) -> (0)
   [junit4]   2> 1936261 INFO  (TEST-ZkStateReaderTest.testStateFormatUpdateWithExplicitRefresh-seed#[C8DC0E1270FE2FF6]) [    ] o.a.s.c.c.ZkStateReader Deleting data for [c1]
   [junit4]   2> 1936261 INFO  (TEST-ZkStateReaderTest.testStateFormatUpdateWithExplicitRefresh-seed#[C8DC0E1270FE2FF6]) [    ] o.a.s.c.c.SolrZkClient makePath: /collections/c1
   [junit4]   2> 1936262 INFO  (zkCallback-15097-thread-1) [    ] o.a.s.c.c.ZkStateReader A collections change: [WatchedEvent state:SyncConnected type:NodeChildrenChanged path:/collections], has occurred - updating...
   [junit4]   2> 1936269 INFO  (zkCallback-15097-thread-1) [    ] o.a.s.c.c.ZkStateReader A cluster state change: [WatchedEvent state:SyncConnected type:NodeDataChanged path:/clusterstate.json], has occurred - updating... (live nodes size: [0])
   [junit4]   2> 1936270 INFO  (TEST-ZkStateReaderTest.testStateFormatUpdateWithExplicitRefresh-seed#[C8DC0E1270FE2FF6]) [    ] o.a.s.c.c.ZkStateReader Checking legacy cluster state for collection c1
   [junit4]   2> 1936271 INFO  (TEST-ZkStateReaderTest.testStateFormatUpdateWithExplicitRefresh-seed#[C8DC0E1270FE2FF6]) [    ] o.a.s.c.o.ZkStateWriter going to create_collection /collections/c1/state.json
   [junit4]   2> 1936271 INFO  (zkCallback-15097-thread-1) [    ] o.a.s.c.c.ZkStateReader A cluster state change: [WatchedEvent state:SyncConnected type:NodeCreated path:/collections/c1/state.json] for collection [c1] has occurred - updating... (live nodes size: [0])
   [junit4]   2> 1936272 INFO  (zkCallback-15097-thread-1) [    ] o.a.s.c.c.ZkStateReader Add data for [c1] ver [0]
   [junit4]   2> 1936272 INFO  (TEST-ZkStateReaderTest.testStateFormatUpdateWithExplicitRefresh-seed#[C8DC0E1270FE2FF6]) [    ] o.a.s.c.c.ZkStateReader Checking legacy cluster state for collection c1
   [junit4]   2> 1936276 INFO  (zkCallback-15097-thread-2) [    ] o.a.s.c.c.ZkStateReader A cluster state change: [WatchedEvent state:SyncConnected type:NodeDataChanged path:/clusterstate.json], has occurred - updating... (live nodes size: [0])
   [junit4]   2> 1936277 WARN  (zkCallback-15097-thread-2) [    ] o.a.s.c.c.ZkStateReader ZooKeeper watch triggered, but Solr cannot talk to ZK: [KeeperErrorCode = Session expired for /clusterstate.json]
   [junit4]   2> 1936278 INFO  (TEST-ZkStateReaderTest.testStateFormatUpdateWithExplicitRefresh-seed#[C8DC0E1270FE2FF6]) [    ] o.a.s.c.ZkTestServer connecting to 127.0.0.1:60885 60885
   [junit4]   2> 1936499 INFO  (Thread-5829) [    ] o.a.s.c.ZkTestServer connecting to 127.0.0.1:60885 60885
   [junit4]   2> 1936501 INFO  (TEST-ZkStateReaderTest.testStateFormatUpdateWithExplicitRefresh-seed#[C8DC0E1270FE2FF6]) [    ] o.a.s.SolrTestCaseJ4 ###Ending testStateFormatUpdateWithExplicitRefresh
   [junit4]   2> 1936504 INFO  (TEST-ZkStateReaderTest.testWatchedCollectionCreation-seed#[C8DC0E1270FE2FF6]) [    ] o.a.s.SolrTestCaseJ4 ###Starting testWatchedCollectionCreation
   [junit4]   2> 1936504 INFO  (TEST-ZkStateReaderTest.testWatchedCollectionCreation-seed#[C8DC0E1270FE2FF6]) [    ] o.a.s.c.ZkTestServer STARTING ZK TEST SERVER
   [junit4]   2> 1936504 INFO  (Thread-5830) [    ] o.a.s.c.ZkTestServer client port:0.0.0.0/0.0.0.0:0
   [junit4]   2> 1936504 INFO  (Thread-5830) [    ] o.a.s.c.ZkTestServer Starting server
   [junit4]   2> 1936607 INFO  (TEST-ZkStateReaderTest.testWatchedCollectionCreation-seed#[C8DC0E1270FE2FF6]) [    ] o.a.s.c.ZkTestServer start zk server on port:51190
   [junit4]   2> 1936607 INFO  (TEST-ZkStateReaderTest.testWatchedCollectionCreation-seed#[C8DC0E1270FE2FF6]) [    ] o.a.s.c.c.SolrZkClient Using default ZkCredentialsProvider
   [junit4]   2> 1936612 INFO  (TEST-ZkStateReaderTest.testWatchedCollectionCreation-seed#[C8DC0E1270FE2FF6]) [    ] o.a.s.c.c.ConnectionManager Waiting for client to connect to ZooKeeper
   [junit4]   2> 1936614 INFO  (zkCallback-15099-thread-1) [    ] o.a.s.c.c.ConnectionManager Watcher org.apache.solr.common.cloud.ConnectionManager@398dc94 name:ZooKeeperConnection Watcher:127.0.0.1:51190 got event WatchedEvent state:SyncConnected type:None path:null path:null type:None
   [junit4]   2> 1936614 INFO  (TEST-ZkStateReaderTest.testWatchedCollectionCreation-seed#[C8DC0E1270FE2FF6]) [    ] o.a.s.c.c.ConnectionManager Client is connected to ZooKeeper
   [junit4]   2> 1936614 INFO  (TEST-ZkStateReaderTest.testWatchedCollectionCreation-seed#[C8DC0E1270FE2FF6]) [    ] o.a.s.c.c.SolrZkClient Using default ZkACLProvider
   [junit4]   2> 1936615 INFO  (TEST-ZkStateReaderTest.testWatchedCollectionCreation-seed#[C8DC0E1270FE2FF6]) [    ] o.a.s.c.c.SolrZkClient Using default ZkCredentialsProvider
   [junit4]   2> 1936616 INFO  (TEST-ZkStateReaderTest.testWatchedCollectionCreation-seed#[C8DC0E1270FE2FF6]) [    ] o.a.s.c.c.ConnectionManager Waiting for client to connect to ZooKeeper
   [junit4]   2> 1936616 INFO  (zkCallback-15100-thread-1) [    ] o.a.s.c.c.ConnectionManager Watcher org.apache.solr.common.cloud.ConnectionManager@37bd99a5 name:ZooKeeperConnection Watcher:127.0.0.1:51190 got event WatchedEvent state:SyncConnected type:None path:null path:null type:None
   [junit4]   2> 1936616 INFO  (TEST-ZkStateReaderTest.testWatchedCollectionCreation-seed#[C8DC0E1270FE2FF6]) [    ] o.a.s.c.c.ConnectionManager Client is connected to ZooKeeper
   [junit4]   2> 1936617 INFO  (TEST-ZkStateReaderTest.testWatchedCollectionCreation-seed#[C8DC0E1270FE2FF6]) [    ] o.a.s.c.c.SolrZkClient Using default ZkACLProvider
   [junit4]   2> 1936617 INFO  (TEST-ZkStateReaderTest.testWatchedCollectionCreation-seed#[C8DC0E1270FE2FF6]) [    ] o.a.s.c.c.SolrZkClient makePath: /solr
   [junit4]   2> 1936619 INFO  (TEST-ZkStateReaderTest.testWatchedCollectionCreation-seed#[C8DC0E1270FE2FF6]) [    ] o.a.s.c.c.SolrZkClient Using default ZkCredentialsProvider
   [junit4]   2> 1936621 INFO  (TEST-ZkStateReaderTest.testWatchedCollectionCreation-seed#[C8DC0E1270FE2FF6]) [    ] o.a.s.c.c.ConnectionManager Waiting for client to connect to ZooKeeper
   [junit4]   2> 1936622 INFO  (zkCallback-15101-thread-1) [    ] o.a.s.c.c.ConnectionManager Watcher org.apache.solr.common.cloud.ConnectionManager@6160c42 name:ZooKeeperConnection Watcher:127.0.0.1:51190/solr got event WatchedEvent state:SyncConnected type:None path:null path:null type:None
   [junit4]   2> 1936622 INFO  (TEST-ZkStateReaderTest.testWatchedCollectionCreation-seed#[C8DC0E1270FE2FF6]) [    ] o.a.s.c.c.ConnectionManager Client is connected to ZooKeeper
   [junit4]   2> 1936622 INFO  (TEST-ZkStateReaderTest.testWatchedCollectionCreation-seed#[C8DC0E1270FE2FF6]) [    ] o.a.s.c.c.SolrZkClient Using default ZkACLProvider
   [junit4]   2> 1936622 INFO  (TEST-ZkStateReaderTest.testWatchedCollectionCreation-seed#[C8DC0E1270FE2FF6]) [    ] o.a.s.c.c.SolrZkClient makePath: /live_nodes
   [junit4]   2> 1936623 INFO  (TEST-ZkStateReaderTest.testWatchedCollectionCreation-seed#[C8DC0E1270FE2FF6]) [    ] o.a.s.c.c.SolrZkClient makePath: /collections
   [junit4]   2> 1936624 INFO  (TEST-ZkStateReaderTest.testWatchedCollectionCreation-seed#[C8DC0E1270FE2FF6]) [    ] o.a.s.c.c.SolrZkClient makePath: /aliases.json
   [junit4]   2> 1936625 INFO  (TEST-ZkStateReaderTest.testWatchedCollectionCreation-seed#[C8DC0E1270FE2FF6]) [    ] o.a.s.c.c.SolrZkClient makePath: /clusterstate.json
   [junit4]   2> 1936626 INFO  (TEST-ZkStateReaderTest.testWatchedCollectionCreation-seed#[C8DC0E1270FE2FF6]) [    ] o.a.s.c.c.SolrZkClient makePath: /security.json
   [junit4]   2> 1936626 INFO  (TEST-ZkStateReaderTest.testWatchedCollectionCreation-seed#[C8DC0E1270FE2FF6]) [    ] o.a.s.c.c.ZkStateReader Updating cluster state from ZooKeeper... 
   [junit4]   2> 1936627 INFO  (TEST-ZkStateReaderTest.testWatchedCollectionCreation-seed#[C8DC0E1270FE2FF6]) [    ] o.a.s.c.c.ZkStateReader Loaded empty cluster properties
   [junit4]   2> 1936627 INFO  (TEST-ZkStateReaderTest.testWatchedCollectionCreation-seed#[C8DC0E1270FE2FF6]) [    ] o.a.s.c.c.ZkStateReader Updated live nodes from ZooKeeper... (0) -> (0)
   [junit4]   2> 1936628 INFO  (TEST-ZkStateReaderTest.testWatchedCollectionCreation-seed#[C8DC0E1270FE2FF6]) [    ] o.a.s.c.c.ZkStateReader Deleting data for [c1]
   [junit4]   2> 1936632 INFO  (TEST-ZkStateReaderTest.testWatchedCollectionCreation-seed#[C8DC0E1270FE2FF6]) [    ] o.a.s.c.c.SolrZkClient makePath: /collections/c1
   [junit4]   2> 1936633 INFO  (zkCallback-15101-thread-1) [    ] o.a.s.c.c.ZkStateReader A collections change: [WatchedEvent state:SyncConnected type:NodeChildrenChanged path:/collections], has occurred - updating...
   [junit4]   2> 1936633 INFO  (TEST-ZkStateReaderTest.testWatchedCollectionCreation-seed#[C8DC0E1270FE2FF6]) [    ] o.a.s.c.c.ZkStateReader Checking legacy cluster state for collection c1
   [junit4]   2> 1936635 INFO  (TEST-ZkStateReaderTest.testWatchedCollectionCreation-seed#[C8DC0E1270FE2FF6]) [    ] o.a.s.c.o.ZkStateWriter going to create_collection /collections/c1/state.json
   [junit4]   2> 1936641 INFO  (zkCallback-15101-thread-2) [    ] o.a.s.c.c.ZkStateReader A cluster state change: [WatchedEvent state:SyncConnected type:NodeCreated path:/collections/c1/state.json] for collection [c1] has occurred - updating... (live nodes size: [0])
   [junit4]   2> 1936641 INFO  (zkCallback-15101-thread-2) [    ] o.a.s.c.c.ZkStateReader Add data for [c1] ver [0]
   [junit4]   2> 1936644 INFO  (TEST-ZkStateReaderTest.testWatchedCollectionCreation-seed#[C8DC0E1270FE2FF6]) [    ] o.a.s.c.ZkTestServer connecting to 127.0.0.1:51190 51190
   [junit4]   2> 1936744 INFO  (Thread-5830) [    ] o.a.s.c.ZkTestServer connecting to 127.0.0.1:51190 51190
   [junit4]   2> 1936745 INFO  (TEST-ZkStateReaderTest.testWatchedCollectionCreation-seed#[C8DC0E1270FE2FF6]) [    ] o.a.s.SolrTestCaseJ4 ###Ending testWatchedCollectionCreation
   [junit4]   2> 1936747 INFO  (TEST-ZkStateReaderTest.testStateFormatUpdateWithTimeDelay-seed#[C8DC0E1270FE2FF6]) [    ] o.a.s.SolrTestCaseJ4 ###Starting testStateFormatUpdateWithTimeDelay
   [junit4]   2> 1936748 INFO  (TEST-ZkStateReaderTest.testStateFormatUpdateWithTimeDelay-seed#[C8DC0E1270FE2FF6]) [    ] o.a.s.c.ZkTestServer STARTING ZK TEST SERVER
   [junit4]   2> 1936761 INFO  (Thread-5831) [    ] o.a.s.c.ZkTestServer client port:0.0.0.0/0.0.0.0:0
   [junit4]   2> 1936762 INFO  (Thread-5831) [    ] o.a.s.c.ZkTestServer Starting server
   [junit4]   2> 1936861 INFO  (TEST-ZkStateReaderTest.testStateFormatUpdateWithTimeDelay-seed#[C8DC0E1270FE2FF6]) [    ] o.a.s.c.ZkTestServer start zk server on port:56208
   [junit4]   2> 1936862 INFO  (TEST-ZkStateReaderTest.testStateFormatUpdateWithTimeDelay-seed#[C8DC0E1270FE2FF6]) [    ] o.a.s.c.c.SolrZkClient Using default ZkCredentialsProvider
   [junit4]   2> 1936862 INFO  (TEST-ZkStateReaderTest.testStateFormatUpdateWithTimeDelay-seed#[C8DC0E1270FE2FF6]) [    ] o.a.s.c.c.ConnectionManager Waiting for client to connect to ZooKeeper
   [junit4]   2> 1936871 INFO  (zkCallback-15103-thread-1) [    ] o.a.s.c.c.ConnectionManager Watcher org.apache.solr.common.cloud.ConnectionManager@37d320a9 name:ZooKeeperConnection Watcher:127.0.0.1:56208 got event WatchedEvent state:SyncConnected type:None path:null path:null type:None
   [junit4]   2> 1936871 INFO  (TEST-ZkStateReaderTest.testStateFormatUpdateWithTimeDelay-seed#[C8DC0E1270FE2FF6]) [    ] o.a.s.c.c.ConnectionManager Client is connected to ZooKeeper
   [junit4]   2> 1936871 INFO  (TEST-ZkStateReaderTest.testStateFormatUpdateWithTimeDelay-seed#[C8DC0E1270FE2FF6]) [    ] o.a.s.c.c.SolrZkClient Using default ZkACLProvider
   [junit4]   2> 1936872 INFO  (TEST-ZkStateReaderTest.testStateFormatUpdateWithTimeDelay-seed#[C8DC0E1270FE2FF6]) [    ] o.a.s.c.c.SolrZkClient Using default ZkCredentialsProvider
   [junit4]   2> 1936881 INFO  (TEST-ZkStateReaderTest.testStateFormatUpdateWithTimeDelay-seed#[C8DC0E1270FE2FF6]) [    ] o.a.s.c.c.ConnectionManager Waiting for client to connect to ZooKeeper
   [junit4]   2> 1936882 INFO  (zkCallback-15104-thread-1) [    ] o.a.s.c.c.ConnectionManager Watcher org.apache.solr.common.cloud.ConnectionManager@365cec97 name:ZooKeeperConnection Watcher:127.0.0.1:56208 got event WatchedEvent state:SyncConnected type:None path:null path:null type:None
   [junit4]   2> 1936882 INFO  (TEST-ZkStateReaderTest.testStateFormatUpdateWithTimeDelay-seed#[C8DC0E1270FE2FF6]) [    ] o.a.s.c.c.ConnectionManager Client is connected to ZooKeeper
   [junit4]   2> 1936882 INFO  (TEST-ZkStateReaderTest.testStateFormatUpdateWithTimeDelay-seed#[C8DC0E1270FE2FF6]) [    ] o.a.s.c.c.SolrZkClient Using default ZkACLProvider
   [junit4]   2> 1936882 INFO  (TEST-ZkStateReaderTest.testStateFormatUpdateWithTimeDelay-seed#[C8DC0E1270FE2FF6]) [    ] o.a.s.c.c.SolrZkClient makePath: /solr
   [junit4]   2> 1936885 INFO  (TEST-ZkStateReaderTest.testStateFormatUpdateWithTimeDelay-seed#[C8DC0E1270FE2FF6]) [    ] o.a.s.c.c.SolrZkClient Using default ZkCredentialsProvider
   [junit4]   2> 1936886 INFO  (TEST-ZkStateReaderTest.testStateFormatUpdateWithTimeDelay-seed#[C8DC0E1270FE2FF6]) [    ] o.a.s.c.c.ConnectionManager Waiting for client to connect to ZooKeeper
   [junit4]   2> 1936886 INFO  (zkCallback-15105-thread-1) [    ] o.a.s.c.c.ConnectionManager Watcher org.apache.solr.common.cloud.ConnectionManager@4f395146 name:ZooKeeperConnection Watcher:127.0.0.1:56208/solr got event WatchedEvent state:SyncConnected type:None path:null path:null type:None
   [junit4]   2> 1936886 INFO  (TEST-ZkStateReaderTest.testStateFormatUpdateWithTimeDelay-seed#[C8DC0E1270FE2FF6]) [    ] o.a.s.c.c.ConnectionManager Client is connected to ZooKeeper
   [junit4]   2> 1936887 INFO  (TEST-ZkStateReaderTest.testStateFormatUpdateWithTimeDelay-seed#[C8DC0E1270FE2FF6]) [    ] o.a.s.c.c.SolrZkClient Using default ZkACLProvider
   [junit4]   2> 1936887 INFO  (TEST-ZkStateReaderTest.testStateFormatUpdateWithTimeDelay-seed#[C8DC0E1270FE2FF6]) [    ] o.a.s.c.c.SolrZkClient makePath: /live_nodes
   [junit4]   2> 1936888 INFO  (TEST-ZkStateReaderTest.testStateFormatUpdateWithTimeDelay-seed#[C8DC0E1270FE2FF6]) [    ] o.a.s.c.c.SolrZkClient makePath: /collections
   [junit4]   2> 1936889 INFO  (TEST-ZkStateReaderTest.testStateFormatUpdateWithTimeDelay-seed#[C8DC0E1270FE2FF6]) [    ] o.a.s.c.c.SolrZkClient makePath: /aliases.json
   [junit4]   2> 1936890 INFO  (TEST-ZkStateReaderTest.testStateFormatUpdateWithTimeDelay-seed#[C8DC0E1270FE2FF6]) [    ] o.a.s.c.c.SolrZkClient makePath: /clusterstate.json
   [junit4]   2> 1936891 INFO  (TEST-ZkStateReaderTest.testStateFormatUpdateWithTimeDelay-seed#[C8DC0E1270FE2FF6]) [    ] o.a.s.c.c.SolrZkClient makePath: /security.json
   [junit4]   2> 1936892 INFO  (TEST-ZkStateReaderTest.testStateFormatUpdateWithTimeDelay-seed#[C8DC0E1270FE2FF6]) [    ] o.a.s.c.c.ZkStateReader Updating cluster state from ZooKeeper... 
   [junit4]   2> 1936893 INFO  (TEST-ZkStateReaderTest.testStateFormatUpdateWithTimeDelay-seed#[C8DC0E1270FE2FF6]) [    ] o.a.s.c.c.ZkStateReader Loaded empty cluster properties
   [junit4]   2> 1936893 INFO  (TEST-ZkStateReaderTest.testStateFormatUpdateWithTimeDelay-seed#[C8DC0E1270FE2FF6]) [    ] o.a.s.c.c.ZkStateReader Updated live nodes from ZooKeeper... (0) -> (0)
   [junit4]   2> 1936895 INFO  (TEST-ZkStateReaderTest.testStateFormatUpdateWithTimeDelay-seed#[C8DC0E1270FE2FF6]) [    ] o.a.s.c.c.ZkStateReader Deleting data for [c1]
   [junit4]   2> 1936895 INFO  (TEST-ZkStateReaderTest.testStateFormatUpdateWithTimeDelay-seed#[C8DC0E1270FE2FF6]) [    ] o.a.s.c.c.SolrZkClient makePath: /collections/c1
   [junit4]   2> 1936896 INFO  (zkCallback-15105-thread-1) [    ] o.a.s.c.c.ZkStateReader A collections change: [WatchedEvent state:SyncConnected type:NodeChildrenChanged path:/collections], has occurred - updating...
   [junit4]   2> 1936897 INFO  (zkCallback-15105-thread-1) [    ] o.a.s.c.c.ZkStateReader A cluster state change: [WatchedEvent state:SyncConnected type:NodeDataChanged path:/clusterstate.json], has occurred - updating... (live nodes size: [0])
   [junit4]   2> 1936899 INFO  (TEST-ZkStateReaderTest.testStateFormatUpdateWithTimeDelay-seed#[C8DC0E1270FE2FF6]) [    ] o.a.s.c.o.ZkStateWriter going to create_collection /collections/c1/state.json
   [junit4]   2> 1936899 INFO  (zkCallback-15105-thread-1) [    ] o.a.s.c.c.ZkStateReader A cluster state change: [WatchedEvent state:SyncConnected type:NodeCreated path:/collections/c1/state.json] for collection [c1] has occurred - updating... (live nodes size: [0])
   [junit4]   2> 1936899 INFO  (zkCallback-15105-thread-1) [    ] o.a.s.c.c.ZkStateReader Add data for [c1] ver [0]
   [junit4]   2> 1936900 INFO  (zkCallback-15105-thread-1) [    ] o.a.s.c.c.ZkStateReader A cluster state change: [WatchedEvent state:SyncConnected type:NodeDataChanged path:/clusterstate.json], has occurred - updating... (live nodes size: [0])
   [junit4]   2> 1936902 INFO  (TEST-ZkStateReaderTest.testStateFormatUpdateWithTimeDelay-seed#[C8DC0E1270FE2FF6]) [    ] o.a.s.c.ZkTestServer connecting to 127.0.0.1:56208 56208
   [junit4]   2> 1937082 INFO  (Thread-5831) [    ] o.a.s.c.ZkTestServer connecting to 127.0.0.1:56208 56208
   [junit4]   2> 1937101 INFO  (TEST-ZkStateReaderTest.testStateFormatUpdateWithTimeDelay-seed#[C8DC0E1270FE2FF6]) [    ] o.a.s.SolrTestCaseJ4 ###Ending testStateFormatUpdateWithTimeDelay
   [junit4]   2> 1937118 INFO  (TEST-ZkStateReaderTest.testStateFormatUpdateWithTimeDelayLazy-seed#[C8DC0E1270FE2FF6]) [    ] o.a.s.SolrTestCaseJ4 ###Starting testStateFormatUpdateWithTimeDelayLazy
   [junit4]   2> 1937119 INFO  (TEST-ZkStateReaderTest.testStateFormatUpdateWithTimeDelayLazy-seed#[C8DC0E1270FE2FF6]) [    ] o.a.s.c.ZkTestServer STARTING ZK TEST SERVER
   [junit4]   2> 1937125 INFO  (Thread-5832) [    ] o.a.s.c.ZkTestServer client port:0.0.0.0/0.0.0.0:0
   [junit4]   2> 1937125 INFO  (Thread-5832) [    ] o.a.s.c.ZkTestServer Starting server
   [junit4]   2> 1937225 INFO  (TEST-ZkStateReaderTest.testStateFormatUpdateWithTimeDelayLazy-seed#[C8DC0E1270FE2FF6]) [    ] o.a.s.c.ZkTestServer start zk server on port:36657
   [junit4]   2> 1937225 INFO  (TEST-ZkStateReaderTest.testStateFormatUpdateWithTimeDelayLazy-seed#[C8DC0E1270FE2FF6]) [    ] o.a.s.c.c.SolrZkClient Using default ZkCredentialsProvider
   [junit4]   2> 1937245 INFO  (TEST-ZkStateReaderTest.testStateFormatUpdateWithTimeDelayLazy-seed#[C8DC0E1270FE2FF6]) [    ] o.a.s.c.c.ConnectionManager Waiting for client to connect to ZooKeeper
   [junit4]   2> 1937250 INFO  (zkCallback-15107-thread-1) [    ] o.a.s.c.c.ConnectionManager Watcher org.apache.solr.common.cloud.ConnectionManager@3c9a4d15 name:ZooKeeperConnection Watcher:127.0.0.1:36657 got event WatchedEvent state:SyncConnected type:None path:null path:null type:None
   [junit4]   2> 1937250 INFO  (TEST-ZkStateReaderTest.testStateFormatUpdateWithTimeDelayLazy-seed#[C8DC0E1270FE2FF6]) [    ] o.a.s.c.c.ConnectionManager Client is connected to ZooKeeper
   [junit4]   2> 1937250 INFO  (TEST-ZkStateReaderTest.testStateFormatUpdateWithTimeDelayLazy-seed#[C8DC0E1270FE2FF6]) [    ] o.a.s.c.c.SolrZkClient Using default ZkACLProvider
   [junit4]   2> 1937259 INFO  (TEST-ZkStateReaderTest.testStateFormatUpdateWithTimeDelayLazy-seed#[C8DC0E1270FE2FF6]) [    ] o.a.s.c.c.SolrZkClient Using default ZkCredentialsProvider
   [junit4]   2> 1937265 INFO  (TEST-ZkStateReaderTest.testStateFormatUpdateWithTimeDelayLazy-seed#[C8DC0E1270FE2FF6]) [    ] o.a.s.c.c.ConnectionManager Waiting for client to connect to ZooKeeper
   [junit4]   2> 1937274 INFO  (zkCallback-15108-thread-1) [    ] o.a.s.c.c.ConnectionManager Watcher org.apache.solr.common.cloud.ConnectionManager@2b35eb82 name:ZooKeeperConnection Watcher:127.0.0.1:36657 got event WatchedEvent state:SyncConnected type:None path:null path:null type:None
   [junit4]   2> 1937274 INFO  (TEST-ZkStateReaderTest.testStateFormatUpdateWithTimeDelayLazy-seed#[C8DC0E1270FE2FF6]) [    ] o.a.s.c.c.ConnectionManager Client is connected to ZooKeeper
   [junit4]   2> 1937274 INFO  (TEST-ZkStateReaderTest.testStateFormatUpdateWithTimeDelayLazy-seed#[C8DC0E1270FE2FF6]) [    ] o.a.s.c.c.SolrZkClient Using default ZkACLProvider
   [junit4]   2> 1937274 INFO  (TEST-ZkStateReaderTest.testStateFormatUpdateWithTimeDelayLazy-seed#[C8DC0E1270FE2FF6]) [    ] o.a.s.c.c.SolrZkClient makePath: /solr
   [junit4]   2> 1937294 INFO  (TEST-ZkStateReaderTest.testStateFormatUpdateWithTimeDelayLazy-seed#[C8DC0E1270FE2FF6]) [    ] o.a.s.c.c.SolrZkClient Using default ZkCredentialsProvider
   [junit4]   2> 1937295 INFO  (TEST-ZkStateReaderTest.testStateFormatUpdateWithTimeDelayLazy-seed#[C8DC0E1270FE2FF6]) [    ] o.a.s.c.c.ConnectionManager Waiting for client to connect to ZooKeeper
   [junit4]   2> 1937296 INFO  (zkCallback-15109-thread-1) [    ] o.a.s.c.c.ConnectionManager Watcher org.apache.solr.common.cloud.ConnectionManager@69a0c2b4 name:ZooKeeperConnection Watcher:127.0.0.1:36657/solr got event WatchedEvent state:SyncConnected type:None path:null path:null type:None
   [junit4]   2> 1937296 INFO  (TEST-ZkStateReaderTest.testStateFormatUpdateWithTimeDelayLazy-seed#[C8DC0E1270FE2FF6]) [    ] o.a.s.c.c.ConnectionManager Client is connected to ZooKeeper
   [junit4]   2> 1937296 INFO  (TEST-ZkStateReaderTest.testStateFormatUpdateWithTimeDelayLazy-seed#[C8DC0E1270FE2FF6]) [    ] o.a.s.c.c.SolrZkClient Using default ZkACLProvider
   [junit4]   2> 1937296 INFO  (TEST-ZkStateReaderTest.testStateFormatUpdateWithTimeDelayLazy-seed#[C8DC0E1270FE2FF6]) [    ] o.a.s.c.c.SolrZkClient makePath: /live_nodes
   [junit4]   2> 1937297 INFO  (TEST-ZkStateReaderTest.testStateFormatUpdateWithTimeDelayLazy-seed#[C8DC0E1270FE2FF6]) [    ] o.a.s.c.c.SolrZkClient makePath: /collections
   [junit4]   2> 1937301 INFO  (TEST-ZkStateReaderTest.testStateFormatUpdateWithTimeDelayLazy-seed#[C8DC0E1270FE2FF6]) [    ] o.a.s.c.c.SolrZkClient makePath: /aliases.json
   [junit4]   2> 1937302 INFO  (TEST-ZkStateReaderTest.testStateFormatUpdateWithTimeDelayLazy-seed#[C8DC0E1270FE2FF6]) [    ] o.a.s.c.c.SolrZkClient makePath: /clusterstate.json
   [junit4]   2> 1937303 INFO  (TEST-ZkStateReaderTest.testStateFormatUpdateWithTimeDelayLazy-seed#[C8DC0E1270FE2FF6]) [    ] o.a.s.c.c.SolrZkClient makePath: /security.json
   [junit4]   2> 1937304 INFO  (TEST-ZkStateReaderTest.testStateFormatUpdateWithTimeDelayLazy-seed#[C8DC0E1270FE2FF6]) [    ] o.a.s.c.c.ZkStateReader Updating cluster state from ZooKeeper... 
   [junit4]   2> 1937310 INFO  (TEST-ZkStateReaderTest.testStateFormatUpdateWithTimeDelayLazy-seed#[C8DC0E1270FE2FF6]) [    ] o.a.s.c.c.ZkStateReader Loaded empty cluster properties
   [junit4]   2> 1937310 INFO  (TEST-ZkStateReaderTest.testStateFormatUpdateWithTimeDelayLazy-seed#[C8DC0E1270FE2FF6]) [    ] o.a.s.c.c.ZkStateReader Updated live nodes from ZooKeeper... (0) -> (0)
   [junit4]   2> 1937311 INFO  (TEST-ZkStateReaderTest.testStateFormatUpdateWithTimeDelayLazy-seed#[C8DC0E1270FE2FF6]) [    ] o.a.s.c.c.SolrZkClient makePath: /collections/c1
   [junit4]   2> 1937313 INFO  (zkCallback-15109-thread-1) [    ] o.a.s.c.c.ZkStateReader A cluster state change: [WatchedEvent state:SyncConnected type:NodeDataChanged path:/clusterstate.json], has occurred - updating... (live nodes size: [0])
   [junit4]   2> 1937313 INFO  (zkCallback-15109-thread-2) [    ] o.a.s.c.c.ZkStateReader A collections change: [WatchedEvent state:SyncConnected type:NodeChildrenChanged path:/collections], has occurred - updating...
   [junit4]   2> 1937316 INFO  (TEST-ZkStateReaderTest.testStateFormatUpdateWithTimeDelayLazy-seed#[C8DC0E1270FE2FF6]) [    ] o.a.s.c.c.ZkStateReader Deleting data for [c1]
   [junit4]   2> 1937325 INFO  (TEST-ZkStateReaderTest.testStateFormatUpdateWithTimeDelayLazy-seed#[C8DC0E1270FE2FF6]) [    ] o.a.s.c.o.ZkStateWriter going to create_collection /collections/c1/state.json
   [junit4]   2> 1937326 INFO  (zkCallback-15109-thread-1) [    ] o.a.s.c.c.ZkStateReader Uninteresting collection c1
   [junit4]   2> 1937326 INFO  (zkCallback-15109-thread-1) [    ] o.a.s.c.c.ZkStateReader A cluster state change: [WatchedEvent state:SyncConnected type:NodeDataChanged path:/clusterstate.json], has occurred - updating... (live nodes size: [0])
   [junit4]   2> 1937337 INFO  (TEST-ZkStateReaderTest.testStateFormatUpdateWithTimeDelayLazy-seed#[C8DC0E1270FE2FF6]) [    ] o.a.s.c.c.ZkStateReader Add data for [c1] ver [0]
   [junit4]   2> 1937346 INFO  (TEST-ZkStateReaderTest.testStateFormatUpdateWithTimeDelayLazy-seed#[C8DC0E1270FE2FF6]) [    ] o.a.s.c.ZkTestServer connecting to 127.0.0.1:36657 36657
   [junit4]   2> 1937522 INFO  (Thread-5832) [    ] o.a.s.c.ZkTestServer connecting to 127.0.0.1:36657 36657
   [junit4]   2> 1937526 INFO  (TEST-ZkStateReaderTest.testStateFormatUpdateWithTimeDelayLazy-seed#[C8DC0E1270FE2FF6]) [    ] o.a.s.SolrTestCaseJ4 ###Ending testStateFormatUpdateWithTimeDelayLazy
   [junit4]   2> 1937528 INFO  (TEST-ZkStateReaderTest.testExternalCollectionWatchedNotWatched-seed#[C8DC0E1270FE2FF6]) [    ] o.a.s.SolrTestCaseJ4 ###Starting testExternalCollectionWatchedNotWatched
   [junit4]   2> 1937528 INFO  (TEST-ZkStateReaderTest.testExternalCollectionWatchedNotWatched-seed#[C8DC0E1270FE2FF6]) [    ] o.a.s.c.ZkTestServer STARTING ZK TEST SERVER
   [junit4]   2> 1937545 INFO  (Thread-5833) [    ] o.a.s.c.ZkTestServer client port:0.0.0.0/0.0.0.0:0
   [junit4]   2> 1937546 INFO  (Thread-5833) [    ] o.a.s.c.ZkTestServer Starting server
   [junit4]   2> 1937649 INFO  (TEST-ZkStateReaderTest.testExternalCollectionWatchedNotWatched-seed#[C8DC0E1270FE2FF6]) [    ] o.a.s.c.ZkTestServer start zk server on port:47317
   [junit4]   2> 1937649 INFO  (TEST-ZkStateReaderTest.testExternalCollectionWatchedNotWatched-seed#[C8DC0E1270FE2FF6]) [    ] o.a.s.c.c.SolrZkClient Using default ZkCredentialsProvider
   [junit4]   2> 1937654 INFO  (TEST-ZkStateReaderTest.testExternalCollectionWatchedNotWatched-seed#[C8DC0E1270FE2FF6]) [    ] o.a.s.c.c.ConnectionManager Waiting for client to connect to ZooKeeper
   [junit4]   2> 1937668 INFO  (zkCallback-15111-thread-1) [    ] o.a.s.c.c.ConnectionManager Watcher org.apache.solr.common.cloud.ConnectionManager@587d50ff name:ZooKeeperConnection Watcher:127.0.0.1:47317 got event WatchedEvent state:SyncConnected type:None path:null path:null type:None
   [junit4]   2> 1937668 INFO  (TEST-ZkStateReaderTest.testExternalCollectionWatchedNotWatched-seed#[C8DC0E1270FE2FF6]) [    ] o.a.s.c.c.ConnectionManager Client is connected to ZooKeeper
   [junit4]   2> 1937668 INFO  (TEST-ZkStateReaderTest.testExternalCollectionWatchedNotWatched-seed#[C8DC0E1270FE2FF6]) [    ] o.a.s.c.c.SolrZkClient Using default ZkACLProvider
   [junit4]   2> 1937669 INFO  (TEST-ZkStateReaderTest.testExternalCollectionWatchedNotWatched-seed#[C8DC0E1270FE2FF6]) [    ] o.a.s.c.c.SolrZkClient Using default ZkCredentialsProvider
   [junit4]   2> 1937692 INFO  (TEST-ZkStateReaderTest.testExternalCollectionWatchedNotWatched-seed#[C8DC0E1270FE2FF6]) [    ] o.a.s.c.c.ConnectionManager Waiting for client to connect to ZooKeeper
   [junit4]   2> 1937692 INFO  (zkCallback-15112-thread-1) [    ] o.a.s.c.c.ConnectionManager Watcher org.apache.solr.common.cloud.ConnectionManager@1162a80d name:ZooKeeperConnection Watcher:127.0.0.1:47317 got event WatchedEvent state:SyncConnected type:None path:null path:null type:None
   [junit4]   2> 1937692 INFO  (TEST-ZkStateReaderTest.testExternalCollectionWatchedNotWatched-seed#[C8DC0E1270FE2FF6]) [    ] o.a.s.c.c.ConnectionManager Client is connected to ZooKeeper
   [junit4]   2> 1937692 INFO  (TEST-ZkStateReaderTest.testExternalCollectionWatchedNotWatched-seed#[C8DC0E1270FE2FF6]) [    ] o.a.s.c.c.SolrZkClient Using default ZkACLProvider
   [junit4]   2> 1937692 INFO  (TEST-ZkStateReaderTest.testExternalCollectionWatchedNotWatched-seed#[C8DC0E1270FE2FF6]) [    ] o.a.s.c.c.SolrZkClient makePath: /solr
   [junit4]   2> 1937695 INFO  (TEST-ZkStateReaderTest.testExternalCollectionWatchedNotWatched-seed#[C8DC0E1270FE2FF6]) [    ] o.a.s.c.c.SolrZkClient Using default ZkCredentialsProvider
   [junit4]   2> 1937696 INFO  (TEST-ZkStateReaderTest.testExternalCollectionWatchedNotWatched-seed#[C8DC0E1270FE2FF6]) [    ] o.a.s.c.c.ConnectionManager Waiting for client to connect to ZooKeeper
   [junit4]   2> 1937697 INFO  (zkCallback-15113-thread-1) [    ] o.a.s.c.c.ConnectionManager Watcher org.apache.solr.common.cloud.ConnectionManager@13297a39 name:ZooKeeperConnection Watcher:127.0.0.1:47317/solr got event WatchedEvent state:SyncConnected type:None path:null path:null type:None
   [junit4]   2> 1937697 INFO  (TEST-ZkStateReaderTest.testExternalCollectionWatchedNotWatched-seed#[C8DC0E1270FE2FF6]) [    ] o.a.s.c.c.ConnectionManager Client is connected to ZooKeeper
   [junit4]   2> 1937698 INFO  (TEST-ZkStateReaderTest.testExternalCollectionWatchedNotWatched-seed#[C8DC0E1270FE2FF6]) [    ] o.a.s.c.c.SolrZkClient Using default ZkACLProvider
   [junit4]   2> 1937698 INFO  (TEST-ZkStateReaderTest.testExternalCollectionWatchedNotWatched-seed#[C8DC0E1270FE2FF6]) [    ] o.a.s.c.c.SolrZkClient makePath: /live_nodes
   [junit4]   2> 1937699 INFO  (TEST-ZkStateReaderTest.testExternalCollectionWatchedNotWatched-seed#[C8DC0E1270FE2FF6]) [    ] o.a.s.c.c.SolrZkClient makePath: /collections
   [junit4]   2> 1937700 INFO  (TEST-ZkStateReaderTest.testExternalCollectionWatchedNotWatched-seed#[C8DC0E1270FE2FF6]) [    ] o.a.s.c.c.SolrZkClient makePath: /aliases.json
   [junit4]   2> 1937701 INFO  (TEST-ZkStateReaderTest.testExternalCollectionWatchedNotWatched-seed#[C8DC0E1270FE2FF6]) [    ] o.a.s.c.c.SolrZkClient makePath: /clusterstate.json
   [junit4]   2> 1937703 INFO  (TEST-ZkStateReaderTest.testExternalCollectionWatchedNotWatched-seed#[C8DC0E1270FE2FF6]) [    ] o.a.s.c.c.SolrZkClient makePath: /security.json
   [junit4]   2> 1937704 INFO  (TEST-ZkStateReaderTest.testExternalCollectionWatchedNotWatched-seed#[C8DC0E1270FE2FF6]) [    ] o.a.s.c.c.ZkStateReader Updating cluster state from ZooKeeper... 
   [junit4]   2> 1937704 INFO  (TEST-ZkStateReaderTest.testExternalCollectionWatchedNotWatched-seed#[C8DC0E1270FE2FF6]) [    ] o.a.s.c.c.ZkStateReader Loaded empty cluster properties
   [junit4]   2> 1937705 INFO  (TEST-ZkStateReaderTest.testExternalCollectionWatchedNotWatched-seed#[C8DC0E1270FE2FF6]) [    ] o.a.s.c.c.ZkStateReader Updated live nodes from ZooKeeper... (0) -> (0)
   [junit4]   2> 1937706 INFO  (TEST-ZkStateReaderTest.testExternalCollectionWatchedNotWatched-seed#[C8DC0E1270FE2FF6]) [    ] o.a.s.c.c.SolrZkClient makePath: /collections/c1
   [junit4]   2> 1937713 INFO  (zkCallback-15113-thread-1) [    ] o.a.s.c.c.ZkStateReader A collections change: [WatchedEvent state:SyncConnected type:NodeChildrenChanged path:/collections], has occurred - updating...
   [junit4]   2> 1937714 INFO  (TEST-ZkStateReaderTest.testExternalCollectionWatchedNotWatched-seed#[C8DC0E1270FE2FF6]) [    ] o.a.s.c.o.ZkStateWriter going to create_collection /collections/c1/state.json
   [junit4]   2> 1937717 INFO  (zkCallback-15113-thread-1) [    ] o.a.s.c.c.ZkStateReader Adding lazy collectionRef for collection c1
   [junit4]   2> 1937718 INFO  (TEST-ZkStateReaderTest.testExternalCollectionWatchedNotWatched-seed#[C8DC0E1270FE2FF6]) [    ] o.a.s.c.c.ZkStateReader Refreshing lazily-loaded state for collection c1
   [junit4]   2> 1937718 INFO  (TEST-ZkStateReaderTest.testExternalCollectionWatchedNotWatched-seed#[C8DC0E1270FE2FF6]) [    ] o.a.s.c.c.ZkStateReader Add data for [c1] ver [0]
   [junit4]   2> 1937725 INFO  (TEST-ZkStateReaderTest.testExternalCollectionWatchedNotWatched-seed#[C8DC0E1270FE2FF6]) [    ] o.a.s.c.ZkTestServer connecting to 127.0.0.1:47317 47317
   [junit4]   2> 1937893 INFO  (Thread-5833) [    ] o.a.s.c.ZkTestServer connecting to 127.0.0.1:47317 47317
   [junit4]   2> 1937894 INFO  (TEST-ZkStateReaderTest.testExternalCollectionWatchedNotWatched-seed#[C8DC0E1270FE2FF6]) [    ] o.a.s.SolrTestCaseJ4 ###Ending testExternalCollectionWatchedNotWatched
   [junit4]   2> 1937895 INFO  (SUITE-ZkStateReaderTest-seed#[C8DC0E1270FE2FF6]-worker) [    ] o.a.s.SolrTestCaseJ4 ###deleteCore
   [junit4]   2> NOTE: leaving temporary files on disk at: /x1/jenkins/jenkins-slave/workspace/Lucene-Solr-Tests-master/solr/build/solr-core/test/J1/temp/solr.cloud.overseer.ZkStateReaderTest_C8DC0E1270FE2FF6-001
   [junit4]   2> Jul 07, 2016 11:00:42 AM com.carrotsearch.randomizedtesting.ThreadLeakControl checkThreadLeaks
   [junit4]   2> WARNING: Will linger awaiting termination of 1 leaked thread(s).
   [junit4]   2> NOTE: test params are: codec=Asserting(Lucene62): {}, docValues:{}, maxPointsInLeafNode=1950, maxMBSortInHeap=7.746480156488284, sim=RandomSimilarity(queryNorm=true): {}, locale=en-MT, timezone=Europe/Monaco
   [junit4]   2> NOTE: Linux 3.13.0-85-generic amd64/Oracle Corporation 1.8.0_74 (64-bit)/cpus=4,threads=1,free=156320848,total=529530880
   [junit4]   2> NOTE: All tests run in this JVM: [TestAddFieldRealTimeGet, DistributedIntervalFacetingTest, TestCustomDocTransformer, DirectoryFactoryTest, NotRequiredUniqueKeyTest, TestSolrConfigHandlerCloud, TestClusterStateMutator, TestSystemIdResolver, CheckHdfsIndexTest, BigEndianAscendingWordSerializerTest, TestDocBasedVersionConstraints, TestShardHandlerFactory, LeaderInitiatedRecoveryOnShardRestartTest, ConjunctionSolrSpellCheckerTest, SortByFunctionTest, TestManagedSynonymFilterFactory, TestUpdate, TestSolrDeletionPolicy2, TestRawResponseWriter, ShardRoutingTest, TestSimpleTrackingShardHandler, TestAuthenticationFramework, ConvertedLegacyTest, TestQueryUtils, SchemaVersionSpecificBehaviorTest, QueryResultKeyTest, TestDocumentBuilder, BlockJoinFacetSimpleTest, NumericFieldsTest, TestCodecSupport, TestStressLiveNodes, TestMiniSolrCloudCluster, TestFileDictionaryLookup, TestPartialUpdateDeduplication, SparseHLLTest, DirectSolrSpellCheckerTest, TestCloudManagedSchema, DocValuesTest, MultiTermTest, TestSizeLimitedDistributedMap, TestHashPartitioner, TestLFUCache, OverseerModifyCollectionTest, BasicFunctionalityTest, UpdateRequestProcessorFactoryTest, TestExactStatsCache, SoftAutoCommitTest, TestReqParamsAPI, AsyncMigrateRouteKeyTest, OpenExchangeRatesOrgProviderTest, TestBinaryResponseWriter, HdfsRecoverLeaseTest, TestSchemaNameResource, DistributedMLTComponentTest, ClassificationUpdateProcessorFactoryTest, TestQueryTypes, CSVRequestHandlerTest, SolrPluginUtilsTest, TestCollationFieldDocValues, TestSubQueryTransformerCrossCore, TestDFRSimilarityFactory, CollectionReloadTest, HdfsChaosMonkeySafeLeaderTest, DistributedTermsComponentTest, TestDynamicFieldCollectionResource, BlockCacheTest, FacetPivotSmallTest, FullHLLTest, CollectionsAPIAsyncDistributedZkTest, HighlighterTest, TestInitParams, TermVectorComponentTest, ZkSolrClientTest, TestFiltering, OutOfBoxZkACLAndCredentialsProvidersTest, SharedFSAutoReplicaFailoverTest, MergeStrategyTest, DistribCursorPagingTest, PKIAuthenticationIntegrationTest, TestConfigSetsAPI, DocumentBuilderTest, SolrIndexSplitterTest, TestSolrXml, ConfigSetsAPITest, MBeansHandlerTest, TestLeaderInitiatedRecoveryThread, TestConfigSetImmutable, DistanceFunctionTest, TestRebalanceLeaders, DOMUtilTest, EnumFieldTest, TestCursorMarkWithoutUniqueKey, TestCoreContainer, TestBM25SimilarityFactory, BJQParserTest, TestSurroundQueryParser, ClusterStateUpdateTest, TestSortingResponseWriter, TestSolrCLIRunExample, TestRandomFaceting, TestZkChroot, TestRandomDVFaceting, ZkCLITest, ShardRoutingCustomTest, TestDistributedSearch, SolrCmdDistributorTest, PeerSyncTest, TestLazyCores, SolrRequestParserTest, TestFoldingMultitermQuery, TestStressLucene, WordBreakSolrSpellCheckerTest, TestAtomicUpdateErrorCases, XsltUpdateRequestHandlerTest, LukeRequestHandlerTest, PathHierarchyTokenizerFactoryTest, RequiredFieldsTest, TestCollationField, ReturnFieldsTest, JsonLoaderTest, TestComponentsName, SOLR749Test, UpdateParamsTest, TestSolrIndexConfig, TestQuerySenderNoQuery, BadComponentTest, TestStressRecovery, SynonymTokenizerTest, TestSweetSpotSimilarityFactory, TestLMDirichletSimilarityFactory, TestLMJelinekMercerSimilarityFactory, TestFastWriter, TimeZoneUtilsTest, URLClassifyProcessorTest, ChaosMonkeyNothingIsSafeTest, ConcurrentDeleteAndCreateCollectionTest, ConnectionManagerTest, CustomCollectionTest, DistributedQueueTest, HttpPartitionTest, TestCloudPivotFacet, TestCollectionAPI, TestDistribDocBasedVersion, TestLeaderElectionZkExpiry, TestLocalFSCloudBackupRestore, TestMiniSolrCloudClusterSSL, TestStressCloudBlindAtomicUpdates, HdfsRecoveryZkTest, HdfsSyncSliceTest, HdfsTlogReplayBufferedWhileIndexingTest, HdfsUnloadDistributedZkTest, HdfsWriteToMultipleCollectionsTest, ZkStateReaderTest]
   [junit4] Completed [503/620 (1!)] on J1 in 2.81s, 6 tests, 1 error <<< FAILURES!

[...truncated 370 lines...]
BUILD FAILED
/x1/jenkins/jenkins-slave/workspace/Lucene-Solr-Tests-master/build.xml:740: The following error occurred while executing this line:
/x1/jenkins/jenkins-slave/workspace/Lucene-Solr-Tests-master/build.xml:684: The following error occurred while executing this line:
/x1/jenkins/jenkins-slave/workspace/Lucene-Solr-Tests-master/build.xml:59: The following error occurred while executing this line:
/x1/jenkins/jenkins-slave/workspace/Lucene-Solr-Tests-master/solr/build.xml:233: The following error occurred while executing this line:
/x1/jenkins/jenkins-slave/workspace/Lucene-Solr-Tests-master/solr/common-build.xml:530: The following error occurred while executing this line:
/x1/jenkins/jenkins-slave/workspace/Lucene-Solr-Tests-master/lucene/common-build.xml:1443: The following error occurred while executing this line:
/x1/jenkins/jenkins-slave/workspace/Lucene-Solr-Tests-master/lucene/common-build.xml:984: There were test failures: 620 suites (10 ignored), 2635 tests, 1 error, 103 ignored (88 assumptions) [seed: C8DC0E1270FE2FF6]

Total time: 72 minutes 14 seconds
Build step 'Invoke Ant' marked build as failure
Archiving artifacts
Recording test results
Email was triggered for: Failure - Any
Sending email for trigger: Failure - Any




Mime
View raw message